##TITLE=31Pdec_B3dm2808K
 CDcl3 24 sc
 30.8.2023
##JCAMPDX= 6.0         $$ Bruker NMR JCAMP-DX V2.0
##DATA TYPE= NMR SPECTRUM
##DATA CLASS= NTUPLES
##ORIGIN= UXNMR, Bruker Analytische Messtechnik GmbH
##OWNER= root
$$ XWIN-NMR		Version 3.5
$$ Wed Aug 30 13:53:31 2023 Russian Standard Time (UT+4h)  she@DPX200
##.OBSERVE FREQUENCY= 81.013821
##.OBSERVE NUCLEUS= ^31P
##.ACQUISITION MODE= SIMULTANEOUS
##.ACQUISITION SCHEME= undefined
##.AVERAGES= 40
##.DIGITISER RES= 16
##SPECTROMETER/DATA SYSTEM= spect
##.PULSE SEQUENCE= zgpg30
##.SOLVENT NAME= CDCl3
##.SHIFT REFERENCE= (INTERNAL, CDCl3, 0, 248.564)
##AUDIT TRAIL= $$ (NUMBER, WHEN, WHO, WHERE, WHAT)
$$ ##TITLE= Audit trail, XWIN-NMR		Version 3.5
$$ ##JCAMPDX= 5.01
$$ ##ORIGIN= Bruker BioSpin GmbH
$$ ##OWNER= she
$$ F:/spectra/data/she/nmr/P31/1/pdata/1/auditp.txt
$$ ##AUDIT TRAIL=  $$ (NUMBER, WHEN, WHO, WHERE, WHAT)
(   1,<2023-08-30 13:52:21.53 +0400>,<she>,<DPX200>,
      <created by zg, POWCHK disabled, PULCHK disabled
       configuration hash MD5:
       00 E9 B6 7A A2 85 ED C7 34 08 36 98 17 FE 4E 26
       data hash MD5: 32K
       B2 96 A9 68 92 00 13 B4 BD 0A E9 87 4A BA C5 BE>)
(   2,<2023-08-30 13:52:23.78 +0400>,<she>,<DPX200>,
      <Start of raw data processing
       efp BC_mod = 2 LB = 5 FT_mod = 6 PKNL = 1 PHC0 = -11156.37 PHC1 = 382.2849 SI = 64K 
       data hash MD5: 64K
       21 89 A4 B7 A8 F0 94 02 B7 87 5B 8A 86 67 9D 18>)
(   3,<2023-08-30 13:53:01.89 +0400>,<she>,<DPX200>,
      <pk PHC0 = 305.8809 PHC1 = -274.3999 
       data hash MD5: 64K
       29 5A D1 AC D4 0B 59 4D 27 19 27 E9 DC A9 DD 01>)
(   4,<2023-08-30 13:53:05.15 +0400>,<she>,<DPX200>,
      <abs ABSG = 5 
       data hash MD5: 64K
       44 E4 CB C0 21 E3 E9 EC FD DA 9C 48 94 96 35 BC>)
$$ ##END=
$$ 
$$ hash MD5
$$ BE 3A 1D 9E C5 E3 7E 92 64 54 88 1F E6 0F 38 7F
##$RELAX= 
##$RELAX= 
##$RELAX= 
##$RELAX= 
##$RELAX= 
##$RELAX= 
##$RELAX= 
##$RELAX= 
##$RELAX= 
$$ Bruker specific parameters
$$ --------------------------
##$DU= <F:/spectra>
##$EXPNO= 1
##$NAME= <P31>
##$PROCNO= 1
##$TYPE= <nmr>
##$USER= <she>
##$AMP= (0..31)
100 100 100 100 100 100 100 100 100 100 100 100 100 100 100 100 100 100 
100 100 100 100 100 100 100 100 100 100 100 100 100 100 
##$AQSEQ= 0
##$AQ_mod= 1
##$AUNM= <au_zg>
##$AUTOPOS= <>
##$BF1= 81.014009
##$BF2= 200.13
##$BF3= 200.13
##$BF4= 200.13
##$BF5= 200.13
##$BF6= 200.13
##$BF7= 200.13
##$BF8= 200.13
##$BYTORDA= 1
##$CFDGTYP= 0
##$CFRGTYP= 5
##$CHEMSTR= <none>
##$CNST= (0..31)
1 1 145 1 1 1 1 1 1 1 1 1 1 1 1 1 1 1 1 1 1 1 1 1 1 1 1 1 1 1 1 1 
##$CPDPRG= <waltz16>
##$CPDPRG1= <>
##$CPDPRG2= <waltz16>
##$CPDPRG3= <>
##$CPDPRG4= <mlev>
##$CPDPRG5= <mlev>
##$CPDPRG6= <mlev>
##$CPDPRG7= <mlev>
##$CPDPRG8= <mlev>
##$CPDPRGB= <>
##$CPDPRGT= <>
##$D= (0..31)
0 1 0 0 0 0 0 0 0 0 0 0.03 2e-05 3e-06 0 0 0 0 0 0 0 0 0 0 0 0 0 0 0 0 
0 0 
##$DATE= 1693389140
##$DBL= (0..7)
120 120 120 11 120 120 24 19 
##$DBP= (0..7)
150 150 150 150 150 150 150 150 
##$DBP07= 0
##$DBPNAM0= <>
##$DBPNAM1= <>
$$ [...]
##$SUBNAM3= <"">
##$SUBNAM4= <"">
##$SUBNAM5= <"">
##$SUBNAM6= <"">
##$SUBNAM7= <"">
##$SUBNAM8= <"">
##$SUBNAM9= <"">
##$SW= 501.771253377433
##$SWIBOX= (0..15)
0 1 3 0 0 0 0 0 0 0 0 0 0 0 0 0 
##$SW_h= 40650.406504065
##$TD= 32768
##$TD0= 1
##$TE= 0
##$TE2= 300
##$TE3= 300
##$TEG= 300
##$TL= (0..7)
0 120 53 12 22 120 120 120 
##$TP= (0..7)
150 150 150 150 150 150 150 150 
##$TP07= 0
##$TPNAME0= <>
##$TPNAME1= <>
##$TPNAME2= <>
##$TPNAME3= <>
##$TPNAME4= <>
##$TPNAME5= <>
##$TPNAME6= <>
##$TPNAME7= <>
##$TPOAL= (0..7)
0.5 0.5 0.5 0.5 0.5 0.5 0.5 0.5 
##$TPOFFS= (0..7)
0 0 0 0 0 0 0 0 
##$TUNHIN= 0
##$TUNHOUT= 0
##$TUNXOUT= 0
##$USERA1= <user>
##$USERA2= <user>
##$USERA3= <user>
##$USERA4= <user>
##$USERA5= <user>
##$V9= 5
##$VALIST= <valist>
##$VCLIST= <CCCCCCCCCCCCCCC>
##$VD= 0
##$VDLIST= <DDDDDDDDDDDDDDD>
##$VPLIST= <PPPPPPPPPPPPPPP>
##$VTLIST= <TTTTTTTTTTTTTTT>
##$WBST= 1024
##$WBSW= 4
##$XGAIN= (0..3)
0 0 0 0 
##$XL= 0
##$YL= 0
##$YMAX_a= 2640
##$YMIN_a= -3046
##$ZGOPTNS= <>
##$ZL1= 120
##$ZL2= 120
##$ZL3= 120
##$ZL4= 120
##$ABSF1= 248.5645
##$ABSF2= -253.2056
##$ABSG= 5
##$ABSL= 3
##$ALPHA= 0
##$AQORDER= 0
##$ASSFAC= 0
##$ASSFACI= 0
##$ASSFACX= 0
##$ASSWID= 0
##$AUNMP= <proc_1d>
##$AZFE= 0.1
##$AZFW= 0.5
##$BCFW= 0
##$BC_mod= 2
##$BYTORDP= 0
##$COROFFS= 0
##$CY= -3
##$DATMOD= 1
##$DC= 0
##$DFILT= <>
##$DTYPP= 0
##$F1P= 0
##$F2P= 0
##$FCOR= 1
##$FTSIZE= 65536
##$FT_mod= 6
##$GAMMA= 0
##$GB= 0
##$INTBC= 1
##$INTSCL= 6.047779e-11
##$ISEN= 30
##$LB= 5
##$LEV0= 0
##$LPBIN= 0
##$MAXI= 10000
##$MC2= 0
##$MEAN= 0
##$ME_mod= 0
##$MI= 50
##$NCOEF= 0
##$NC_proc= -11
##$NLEV= 6
##$NOISF1= 182.463
##$NOISF2= 159.3651
##$NSP= 0
##$NTH_PI= 0
##$NZP= 0
##$OFFSET= 248.5645
##$PC= 4
##$PHC0= -10850.49
##$PHC1= 107.885
##$PH_mod= 1
##$PKNL= yes
##$PPARMOD= 0
##$PSCAL= 0
##$PSIGN= 0
##$REVERSE= no
##$SF= 81.0140089999694
##$SI= 65536
##$SIGF1= 159.3651
##$SIGF2= -187.1042
##$SINO= 113.3802
##$SIOLD= 16384
##$SREGLST= <1H.CDCl3>
##$SSB= 0
##$STSI= 65536
##$STSR= 0
##$SW_p= 40650.406504065
##$SYMM= 0
##$S_DEV= 0
##$TDeff= 32768
##$TDoff= 0
##$TI= <>
##$TILT= no
##$TM1= 0
##$TM2= 0
##$TOPLEV= 0
##$USERP1= <user>
##$USERP2= <user>
##$USERP3= <user>
##$USERP4= <user>
##$USERP5= <user>
##$WDW= 1
##$XDIM= 65536
##$YMAX_p= 492967924
##$YMIN_p= -89398301
$$ End of Bruker specific parameters
$$ ---------------------------------
##NTUPLES= NMR SPECTRUM
##VAR_NAME=  FREQUENCY,     SPECTRUM/REAL,   SPECTRUM/IMAG
##SYMBOL=    X,             R,               I
##VAR_TYPE=  INDEPENDENT,   DEPENDENT,       DEPENDENT
##VAR_FORM=  AFFN,          ASDF,            ASDF
##VAR_DIM=   65536,         65536,           65536
##UNITS=     HZ,            ARBITRARY UNITS, ARBITRARY UNITS
##FACTOR=    0.620285442955139, 1,           1
##FIRST=     20137.2065510682, 0,            0
##LAST=      -20513.1999529968, 0,           0
##MIN=       -20513.1999529968, -89398301,   0
##MAX=       20137.2065510682, 492967924,    0
$$ Real data points
##PAGE= N=1
##DATA TABLE= (X++(R..R)), XYDATA
$$ [...]
12893a0842688r977245j0726292r767356o919375l345670m19185J629775L414030
12885d6954006N126252O400232P221040P904117P992060O256269K443955j674261
12877e284342l763644l161643j200934L38236N80338l13261j662186k831687l634166
12868b0933289m221347m457094l637058j182079K482135O030493Q179975Q391060
12860i347204O923458M607492K429538Q59925n03546k321093m504218o154218
12852h009866o590721o081426n339468m624222l723445k654936j857339j519806
12844d0401229j139216j62093J083794J585188Q84548k77735q33990n93095j79879
12835d0033707K3428L29263J099125K193987L362238M758700O559388Q154302
$$ y = [-10842688, -20819933, -31546225, -41313581, -48232956, -51578626, -51997811, -50368036, -46954006, -41827754, -35427522, -28206482, -20302365, -12310305, -6054036, -3610081, -5284342, -9047986, -12209629, -13410563, -13072327, -12491989, -12805250, -14467436, -17299123, -20933289, -25154636, -29611730, -33248788, -34430867, -31948732, -25918239, -17738264, -9347204, -2423746, 2183746, 4613284, 5473209, 4969663, 2648570, -1855648, -8009866, -14600587, -20682013, -26021481, -30645703, -34369148, -37024084, -38881423, -40401229, -41540445, -41702538, -40618744, -39033556, -38149008, -38426743, -39260733, -39853828, -40033707, -40010279, -39681016, -38581891, -36387904, -33025666, -28266966, -21707578, -13553276]
12827a3553276Q248383O060321K305755j192828k903627k619910j286189k6066
12819d967437O36436Q61614J118010J743357K639789L277853L139043K264071
12811A0712736J252145O38756M15587K33561j57308q55837j957094l404067m727863
12802B150616n209347m383825k350928K87189K691768M204979M743928M681794
12794F816174M227366L200316J638120K13550m74653q04179j717141l438512n144859
12785D516182n921510n508687m061517j838228N67453K205540K456287J574456
12777f010024L30111p01576j369424j753245j955699j941951j533623p55615j04202
12768a5795248p2577m42124n81700n16943j012159k251731l082594k185820L05068
$$ y = [-13553276, -5304893, 755428, 3061183, 1868355, -1035272, -3655182, -4941371, -4967437, -4331001, -3469387, -2351377, -608020, 2031769, 5309622, 8448665, 10712736, 11964881, 12603637, 13019224, 13252785, 13095477, 12239640, 10282546, 6878479, 2150616, -3058731, -7442556, -9793484, -9506295, -6814527, -2609548, 2134380, 6816174, 11043540, 14243856, 15881976, 16095526, 15620873, 14816694, 13099553, 9661041, 4516182, -1405328, -6914015, -10975532, -12813760, -12246307, -10040767, -7584480, -6010024, -5679913, -6381489, -7750913, -9504158, -11459857, -13401808, -14935431, -15691046, -15795248, -15867825, -16309949, -16891649, -17408592, -18420751, -20672482, -23755076, -25940896, -25635828]
12759b5635828K863925M038518L474620J800298M8045r53244j167484j392858
12751a6924008k376309l878679m862973m505835k739536L1681L271441O300551
12743b5683667Q334709Q821885P814201O100547M926934N157275O335466O807110
12735B8614460N245144K052837j067754k891516l682528m504265n968800p774318
12727A0023260r077572r055109p342808m316317j053549J158561J603616P09287
12719a7350631j81018N2815J210137K032460J721678Q76871O13118J094856J519449
12710h410265J432870J344200J760596K139539J339989r67655l697928n220125
12702a0278779m686179k537077L4549J944858K727529K619538K382805K792130
$$ y = [-25635828, -22771903, -18733385, -15258765, -13458467, -13410422, -14363666, -15531150, -16924008, -19300317, -23178996, -28041969, -32547804, -35287340, -35255659, -31984218, -25683667, -17348958, -8527073, -712872, 5387675, 10314609, 15471884, 21807350, 28614460, 33859604, 35912441, 34844687, 31953171, 28270643, 23766378, 17797578, 10023260, 945688, -8109421, -15452229, -19768546, -20822095, -19663534, -18059918, -17350631, -17531649, -17478834, -16268697, -14236237, -12514559, -11637688, -11024570, -9929714, -8410265, -6977395, -5633195, -3872599, -1733060, -393071, -1360726, -5058654, -10278779, -14964958, -17502035, -17467486, -15522628, -12795099, -10175561, -7792756, -5000626]
12694e000626L870795M618631L893269J723985n50848j638487j513154j119229
12686D284336j234295j977890l120274m310577n035912m864613l919426k856652
12678b3035303k236147k030603j763924r83176L79512J911833K951755L064309
12670b1741744K358220J322919M39317p874P1604N63184J189870J637148J524252
12661a2643104L26117k196280n218762o965231o171256l324774l5656K678700
12653c3550246N022523P492791R931117J1592476J1708264R928587O695409L310379
12645C2131300J143457M87384M70884K32732j96961l68633l41480p73034k272487
12636C0513162m869519p851868r894067r719508p166694l586716q22124L13229
$$ y = [-5000626, -1129831, 3488800, 7382069, 9106054, 8555206, 6916719, 5403565, 4284336, 3050041, 1072151, -2048123, -6358700, -11394612, -16259225, -20178651, -23035303, -25271450, -27302053, -29065977, -30049153, -29669641, -27757808, -24806053, -21741744, -19383524, -18060605, -17621288, -17629162, -17557558, -16994374, -15804504, -14167356, -12643104, -12316987, -14513267, -19732029, -26697260, -32868516, -36193290, -36228946, -33550246, -28527723, -21034932, -11103815, 488661, 12196925, 22125512, 28820921, 32131300, 33274757, 33762141, 34233025, 34465757, 34268796, 33900163, 33558683, 32785649, 30513162, 25643643, 17791775, 7897708, -1821800, -8988494, -12575210, -13397334, -13084105]
12628a3084105M53516P50090J787223L294943M523568M805435M094939L216215
12620I841824L399318N244673Q081323J0494339J1518369J1180808R877220P534795
12612G7172669L748675j269109o219906r443313j0101254q655883o381930m521792
12604C4328157l665877l567039l449524k696750j424197l72223j44458n49463
12596A8458626q22158n86962m19393j106048k356073k775546j462586Q07761K517774
12587A2255395L152470L268853L108794K254196Q28060j32664j50267k44115j536474
12578B2804248l570648m954867n209939m961734m578920l713132k218674n76574
12570f980240Q01151J980899L086585M100213N113462O064770O200596M688621
$$ y = [-13084105, -12630589, -11880499, -10093276, -6798333, -2274765, 2530670, 6625609, 9841824, 13241142, 18485815, 26567138, 37061477, 48579846, 59760654, 69637874, 77172669, 80921344, 79652235, 73432329, 63989016, 53887762, 45231879, 38849949, 34328157, 30662280, 27095241, 23645717, 20948967, 19524770, 19152547, 19008089, 18458626, 17636468, 17049506, 16630113, 15524065, 13167992, 10392446, 8929860, 9737621, 12255395, 15407865, 18676718, 21785512, 24039708, 24867768, 24735104, 24584837, 24340722, 22804248, 19233600, 14278733, 9068794, 4107060, -471860, -4184992, -6403666, -6980240, -6179089, -4198190, -1111605, 2988608, 8102070, 14166840, 20367436, 25056057]
12562B5056057K032682L2180j46895P54861J184126N95301k68774m35661M14162
12553B9218039J733539K382288J513577l97916j774138j594303n18415K2762n05587
12544C0079846j434525j919785j735153j197554p76349p44329r47790j063767
12536B0260594j282484k383772m713723p337411q710521q100216n940427k937180
12528b1145140O10423M495096Q046391J0183408R998176P366977L204902q97631
12520B1862602l566758m416212m079229l595163l683384m289680m650053l959858
12512a0377735k135977J55645K161319L400661L399164J718373j284829m151988
12504g115367n448805n175728m583556m538425m483847l218870m83027K471718
$$ y = [25056057, 27088739, 27120919, 26974024, 27728885, 28913011, 29508312, 29239538, 28803877, 29218039, 30951578, 33333866, 34847443, 34449527, 32675389, 31081086, 30562671, 30585433, 30079846, 28645321, 26725536, 24990383, 23792829, 23016480, 22272151, 21324361, 20260594, 18978110, 16594338, 11880615, 4543204, -4167317, -12267533, -18207960, -21145140, -20534717, -16039621, -7993230, 2190178, 12188354, 19555331, 22760233, 21862602, 18295844, 13879632, 9800403, 6205240, 2521856, -1767824, -6417877, -10377735, -12513712, -12358067, -10196748, -6796087, -3396923, -1678550, -2963379, -7115367, -12564172, -17739900, -22323456, -26861881, -31345728, -34564598, -35047625, -32575907]
12496c2575907L944201L400337J948587J120227J330526J823427J978021K085891
12488a4944690K674556L617192M282093M172900L081426J046496j359664l059875
12480d89566l346359k534018j323922J31539J925202L484136L833920K830761
12472D511693J433910O04773M92661P75382J119477J070032J64745j387185k605273
12463F180215k770557k197953j547543p60797O63743K473802L448938K607418
12455H097266K17871k600063m907752o261095o338779m913857k361221K71506
12447a8796124K111992L225960M190212N029982N037298L705059J415235r62859
12439D956755k756966l545016k988234j133351J271058L215347M212854M422549
$$ y = [-32575907, -28631706, -25231369, -23282782, -22162555, -20832029, -19008602, -17030581, -14944690, -12270134, -8652942, -4370849, -197949, 2883477, 3929973, 2570309, -489566, -3835925, -6369943, -7693865, -7562326, -5637124, -2152988, 1680932, 4511693, 5945603, 6550376, 7043037, 7818419, 8937896, 10007928, 10172673, 8785488, 6180215, 3409658, 1211705, -335838, -1096635, -432892, 2040910, 5489848, 8097266, 8315137, 5715074, 807322, -5453773, -11792552, -16706409, -19067630, -18796124, -16684132, -13458172, -9267960, -4237978, 799320, 4504379, 5919614, 4956755, 2199789, -1345227, -4333461, -5466812, -4195754, -980407, 3232447, 7654996]
12431G654996M113913L308425J892236j30805k357468l773063l219737o61153
12423F827344K165805L050497J450256j071666k612414k664422k024461j642737
12415C478202j978701l004564m202668m655032l639645j283010J518713L771011
12407i995694M877290M758837L906078L257829L570746M685268N601832N415543
12399B6077729M042272K003028j96240k259122l967158n280831o502540p887499
12391F029639q985794q803252o911634m115233j688500j70021P62181J523917
12383b2358697K322793L499191N388243P510462Q417801O855952K997010j621898
12375A3010857n138092o266213m733900j425083J985289M016882M265420L375733
$$ y = [7654996, 11768909, 15077334, 16969570, 16838765, 14481297, 10708234, 7488497, 6827344, 8993149, 12043646, 13493902, 12422236, 9809822, 7145400, 5120939, 3478202, 1499501, -1505063, -5707731, -10362763, -14002408, -15285418, -13766705, -9995694, -5118404, -359567, 3546511, 6804340, 10375086, 15060354, 20662186, 26077729, 30120001, 32123029, 31926789, 29667667, 25700509, 20419678, 13917138, 6029639, -2956155, -11759407, -18671041, -22786274, -24474774, -24644795, -23882614, -22358697, -20035904, -16536713, -11148470, -3638008, 4779793, 11635745, 14632755, 13010857, 7872765, 1606552, -3127348, -4552431, -2567142, 1449740, 5715160, 9090893]
12367I090893K272274J415028N73908p40347k424918l446811k831356j055330
12359B853341J64825k12034j397255j907416j240954J38628J855156L742937N259219
12350I256447N818739N755559O042867O797345O785313M803204J095517k867041
12342D3487950n587218o252783m729243j434974K672319O172058P532259N891131
12334D7751499J904094k388453n040258n594234m806128l339850j372729O70357
12326B7784298J858596J551949R204j938086l391997l606601k427141p49743J17116
12317A9207595r2096l45682J39844P62672N25459l99954r30870o87511n32605
12308A7646852j387758l112093m798126n759339n888377n253418l755699j340349
$$ y = [9090893, 11363167, 12778195, 13352103, 12611756, 10186838, 6740027, 3908671, 2853341, 3018166, 2806132, 1408877, -498539, -1739493, -1600865, 254291, 3997228, 9256447, 15075186, 20830745, 26873612, 33670957, 40456270, 45259474, 46354991, 43487950, 37900732, 31647949, 26918706, 25483732, 28156051, 34328109, 41860368, 47751499, 49655593, 47267140, 42226882, 36632648, 31826520, 28486670, 27113941, 27784298, 29642894, 31194843, 31204047, 29265961, 25873964, 22267363, 19840222, 19090479, 19207595, 19115499, 18769817, 18909661, 19672333, 20197792, 19797838, 18866968, 18179457, 17646852, 16259094, 13147001, 8348875, 2589536, -3298841, -8552259, -12307958, -13648307]
12300a3648307J618317M407301O540846Q061750R138152R573803R024062P580065
12292D2295989N746429L808110J569055j160109m040068o242311o904953n751259
12284B9320883l620861k202794k615882m134711m836251l682057j495170K76248
12276G009405J165545J669063K108484K125449J257171l37760j800578k212392
12268A0984387j478590n80520o99434k082002m017727n770902p007958p385936
12260a8038682o499510m510089k197001n5453K076103M165115N454589N356688
12252a4248240M370950L518970L258244L494288M219168N421642O581648O865714
12244B3482384N714688K903074j499172o529939j0059741j0074751o457713j143184
$$ y = [-13648307, -12029990, -7622689, -1081843, 6979907, 16118059, 25691862, 34715924, 42295989, 48042418, 51850528, 53419583, 52259474, 48219406, 41977095, 35072142, 29320883, 25700022, 23497228, 20881346, 16746635, 11910384, 8228327, 6733157, 7009405, 8174950, 9844013, 11952497, 14077946, 15335117, 14997357, 13196779, 10984387, 9505797, 8925277, 8225843, 6143841, 2126114, -3644788, -10652746, -18038682, -24538192, -29048281, -31245282, -31300735, -29224632, -25059517, -19604928, -14248240, -9877290, -6358320, -3100076, 394212, 4613380, 10035022, 16616670, 23482384, 29197072, 32100146, 30600974, 24071035, 14011294, 3936543, -2521170, -3664354]
12236c664354L337678N136807L607312k35166l728652m255228j660914J450887
12228a1630K342218Q67972o10879K65784L650404P479654R333975Q355286N532437
12219C7205221K326710o23624l296365n313026n868540m618098k112490P24771
12211A8424559L156393M691064N142709M840481M378229L908181K954847J136796
12203D8633259j136230k893784l480698l173467k979232l713312n144456o224433
12195A9887647o323073n906496n632112n142303l419823k41460L369150O164649
12187B756179P572855P590564O524040N058232L915874L076063J838614R756j489544
12178C6852633j657058o71591L33299M57591m42833k125628m265266o405781q045334
$$ y = [-3664354, -326676, 4810131, 8417443, 8182277, 4453625, 198397, -1462517, -11630, 2330588, 3198560, 2587681, 2853465, 6503869, 13983523, 23317498, 31672784, 37205221, 39531931, 38908307, 35611942, 30298916, 24430376, 19812278, 17699788, 18424559, 21580952, 26272016, 31414725, 36255206, 40633435, 44541616, 47496463, 48633259, 47497029, 44603245, 41122547, 37949080, 34969848, 31256536, 26112080, 19887647, 13564574, 7658078, 2025966, -3116337, -6536160, -6777620, -3408470, 2756179, 10329034, 17919598, 24443638, 29501870, 33417744, 36493807, 38332421, 38342177, 36852633, 35195575, 34523984, 34857283, 35314874, 34872041, 32746413, 28481147, 22075366, 14030032]
12169A4030032q869247q727768p508836n381377l172624k108589k837221m671111
12161b9246741n961997n432058l236999o46644J338382K812416M269347N475030
12153c0629264N576976M253571K195500L42020q99566j574431j862244k102361
12145b4699799k661262l375676l415079k063408N02023L370139N562222O397389
12137b0383451N643020L711255J483727l75218j752715k595464k558590j589521
12129a8416957m80450j89048o91856j058443o98353j00420k53399j639040l797795
12120b7325761n544958n583818l316987O31073M698707P303658P714684O441596
12112a4981806M940353M524077N153647N539092M784039L536596K906787K621305
$$ y = [14030032, 5160785, -3566983, -11075819, -16457196, -19629820, -21738409, -24575630, -29246741, -35208738, -40640796, -43877795, -44524439, -43186057, -40373641, -36104294, -30629264, -25052288, -20798717, -18603217, -18261197, -19160763, -20735194, -22597438, -24699799, -27361061, -30736737, -34151816, -36215224, -35713201, -32343062, -26780840, -20383451, -14740431, -11029176, -9545449, -9920667, -11673382, -14268846, -16827436, -18416957, -18897407, -19086455, -19778311, -20836754, -21535107, -21635527, -21888926, -23527966, -27325761, -32870719, -38454537, -41771524, -41140451, -36441744, -29138086, -21423402, -14981806, -10041453, -5517376, -363729, 5175363, 9959402, 13495998, 16402785, 19024090]
12104A9024090J273227j516474m245257n362094n142566m969935n293100n235908
12096a1468017m048952k018626J90827K269830L949372M606704L824086K069844
12088f24932K45520j359356l137959n171978o734083p076086o308583n042079
12080c5209536l354696o89456L082537O935244R389380R794547Q593272O364301
12072D905593L033884j638779o907690j0780082j1255188p954441k555079K343598
12064c0808184M859641M743857L195492J899880J842000K648671L097669K408901
12056f112073Q97663p57817k485857m503290o181573o028419l225630J192228
12048b7204768N088252O926468O461313M193341R25850k075529l289148k037792
$$ y = [19024090, 20297317, 18780843, 14535586, 9173492, 4030926, -939009, -6232109, -11468017, -15516969, -17535595, -17344768, -15074938, -11125566, -6518862, -2694776, -624932, -379412, -1738768, -4876727, -10048705, -16782788, -23858874, -30167457, -35209536, -38564232, -39253688, -36171151, -29235907, -19846527, -10051980, -1458708, 4905593, 7939477, 6300698, -606992, -11387074, -22642262, -30596703, -33151782, -30808184, -25948543, -21204686, -18009194, -16109314, -14267314, -11618643, -8520974, -6112073, -5214410, -5972227, -8458084, -12961374, -19142947, -25171366, -28396996, -27204768, -22116516, -15190048, -8728735, -4535394, -3609544, -5685073, -8974221, -11012013]
12040a1012013O51511K753248L012356J859940N48802k54579p08494r51722p23520
12031d824471L322O36319P06484O03057R58446J554351J592286J024229P98531
12022C052554J532797K652211L244061L155252K761013K244275J777411J928631
12014B2348205K993081M114151L995818K573054J147133O15586L45781p18536
12006C7414273k454592l756464m036982l820309l797000l835383l197972j513365
11998A1002206O70198K246054K438078J457564L07527k13117l51543j038903k546763
11989A3971301l769557l271312j044868J249940K068635J633095J383612K058874
11981A4279720K948110L053441K348621J609656J468401J978764K772115L294358
$$ y = [-11012013, -10360502, -7607254, -4594898, -2734958, -2186156, -2440735, -3149229, -4100951, -4824471, -4821149, -4184830, -3478346, -2875289, -1916843, -362492, 1229794, 2254023, 3052554, 4585351, 7237562, 10481623, 13636875, 16397888, 18642163, 20419574, 22348205, 25341286, 29455437, 33451255, 36024309, 37171442, 37787028, 38132809, 37414273, 34959681, 31203217, 27166235, 23345926, 19548926, 15713543, 12515571, 11002206, 11672404, 13918458, 16356536, 17814100, 18121627, 17908510, 17556967, 16518064, 13971301, 10201744, 6930432, 5885564, 7135504, 9204139, 10837234, 12220846, 14279720, 17227830, 20281271, 22629892, 24239548, 25707949, 27686713, 30458828, 33753186]
11973C3753186L151395K490899J732085O96905j433019m762154p802804q816347
11965A9010146p866713o686707o483503o719625o242903m749906k683688m27738
11957b2850637J705092L120843L321585K544893J554397Q87250O72975R96177
11949h047425J908978L068483L787782L581291K484892R26190m28382q21985Q8171
11940F547995J714580K901120L057822K715466K734475L189959L380561K859921
11932B9101899K060928J731741K003686K302268K121096J585686J111212O72362
11924D2690878l48136k522752n644817q648538j0297446j0088888q588151o846900
11916a0294750n475281m351853l160520j901376p66962J36452O93164P60344O43019
$$ y = [33753186, 36904581, 39395480, 41127565, 41824470, 40391451, 35629297, 27826493, 19010146, 11143433, 4456726, -2026777, -8746402, -14989305, -19739211, -22422899, -22850637, -21145545, -18024702, -14703117, -12158224, -10603827, -9716577, -9043602, -8047425, -6138447, -3069964, 717818, 4299109, 6784001, 7710191, 7281809, 6459824, 6547995, 8262575, 11163695, 14221517, 16936983, 19671458, 22861417, 26241978, 29101899, 31162827, 32894568, 34898254, 37200522, 39321618, 40907304, 42018516, 42690878, 42342742, 39819990, 34175173, 25526635, 15229189, 5140301, -3447850, -10294750, -15770031, -20121884, -23282404, -25183780, -25950742, -25814290, -25121126, -24360782, -23717763]
11907b3717763J229011L002936N085446O004623N463327M571147M166425L822324
11899I627476K999883K287739K580781L553706L975674L323392K064465L68935
11891C0782051k314600n962134r175274j0457289r863991q723877p975841p437278
11883c1128233o634426n669923m986863m644472m181363l130879j477324M02864
11875f1450619K135944L637760N058772O507721P807998Q425559P638482N023690
11867a5214693J058525k796509m926825m675652k623359J32759K703159M448941
11859b1893654M867324L945141K455488J346626P16612j73223j651503k862994
11851a3250183k756912j625520r44171j481424k179202j427941Q89212L260735
$$ y = [-23717763, -22488752, -19485816, -14400370, -8395747, -2932420, 1638727, 5805152, 9627476, 12627359, 14915098, 17495879, 21049585, 25025259, 28348651, 30413116, 30782051, 28467451, 22505317, 13330043, 2872754, -6991237, -15715114, -23690955, -31128233, -37762659, -43432582, -48419445, -53063917, -57245280, -60376159, -61853483, -61450619, -59314675, -55676915, -50618143, -44110422, -36302424, -27876865, -20238383, -15214693, -14156168, -16952677, -21879502, -26555154, -29178513, -29045754, -26342595, -21893654, -17026330, -13081189, -10625701, -9279075, -8562463, -8735686, -10387189, -13250183, -16007095, -17632615, -18576786, -20058210, -22237412, -23665353, -22776141, -19515406]
11843a9515406M354540M297949M038685M104882M395979M667426M597433L631569
11835A4573057J446900j369094l585453m396269l911222k620640q99070P66513
11827D722J577398J001767m86325j576020j162278P54515L069933M390478M009440
11818A1583630K298558K30598j424907k404950k678316k254941j349925l99898
11810C599849L27435R63570J672497K223201K209797J647096J073802R79900J279485
11801A5976632J448391J116246M19855k45645p27769j221515j856459k376882
11793A2532854k395057j820816q32670M15360J706271K451458J956052K08611
11785A4222063j867399l142453l108731k002397n23964L79843q4365j903560m140892
$$ y = [-19515406, -15160866, -10862917, -6824232, -2719350, 1676629, 6344055, 10941488, 14573057, 16019957, 14650863, 11065410, 6669141, 2757919, 137279, -761791, 4722, 1582120, 2583887, 2097562, 521542, -640736, 113779, 3183712, 7574190, 11583630, 13882188, 14112786, 12687879, 10282929, 7604613, 5349672, 3999747, 3599849, 3927284, 4890854, 6563351, 8786552, 10996349, 12643445, 13717247, 14697147, 15976632, 17425023, 18541269, 18961124, 18715479, 17987710, 16766195, 14909736, 12532854, 10137797, 8316981, 7484311, 7899671, 9605942, 12057400, 14013452, 14222063, 12354664, 9212211, 6103480, 4101083, 3577119, 3956962, 3872597, 1969037, -2171855]
11776b171855n788529o615303o915704o654673n349694k869408p410J988148K505108
11767c1879320K199014K409558L687593M962349M630515K568579M55036k57194
11759a1223870l2335k49711j065388j312619m04087P76924J213240J125814J469756
11750i702276K588700L871869M413767L657179J747034l70649j533530j465169
11742C206925j056936j219103j776552j937690j519448j068187r10042q14424
11734g095457p41965j255382k729602m505289n355763m777114l464845k460036
11726c2385453k143992k256184k596821l235322m006037m314932l805749k895451
11718e7639941k140347j200774R72709M790726R303799J2968274J4705576J4089233
$$ y = [-2171855, -7960384, -14575687, -21491391, -28146064, -33495758, -36365166, -36372576, -34384428, -31879320, -29680306, -27270748, -23583155, -18620806, -13990291, -11421712, -10966676, -11223870, -11256205, -11505916, -12571304, -13883923, -14288010, -13511086, -12297846, -11172032, -9702276, -7113576, -3241707, 1172060, 4829239, 6576273, 6205624, 4672094, 3206925, 2149989, 930886, -845666, -2783356, -4302804, -5370991, -6281033, -7095457, -7837422, -9092804, -11822406, -16327695, -21683458, -26460572, -29925417, -32385453, -34529445, -36785629, -39382450, -42617772, -46623809, -50938741, -54744490, -57639941, -59780288, -60981062, -60008353, -55217627, -45913828, -32945554, -18239978, -4150745]
11710d150745J1160276O653092K093953r91352k111363j903087j376750j276604
11702H097420j831388k618216k802481k020762j006353q66638j710678k487680
11694g246776k332187j601286j272835j634189j970234j503792l77640L98078
11686a7540861m3989j471193k644522k424197p23189J656146L869752N461696
11678a3860357O200403O014797N169193M095694K895879J319019o32017k408901
11670H793710l427549l572590l005382j857862m89701K83751j67950j406869k175362
11661g025804j704160m61713N37233Q32168O81350M35689J90166p571n0446k4785
11651f597873k35521p21869r77380m81934O04473J628608K263385K709727L019147
$$ y = [-4150745, 7009531, 13662623, 15756576, 14765224, 12653861, 10750774, 9374024, 8097420, 6266032, 3647816, 845335, -1175427, -2181780, -3048418, -4759096, -7246776, -9578963, -11180249, -12453084, -14087273, -16057507, -17561299, -17938939, -17540861, -17584850, -19056043, -21700565, -24124762, -24847951, -23191805, -19322053, -13860357, -7659954, -1645157, 3524036, 7619730, 10515609, 11834628, 11202611, 8793710, 5366161, 1793571, -1211811, -3069673, -3559374, -3275623, -3443573, -4850442, -7025804, -8729964, -9191677, -8654444, -7822276, -7140926, -6705237, -6515071, -6522642, -6573088, -6597873, -6833394, -7555263, -8532643, -9014577, -8410104, -6781496, -4518111, -1808384, 1210763]
11642A210763K741881J612493K37219m04378o0428N81401P49154K91989m74879
11633F485215j253356j965483k734531l760998m969541n679023m913417k306967
11625b1098101J351484M587594O230716O004601M403613K178243r0139k004225
11617A563786l082029k794420j163797Q27385J855616J373904j25862j864774
11609c410191l307978l922356l113811r15747J615144L214930L491466K842785
11601c505758J573307l21759k514841m077368m136257k587563r2544K352921L797262
11592i512600L739759K573128J518241J748171L368476N247640N901771M687348
11584A9271934K320354K47109o86837j053594k187022m558032o929158p386231
$$ y = [1210763, 3952644, 5565137, 5802356, 5397978, 5337550, 5918951, 6668105, 6960094, 6485215, 5231859, 3266376, 531845, -3229153, -8198694, -13877717, -18791134, -21098101, -19746617, -15159023, -8928307, -2923706, 1479907, 3658150, 3568011, 1563786, -1518243, -4312663, -5476460, -4649075, -2793459, -1419555, -1545417, -3410191, -6718169, -10640525, -13754336, -14670083, -13054939, -9840009, -6348543, -3505758, -1932451, -2254210, -4769051, -8846419, -12982676, -15570239, -15662783, -13309862, -9512600, -5772841, -3199713, -1681472, 66699, 3435175, 8682815, 14584586, 19271934, 21592288, 21839397, 21152560, 20098966, 17911944, 13353912, 6424754, -961477]
11576i61477n250746j785988J044755K305006K457192K339468K264889K175631
11568D588730K177581K492806L020124L293154K884361J690193k3552j581829
11560A8541568k130865j456146n77660r26298k675930m377544m569894l294396
11552a467165j589148M5771J958721M275371O245405O846096N645271L004913
11544B4965235j69981k821472m319024m834335m854819m303689k616016J36634
11536A182533K699134L611490K489333P0035k669170n028329o492928o720687
11528a0858589n754088m013451k058492m65634K73669O5626o54560j376689j961862
11519b6804070k314520j863363l0922K708277M893196N521368M934938L901804
$$ y = [-961477, -6212223, -7998211, -6953456, -4648450, -2191258, 148210, 2413099, 4588730, 6766311, 9259117, 12279241, 15572395, 18456756, 20146949, 20123397, 18541568, 16410703, 14954557, 14376897, 13450599, 10774669, 6397125, 1827231, -1467165, -3056313, -3010542, -1051821, 3223550, 9468955, 16315051, 21960322, 24965235, 24795254, 21973782, 17654758, 12820423, 7965604, 3661915, 1045899, 1182533, 3881667, 7493157, 9982490, 10052525, 7383355, 2355026, -4137902, -10858589, -16612677, -20626128, -22684620, -23150254, -22876585, -22810959, -23465519, -24842208, -26804070, -29118590, -30981953, -31012875, -28304598, -23411402, -17890034, -12955096, -9053292]
11511i053292K369702j35414l079583m747197l840943q77114K276823M029874
11503a3057144M112947L383325K982812L559044M887881O063140O169602M918055
11495B3019662K689801M0891k721705n432847p662768q683676q079335o339037
11487a3169014m517157l133506j704443L02744K294791K915828J677000k73785
11479a5607542j260133n98036J188008L154540M453056M459908L203036J737110
11471G29947J434584K545822L802684L780891K472852J235509J282879K483434
11463A9768602L643934L761456K841920J540985K81238r34303j867924j793315
11455B7242593m16982J206839J396542l52157k761928m158348l994161k767659
$$ y = [-9053292, -6683590, -6819004, -9898587, -14645784, -18486727, -19363841, -17087018, -13057144, -8944197, -5560872, -2578060, 980984, 5868865, 11932005, 18101607, 23019662, 25709463, 25750354, 23028649, 17595802, 9933034, 1249358, -6829977, -13169014, -17686171, -20819677, -22524120, -22221376, -19926585, -17010757, -15333757, -15607542, -16867675, -17465711, -16277703, -13123163, -8670107, -4210199, -1007163, 729947, 2164531, 4710353, 8513037, 12293928, 14766780, 16002289, 17285168, 19768602, 23412536, 27173992, 30015912, 31556897, 31838135, 30903832, 29035908, 27242593, 26825611, 28032450, 29428992, 29076835, 26314907, 22156559, 18162398, 15394739]
11447A5394739j030112Q90674K451916K925005K049184L08756j537146k957805
11439A8495211l729065l910986l871932m009220m256860m095693l201993j845920
11431a0426458m67188Q71319K300764L626744M441300M765153N150134N920875
11423A6182643O561882O114049M098676R44221k302837m518077n064142m317298
11415A7699117l626331m263036o168609p971602q377178p279720n418189l385872
11407b8791420j345791O00904K268759L508710M077056L499873J534758j233686
11399a5880837l691793n146031n601565n108372l403199n00276K742469N058468
11391c1531136N726966M974526L567927K112385O51738j035622k644529l080724
$$ y = [15394739, 14364627, 15255301, 17707217, 20632222, 22681406, 22990162, 21453016, 18495211, 14766146, 10855160, 6983228, 2974008, -1282852, -5378545, -8580538, -10426458, -10893646, -10022327, -7721563, -4094819, 346481, 5111634, 10261768, 16182643, 22744525, 28858574, 32957250, 33901471, 31598634, 27080557, 22016415, 17699117, 14072786, 9809750, 3641141, -4330461, -12707639, -19987359, -25405548, -28791420, -30137211, -29536307, -27267548, -23758838, -19681782, -16181909, -14647151, -15880837, -19572630, -24718661, -30320226, -35428598, -38831797, -39332073, -36589604, -31531136, -25804170, -20829644, -17261717, -15149332, -14497594, -15533216, -18177745, -21258469]
11383b1258469j426975J873402N239821P320465P637341O042496K533237k003234
11375E958084n756167p481576p572989p057611o108732m403629k502325j683150
11367c6608095k268256l013188k515911o66838J570725L314478M353499M923496
11359c0910090N256756N310574M860652L900762K806600J930062J262503P88068
11351d794113Q38945J565145K287159K071539R09344l49041j219795j955798k546893
11342c193508k244159o19286J468387K528028J790285l49092k776958m254095
11334g650398m144020l091425k569817l231812m065914l687181k015455N376J928816
11325b8521830M038959O087080O826472N306376K120085j024689k656787k276077
$$ y = [-21258469, -22685444, -20812042, -15572221, -8251756, -614415, 5428081, 7961318, 5958084, 201917, -7279659, -14852648, -21910259, -28018991, -32422620, -34924945, -36608095, -38876351, -41889539, -44405450, -45072288, -43501563, -40187085, -35833586, -30910090, -25653334, -20342760, -15482108, -11581346, -8774746, -6844684, -5582181, -4794113, -3955168, -2390023, -102864, 1968675, 2878019, 2528978, 1309183, -646615, -3193508, -5437667, -6056953, -4588566, -2060538, -270253, -619345, -3396303, -7650398, -11794418, -14885843, -17455660, -20687472, -24753386, -28440567, -30456022, -30450646, -28521830, -24482871, -18395791, -11569319, -6262943, -4142858, -5167547, -7824334, -10100411]
11317a0100411k76824K323865M291126M863924M209904L025328J686614K4079
11309A0047605j983150l525702l326812q59770K908573O211943P957599Q350460
11301B5780746Q061147P131166N034607J711652j854855m304497n079948m850764
11293C1629254m729892n069166n117682l988832j868265m865M68713o45080k957935
11284G716250o008543q976513j0412546r126012n440577j056328K422932M448340
11276b6432997N140033M678948L371226J775232L47726p42744j239536p42977
11268a3845089N30162J396019P96006r26884k443178k990766k826797k181013
11260b2491540o94607J644508L711898M159183K904993J135112p1875n86768p60089
$$ y = [-10100411, -10377235, -8053370, -3762244, 1101680, 5311584, 8336912, 10023526, 10047605, 8064455, 4538753, 1211941, 352171, 3260744, 9472687, 17430286, 25780746, 33841893, 40973059, 46007666, 47719318, 45864463, 41559966, 36480018, 31629254, 26899362, 21830196, 16712514, 12723682, 10855417, 10850552, 11319265, 10674185, 7716250, 1707707, -7268806, -17681352, -26807364, -32247941, -33304269, -30881337, -26432997, -21292964, -16614016, -13242790, -11467558, -11119832, -11862576, -13102112, -13845089, -13314927, -11918908, -11122902, -12049786, -14492964, -17483730, -20310527, -22491540, -23186147, -21541639, -17829741, -13670558, -10765565, -9630453, -9702328, -10289096, -11049185]
11251a1049185p39071m93940j17717K24282M85990P05645R11856J153816J452834
11242g465490J667953J657825J656052K120394K935962L079439J545322j421692
11234E775765m371171n983450o126859n551187m814630l753269j987932K58895
11226b6553838K152338L232471M164015N971765Q463713J0056944R609794P916106
11218B5013308O686663O316441N471823K906351j058763n007463p646651q261331
11210B4420378o716741l682446n22867J635532K680083L107040L122628K539444
11202B6583051J364930N1128q23353q92199j72870Q44875J461863J411996J092178
11193C0921599R25405P73644L19310l02734p88906j368634k576528m336284n874351
$$ y = [-11049185, -11788256, -12282196, -12399913, -12175631, -11689641, -10983996, -10072140, -8918324, -7465490, -5797537, -4139712, -2483660, -363266, 2572696, 5652135, 7197457, 5775765, 1404594, -4578856, -10705715, -16256902, -21071532, -24824801, -26812733, -26553838, -24401500, -21169029, -17005014, -11033249, -2569536, 7487408, 17097202, 25013308, 31699971, 38016412, 43488235, 46394586, 45335823, 40328360, 32681709, 24420378, 17703637, 14021191, 13498324, 15133856, 17813939, 20920979, 24043607, 26583051, 27947981, 27999109, 27175756, 26283557, 26110687, 26955562, 28417425, 29829421, 30921599, 31847004, 32620648, 32939958, 32637224, 31848318, 30479684, 27903156, 23566872, 17692521]
11184A7692521o653178o867402o874140o644740n997239m902191l286530r76154
11176b4509053J796678M164227N319393N277284M663312L965803L312064K751917
11168F741625K335365J987083J667844J616937K086511K837283L228810K849883
11160B5351341J768716J66303j834362l770050m691033l918439j915799k5331
11152A1131346P96455P77502P84277J248628J906296K421648K760278K735262
11144B4561692J649458r57086m178743o021364n302469l019184j328603j264145
11136D139556j991219k345236k399241l028961m387583n566093n767022n193565
11128b6539364m556047m160349l801840l215604k244771q02655Q84534K115397
$$ y = [17692521, 11039343, 4171941, -2702199, -9346939, -15344178, -20246369, -23532899, -24509053, -22712375, -18548148, -13228755, -7951471, -3288159, 677644, 3989708, 6741625, 9076990, 11064073, 12731917, 14348854, 16435365, 19272648, 22501458, 25351341, 27120057, 27286360, 25451998, 21681948, 16990915, 13072476, 11156677, 11131346, 11927801, 12705303, 13489580, 14738208, 16644504, 19066152, 21826430, 24561692, 26211150, 25254064, 21075321, 15053957, 9751488, 6732304, 5403701, 4139556, 2148337, -196899, -2596140, -5625101, -10012684, -15578777, -21345799, -26539364, -31095411, -35255760, -39057600, -42273204, -44517975, -45320630, -44436096, -42320699]
11120d2320699K286755J689626J312387J704325K406528K728398K719966K954688
11112b4518026L493768L530090K224704k85756k841523m157654l732835j953203
11104b8240435N53175L475648O608023R224432J0086704Q394753M692644O41742
11096A5436686k173587l256653l205240k895374k668175k275618j583792j094247
11088c716000j408075k183441k117533k64160K934187O181821Q485226R357794
11080A7269819Q378013N452132J522680j820903l746615m612193m764197l677752
11072A4000984r31541K481390M679899M680851L072734R92501r01939k361907
11064B5712972l168827l270322k971771k665286k581077k978452m180311o001470
$$ y = [-42320699, -40033944, -38344318, -37031931, -35327606, -32921078, -30192680, -27472714, -24518026, -21024258, -17494168, -15269464, -15555220, -18396743, -22554397, -26287232, -28240435, -27687260, -24211612, -17603589, -8379157, 1707547, 10102300, 14794944, 15436686, 13263099, 10006446, 6801206, 3905832, 1237657, -1037961, -2621753, -3716000, -5124075, -7307516, -9425049, -9689209, -6755022, -573201, 7912025, 17269819, 25647832, 31099964, 32622644, 30801741, 27055126, 22442933, 17678736, 14000984, 13069443, 15550833, 20230732, 24911583, 27984317, 28976818, 28074879, 25712972, 22544145, 19273823, 16302052, 13636766, 11055689, 8077237, 3896926, -2104544]
11056b104544p405929p277359n544146l158689r64719R97098L002443M981187
11048a7474658O652089P936210Q773976Q720169P268467M674973K027434K01138
11040B8779798j078288k857910n633940q537453r913362q763405n699310k491927
11032a6195797o32878l13316p28399j095043j121025o93526L41407J879473L378195
11023a5180909M271319M407575L883696K656163O34030j907911m272639n730042
11015a1238718n884192m794142k917523q47527J041229K587076L475076L327226
11007a5251495K515336K415625M063343O604576P879591O777234M338330K186972
10999B1529512N87106j267450l535555n265898n663650n010202l994592k683529
$$ y = [-2104544, -9510473, -16787832, -22331978, -25490667, -26455386, -25458288, -22455845, -17474658, -10822569, -2886359, 5887617, 14607786, 21876253, 26551226, 28578660, 28779798, 27701510, 24843600, 19209660, 10672207, 758845, -8004560, -13703870, -16195797, -16828675, -17141991, -17870390, -18965433, -20086458, -20779984, -20438577, -18559104, -15180909, -10909590, -6502015, -2618319, 37844, 671874, -1236037, -5508676, -11238718, -17122910, -21917052, -24834575, -25682102, -24640873, -22053797, -18578721, -15251495, -12736159, -10320534, -6257191, 347385, 8226976, 15004210, 19342540, 21529512, 22116618, 20849168, 17313613, 12047715, 6384065, 1373863, -2620729, -5304258]
10991e304258o70485J929594M081711M583576L186150J005188j85245P21076L273221
10982A2620528N790969O647959N403453K902175M39747j197225k075624k723533
10974B7808449l516891m447598n284444n643894m891745k457937J300384M729015
10966G595339N907869M214176O49359l277072o510230q336283q175999o179196
10958a4112037l644734k027347j426227n96520J400362M035638O015066O700992
10950c654807O471957N968785N454168M855247M028823K878188J466264J52251
10942B7620876n44153l74796L77184J149985J579517J636988J310284L42736j446809
10933C1651812l528292m665177l965408j949200k36163l8423j195308k722442
$$ y = [-5304258, -5974743, -4045149, 36562, 4620138, 7806288, 8811476, 8626231, 9347307, 12620528, 18411497, 25059456, 30462909, 33365084, 33804831, 32607606, 30531982, 27808449, 24291558, 19843960, 14559516, 8915622, 4023877, 1565940, 2866324, 7595339, 13503208, 17717384, 18366743, 15089671, 8579441, 243158, -7932841, -14112037, -17756771, -19784118, -21210345, -21806865, -20406503, -16370865, -10355799, -3654807, 2817150, 8785935, 14240103, 19095350, 23124173, 26002361, 27468625, 27620876, 27076723, 26701927, 27079111, 28229096, 29808613, 31445601, 32755885, 33098621, 31651812, 28123520, 23458343, 19492935, 17543735, 17307572, 17269149, 16073841, 13351399]
10925A3351399l827360m069710l039878o63886K175043L999766M039958K862970
10917A4828302J577306P77319L99513P7260p86990k866017o126736r252535j0476654
10908a1849232r249004o757302m611921l297276k130832m54018J552290L198753
10900c3598542M046727M158006L811711L256548K715241K338601J962004J052593
10892a0257111p97788l223681n103225n415691m099139k013397j28309J130041
10884b9908300J787024J859457J255470J17996j023701j683109j881185j892478
10876c1368826j568480l62782J721542L596458M030940L087488K185425K641651
10868a6036584M432985O402511P299677O544103M457200K085845N21289K8383
$$ y = [13351399, 9524039, 5454329, 2414451, 1750565, 3925608, 7925374, 11965332, 14828302, 16405608, 17182927, 17582440, 17659700, 16872710, 14006693, 7879957, -1372578, -11849232, -21098236, -27855538, -32467459, -35764735, -37895567, -38349585, -36797295, -33598542, -29551815, -25393809, -21582098, -18325550, -15610309, -13271708, -11309704, -10257111, -11054899, -14278580, -19381805, -24797496, -28896635, -30910032, -31038341, -29908300, -28121276, -26261819, -25006349, -24888353, -25912054, -27595163, -29476348, -31368826, -32937306, -33300088, -31578546, -27982088, -23951148, -20863660, -18678235, -16036584, -11603599, -5201088, 2098589, 8642692, 13099892, 15185737, 15707026, 15735409]
10860A5735409p7721n43674j362984j992731k079937j692645j100614o95678r16055
10851E273370j793058k655912k739772k113394j615411j816703k411327k692723
10843a2564930k196391o88959J992527N568683Q913007J0545779R799534P381092
10835B8750342M665964K535659J002877k28028j259605k202712l426760n021505
10827B4816232o077654n210088k190841J371818L508566L868449L785303M525321
10819B8397106O006675P264629P595254O925509N409620L134661L24865k325466
10811F2732853l771993l403235j885199r73077k075308m957640q040384r849453
10803B7776564r929635q608791o496317m308336k623366j462493l48061J044842
$$ y = [15735409, 15657688, 15114014, 13751030, 11758299, 9678362, 7985717, 6885103, 6189425, 5273370, 3480312, 824400, -1915372, -4028766, -5644177, -7460880, -9872207, -12564930, -14761321, -15450280, -13457753, -7889070, 1023937, 11569716, 21369250, 28750342, 33416306, 35951965, 36954842, 36726814, 35467209, 33264497, 29837737, 24816232, 18738578, 13528490, 11337649, 12709467, 16218033, 20086482, 23871785, 28397106, 34403781, 41668410, 49263664, 56189173, 61598793, 64733454, 65058319, 62732853, 58960860, 55557625, 53672426, 52699349, 50624041, 45666401, 37626017, 27776564, 17846929, 9238138, 2741821, -1566515, -4189881, -5652374, -6000435, -4955593]
10795d955593K512116L638972M133677L754694K394407N31232q32644j148653
10787A0028208j009699j425847k542081l494098l506715k758762k080501k037353
10779h826848k395323k369433j404480J96852J509936J976013K006113K385753
10771f921417L225775L840438L644429K823665K026052J690299J846340K312805
10763A4488386K807722K990255K699300K153941J657374J070069p9704j744851
10755B6042492k953824k751135j476039n56188q78593j892484k623778k984286
10747I926165l429683l718817k935707q09090J738917L565888M219754L716374
10739A2273801K173728J18166j487160k159805k451454l007100l456545k949695
$$ y = [-4955593, -2443477, 1195495, 5329172, 9083866, 11478273, 12009505, 11176861, 10028208, 9018509, 7592662, 5050581, 1556483, -1950232, -4708994, -6789495, -8826848, -11222171, -13591604, -14996084, -14799232, -13289296, -11313283, -9307170, -6921417, -3695642, 144796, 3789225, 6612890, 8638942, 10329241, 12175581, 14488386, 17296108, 20286363, 22985663, 25139604, 26796978, 27867047, 27787343, 26042492, 23088668, 20337533, 18861494, 18305306, 17426713, 15534229, 12910451, 9926165, 6496482, 2777665, -158042, -967132, 771785, 4337673, 8557427, 12273801, 14447529, 14565695, 13078535, 10918730, 8467276, 5460176, 2003631, -946064]
10731i46064j549712k70697L20534Q29870K121940M164864O045580O831882O257364
10722B3805561M816973L317395K139732R18274q39598k877415m245040m185926
10714B2849956k641196j8056K952311N083131N190755L137957M2002k895167n388600
10705B8313093p575775r027154q916804p017557l947369m89298K774467N163863
10697g22534N951173N111639L628273K562191J913549P81348j297502l457527
10689A4470610m156688k661843K50452L043106M644338M818895L684764J519910
10681B5613544p72876j708075n58123J389919J687009p61634m387514o496317
10673A4005933n840545l363114p70018R86250J855415K078107J904231J632363
$$ y = [-946064, -2495776, -2766473, -2445939, -1616069, 505871, 4670735, 10716315, 17548197, 23805561, 28622534, 31939929, 34079661, 34997935, 34158337, 31280922, 27035882, 22849956, 20208760, 20190704, 23143015, 28226146, 33416901, 36554858, 36596860, 33701693, 28313093, 20737318, 11710164, 2793360, -4224197, -8171566, -8660864, -5886397, -722534, 5228639, 10340278, 13968551, 16530742, 18444291, 19225639, 17928137, 14470610, 10313922, 7652079, 7902531, 10945637, 15589975, 20408870, 24093634, 25613544, 24840668, 23132593, 22574470, 23964389, 25651398, 24889764, 20502250, 14005933, 8165388, 4802274, 4032256, 5018506, 6873921, 8952028, 10856259, 12488622]
10665A2488622J447920J185449N07980o04219j677511k108594j647658n52265
10657I039724O25966J410796J688499J689341J623966J315136K74420j782806
10649A5885042m504453o989830q307759q021449o375971m052619j689460L87549
10641b3668950J964872K667501K227490J065895J55376o0358k94240j400207k853799
10632b0196420k997978j075532J638220L296267L646052M002602N193724O312094
10624a80971N745109K938160j104172m634933o212866n397634k957132l84030
10616a2188469J055826R37067l82224j987949k659153j646475L86708J736707
10608a4747962J479475M92898J56757N65249Q21779O87257Q04386J238918R04432
$$ y = [12488622, 13936542, 15121991, 15629971, 15025752, 13348241, 11239647, 9591989, 9039724, 9665690, 11076486, 12764985, 14454326, 16078292, 17393428, 17667848, 15885042, 11380589, 4390759, -3917000, -11938449, -18314420, -22367039, -24056499, -23668950, -21704078, -19036577, -16809087, -15743192, -15587816, -15648174, -15942414, -17342621, -20196420, -23194398, -24269930, -22631710, -19335443, -15689391, -11686789, -6493065, -180971, 5564138, 8502298, 7398126, 2763193, -3449673, -8847307, -11804439, -12188469, -11132643, -10195576, -10577800, -12565749, -15224902, -16871377, -16484669, -14747962, -13268487, -12775589, -12618832, -12053583, -11231804, -10544547, -9740161, -8501243, -7596811]
10599g596811j047175l928867o111530o515942n215839l021986q74069O30453
10591c3681766J429357J658184J241355K38838n53172j39099J359195K676816
10583b5770292K977946K666705K271123J494721J33125r19115o89356K81908M84052
10574a7069183n52429j744574j948592j083960L32893J947899L563676M973901
10566a1580369O142255P200101Q073443Q382198P800129O296532M071034J541862
10558C7927185o56633j978217k285069j762503p47909J93713M38540j01859r39619
10549C0087629j882271l345447n267858o456796n961511m574946l843629l901475
10541e146304l515581k143613n72758O68205K149846M202439N817770N697432
$$ y = [-7596811, -8643986, -12572853, -18684383, -25200325, -30416164, -33438150, -34312219, -33681766, -32252409, -30594225, -29352870, -29114032, -29667204, -29806303, -28447108, -25770292, -22792346, -20125641, -17854518, -16359797, -16226672, -17145787, -17835143, -17553235, -17069183, -17621612, -19366186, -21314778, -22398738, -22065845, -20117946, -16554270, -11580369, -5438114, 1761987, 9835430, 18217628, 26017757, 32314289, 36385323, 37927185, 37270552, 35292335, 33007266, 31244763, 30496854, 30690567, 31129107, 31027248, 30087629, 28205358, 24859911, 19592053, 13135257, 7173746, 2598800, -1244829, -5146304, -8661885, -10805498, -11378256, -10710051, -8560205, -4357766, 1460004, 7157436]
10533G157436L793168J235862p48437j428953p00086P52731J718972J384800l3653
10524A3131840j592950k313215j736004l64875M35655m56975k809465n357111
10516a063100p044010p465491o494572m348420j862639J40813J637933K876496
10508b3622990L549805L494970L658173N019842O965092Q156517Q561193Q984186
10500B4766788R218819Q767253Q824243J0919487J3960075J5756640J7379456
10493A09592761K2284234L0925628M0771804N2048711O6533216P7219845O7000220
10486D66376419K6591505k8849176o9799192p9952114o7885147n1723985m0312677
10479A54445633l2115630k4679484j8159334j2465478o884482k285150l24114
$$ y = [7157436, 10950604, 12186466, 11438029, 10009076, 9308990, 10061721, 11780693, 13165493, 13131840, 11538890, 9225675, 7489671, 7124796, 7560451, 7103476, 4294011, -1063100, -8107110, -15572601, -22067173, -26415593, -28278232, -28137419, -26499486, -23622990, -20073185, -16578215, -12920042, -7900200, -935108, 7221409, 15782602, 24766788, 33985607, 42752860, 51577103, 62496590, 76456665, 92213305, 109592761, 131876995, 162802623, 203574427, 255623138, 322156354, 399376199, 466376419, 492967924, 464118748, 394319556, 314367442, 246482295, 194758310, 154445633, 122330003, 97650519, 79491185, 67025707, 60141225, 57856075, 57531961]
10472E7531961q60728k457208m517851o790642p921194o910256n164263m786300
10464A8123519n438395n039091l053495r68276K13083R66216J824879K664476
10456I292916L343254L614186K656804J86421k309589l102152k748719l301440
10448G631681n028063n830321m285341j502430O97240J918978K652566K850580
10440h95110K150891Q44874k63720o65437l90858J41660K69761l77856j223494
10431d09289j200305j75573O73169K88245r81837j956574k035586j517726p96913
10422h112389J38879J278369K007543J358064r36611l744057n318927m984767
10414a8313896l679958k606908j875287j024678l84691r27283k684699m077436
$$ y = [57531961, 56671233, 54214025, 49696174, 42905532, 34984338, 28074082, 22909819, 18123519, 12685124, 7646033, 4592538, 3624262, 3837345, 4803561, 6628440, 9292916, 12636170, 16250356, 18907160, 19093581, 16783992, 13681840, 10933121, 7631681, 2603618, -3226703, -7512044, -9014474, -8317234, -6398256, -3745690, -895110, 1255781, 2100655, 1836935, 1171498, 780640, 922300, 1192061, 814205, -409289, -1609594, -1785167, -1111998, -823753, -1805590, -3762164, -5797750, -7315476, -8112389, -7973510, -6695141, -4687598, -3329534, -4266145, -8010202, -13329129, -18313896, -21993854, -24600762, -26476049, -27500727, -27885418, -28812701, -31497400, -35574836]
10406c5574836l189583N39588N897515J0781210J3501380J3699573J2241623J0142729
10398B8039199P693818M747046J445685j835229n019305q143340j0655029j1503291
10390D769554j0138037p128527l757428j250643k49502n61604j370162k001458
10382b1687807k499396l245872m200003m835382m644262l381043j115275J460339
10374d4148701L056824K814166J310848Q3371J97728J648692L810969N758591
10366b5467512O327054M789234J735969j251493k959225l219208k450835j266981
10358b3762997n20225q88131k114193l244946l815053m203419m654219m680207
10350d7883390l832479k462257j212328j39605J185804K913769M574007N406502
$$ y = [-35574836, -38764419, -38224831, -32327316, -21546106, -8044726, 5654847, 17896470, 28039199, 35733017, 40480063, 41925748, 40090519, 35071214, 26927874, 16272845, 4769554, -5368483, -12497010, -16254438, -17505081, -17754583, -18316187, -19686349, -21687807, -24187203, -27433075, -31633078, -36468460, -41112722, -44493765, -45609040, -44148701, -41091877, -38277711, -36966863, -36883492, -36685764, -35037072, -31226103, -25467512, -19140458, -14351224, -12615255, -13866748, -16825973, -20045181, -22496016, -23762997, -24283222, -25171353, -27285546, -30530492, -34345545, -38548964, -43203183, -47883390, -51715869, -54178126, -55390454, -55530059, -54344255, -51430486, -46856479, -41449977]
10342d1449977M965047L615044K388060J956146J810022J011664k43478o06472
10334b6553944N59604K016902J969676J58999j905667k563895j368744R77678
10326b6709391L479148N468172O647280O838204N981971M512419L401787L337593
10318A2957183L882177L896927K834655J197512k84379j427088k480510l752888
10310A6823589n448918p364303q618998q241918o208941l430658o64956J883837
10302b1271266L771648M053276K385953k14535k283957l145803k891950j824031
10294b1420665n50474n0432p70512j853617j930063n82851J403627L006894L722878
10285a9025215L651403L346912L380731L637552L335593K154817R36808P23043
$$ y = [-41449977, -36484930, -32869886, -30481826, -28525680, -26715658, -25703994, -25947472, -26553944, -25994340, -23977438, -22007762, -21848763, -23754430, -26318325, -27687069, -26709391, -23230243, -17762071, -11114791, -4276587, 1705384, 6217803, 9619590, 12957183, 16839360, 20736287, 23570942, 24768454, 24484075, 23056987, 20576477, 16823589, 11374671, 4010368, -4608630, -12850548, -19059489, -22490147, -23155103, -21271266, -17499618, -13446342, -11060389, -11274924, -13558881, -16704684, -19596634, -21420665, -21971139, -22021571, -22792083, -24645700, -26575763, -27158614, -25754987, -22748093, -19025215, -15373812, -12026900, -8646169, -5008617, -1673024, 481793, 1418601, 2141644]
10277B141644J490651K442883L123782L494166L283517K187595N33117j122695
10269A7574660k867121m913815o333762n576735k621354M64561J698281J127460
10261a447825O0295q38751j871111l213034m361260m605311l608968j709566Q964
10252b1586567K79054j195400l303592m607387m597100l527722j522189J340360
10244c8720543M201177N614654M869343K561266l68518l554414o754801r043415
10236d1195251r234358p115572l747659m29818K261419M310679N617241N954263
10228d3579056N461291M774392M521244M827043N356262N677746N543534N006454
10220b411090M372498L858318L177702J728381n17767k493194k838711j277084
$$ y = [2141644, 3632295, 6075178, 9198960, 12693126, 15976643, 18164238, 18697355, 17574660, 14707539, 9793724, 3459962, -2116773, -4738127, -4273566, -2575285, -1447825, -1387530, -2226281, -4097392, -7310426, -11671686, -16276997, -19885965, -21595531, -21586567, -21307513, -22502913, -25806505, -30413892, -35010992, -38538714, -40060903, -38720543, -34519366, -28904712, -24035369, -21474103, -21842621, -25397035, -32151836, -41195251, -50429609, -57545181, -61292840, -61722658, -59461239, -55150560, -49533319, -43579056, -38117765, -33343373, -28822129, -23995086, -18638824, -12961078, -7417544, -2411090, 1961408, 5819726, 8997428, 10725809, 10208042, 7714848, 4876137, 3599053]
10212C599053J139236L176876M407136M926430M643856L350455J240245j178200
10204B5305087l597680n788932o963602n995577k755394J164435L621594L771015
10196H760946K452054R88076J44143J59752R98235K116749K482231J470339l08440
10187A9264085j529180j526053q10685k30791m9214k7351r496j4965P8552M61210
10177A5606112Q73981N25575j105548l420655m972748m775134l214002j510873
10169a993292m47103P7916L33787J68732n58063j355756j498291j031936q92987
10160g196993j792820l256374m041803l448286k029438r87777r46087j402148
10152b5101726j441123q59662k93794j83751o1857P21956J880630K462152K235349
$$ y = [3599053, 4738289, 7915165, 12322301, 17248731, 21892587, 25243042, 26483287, 25305087, 21707407, 15918475, 8954873, 2959296, 203902, 1368337, 4989931, 8760946, 11213000, 12201076, 12345219, 12504971, 13503206, 15619955, 18102186, 19572525, 19264085, 17734905, 16208852, 15398167, 15167376, 15118162, 15090811, 15081315, 15066350, 15144902, 15606112, 16480093, 17005668, 15900120, 12479465, 7506717, 2731583, -482419, -1993292, -2440395, -2362479, -2028692, -1859960, -2418023, -3773779, -5272070, -6304006, -7196993, -8989813, -12246187, -16287990, -19736276, -21765714, -22753491, -23699578, -25101726, -26542849, -27402511, -27696305, -27880056, -27941913, -27219957, -25339327, -22877175, -20641826]
10143b0641826K077001K633751L189886K515622O26849r61714q53025Q37893K947329
10134g628234M730193O343797P877580Q491617P102241L877916M63594j631059
10126B9627645k508966l303910m400536m927894m104089k439820j236708j257777
10118E447945k226915l335549l854583l442045k278251r25002J68214J009078
10110i437108J810302K548062K984417L029027K847737K625392K367481J929184
10102A0704494J182577K19849o05655r97969j078547j190153j360652j390196
10094E483748j593195k853484n424360q041770q883602p334000m321221j105509
10086c4073393J554047L045409K685353N05518k168670l613087l192352j623243
$$ y = [-20641826, -18564825, -15931074, -12741188, -10225566, -9598717, -10560431, -11413456, -10575563, -7628234, -2898041, 3445756, 11323336, 19814953, 26917194, 30795110, 31258704, 29627645, 27118679, 23814769, 19414233, 14486339, 10382250, 7942430, 6705722, 5447945, 3221030, -114519, -3969102, -7411147, -9689398, -10614400, -10446186, -9437108, -7626806, -5078744, -2094327, 934700, 3782437, 6407829, 8775310, 10704494, 11887071, 12106920, 11501265, 10503296, 9424749, 8234596, 6873944, 5483748, 3890553, 1037069, -4387291, -12429061, -21312663, -28646663, -32967884, -34073393, -32519346, -29473937, -26788584, -26283066, -28451736, -32064823, -35257175, -36880418]
10078c6880418J17048J668500L017485L873130L762058K626444R50425p51448
10070b1616776k255923l342133l599928k952151k162941k235721l167748l757243
10062d5090564k914060q42937J338722K838236L681712M232703M694549N024883
10054b7036756M931042L942794J873848o83393k605830l127907k374509j058267
10046b6138978J13205P55482Q89265Q82137J108618J492676J502359P60897l63134
10037a8997473r02707j61941J427259K339593J149956k014964n306035o709370
10029b9175682n788541l725182j793672k01460J540978L609814N610576P118575
10021b2804594Q027108Q242589P327847M823291J061991k532984m310961l708329
$$ y = [-36880418, -36763370, -35094870, -32077385, -28204255, -24442197, -21815753, -20865328, -21616776, -23872699, -27214832, -30814760, -33766911, -35929852, -38165573, -41333321, -45090564, -48004624, -48847561, -47508839, -44670603, -40988891, -36756188, -32061639, -27036756, -22105714, -18162920, -16289072, -16972465, -19578295, -22706202, -25080711, -26138978, -26025773, -25270291, -24381026, -23498889, -22390271, -20897595, -19395236, -18634339, -18997473, -19900180, -20062121, -18634862, -16295269, -15145313, -17160277, -22466312, -29175682, -34964223, -38689405, -40483077, -40684537, -39143559, -35533745, -29923169, -22804594, -14777486, -6534897, 792950, 5616241, 6678232, 4145248, -165713, -3874042]
10013c874042j615988N43977J871569K147771J498065L57142n14521n71643q9174
10004b46844J42759k66486j028992j730150k169493k104321j212710L88628J939864
9995f287745K647937K295946J105852o63280k718188m630301o074241p011315
9987b1335335p389108o865879n158944k573139O8613J968279K765255K749679
9979c5770579K924316M395447P053404R046255Q366289N143632J708832P5246
9971B942842M969O7830q2889M49289J851141K731937J835575j07579j075041k6444
9961H591630K213310M116537M618954L111728n98234n553057r458663j0203275
9953c161070p658251l572431J63543K672379L774273L406678J727580o29825k742077
$$ y = [-3874042, -5490030, -4946053, -3074484, -926713, 571352, 928494, 413973, -157670, -246844, -104085, -370571, -1399563, -3129713, -5299206, -7403527, -8616237, -8227609, -6287745, -3639808, -1343862, -238010, -901290, -3619478, -8249779, -14324020, -21335335, -28724443, -35590322, -40749266, -43322405, -43253792, -41285513, -38520258, -35770579, -32846263, -28450816, -21397412, -12351157, -3984868, 1158764, 2867596, 2942842, 2947811, 3015641, 2932752, 3382041, 5233182, 7965119, 9800694, 9693115, 8618074, 8591630, 10804940, 14921477, 19540431, 22652159, 22053925, 16500868, 7042205, -3161070, -10819321, -14391752, -14228209, -11555830, -7781557, -4374879, -2647299, -3277124, -6019201]
9944f019201l719911k950297n48821K255567L722014L029444R35636j141971k323571
9935f761111k337385j022055J484542M203392N696961N263825L468463J420105
9927A1416737j65403j155984j693190j973010k133786k116629j707176q39463
9919c67904K44258J246626K084104K707798K752232J691231m68697k783152l910926
9910C195570l176426j089064J129283K433360K532740K010520K030091L505637
9902A2571711O117737Q352047Q978857Q327538P507108O504763L995906o26437
9894F1729230n903245r681612j1255617j1382748j0676650r011374o368785l247090
9886e797891j07226K684493M199355L285450J37109l266660n002376m945814m064982
$$ y = [-6019201, -9739112, -12689409, -13238230, -10982663, -7260649, -4231205, -3295569, -4437540, -6761111, -9098496, -10120551, -8636009, -4432617, 1264344, 6528169, 9996632, 11416737, 11251334, 10095350, 8402160, 6429150, 4295364, 2178735, 471559, -367904, -123646, 1122980, 3207084, 5914882, 8667114, 10358345, 9889648, 7106496, 3195570, 19144, -1069920, 59363, 2492723, 5025463, 7035983, 9066074, 12571711, 18689448, 27041495, 36020352, 44347890, 51854998, 58359761, 62355667, 61729230, 55825985, 46144373, 34888756, 23506008, 12829358, 3817984, -2550801, -5797891, -5905117, -3220624, 978731, 4264181, 4401290, 1134630, -3867746, -8813560, -12878542]
9877a2878542k624484q4407L471622O827271Q702104Q662018O896406L801845
9869B2773833N6003l420520n912607p111500o918383n552805l899269l079870
9861a3065118l346539l865792l898361l690380l796799m001289l476319j759174
9853d0899771R08384L957790O685682Q252536Q086964O381379L929979J606447
9845a090610K12651L52865J753653K940583K456041N19245j193952j534979r62674
9836C452823n11975n16707p49180j037505j089286k87096J550066L509196M398371
9827H718707M021334K997319J553962o41406l396959n595337o304223n829502
9819d476105n275305n286770n457996m802348k696984M10504L155237M395063
$$ y = [-12878542, -15503026, -15587433, -12115811, -5288540, 3413564, 12075582, 18971988, 22773833, 22829836, 19409316, 13496709, 6385209, -533174, -6085979, -9985248, -13065118, -16411657, -20277449, -24175810, -27866190, -31662989, -35664278, -39140597, -40899771, -39991387, -36033597, -29347915, -21095379, -13008415, -6627036, -2697057, -1090610, -877959, -525094, 1228559, 4169142, 6625183, 7144428, 5950476, 4415497, 3452823, 2940848, 2424141, 1674961, 637456, -451830, -738926, 811140, 4320336, 8718707, 12740041, 15737360, 17291322, 16649916, 13252957, 7657620, 1353397, -4476105, -9751410, -15038180, -20496176, -25298524, -27995508, -27585004, -24429767, -20034704]
9811b0034704M314664M137392M680160N555249N904177N403258M187007K271590
9803A6418793k47496k556854l439407k531009q56890J93405J53099n35296j469970
9794E128375k619118l677128l716140j956629J271563M655192O887355P321796
9786A3295266N946567L294118L96006j772114l100758m250107n544149o406163
9778A858666o211974n225826m163767l186094j973049n91562M55051J047726J614395
9769a6376434K301794K616077K209351J553031J458113K204257L387816M367682
9761C721687M699000M452745M258522M622834N003320M068199J270370k273226
9753B9823451m987714o601658q098711j0050918j1602397j1213947q113956l096983
$$ y = [-20034704, -15720040, -11582648, -6902488, -1347239, 4556938, 9960196, 14147203, 16418793, 16171297, 13614443, 10175036, 7644027, 6787137, 6980542, 7133641, 6598345, 5128375, 2509257, -1167871, -4884011, -6840640, -5569077, -913885, 5973470, 13295266, 19241833, 22535951, 22931957, 21159843, 18059085, 13808978, 8264829, 1858666, -4353308, -9579134, -13742901, -16928995, -18902044, -19493606, -19038555, -17990829, -16376434, -14074640, -11458563, -9249212, -7696181, -6238068, -4033811, -645995, 3721687, 8420687, 12873432, 17131954, 21754788, 26758108, 30826307, 32096677, 29823451, 24835737, 18234079, 10135368, 84450, -11517947, -22731894, -30845850, -33942833]
9745c3942833J764379M386068M259807K902212K320717K978596L686541L453512
9737h191001K712139K377951K363618J738677J12410j833300l197394l651670
9729g568570l215917j801968N31610L055932M591343M440645L006260J442844
9721D482179P55309J156816K080629K689233K457797J436457J09497q55781p45315
9712A3566821R48373L948344O850291P833330O089071K465816j426587m543932
9704C5731527o723575q086732q603458q158986o717420m529001k428176j564260
9696a1080081k228134l147294k730755j046825K48183J21981o12885p37999l41964
9687b1555773j99184o1551J254026M097911P222823R017387Q954525P688719O205037
$$ y = [-33942833, -32178454, -27792386, -23532579, -20630367, -18309650, -15331054, -11644513, -8191001, -5478862, -3100911, -737293, 1001384, 1113794, -719506, -3916900, -7568570, -10784487, -12586455, -12054845, -8998913, -4407570, 33075, 3039335, 4482179, 5237488, 6394304, 8474933, 11164166, 13621963, 15058420, 15167917, 14312136, 13566821, 14515194, 18463538, 25313829, 33147159, 39236230, 41702046, 40275459, 35731527, 29007952, 20921220, 12317762, 4158776, -2558644, -7087645, -9515821, -11080081, -13308215, -16455509, -19186264, -20233089, -19984906, -19862925, -20475810, -21213809, -21555773, -21754957, -21816508, -20562482, -16464571, -9241748, -224361, 8730164, 16418883, 22623920]
9678B2623920N031288L966109K532365R02249R1359P13933J802033J675379K3552
9669C9362187j684914k071145j323169m49103J25987N48204P13606L19262m80280
9660C5060635j244790k100115l755566o383505q818602r225098o680637k179356
9652e327034J961112L927513L787389K935092K291328J572229M39961m41216k13041
9643A0933333P78627J315801R83155O89629J369755K881447M462465N603687O008002
9634C5025901N244595L154253M24733j850117l218421m018100m415934l839674
9626B6507236j792786R85248K723299K245345K17079j470834j523329k87181Q85474
9617B8489551R42062k43629k046757l477526l644096k368469m43935R86997J379286
$$ y = [22623920, 27655208, 31621317, 34153682, 35055931, 35147290, 35861223, 37663256, 39338635, 39362187, 37677273, 35606128, 34282959, 33833856, 33959843, 34508047, 35221653, 35540915, 35060635, 33815845, 31715730, 27960164, 21576659, 12758057, 3532959, -3147678, -5327034, -3365922, 561591, 4348980, 7284072, 9575400, 11147629, 11587590, 11146374, 10933333, 11711960, 13027761, 14010916, 14700545, 16070300, 18951747, 23414212, 29017899, 35025901, 40270496, 43424749, 43849482, 41999365, 38780944, 34762844, 30346910, 26507236, 24714450, 25699698, 28422997, 30668342, 30885421, 29414587, 27891258, 27604077, 28489551, 29431613, 29187984, 27141227, 23663701, 20019605, 17651136, 17207201, 18194198, 19573484]
9608A9573484R99224L51706l03923r51724j672223k476137l019902k667415j322732
9599H510358r6839m47509k445955m482098n011435m115135l016090k596782k895334
9590a6596819l609392m413713m939208n004432m825727m606886m054900k708253
9582e0759330o05147J750079L845221N124609M851150K806158O9402j723513k087320
9573c6728691j972883k153708k086785q49222J357305L245442L762927K996044
9565c2429571J966763J798731K804590M108819M430244L479775K272366J822663
9557i745620J963930J822465R86067l69522k127680m215435o028915o657704n916550
9548c0288964m650224l755679l225294k345660n82954J866022M155395N299987
$$ y = [19573484, 20572708, 20924414, 20620491, 19668767, 17996544, 15520407, 12500505, 9833090, 8510358, 8413519, 7966010, 5520055, 1037957, -3973478, -8088613, -11104703, -13701485, -16596819, -20206211, -24619924, -29559132, -34563564, -39389291, -43996177, -48051077, -50759330, -51364477, -49614398, -45769177, -40644568, -35793418, -32987260, -32917858, -34641371, -36728691, -38701574, -40855282, -42942067, -43791289, -42433984, -39188542, -35425615, -32429571, -30462808, -28664077, -25859487, -21750668, -17320424, -13840649, -11568283, -9745620, -7781690, -5959225, -4973158, -5342680, -7470360, -11685795, -17714710, -24372414, -30288964, -34939188, -38694867, -41920161, -44265821, -44848775, -42982753, -38827358, -33527371]
9540c3527371M868646L379072J879899J000892M82372l14845j560960k703311
9532b6495606k988272k151619n73565J198578K898606M351240N089064M735703
9524a3935871L867496L818987N152457O821730P481286P186918O911828O612594
9516C3917425M985504J538827k068450l564594k512112n31944O70410Q23318O71693
9507C3930077P29253Q30459O63148L06468O1793r2051n37671j360374j949223
9498C2581879j677031r06887q29213k109552m020247n133350m676829l077307
9490A0151463j417350n62664o41632j133883j440377j366761j029318n26309k5629
9481B007540J3184p31581j748334k001491j139556J09313R64965J430126J721676
$$ y = [-33527371, -28658725, -25279653, -23399754, -22398862, -21916490, -22231335, -23792295, -26495606, -29483878, -31635497, -32209062, -31010484, -28111878, -23760638, -18671574, -13935871, -10068375, -6249388, -1096931, 5724799, 13206085, 20393003, 27304831, 33917425, 38902929, 40441756, 38373306, 34808712, 32296600, 31764656, 32435066, 33258384, 33930077, 34659330, 35489789, 36152937, 36459405, 36521198, 36429147, 35891476, 34531102, 32581879, 30904848, 29997961, 29168748, 27059196, 23038949, 17905599, 13228770, 10151463, 8734113, 8171449, 7529817, 6395934, 4955557, 3588796, 2559478, 2033169, 2007540, 2020724, 1289143, -459191, -2460682, -3600238, -3490925, -2525960, -1095834, 625842]
9472F25842J484813K71186j493322k718033k809357k162156j527884j269134j169206
9463a0767251o29864Q38759K953794M568650M601281K983292M26990k457878n297846
9454b780073p443218q111274p221086n511049l574663j252609J692248M647367
9446b9554357O293529N602789K592862j650099n476984p433684o935121m430316
9438d0991381j021765K038426L734054L664705K304379P35220r6052N5519P87344
9429b8789551J499680J812819J724461J441559J064210N50172K0138k11246j62646
9420b1050404m24078j375258k316101j977816j651K555195M300279M649947L797729
9411a1842158K129520P7574j767500k817241k719232j389084Q76829L203559M494928
$$ y = [625842, 2110655, 2381841, 888519, -1829514, -4638871, -6801027, -8328911, -9598045, -10767251, -11397115, -10558356, -7604562, -3035912, 1565369, 4548661, 4975651, 2517773, -2780073, -10223291, -18334565, -25555651, -31066700, -34641363, -35893972, -34201724, -29554357, -23260828, -17658039, -15065177, -16715276, -22192260, -29625944, -36561065, -40991381, -42013146, -39974720, -36240666, -32575961, -30271582, -29536362, -29632414, -29576895, -28789551, -27289871, -25477052, -23752591, -22311032, -21246822, -20696650, -20676512, -20887758, -21050404, -21474482, -22849740, -25165841, -27143657, -27145308, -24590113, -20289834, -15639887, -11842158, -9712638, -9635064, -11402564, -14219805, -16939037, -18328121, -17451292, -14247733, -9752805]
9402i752805M347635L404286K615246K462700L057211M408319O057942O846339
9394B3446873N766336L011827k90525l233386n452451o483300n684998l151087
9386G929289j20183J991196K720143K485868J763489P41359m07988j362197j774819
9377A3966157j355383M4243K074240L649964L530946J456597j420054l486927
9369A8459783m095089l939250m084733m815862n494085n322722m028881j923526
9361a5244365L43548J983267K367961J508774K19980m44804k9893J073293K119368
9352f102871K596374K401161J722495R04852L04611R8986J72094J90752j83347
9343B105107j070041k271856l416501m242349m697304m750415m286328l328108
$$ y = [-9752805, -5405170, -2000884, 614362, 3077062, 6134273, 10542592, 16600534, 23446873, 29213209, 32225036, 31934511, 28701125, 23248674, 16765374, 11080376, 7929289, 7809106, 9800302, 12520445, 15006313, 16769802, 17511161, 17103173, 15740976, 13966157, 12610774, 12655017, 14729257, 18379221, 21910167, 23366764, 21946710, 18459783, 14364694, 10425444, 6340711, 1524849, -3969236, -9291958, -13320839, -15244365, -14900817, -12917550, -10549589, -9040815, -8820835, -9265639, -9295532, -8222239, -6102871, -3506497, -1105336, 617159, 1522011, 1826622, 1925608, 2097702, 2288454, 2105107, 1035066, -1236790, -4653291, -8895640, -13592944, -18343359, -22629687, -25957795]
9335b5957795k197649j226272m33195K38112N21551J20817o08710q33630l50848
9326c0727619m2356p88636k246695l220987l068702k164606j000613N16694K563992
9317d0179528M646648N825017N598750M267610K493346Q31492k59444l08052Q78943
9308a6205218K760171M175373M220023L006176J333543l68143k342994m522594
9300g943663n714744m483214q75672L270204N941694O514559N653483M277348
9292F639995L036944K319626K055707J587852L08778j461197k631429k494124
9284I362152j399444j88601O56349J043845P93236l62171k222195l935148m685319
9275i37296m530064m296037m527114m736712l964493k011327J78359J425355J363508
$$ y = [-25957795, -28155444, -29381716, -29814911, -29576799, -29055248, -28934431, -29543141, -30376771, -30727619, -30769975, -31558611, -33805306, -37026293, -40094995, -42259601, -43260214, -42743520, -40179528, -35532880, -29707863, -24109113, -19841503, -17348157, -16516665, -16776109, -17084161, -16205218, -13445047, -9269674, -5049651, -2043475, -709932, -1078075, -3421069, -7943663, -13658407, -18141621, -19017293, -15747089, -9805395, -3290836, 2362647, 6639995, 9676939, 11996565, 14052272, 15640124, 15948902, 14487705, 11856276, 9362152, 7962708, 7774107, 8430456, 9474301, 10267537, 9905366, 7683171, 3748023, -937296, -5467360, -9763397, -14290511, -19027223, -22991716, -25003043, -24824684, -23399329, -22035821]
9266b2035821N27832k93583o35908n71115n92379j122410j992671k633464k869350
9257c2218869l102442l438548l125237j412403J308634L797633N225139N611220
9249b7354873N231387M299080L219530K465450K073505J818946J917669K837890
9241c491416M204316M620934L086365K15765k286015l086133k027559L7042J908605
9232C181904K898148L302899L841865M681004N478306O238823P256370Q095726
9224D4975045P690171N932544M175247L427835K964241J641763k33971j591035
9216F8981840k578998m426261p351649r866693j0391781q649037n330012j375451
9208A9011958K103794M109113M550303M311410M188558M110780L495504J860786
$$ y = [-22035821, -21507989, -21801572, -22437480, -23008595, -23600974, -24723384, -26716055, -29349519, -32218869, -35321311, -38759859, -41885096, -43297499, -41988865, -38191232, -32966093, -27354873, -22123486, -17824406, -14604876, -12139426, -10065921, -8246975, -6329306, -3491416, 712900, 5333834, 8420199, 8635964, 6349949, 3263816, 1236257, 1273299, 3181904, 6080052, 9382951, 13224816, 17905820, 23384126, 29622949, 36879319, 44975045, 52665216, 58597760, 62773007, 66200842, 69165083, 70806846, 70572875, 68981840, 66402842, 61976581, 54624932, 44758239, 34366458, 25717421, 20387409, 19011958, 21115752, 25224865, 29775168, 34086578, 38275136, 42385916, 45881420, 47742206]
9200D7742206r93967m767576q363509j0362217j0119052q131943n362534k702289
9192c060881r89645o55305j045240q23020N55316K317212L554877M194672M423662
9183H471648M009393K915614J968459K021102K728246K899405J940448L58826
9175B7313141r99135j610893j291422k11076R44806J243447J37616k208600n024208
9166A8293676p154095p523661n919813l282749q45336R86589K591078M120453
9158A266142N056391M892853L861951K692492J762207O94404j123874l621931
9150A5480635n770936o474052n769237m849905m714072n046771m684903k993128
9142b4822369n17191J570518K402448J927601Q35508L2783K8585P21036J655528
$$ y = [47742206, 46748239, 41980663, 33617154, 23254937, 13135885, 5003942, -358592, -3060881, -4050526, -4705831, -5751071, -6574091, -6018775, -3701563, -146686, 4047986, 8471648, 12481041, 15396655, 17365114, 19386216, 22114462, 25013867, 26954315, 27313141, 26314006, 24703113, 23411691, 23200615, 24145421, 25388868, 25526484, 23317884, 18293676, 11139581, 3615920, -2303893, -5586642, -6431978, -5445389, -2854311, 1266142, 6322533, 11215386, 15077337, 17769829, 19532036, 20226440, 19102566, 15480635, 9709699, 3235647, -2533590, -7383495, -12097567, -17144338, -21829241, -24822369, -25339560, -23769042, -21366594, -19438993, -18603485, -18570702, -18542117, -17821081, -16165553]
9133a6165553K317757K295486J565896O91056K79324P8870q88603k937638m899989
9124a7663394n184616l408577n89197J966827L498297L872933L571612L582515
9116a0353600M706525O766532Q746610R663270R059352O939629L834062Q91865
9108D0254245p39715r23389o51759j073991k641276n117252p925263j0318196
9100A0863404j1578217j1313978r501983o360985k528450P44529K203815J736326
9092b5735539N91631J22934M17798M01438p38075k372491k769039p40591K949495
9083b7872439O005343O616722M932194K428886K83392j126057j535007o55251
9075a0922217J039032K222214K024576J073955P70802J744650L368143M563500
$$ y = [-16165553, -13847796, -11552310, -9986414, -9295358, -9016034, -8937164, -9825767, -12763405, -17663394, -22848010, -26256587, -26845784, -24878957, -21380660, -17507727, -13936115, -10353600, -5647075, 1119457, 9866067, 19529337, 28588689, 35528318, 39362380, 40254245, 39514530, 38591141, 37939382, 36865391, 34224115, 29106863, 21181600, 10863404, -714813, -12028791, -21530774, -27891759, -30420209, -29675680, -27471865, -25735539, -25143908, -25020974, -24603176, -24201738, -24939813, -27312304, -30081343, -30821934, -27872439, -21867096, -15250374, -10318180, -7889294, -7605902, -8731959, -10266966, -10922217, -9883185, -7660971, -5636395, -4562440, -3791638, -2046988, 1321155, 5884655]
9067E884655M727795M044653L258475L046771L288705L028584J509182p42725
9059B8046095k181979j753176q22J424583J287581k47322j973843k708022j926018
9050A9967077L01398L444492O421768P873044P097002M685514J875383o47988
9042E1017690k911654m767794n566338n046065m072013l949102n054640o410878
9034A3239206o574211m864733j942606N93222J310475l6155k405973m286038m571568
9025i538381k961955n9646K771472M143427L687203K246964Q42405l19768j546066
9016g34345k683705k991436k074228o41365j22211j466861m212991o695419p352522
9007b8975083n959316l511836j004597J293237L340965M779732N357900N432810
$$ y = [5884655, 10612450, 14657103, 17915578, 20962349, 24251054, 27279638, 28788820, 28046095, 25864116, 24110940, 24110118, 25534701, 26822282, 26574960, 24601117, 21893095, 19967077, 20268475, 23712967, 30134735, 38007779, 45104781, 49790295, 51665678, 51017690, 48106036, 43338242, 37771904, 32725839, 28653826, 24704724, 19650084, 13239206, 6664995, 1800262, -142344, 450878, 1761353, 1725198, -680775, -4966813, -9538381, -12500336, -12559982, -9788510, -5645083, -1957880, 289084, 1131489, 811721, -734345, -3418050, -6409486, -8483714, -9125079, -9247290, -10714151, -14927142, -21622561, -28975083, -34934399, -38446235, -39450832, -38157595, -34816630, -30036898, -24678998, -19246188]
8999a9246188N385433M796971K978709L12201j699457j968221q60526N32051J594956
8990h174071K291839K587066K393753J938383J659542J698747J760721J448307
8982G604287N39633r27699k564409l723958m006542l650899l206747k945296k882348
8973a5763978l153725l781424m072931k973979l98524K294913L651236L629597
8965b0568815L293204L308600L417099L265818K956417K540801J656350J44233
8957A3707j389748k155555k097727j765577j424117q09843K33359J362137K119649
8948e913715K346114K024931J041989o03154k466214l767917l861615k620078
8940a3819659n56516J354577K209734J776950N67009o88403j427599j127474O83750
$$ y = [-19246188, -13860755, -9063784, -6085075, -5772874, -7472331, -9440552, -10301078, -9769027, -8174071, -5882232, -3295166, -901413, 1036970, 2696512, 4395259, 6155980, 7604287, 8143920, 7216221, 4651812, 927854, -3078688, -6729587, -9936334, -12881630, -15763978, -18917703, -22699127, -26772058, -29746037, -30144561, -27849648, -24198412, -20568815, -17275611, -13967011, -10549912, -7284094, -4327677, -1786876, -130526, 13707, -1376041, -3531596, -5629323, -7394900, -8819017, -9628860, -9395501, -8033364, -5913715, -3567601, -1542670, -500681, -1103835, -3570049, -7337966, -11199581, -13819659, -14376175, -13021598, -10811864, -9034914, -8467905, -9156308, -10583907, -11711381, -11027631]
8931a1027631L727764O472954P055871N044183J951347k84967j093818j323550
8923A0522153j881192k820509l618484l737539k782469o51397K071904M150700
8915A253167M543660L244515J179737n61159j293741r03299J54067J146619J703904
8906A0467470K068564K452932K397792J261776p83875k829447m285545n251811
8898E497856n762258n426462m191325k787353j811907q11088J053061L649151
8890a0590325N813896O544988N739148L889759J720356J79660R2504J341301K626099
8881A7357386K403073J56622l184499n961662p032695o615423n956011o000529
8873a4833738o429610o176183m766514k832893j331072n71567p8259Q32308K379642
$$ y = [-11027631, -7299867, -826913, 6228958, 11273141, 13224488, 12939521, 11845703, 10522153, 8640961, 5820452, 2201968, -1535571, -4318040, -4969437, -2897533, 1253167, 5796827, 9041342, 10221079, 9659920, 8366179, 7462880, 7616947, 8763566, 10467470, 12536034, 14988966, 17386758, 18648534, 17864659, 15035212, 10749667, 5497856, -264402, -5690864, -9882189, -12669542, -14481449, -15292537, -14239476, -10590325, -4776429, 1768559, 7507707, 11397466, 13117822, 13297482, 13389986, 14731287, 17357386, 19760459, 19917081, 16732582, 10770920, 3738225, -2877198, -8833209, -14833738, -21263348, -27439531, -32206045, -35038938, -36370010, -36941577, -37019836, -36187528, -33807886]
8864c3807886M076123N211169N709119O260844P278479P995856P194793M784248
8856A4702745K071854L68422j59555j50437j73775m72893j029497j451490j158875
8847A2546499r9731R75848J324410J073055R33731J252755J684045J642132P54093
8838B2086837r70204l031981m572765m969105m356430l395733k593140k026241
8830c828762j581673j155357o81210k55250j97377o82837j294122j268691l53654
8821a1298933P79977J149836M21344q20452j651390j529908m91338J160840L151838
8812i128186N208622O934642P899163P811145O500158L883135K45234l490246
8804B5863667o155784p172796o783117n401195l119028j18121K758548M362480
$$ y = [-33807886, -29731763, -24520594, -18811475, -12550631, -5272152, 2723704, 9918497, 14702745, 16774599, 17143021, 16983466, 16833029, 16659254, 16186361, 15156864, 13705374, 12546499, 12446768, 13422616, 14747026, 15820081, 16753812, 18006567, 19690612, 21332744, 22086837, 21116633, 18084652, 13511887, 8542782, 4186352, 790619, -1802521, -3828762, -5410435, -6565792, -7247002, -7502252, -7699629, -8382466, -9676588, -10945279, -11298933, -10518956, -9369120, -8947776, -9768228, -11419618, -12949526, -13440864, -12280024, -9128186, -3919564, 3015078, 10914241, 18725386, 25225544, 29108679, 29353913, 25863667, 19707883, 12535087, 5751970, 350775, -2768253, -2886374, -127826, 4234654]
8796D234654M259450L171623K298011K196632K250358J215353j488171m869309
8788A3268601o924314o346567l654451n39425J711912K965726L697362M193172
8780H372016M376774M077772L203774J698445m95987l282408o098099p830795
8772D021492p388484m641623o97259K991310N672710P205205P192873N004877
8764A9361101J054173k535189l471418j679833N05691R55552Q3507k4455J512183
8755A5761312L277045L466206J978596Q2030j261934j918690j900729j186162
8747A8297674j56763O71500J458442K794548M497578N453779M925072L252488
8739D1194318R66591j890474m960754o923099o579288m202491j084315J848040
$$ y = [4234654, 8494104, 11665727, 13963738, 16160370, 18410728, 19626081, 18137910, 13268601, 6344287, -2280, -3656731, -4196156, -2484244, 481482, 4178844, 8372016, 12748790, 16826562, 20030336, 21728781, 21232794, 17950386, 11852287, 4021492, -3366992, -8008615, -8705874, -5714564, -41854, 7163351, 14356224, 19361101, 20415274, 17880085, 14408667, 12728834, 13234525, 14190077, 14273584, 14249129, 15761312, 19038357, 22504563, 24483159, 24565189, 23303255, 21384565, 19483836, 18297674, 18140911, 18812411, 20270853, 23065401, 27562979, 33016758, 37941830, 41194318, 42160909, 40270435, 35309681, 28386582, 21807294, 17604803, 16520488, 18368528]
8731A8368528M209035N442708N072909L666656K549159K246460J846836J52111
8723D3554402l025603o823000j0026851j1669870j1507645j0213929q750495p367590
8715b5830581n558375l041017k81958K103362L941298N246873N889253N854078
8707a1677067N401749M567273K904489K59098k437440l751696l217058j866267
8699i816919j146514j434003j696147o07557J977882M707463N996612N541331
8691C522148M349307L399465K758238K083654J342868N62032o53228k602562m560159
8682A0201763n017857l114070M64239M102272O492256P200506O469032M878971
8674C1677112L100345J561092J56801j581888l819846n887824o621152n425773
$$ y = [18368528, 22577563, 28020271, 33093180, 36759836, 39308995, 41555455, 43402291, 43554402, 40528799, 33705799, 23678948, 12009078, 501433, -9712496, -18462991, -25830581, -31388956, -34429973, -34711931, -32608569, -28667271, -23420398, -17531145, -11677067, -6275318, -1708045, 1196444, 1455542, -981898, -4733594, -7950652, -9816919, -10963433, -12397436, -14093583, -14701140, -12723258, -8015795, -2019183, 3522148, 7871455, 11270920, 14029158, 16112812, 17455680, 18017712, 17364484, 14761922, 10201763, 5183906, 2069836, 2534075, 6636347, 13128603, 20329109, 26798141, 31677112, 34777457, 36338549, 36495350, 34913462, 31093616, 25205792, 18584640, 13158867]
8666A3158867k953381n32011J003520J625397J346684j94791k911702n472191
8658E070392o195492m909138l287907k973618l790919m284511l667887k532641
8650b6571721j645582q32217M62375J971078K714984K368736J906683K498103
8642a7127561M053789N324036N345861M278652K655483L55565l068513p143099
8634e325787j0211828j0782328q873680n754905k617392R2816K235140L547265
8626c7690699L939424L832784L803601L949494L815298K932587J389959l492j22409
8617a4153453J574335M287237O185514N755574K913782j106733m661209o491815
8609e696768o218282m481922k330968j46010K487382N549269P836943Q128281
$$ y = [13158867, 10205486, 9673475, 10676995, 12302392, 13649076, 13454285, 10542583, 5070392, -1125100, -6034238, -9322145, -12295763, -16086682, -20371193, -24039080, -26571721, -28217303, -29049520, -28587145, -26616067, -23901083, -21532347, -19625664, -17127561, -13073772, -7749736, -2403875, 1874777, 4530260, 4885825, 1817312, -5325787, -15537615, -26319943, -35193623, -40948528, -43565920, -43473104, -41237964, -37690699, -33751275, -29918491, -26114890, -22165396, -18350098, -15417511, -14027552, -14031044, -14153453, -12579118, -8291881, -2106367, 3649207, 6562989, 5456256, 795047, -5696768, -11915050, -16396972, -18727940, -18873950, -16386568, -10837299, -3000356, 5127925]
8601E127925O648322M551054K325183k10612k531638l414157k669251j693389
8593H133437j698098k325274k585686k160060r81775J453131N137160Q499755
8585A3472590R593459Q189070N721338L367829J236004o51678j786084j932488
8577C7210040j583802j231400p92127q7140O34545R57667O83852k31090j697967
8568C3862578l280503m366968m712089m454615l574145j863409M02390K305748
8560A4318987L096256K794438J784667K37773j729886l624476m688015m445187
8552G744557l106217j552780q07530j169377j889571k038432j597987j221440
8544e638777j005217k28349J465275L268009M006619L345205J882893M55419l27643
$$ y = [5127925, 11776247, 16327301, 18652484, 18441872, 15910234, 12496077, 9826826, 8133437, 6435339, 4110065, 1524379, -635681, -1617456, -164325, 4972835, 13472590, 23066049, 31255119, 36976457, 40344286, 41580290, 40928612, 39142528, 37210040, 35626238, 34394838, 33602711, 33515571, 34150116, 35107783, 35791635, 35560545, 33862578, 30582075, 26215107, 21503018, 17048403, 13474258, 11610849, 12013239, 14318987, 17415243, 20209681, 21994348, 22232121, 20502235, 16877759, 12189744, 7744557, 4638340, 3085560, 2278030, 1108653, -780918, -2819350, -4417337, -5638777, -6643994, -6872343, -5407068, -2139059, 1867560, 5212765, 7095658, 7551077, 7223434]
8535G223434k61676K52941L78126l95689j694538k655753k751363k107207j234885
8526c246610o16827l45863k276R37754K436756L779407M165472L270697J341669
8517A1720179q81810k367411k411904j239783L15737J712438K845520L387714
8509A3080680K754006J011414q09863j736919j775202j556799j573109j990388
8501G403820k555578k288075l3106L946790P471940Q367648O596776L780791R89094
8492C3680100k020235n456758q470732r892690r395533p539614n097288k731157
8484a6923907j043829m14649o41382r66260p32025r2529J43055m02849r74955
8475b2049330n36515P84173J761259J715667J365219J655360K425281K843695
$$ y = [7223434, 6961758, 7214699, 7592825, 7197136, 5502598, 2846845, 95482, -2011725, -3246610, -3863437, -4209300, -4211576, -3273822, -837066, 2942341, 7107813, 10378510, 11720179, 10838369, 8470958, 6059054, 4819271, 5135008, 6847446, 9692966, 13080680, 15834686, 16846100, 16036237, 14299318, 12524116, 10967317, 9394208, 7403820, 4848242, 2560167, 2527061, 6473851, 13945791, 22313439, 28910215, 32691006, 33680100, 31659865, 26203107, 17732375, 7839685, -1555848, -9095462, -14192750, -16923907, -17967736, -18382385, -19023767, -19990027, -20722052, -20814581, -20671526, -21074375, -22049330, -22585845, -21801672, -20040413, -18324746, -16959527, -15304167, -12878886, -10035191]
8467a0035191K659734K327535K243284K551842L425655M786675N905650O019390
8459A9884574N309237M583804L995969K815751O66646j662596l026801l191252
8451B9375332k948998l104373l554563l440237k242426o07557K62024K8484n73282
8442A3194404j162852k499723n091789p664905q134767n965265k635948J58483
8434a9802362J867276K727645L156173L721002M699118N255470L994946R09284
8426F528552k015027k859696j915198j084034j583969k965831m108464m358927
8418a4362594l650337k189088l82314J213122K207112K672899L010588L444716
8410h035896L736149L571026L168436L063737L116459K331843K45915j984785
$$ y = [-10035191, -7375457, -5047922, -2804638, -252796, 3172859, 7959534, 13865184, 19884574, 25193811, 29777615, 33773584, 36589335, 37255981, 35593385, 32566584, 29375332, 26426334, 23321961, 19767398, 16327161, 14084735, 13477178, 13739202, 13767686, 13194404, 12031552, 9531829, 4440040, -3224865, -11359632, -17324897, -19960845, -19802362, -17935086, -15207441, -12051268, -8330266, -3631148, 1624322, 5619268, 6528552, 4513525, 1653829, -261369, -1345403, -2929372, -5895203, -10003667, -14362594, -18012931, -20202019, -20584333, -19371211, -17164099, -14491200, -11480612, -8035896, -4299747, -728721, 2439715, 5503452, 8619911, 10951754, 11197669, 9212884]
8402I212884k737646j946167j002786o98045m09371L66195Q78207L03163q16049
8393C150385j318525j163429j457134k864910m753047n945690n797288m469458
8385b4619096k574327o94323Q74888J939492K152736J421504O02544J061955L088826
8376a6745801N305387O196903N739713M927255M241165L456677K587211J960751
8368A7669261J386644K73121j152990j600521j99453K266943M062588M125855
8360B6831448K695252O63546j219348k543383l007883k299770m14005J878676
8352B2584533L228858K786308J058807n82820j220339r76285m31531J46955R66348
8343B7560834K362887M279867N909119O083166M413473J852437l51900k081942
$$ y = [9212884, 6475238, 4529071, 3526285, 2828240, 2418869, 2785064, 3663271, 3966434, 3150385, 1831860, 668431, -788703, -3653613, -8406660, -14352350, -20149638, -24619096, -27193423, -27887746, -27012858, -25073366, -22920630, -21499126, -20896582, -19834627, -16745801, -11440414, -5243511, 496202, 5423457, 9664622, 13121299, 15708510, 17669261, 19055905, 19329026, 18176036, 16575515, 16376062, 18643005, 22705593, 26831448, 29526700, 30190246, 28970898, 26427515, 23419632, 21119862, 20705857, 22584533, 25813391, 28599699, 29658506, 29075686, 27855347, 26879062, 26447531, 26594486, 27560834, 29923721, 34203588, 40112707, 46195873, 50609346, 52461783, 52109883, 50027941]
8335E0027941m126650o655658q713732r371246q609451o793458m085890r42637
8327G29219J482932K246784J659368P76621M8694q77276k106911k958219k685301
8318a684089j340149K70657J249734J168564K37418r49513j949240k753683l458633
8309i208934l823125l423269k138224j81152K248253M910484P078007P617445
8301C079485N896631K561790p24636k358464j809093P7731J716217K009180J139887
8292A1588728J03010m37999n40700l42555L82104J735182L196564M082325M330520
8283B4097179M435040M688728M850152M510999L444173J609451p81323l081159
8275D3773240m436182m464133l594014k604552j953222j643921j520796j416454
$$ y = [50027941, 45901291, 39245633, 30531901, 21160655, 12551204, 5757746, 1671856, 729219, 2212151, 4458935, 6118303, 6894924, 6943618, 6066342, 3959431, 1001212, -1684089, -3024238, -2753581, -1503847, -335283, -97865, -1047378, -2996618, -5750301, -9208934, -13032059, -16455328, -18593552, -18774704, -16526451, -11615967, -4537960, 3079485, 8976116, 11537906, 10813270, 8454806, 6645713, 6723444, 8439661, 10448841, 11588728, 11691738, 11253739, 10713039, 10370484, 10752588, 12487770, 15684334, 19766659, 24097179, 28532219, 33220947, 38071099, 42582098, 46026271, 47635722, 46854399, 43773240, 39337058, 34872925, 31278911, 28674359, 26721137, 25077216, 23556420, 22139966]
8267B2139966j087011l30322O67480J262309Q66725m33896j939618l076873l896493
8258A4172267m669112n199331m931473l710176j989506j59409J857169M027908
8250f01663N690210O148507N544834M541232L227552R81227k430053o052398q265542
8241H783906p930793n161867j394729J389855K132127J582180J347578K037248
8233B785505K825784K753746J650447l20882k965501n362371n868387l821158
8225h322817p33030J135784J097489J95190m90124o92761m33284J53874L89097
8216g700582m34935j763464j944236j84450K339776L794379L522748K147104M88606
8207B64946r30720j691472j553067p81014J8717M97680Q68434J671976L316600
$$ y = [22139966, 21052955, 20722633, 21390113, 22652422, 23519147, 23085251, 21145633, 18068760, 14172267, 9503155, 4303824, -627649, -4337825, -6327331, -6486740, -4629571, -601663, 5088547, 11237054, 16781888, 21323120, 24550672, 25531899, 23101846, 17049448, 8783906, 853113, -4308754, -5703483, -4313628, -2181501, -599321, 748257, 2785505, 5611289, 8365035, 10015482, 9694600, 6729099, 1366728, -4501659, -8322817, -9055847, -7920063, -6822574, -6627384, -7117508, -7810269, -8243553, -8089679, -7700582, -8135517, -9898981, -11843217, -12027667, -9687891, -5893512, -2370764, -223660, 264946, -665774, -2357246, -3910313, -4691327, -4672610, -4174930, -3306496, -1634520, 1682080]
8198A682080N661124P884325Q867944P861327M856925N39773l919696p272328
8190B6161474q875800r001765q179876o436521l684863o65541J296542J603297
8182g783053P97783m27028j862754l219119l817492l368879k337117r56777J380656
8173b1593780M960356Q522967J0204812R548947P787156O175602M752292K789443
8165C3147795j13070l508127o282864p364043o638017n148317m007828l177353
8157c091824j732565P09602L309001M842462M883707M060253L410877L552910
8149A9944423M235841M602691M000332K571405J035749l166n06915r68228k004557
8140C2907575l734597n458282o222068n762026m547753k925024q51153J352780
$$ y = [1682080, 7343204, 15227529, 24095473, 31956800, 36813725, 37353498, 33433802, 26161474, 17285674, 8283909, 104033, -6332488, -10017351, -10682892, -9386350, -7783053, -6985270, -7412298, -9275052, -12494171, -16311663, -19680542, -22017659, -22974436, -21593780, -16633424, -8110457, 2094355, 11643302, 19430458, 25606060, 30358352, 33147795, 33034725, 29526598, 23243734, 15879691, 9241674, 4093357, 85529, -3091824, -4824389, -4114787, -805786, 4036676, 8920383, 12980636, 16391513, 19944423, 24180264, 28782955, 32783287, 35354692, 36390441, 36387275, 35880360, 34912132, 32907575, 29172978, 23714696, 17492628, 11730602, 7182849, 4257825, 3406672, 4759452]
8132D759452K776436K926516K284743J299491m55927l295038o161213p357526
8124c223066o281443l666258n40520K074288K890687J204125j858293m115023
8116a3515503m648248m403527m318741m005432k767750r04937P21197J715881
8108c2127060K096545J794401Q80947r6447n71333n00655j07977N60668J491351
8099b6579560K478253L363375M157496M683874M520965L559327K193435P48216
8091h74619p69004k106679k591933j934098o91961M34770J224188J468311O12175
8082e228850j467060l828554n311493n650588n187284l984505k038424n4150Q70480
8073c1880428L58211r49309k025653j942410j64894K841340N549098O765827O999473
$$ y = [4759452, 7535888, 10462404, 12747147, 14046638, 13590711, 10295673, 4134460, -3223066, -9504509, -13170767, -13711287, -11636999, -8746312, -7542187, -9400480, -13515503, -18163751, -22567278, -26886019, -30891451, -33659201, -34564138, -33842941, -32127060, -30030515, -28236114, -27355167, -27451614, -28022947, -28523602, -28631579, -28070911, -26579560, -24101307, -20737932, -16580436, -11896562, -7375597, -3816270, -1622835, -874619, -1643623, -3750302, -6342235, -8276333, -8968294, -8533524, -7309336, -5841025, -5228850, -6695910, -10524464, -15835957, -21486545, -26673829, -30658334, -32696758, -32750908, -31880428, -31522217, -32471526, -34497179, -36439589, -36604483, -33763143, -28214045, -21448218, -14448745]
8064a4448745P634625Q847337R274252P841182M965582J677940j470520m056873
8056B0264780n200166m296398k082552j59590O26454Q35010J369460K185184K333780
8047A5875962J128628j056739l273140n059405o657070q120140q687037p504695
8039b3353636m825443j994654j77225N57076Q22552J006235J034385Q17555N80828
8030b5532327O86929J266112K120334K969614L650361L963734L518191K096670
8022e260382K01238j198625j674113j752709k107259k734374l275648l716427
$$ y = [-14448745, -6814120, 2033217, 11307469, 19148651, 24114233, 25792173, 24321653, 20264780, 15064614, 10768216, 8685664, 8526074, 9152528, 9987538, 11356998, 13542182, 15875962, 17004590, 15947851, 12674711, 7615306, 958236, -7161904, -15848941, -23353636, -28179079, -30173733, -30350958, -29793882, -28971330, -27965095, -26930710, -26113155, -25532327, -24845398, -23579286, -21458952, -18489338, -14838977, -10875243, -7357052, -5260382, -5059144, -6257769, -7931882, -9684591, -11791850, -14526224, -17801872, -21518299]
$$ [...]
##END NTUPLES=NMR SPECTRUM
##END=
