##TITLE=31Pdec_B3dm-4
 CDCl3, 64 sc
 13.7.2023
##JCAMPDX= 6.0         $$ Bruker NMR JCAMP-DX V2.0
##DATA TYPE= NMR SPECTRUM
##DATA CLASS= NTUPLES
##ORIGIN= UXNMR, Bruker Analytische Messtechnik GmbH
##OWNER= root
$$ XWIN-NMR		Version 3.5
$$ Thu Jul 13 14:30:56 2023 Russian Standard Time (UT+4h)  she@DPX200
##.OBSERVE FREQUENCY= 81.013821
##.OBSERVE NUCLEUS= ^31P
##.ACQUISITION MODE= SIMULTANEOUS
##.ACQUISITION SCHEME= undefined
##.AVERAGES= 64
##.DIGITISER RES= 16
##SPECTROMETER/DATA SYSTEM= spect
##.PULSE SEQUENCE= zgpg30
##.SOLVENT NAME= DMSO
##.SHIFT REFERENCE= (INTERNAL, DMSO, 0, 248.564)
##AUDIT TRAIL= $$ (NUMBER, WHEN, WHO, WHERE, WHAT)
$$ ##TITLE= Audit trail, XWIN-NMR		Version 3.5
$$ ##JCAMPDX= 5.01
$$ ##ORIGIN= Bruker BioSpin GmbH
$$ ##OWNER= she
$$ F:/spectra/data/she/nmr/P31/1/pdata/1/auditp.txt
$$ ##AUDIT TRAIL=  $$ (NUMBER, WHEN, WHO, WHERE, WHAT)
(   1,<2023-07-13 14:29:40.60 +0400>,<she>,<DPX200>,
      <continue with go, POWCHK disabled, PULCHK disabled
       configuration hash MD5:
       00 E9 B6 7A A2 85 ED C7 34 08 36 98 17 FE 4E 26
       data hash MD5: 32K
       5E CA 1F F3 3A FB 9E EB AE B1 95 AD BF F1 03 74>)
(   2,<2023-07-13 14:29:43.67 +0400>,<she>,<DPX200>,
      <Start of raw data processing
       efp BC_mod = 2 LB = 1 FT_mod = 6 PKNL = 1 PHC0 = -10754.75 PHC1 = 207.2848 SI = 64K 
       data hash MD5: 64K
       4A 6A 44 A2 69 57 F5 B4 F7 8C E3 A9 98 CB F8 A8>)
(   3,<2023-07-13 14:30:25.64 +0400>,<she>,<DPX200>,
      <pk PHC0 = -1.489779 PHC1 = 5.999985 
       data hash MD5: 64K
       A9 22 80 9E 7C 56 71 15 1E 99 F2 B2 27 EF B6 15>)
(   4,<2023-07-13 14:30:31.56 +0400>,<she>,<DPX200>,
      <abs ABSG = 5 
       data hash MD5: 64K
       32 96 F9 F7 EF 9C 26 2D 65 A1 FE E8 2F 83 82 B4>)
$$ ##END=
$$ 
$$ hash MD5
$$ A5 03 38 5F A8 2B 5B 0E 03 CE 7A 44 5B A9 EF C1
##$RELAX= 
##$RELAX= 
##$RELAX= 
##$RELAX= 
##$RELAX= 
##$RELAX= 
##$RELAX= 
##$RELAX= 
##$RELAX= 
$$ Bruker specific parameters
$$ --------------------------
##$DU= <F:/spectra>
##$EXPNO= 1
##$NAME= <P31>
##$PROCNO= 1
##$TYPE= <nmr>
##$USER= <she>
##$AMP= (0..31)
100 100 100 100 100 100 100 100 100 100 100 100 100 100 100 100 100 100 
100 100 100 100 100 100 100 100 100 100 100 100 100 100 
##$AQSEQ= 0
##$AQ_mod= 1
##$AUNM= <au_zg>
##$AUTOPOS= <>
##$BF1= 81.014009
##$BF2= 200.13
##$BF3= 200.13
##$BF4= 200.13
##$BF5= 200.13
##$BF6= 200.13
##$BF7= 200.13
##$BF8= 200.13
##$BYTORDA= 1
##$CFDGTYP= 0
##$CFRGTYP= 5
##$CHEMSTR= <none>
##$CNST= (0..31)
1 1 145 1 1 1 1 1 1 1 1 1 1 1 1 1 1 1 1 1 1 1 1 1 1 1 1 1 1 1 1 1 
##$CPDPRG= <waltz16>
##$CPDPRG1= <>
##$CPDPRG2= <waltz16>
##$CPDPRG3= <>
##$CPDPRG4= <mlev>
##$CPDPRG5= <mlev>
##$CPDPRG6= <mlev>
##$CPDPRG7= <mlev>
##$CPDPRG8= <mlev>
##$CPDPRGB= <>
##$CPDPRGT= <>
##$D= (0..31)
0 1 0 0 0 0 0 0 0 0 0 0.03 2e-05 3e-06 0 0 0 0 0 0 0 0 0 0 0 0 0 0 0 0 
0 0 
##$DATE= 1689244095
##$DBL= (0..7)
120 120 120 11 120 120 24 19 
##$DBP= (0..7)
150 150 150 150 150 150 150 150 
##$DBP07= 0
##$DBPNAM0= <>
##$DBPNAM1= <>
$$ [...]
##$SUBNAM3= <"">
##$SUBNAM4= <"">
##$SUBNAM5= <"">
##$SUBNAM6= <"">
##$SUBNAM7= <"">
##$SUBNAM8= <"">
##$SUBNAM9= <"">
##$SW= 501.771253377433
##$SWIBOX= (0..15)
0 1 3 0 0 0 0 0 0 0 0 0 0 0 0 0 
##$SW_h= 40650.406504065
##$TD= 32768
##$TD0= 1
##$TE= 0
##$TE2= 300
##$TE3= 300
##$TEG= 300
##$TL= (0..7)
0 120 53 12 22 120 120 120 
##$TP= (0..7)
150 150 150 150 150 150 150 150 
##$TP07= 0
##$TPNAME0= <>
##$TPNAME1= <>
##$TPNAME2= <>
##$TPNAME3= <>
##$TPNAME4= <>
##$TPNAME5= <>
##$TPNAME6= <>
##$TPNAME7= <>
##$TPOAL= (0..7)
0.5 0.5 0.5 0.5 0.5 0.5 0.5 0.5 
##$TPOFFS= (0..7)
0 0 0 0 0 0 0 0 
##$TUNHIN= 0
##$TUNHOUT= 0
##$TUNXOUT= 0
##$USERA1= <user>
##$USERA2= <user>
##$USERA3= <user>
##$USERA4= <user>
##$USERA5= <user>
##$V9= 5
##$VALIST= <valist>
##$VCLIST= <CCCCCCCCCCCCCCC>
##$VD= 0
##$VDLIST= <DDDDDDDDDDDDDDD>
##$VPLIST= <PPPPPPPPPPPPPPP>
##$VTLIST= <TTTTTTTTTTTTTTT>
##$WBST= 1024
##$WBSW= 4
##$XGAIN= (0..3)
0 0 0 0 
##$XL= 0
##$YL= 0
##$YMAX_a= 9355
##$YMIN_a= -2021
##$ZGOPTNS= <>
##$ZL1= 120
##$ZL2= 120
##$ZL3= 120
##$ZL4= 120
##$ABSF1= 248.5645
##$ABSF2= -253.2056
##$ABSG= 5
##$ABSL= 3
##$ALPHA= 0
##$AQORDER= 0
##$ASSFAC= 0
##$ASSFACI= 0
##$ASSFACX= 0
##$ASSWID= 0
##$AUNMP= <proc_1d>
##$AZFE= 0.1
##$AZFW= 0.5
##$BCFW= 0
##$BC_mod= 2
##$BYTORDP= 0
##$COROFFS= 0
##$CY= -3
##$DATMOD= 1
##$DC= 0
##$DFILT= <>
##$DTYPP= 0
##$F1P= 0
##$F2P= 0
##$FCOR= 1
##$FTSIZE= 65536
##$FT_mod= 6
##$GAMMA= 0
##$GB= 0
##$INTBC= 1
##$INTSCL= 6.047779e-11
##$ISEN= 30
##$LB= 1
##$LEV0= 0
##$LPBIN= 0
##$MAXI= 10000
##$MC2= 0
##$MEAN= 0
##$ME_mod= 0
##$MI= 50
##$NCOEF= 0
##$NC_proc= -8
##$NLEV= 6
##$NOISF1= 182.463
##$NOISF2= 159.3651
##$NSP= 0
##$NTH_PI= 0
##$NZP= 0
##$OFFSET= 248.5645
##$PC= 4
##$PHC0= -10756.24
##$PHC1= 213.2848
##$PH_mod= 1
##$PKNL= yes
##$PPARMOD= 0
##$PSCAL= 0
##$PSIGN= 0
##$REVERSE= no
##$SF= 81.0140089999694
##$SI= 65536
##$SIGF1= 159.3651
##$SIGF2= -187.1042
##$SINO= 113.3802
##$SIOLD= 16384
##$SREGLST= <1H.CDCl3>
##$SSB= 0
##$STSI= 65536
##$STSR= 0
##$SW_p= 40650.406504065
##$SYMM= 0
##$S_DEV= 0
##$TDeff= 32768
##$TDoff= 0
##$TI= <>
##$TILT= no
##$TM1= 0
##$TM2= 0
##$TOPLEV= 0
##$USERP1= <user>
##$USERP2= <user>
##$USERP3= <user>
##$USERP4= <user>
##$USERP5= <user>
##$WDW= 1
##$XDIM= 65536
##$YMAX_p= 320338164
##$YMIN_p= -68158961
$$ End of Bruker specific parameters
$$ ---------------------------------
##NTUPLES= NMR SPECTRUM
##VAR_NAME=  FREQUENCY,     SPECTRUM/REAL,   SPECTRUM/IMAG
##SYMBOL=    X,             R,               I
##VAR_TYPE=  INDEPENDENT,   DEPENDENT,       DEPENDENT
##VAR_FORM=  AFFN,          ASDF,            ASDF
##VAR_DIM=   65536,         65536,           65536
##UNITS=     HZ,            ARBITRARY UNITS, ARBITRARY UNITS
##FACTOR=    0.620285442955139, 1,           1
##FIRST=     20137.2065510682, 0,            0
##LAST=      -20513.1999529968, 0,           0
##MIN=       -20513.1999529968, -68158961,   0
##MAX=       20137.2065510682, 320338164,    0
$$ Real data points
##PAGE= N=1
##DATA TABLE= (X++(R..R)), XYDATA
$$ [...]
41285 1164838 4253914 -1104246 -6172064 -2642623 4605454 6833328 4689150 2629564
41277 2629564 -1151270 -7715521 -8365147 3327184 16328266 14545840 1130050 -5706184
41269 -5706184 99101 6241015 4281803 765864 1350630 31075 -7816508 -15018342
41261 -15018342 -14489525 -10791759 -10553684 -10514618 -4642277 4187169 8747811 7940169 5060364
41252 5060364 1476574 -800318 3286603 13565398 19765319 13593330 1156267 -4888714
41244 -4888714 -1577575 3917020 6345297 6605232 6331209 5703502 5280312 4742516 2350728
41235 2350728 -89287 3580560 14294700 22812433 21133279 13743135 10011746 10404308
41227 10404308 8707096 3657965 -674432 -2871745 -3954272 -2272146 3089242 7083775
41219 7083775 5154846 1122485 147364 -1163154 -7369113 -12243935 -7023831 3189726
41211 3189726 5584330 156673 -1216615 3963097 4751239 -3476137 -11155436 -11491701
41203 -11491701 -10452298 -12959079 -12726976 -4585888 4529146 6238280 2960934 773188
41195 773188 -1130287 -4814315 -5570757 756390 8761678 10802988 7774175 4543067
41187 4543067 875975 -4324800 -5804951 981948 10012222 11799868 7205484 4885486
41179 4885486 7603704 10136202 8917467 5266735 494781 -4308460 -5240530 -262510
41171 -262510 4573447 1618688 -6699708 -10661123 -6960533 -1682903 -51812 -1401154
41163 -1401154 -4469444 -9211635 -12135149 -8125268 586178 4538566 -695966 -8336401
41155 -8336401 -9623428 -4138646 2188985 5131310 5095131 4747869 5662152 5714052 503549
41146 503549 -9731306 -16838628 -13777913 -5138163 -1433995 -3612075 -2101406 7231320
41138 7231320 15734980 14985560 8906769 6566333 8992903 10201109 7390594 3473678
41130 3473678 1682014 2882005 6245784 8356312 4407850 -5054998 -11445182 -7602391
41122 -7602391 2115191 6818893 2791305 -3485457 -5288802 -2764619 396907 2067406
41114 2067406 2061126 1513568 2993533 7545298 11053609 7993993 -78254 -4873716 -2755514
41105 -2755514 -786346 -6887892 -17526313 -21160081 -12987861 -652037 5637519 3956507
41097 3956507 -327868 -2281059 -659426 3851921 9220698 11651951 8891912 4542258
41089 4542258 5130905 11301057 15672433 12222809 4492877 498402 1988079 3855678
41081 3855678 2876292 856681 -1322740 -6004359 -12226328 -13099867 -4915050 5409588
41073 5409588 8189123 3823457 1215374 4294952 7190980 4224707 -1603150 -3533560
41065 -3533560 -167917 4213551 5829478 4302212 1004285 -2140056 -2770113 268588
41057 268588 5056706 7771729 6062018 1190752 -2526456 -893244 5627940 10716817
41049 10716817 8391689 802687 -3797637 -2031065 198296 -2962763 -8270670 -8438052
41041 -8438052 -2751322 2986536 4692490 2208268 -4618710 -14776677 -21681446 -17936399
41033 -17936399 -5863756 3978990 6682761 7849360 11871668 13925760 9132249 2206211
41025 2206211 462300 2556782 2100038 -1536620 -4149187 -5349692 -7770219 -9620330
41017 -9620330 -6813325 -1616128 -286202 -2039947 401477 7881795 11690777 6407631
41009 6407631 -2525659 -7892002 -9437034 -8950128 -4518057 3940495 9887684 8157780
41001 8157780 2938873 923985 1158272 -582711 -1476292 4650173 14791570 17745951
40993 17745951 9194283 -2103321 -6020885 -2759278 654067 764875 259955 2351339
40985 2351339 6060474 7031546 2169440 -6143242 -11148606 -8592882 -1606163 3357886
40977 3357886 4180196 3775316 4433717 5537270 6738706 9171590 12458891 13826456 11385358
40968 11385358 5940996 -681022 -6393639 -8249876 -4835743 451759 2502513 1434154
40960 1434154 2059047 5640616 7725571 6509427 7323653 14047421 20932029 19531863
40952 19531863 11008201 4395758 3620103 3890911 2097403 2657909 8474695 12667738
40944 12667738 7005952 -4465649 -8908030 -2296291 4726727 2045284 -6245080 -9699706
40936 -9699706 -7498170 -7433717 -11214563 -11316211 -4392121 1851714 167715 -5528812 -7429353
40927 -7429353 -5642434 -5086161 -5307652 -2228432 2720238 4377127 3578825 5790809 9845405
40918 9845405 7818177 -1555865 -8674562 -6600886 -811968 115000 -3137812 -4187104
40910 -4187104 -1878692 -447508 -1444502 -1964341 28300 3299417 5651153 5637842 3424088
40901 3424088 1931023 4178848 7482684 5053108 -3192589 -7273144 -465911 9334651
40893 9334651 9512948 166354 -7465420 -7698248 -5394342 -4565454 -2683797 1319395 3263829
40884 3263829 2066357 3204705 8695599 11548686 6577068 -342790 -1492823 115561
40876 115561 -3572063 -11531633 -15213616 -12223008 -8153072 -4837948 2379155 12873876
40868 12873876 16671558 8352256 -2777359 -4157739 3596088 9791268 9403291 6556991
40860 6556991 3844748 -1592290 -9196157 -11447340 -4496802 4221839 5582492 1646861
40852 1646861 1686191 7547319 10793961 5097276 -5194349 -11382996 -10462207 -5784757
40844 -5784757 -1303673 1368417 2209236 2172592 2523517 3127609 2394671 -297074 -3899018
40835 -3899018 -7891601 -12314884 -14713043 -11089102 -2323511 4432239 4480372 2055103
40827 2055103 3462782 7147536 6620722 855743 -5397543 -10461908 -16594729 -21301325
40819 -21301325 -16942656 -2966437 9202926 9418592 1342732 -4526092 -5581331 -7419292
40811 -7419292 -12538711 -17052574 -18206268 -17794784 -17080452 -14443671 -9668027 -5471740
40803 -5471740 -3336546 -2442324 -3518546 -8051520 -12252835 -8773141 1893867 8311695
40795 8311695 2187694 -9582237 -13967542 -9129959 -4362708 -4429965 -3402664 4080176
40787 4080176 13630243 17604280 15200895 11096523 7643084 3508416 -1671807 -5676989
40779 -5676989 -6422854 -3683658 1109848 4665116 2848489 -5286418 -15161509 -20688947
40771 -20688947 -20068425 -15896735 -11003669 -6735051 -4016526 -2751587 -572003 4522181
40763 4522181 10083973 10833555 5049079 -3189081 -8844909 -10582057 -9648954 -6564118
40755 -6564118 -883326 6556234 12525615 13051452 7044045 -1199240 -4861440 -1779410
40747 -1779410 2935293 3867332 2713180 4730670 9479293 10808866 6293425 791434
40739 791434 -1127854 -881122 -1371109 -1782357 -247217 2627894 6397298 12512093 19332270
40730 19332270 20092694 11575902 1292426 -513413 6042044 11697852 10874602 6661202
40722 6661202 3485543 1503177 -836200 -4258740 -9657240 -16570169 -20263678 -15950242
40714 -15950242 -6612565 -564786 -142559 443028 4189114 6059798 2500525 -1427574
40706 -1427574 -270388 3000336 3516800 4118429 9373171 13890130 7490953 -8246218
40698 -8246218 -19147008 -16921667 -9565827 -8560036 -13096200 -14039754 -9007180 -5196037
40690 -5196037 -7709923 -12090049 -10999415 -4165673 1826302 2118897 -1213361 -3014787
40682 -3014787 -1951666 -1589050 -4823882 -9385756 -10537280 -7474675 -4846233 -7054448
40674 -7054448 -12387947 -14500220 -9896384 -2595036 179323 -3098747 -5723805 -878154
40666 -878154 9152622 15012028 11499675 3205787 -2267180 -2844453 -966112 2338541
40658 2338541 7582762 12825275 14886613 14498715 15279261 16831097 14062715 5578065
40650 5578065 -2180789 -3166317 -627528 -2738889 -10851583 -17277159 -15273387 -7017107
40642 -7017107 26997 1624488 -481122 -2185825 -903933 2989134 6168028 4472098
40634 4472098 -2382557 -8398452 -6872563 616841 4437757 -1120972 -9484067 -10297081
40626 -10297081 -4175844 -1851837 -7828506 -12914072 -7627860 3639138 9267580 6984236
40618 6984236 4843116 7128461 8871816 5985799 2013141 898526 431063 -1886845
40610 -1886845 -2532119 2120073 8040864 8580860 4370529 1441472 1454452 847235 -1124302
40601 -1124302 -876677 2066349 2909602 -815753 -5130438 -6089329 -5576686 -6874339 -8289731
40592 -8289731 -5887506 -569299 2292187 326670 -2296245 -170196 6375724 11438486
40584 11438486 10548658 5876515 2876137 2586619 560291 -5433288 -10662615 -10064762
40576 -10064762 -6494365 -6886858 -11685514 -14276410 -10804915 -3956973 3888617 13635668
40568 13635668 22557333 22292268 10066278 -3544855 -5551198 3681647 12449257 13245909
40560 13245909 8899601 4186086 -432375 -4811687 -5865336 -2345825 1380912 515800
40552 515800 -3347695 -4012820 1311031 8015454 8556187 584063 -9591016 -12819658
40544 -12819658 -7144974 -56018 1106039 -1632462 -946346 4554286 8603729 6779612
40536 6779612 2205474 -5075 471862 490420 -1710877 -5401203 -8679480 -9139693 -5699637
40527 -5699637 -1230788 -428822 -3262562 -3776508 1882000 9052709 9790578 3129028 -3380147
40518 -3380147 -2531758 4422456 9461224 6940979 22400 -3422050 -1239833 84448
40510 84448 -4664162 -10928226 -11542371 -8949927 -11265713 -17045010 -15347704 -4145370
40502 -4145370 3088423 -3393081 -13817495 -12864829 -2020016 4566370 1964638 -1760842
40494 -1760842 -2442644 -5854214 -13850289 -17652708 -11540448 -3267443 -2975265 -8956318
40486 -8956318 -12572508 -12024231 -12603240 -16076128 -18031045 -15498033 -10907999 -7812069
40478 -7812069 -7208088 -8611716 -10883469 -11301505 -7202366 212865 6070825 7110135
40470 7110135 5291579 4984624 7437639 9418591 7627671 3234619 132964 -1264236
40462 -1264236 -5262761 -13728495 -20920785 -20027545 -13049257 -8363152 -8669760 -7940015 -2046301
40453 -2046301 4257269 4957114 2094414 2163617 6387072 9739728 8200671 3063649 -1072900
40444 -1072900 -258678 5037126 8334352 2661836 -9693425 -17078801 -12178811 -1768678
40436 -1768678 2696116 695353 1546491 9116318 15615193 12426784 1282405 -8162963
40428 -8162963 -8422548 39431 10309495 14733189 11105895 4254377 595395 1806512
40420 1806512 5118297 7711802 8044976 5032988 -160761 -3133070 -1228122 2018143
40412 2018143 1933038 271681 1866997 5158274 3488034 -3747239 -9051936 -8261012 -6708773
40403 -6708773 -9944596 -14358382 -12403012 -3322452 6290137 10349595 8010208 2664409
40395 2664409 -704683 917748 5270011 6929738 3970803 -527170 -4506366 -9525262
40387 -9525262 -14945570 -15227294 -7651260 1813962 5772358 4835791 4036946 3355885 -861706
40378 -861706 -6961950 -8636114 -4994242 -2390795 -3893907 -3689293 3699884 13453628
40370 13453628 15498500 7824848 -582723 -1124614 3884754 4944277 -1929328 -10150344
40362 -10150344 -11476530 -6376702 -1744287 -570125 404664 2965651 4080110 2479757
40354 2479757 2087323 4823172 5898260 1713683 -2879260 -1982642 1317083 487738 -2551665
40345 -2551665 -872149 4043905 3476409 -3133732 -5275146 2500215 11709258 12813697
40337 12813697 8252148 5607405 4937321 1204155 -5467248 -10121325 -10638737 -8200342
40329 -8200342 -2963422 4000308 7397200 3796585 -1171285 525720 7054933 9398362
40321 9398362 5448072 2274991 3589611 4357355 530678 -4626768 -7711161 -10444916
40313 -10444916 -13143873 -11089263 -3567220 1119388 -2569263 -7326578 -3947308 3276699
40305 3276699 3238341 -3594451 -6245088 -1870812 242726 -4085113 -6013083 813091
40297 813091 8396517 7056665 1042951 759064 5533544 5939639 272841 -3110996 100063
40288 100063 4410085 4967233 4610611 6874109 9398813 8795876 6549553 5743365 6126738
40279 6126738 6172728 6267338 6370562 4148183 -817145 -4104635 -1757348 3688868 6099531
40270 6099531 3186064 -1698172 -3764751 -819009 4965279 7688438 2838590 -6493758
40262 -6493758 -11820662 -9672967 -5706455 -5719685 -7666585 -7136263 -5768244 -7587086 -10513010
40253 -10513010 -9252854 -4789638 -2843493 -3169502 1150969 11873770 20677155 19738924
40245 19738924 11472075 3686255 -444713 -3312327 -7008953 -10698485 -12179243 -9432998
40237 -9432998 -2478168 4480887 5600658 589293 -3532755 -947474 5408738 8691109
40229 8691109 8359921 10485481 18024895 25528958 25249120 15552257 1508714 -10543153
40221 -10543153 -16780510 -15964614 -9180238 -347938 5328667 5662808 3811921 4482245
40213 4482245 7747236 8716312 4243211 -2160122 -4154546 -79117 5782626 9054553
40205 9054553 9962920 11563331 14970378 17683179 16691855 12815279 10759356 13247931
40197 13247931 15876565 11350008 13869 -7830963 -3466065 9152592 17813236 15694566
40189 15694566 6512898 -2309538 -6670471 -6406681 -3736534 -1871437 -1783332 -394616
40181 -394616 4679695 9678918 8821485 3392462 875121 4166279 7647153 6245733
40173 6245733 2987693 4027873 9980442 15635833 16010559 10650471 4128429 3000615
40165 3000615 9115209 15701180 14388530 6312006 537651 628334 154210 -5453706 -10341382
40156 -10341382 -7185885 1306704 6579327 5843861 3182629 2146025 3142034 5691952
40148 5691952 8140360 7788942 5746715 7524687 13497039 14257969 3558455 -8898627
40140 -8898627 -8353619 3511262 9944364 2832360 -7002304 -7128281 17448 5100636
40132 5100636 7581231 13710931 23328009 28366945 24063678 14438690 5867811 753325
40124 753325 -1186160 -259518 1982663 2127439 -1458075 -5859573 -6961827 -4607715 -1892919
40115 -1892919 127194 3612806 8860035 11750627 9374523 5493645 5861249 9466536
40107 9466536 9925119 5662691 2520878 4279448 6731322 4923542 851531 -1177016
40099 -1177016 -2475003 -7168589 -14290145 -18749844 -18432045 -14842678 -8616051 -417662
40091 -417662 5210071 3739511 -1876466 -4268128 -2499745 -2924484 -7813891 -10417459
40083 -10417459 -5034442 3740893 6813843 2210764 -3828229 -5561165 -3181405 254705
40075 254705 3595491 7284403 9761926 7427831 189636 -5168642 -1774951 7094338
40067 7094338 10266806 3369494 -4922410 -5627114 -2079470 -2974660 -8246473 -11058128
40059 -11058128 -10503966 -11912626 -15427341 -14734536 -8338301 -2633827 -1666388 -2493166 -2927504
40050 -2927504 -4965689 -7491660 -4715630 3616135 8803522 5319912 -1062959 -2860063
40042 -2860063 -1442444 -1652260 -2421600 -272916 2763240 2371307 -257447 -711556 1120371
40033 1120371 1920228 1188067 1131530 2088719 2719590 2955427 2931998 1392381 -1358517
40024 -1358517 -2077747 143438 939965 -2741493 -6873824 -5858137 -329096 5095761
40016 5095761 8111374 8144032 3953628 -2562922 -4681994 329846 4725910 224686
40008 224686 -8748486 -10221614 -1411975 8060204 9350100 3126534 -5174187 -11573377
40000 -11573377 -13703738 -10921807 -6344126 -4664699 -6895098 -10235652 -12296099 -11835450
39992 -11835450 -7218723 907200 6954126 5889030 406128 -2575855 -1288347 482496
39984 482496 779742 911155 505406 -2140010 -5025852 -4323654 -1394666 -1568407 -5620664
39975 -5620664 -8755452 -8487232 -7169259 -5980984 -2811274 2568288 6940334 8433863
39967 8433863 7873290 5243562 400153 -3055044 -1145753 3343475 4181493 2068031
39959 2068031 3510827 8555027 8842145 766091 -7920495 -8801846 -3224792 1838447
39951 1838447 2250557 -2162929 -8759809 -11455577 -5405088 4947578 9406998 6196858
39943 6196858 4517936 9546012 14074632 10675918 3473518 466980 1351010 1008716
39935 1008716 -615405 -254831 1386555 1476133 741300 1172172 1754174 1896713 4600262
39926 4600262 10826988 15965168 17445621 19507905 23920612 23578751 14169778 4761300
39918 4761300 5424488 10274884 6067353 -6034430 -11633427 -5194400 3135036 4503386
39910 4503386 2219698 2084553 3164243 2926588 2337547 1389161 -2310959 -6749487 -5612000
39901 -5612000 979584 4476699 1237399 -1063707 3577468 8722616 5953918 -640908
39893 -640908 -174136 8531612 15455001 13227360 4690937 -3411969 -7655676 -7694345 -4254123
39884 -4254123 35836 686787 -5075357 -14704873 -20980339 -17609006 -6002307 4363402
39876 4363402 5423477 60647 -1806041 3372171 8837615 8462087 5215166 5052673
39868 5052673 8142830 11247554 13935759 16438928 15462330 9141083 3203536 4419680
39860 4419680 9358486 7796956 -2382709 -11557689 -11502115 -5120449 -15437 1421498
39852 1421498 1182677 -164852 -3084460 -5523498 -4689091 -1396592 895821 652119 -958041
39843 -958041 -2971599 -5541539 -8391175 -10777749 -12836806 -15168711 -17462605 -18959107
39835 -18959107 -19409971 -18110519 -13445645 -5540426 2118692 6372319 8272878 10225624
39827 10225624 11250165 10039837 11551066 23217698 42234177 53389419 45097885 23907644
39819 23907644 7626721 6246568 14689269 22416184 24005027 20154307 14021424 8808576
39811 8808576 5882601 3858231 1195910 -1015967 -1458861 -2018915 -4534237 -5574223
39803 -5574223 -249047 9038089 14029603 11619483 6872911 3737901 404192 -2984221
39795 -2984221 -155828 11762294 24711450 28558004 23244467 15995837 10794560 7512427
39787 7512427 7542814 12054533 16540442 14783545 7536786 959478 -2180850 -3355442
39779 -3355442 -2450906 1085056 2624092 -3255037 -12475238 -14329352 -6164175 3003964
39771 3003964 5532046 3547629 1577298 -640213 -3488005 -3217324 2020842 7884407
39763 7884407 10928095 14269663 20383264 23795311 18341239 8073272 3249101 6892262
39755 6892262 11922955 11272272 5329850 -816346 -2846695 674216 7675665 12869642
39747 12869642 11454351 4074222 -3059710 -3931840 1361758 6401975 4774554 -2633892
39739 -2633892 -8078994 -6415125 -1663016 -411676 -1391196 1772657 8381410 9694522
39731 9694522 2130610 -6608323 -8481106 -5111513 -2195031 -605210 1068764 811901
39723 811901 -3363677 -8357417 -10221702 -9697715 -8566691 -5345206 -155594 1781759
39715 1781759 -1537492 -2816539 3758913 10727445 6580284 -6562052 -15390275 -13910394
39707 -13910394 -8697961 -6090531 -5113057 -4442250 -6035171 -9070001 -9207281 -6825670
39699 -6825670 -7830334 -13314762 -16340010 -12423109 -5983179 -2879875 -3234832 -4828959
39691 -4828959 -6904316 -7402157 -3208878 3462428 5522794 943923 -4574942 -7421138
39683 -7421138 -10162916 -12507707 -8401008 1657277 5518430 -4261022 -17164704 -18466334
39675 -18466334 -10019661 -5697352 -10201625 -14731785 -12368515 -6000785 10270 5700673
39667 5700673 10625262 11768769 9381557 7823151 7755225 4108729 -4885097 -12729180
39659 -12729180 -13031952 -8389389 -6461996 -9923078 -14112938 -13363381 -7168732 -677075
39651 -677075 266845 -4268783 -7159729 -2129329 7922139 14107305 12745076 8760801
39643 8760801 7369576 7794840 7415418 6756853 6463329 3781209 -2754206 -8209753 -6764470
39634 -6764470 -761224 2045440 107972 10825 4754567 7269738 1084693 -7726660
39626 -7726660 -7369174 2534334 9335906 4621116 -4953785 -8459225 -5419592 -2896039
39618 -2896039 -2821267 -1129722 2334564 2260539 -2690676 -6746483 -5736557 -2382248 -240409
39609 -240409 1378182 3231282 2835063 -767974 -4106169 -4925291 -5653817 -7620271 -7649965
39600 -7649965 -4797073 -4073598 -7822534 -9954825 -6018242 -2612320 -7444021 -15176740
39592 -15176740 -14382229 -5633603 -523353 -3096052 -4611795 843263 7039964 6925160
39584 6925160 4002676 5746543 11758463 15015855 11728530 5282391 2044908 5306977
39576 5306977 11427316 12070703 3805330 -5678406 -6543458 -817050 581058 -4921276
39568 -4921276 -7170410 604394 10942872 13158571 7239775 220546 -4395446 -6365888
39560 -6365888 -3946606 2496395 6602352 3668671 -1376976 -1205312 2213446 1359071
39552 1359071 -4019090 -6573748 -2725442 3880183 9893369 15208008 17941897 14339324
39544 14339324 5600340 -1442033 -2203963 2281994 10184799 20401422 28154731 26716205
39536 26716205 16939783 8623842 8009540 9380264 4241951 -5692851 -11161123 -8737165
39528 -8737165 -4978609 -6732006 -12397529 -15166863 -12210170 -7687386 -6746644 -8759612
39520 -8759612 -8593252 -4263359 -115505 -213655 -1474563 1999650 8784799 10190629 2179180
39511 2179180 -7827837 -9609086 -2264828 6256372 9476165 7860004 4904964 2286342
39503 2286342 23631 -1484769 -1455410 162952 2175066 2220459 -1856545 -8880754 -13122305
39494 -13122305 -9256262 423720 6727076 3927322 -2899844 -4454277 330238 3465806
39486 3465806 150664 -4031125 -1898562 4039419 5455110 1376569 108331 6804424
39478 6804424 15618425 17640468 12088912 5652130 3828483 6699478 10919199 12368964
39470 12368964 8867567 3443126 2545719 7466891 10315367 3380401 -9569557 -17164005
39462 -17164005 -14817559 -9049858 -6873585 -7253063 -5639540 -1593924 2093141 4303539
39454 4303539 5467396 4795382 1692616 -1111769 451558 6483488 12308622 13412110
39446 13412110 9630453 4487729 1967595 3868016 8469503 11351996 9340872 4653688
39438 4653688 3401871 8131085 13210109 10621600 200578 -9426030 -11286854 -7622667
39430 -7622667 -4337842 -1960510 2710651 8475888 9892576 5331680 -1228556 -6603337
39422 -6603337 -10086566 -8735282 213106 10152087 8758439 -3776098 -10669833 -1437277
39414 -1437277 10910181 7995883 -6111197 -11136832 -1281266 8071943 5996980 876690
39406 876690 2946532 7183797 4283003 -2418956 -3320482 1203570 3015253 531169
39398 531169 -434117 1860538 3009256 1492754 853851 2359837 3385628 3914137 6999999
39389 6999999 11231989 10363365 3460135 -1459974 1649245 7878527 8827919 4956958
39381 4956958 3692333 6870066 7516566 1039826 -6436549 -5749227 2331513 7735526
39373 7735526 4751826 -715467 -343140 4854495 7114003 3746285 45766 366512
39365 366512 2480212 2958840 2945138 4930729 7434499 7012371 3528074 -111298 -2089654
39356 -2089654 -2581130 -1837633 -356222 -43363 -2337392 -5498802 -6128565 -3347457 269585
39347 269585 1875594 1228295 436178 1381624 3126582 2281068 -2765051 -8743705 -11135289
39338 -11135289 -10303033 -10320075 -11702901 -10386611 -5585773 -3137908 -7199329 -13012006
39330 -13012006 -12818387 -6034897 1302923 5006194 5725219 4986748 3203587 1325112
39322 1325112 590201 794461 1491496 3524445 6336409 6062305 783545 -4102585 -1373318
39313 -1373318 7380686 12076544 6311883 -5030885 -11823158 -9062778 -71225 7689293
39305 7689293 8687749 3392917 -2740161 -5467361 -6178935 -8212989 -10483308 -8636564
39297 -8636564 -2110108 4105087 5633449 3612522 2531215 5313628 10748037 13988671
39289 13988671 10451053 1597256 -4582010 -2276190 4137275 4895016 -2936967 -12314502
39281 -12314502 -15074066 -9662028 -107773 8068474 10365665 6170032 177600 -2499197
39273 -2499197 -2624005 -4362388 -7562080 -8341392 -7230412 -9529960 -15701187 -18389574
39265 -18389574 -12415879 -1825968 6669420 11675736 14457020 13885345 9352092 4440954
39257 4440954 2364684 1150187 -1806313 -3991615 -1896148 2255824 3430717 934293
39249 934293 -2512444 -6041382 -9379458 -9201350 -3376873 3115216 3502602 -758822 -2375394
39240 -2375394 184664 1244706 -1784043 -5011094 -6608855 -10250987 -16504258 -18627196
39232 -18627196 -12280745 -3243567 582411 80803 1547567 6127988 9302104 8646486
39224 8646486 5739034 1677984 -3254358 -6239758 -4182054 850528 4108152 5892221
39216 5892221 10364697 16121077 15692415 7367551 -74360 193739 2279449 -3241838
39208 -3241838 -13778877 -17601893 -10891219 -2326549 920265 2620781 8320864 14311030
39200 14311030 13178644 6221669 2306885 5383630 10154366 10780872 7650297 3608058
39192 3608058 -851297 -5134805 -5613064 244829 9001615 14657364 15565326 14127690
39184 14127690 10962221 4381038 -4084740 -8993581 -8198482 -6463935 -8349998 -10782849
39176 -10782849 -7354456 1870651 10057774 12625119 11207677 8060170 2610679 -3630605
39168 -3630605 -4470754 3381190 13583007 16676935 11415555 4270522 -550688 -4217088
39160 -4217088 -7129236 -7086509 -5142567 -6337316 -11353915 -13396752 -7709529 548667
39152 548667 2796488 -2071848 -7852248 -9199006 -5431812 816797 4421870 470180
39144 470180 -8897759 -13628993 -7666053 1238287 694331 -9465160 -17719235 -17423556
39136 -17423556 -13417574 -10537074 -5430311 4973708 14535054 14828419 6910019 -586438
39128 -586438 -2927736 -2792979 -3189912 -2701541 691471 4786699 4882926 -288053 -5964435
39119 -5964435 -5950722 -62604 4849886 3135906 -2347245 -4463801 -1583007 1845058
39111 1845058 3570231 5719493 7775063 5025201 -2559084 -7252949 -4803754 -1990785
39103 -1990785 -5573967 -9604876 -3903502 8104314 11991834 3310702 -5956992 -6041261
39095 -6041261 -3504045 -8794968 -18039396 -18441390 -8297996 134046 -1292556 -6145892
39087 -6145892 -5401275 -1391406 -2241069 -7473212 -8446040 -2259805 3597287 2893177 -467814
39078 -467814 -27276 2386458 322699 -5669238 -7959980 -3615073 1115585 806634 -872209
39069 -872209 2157693 7574376 7009333 -1746992 -10856456 -12227644 -6863432 -1898699
39061 -1898699 -1380673 -3408980 -4839968 -4772344 -2970496 1399556 7194424 9998413 6721215
39052 6721215 455052 -2694973 -1456342 -365820 -2210085 -3625996 -558878 5360202
39044 5360202 9242678 9406256 8021569 7144951 7510696 9542737 11798176 9995176 2139445
39035 2139445 -6153171 -6425452 2003879 10540621 11509967 6105569 874249 -332460
39027 -332460 986826 1292145 -385784 -422150 5838399 16818426 23489079 19291531 9113469
39018 9113469 3042929 2864586 1785155 -2744336 -4481503 829782 8035073 10478489
39010 10478489 9059621 8224363 8287139 7733084 8906711 14434334 20097805 18150885 8134398
39001 8134398 -618637 1063169 12099752 22103255 21756244 12299091 4493609 7315610
38993 7315610 18822685 30040000 35437530 35778746 33970959 35018901 47130960 71976208
38985 71976208 93546968 89729436 59874928 29035289 17813552 19695250 17592728
38978 17592728 10432639 8579198 11750116 9724715 2042368 -588636 4437279 6736022
38970 6736022 856189 -4850907 -2678893 2970762 4987905 4446703 5118896 5288475 2221822
38961 2221822 -1528408 -2726548 -2973858 -4092997 -3526207 -74089 1099652 -4377775
38953 -4377775 -12077767 -14144094 -9533455 -3523410 -154073 -254672 -3640645 -7780205
38945 -7780205 -7228251 7980 8099724 10829191 10583850 13716349 19405183 20662962
38937 20662962 15745248 10824830 9974817 9389594 4654119 -1371068 -1944037 4837351
38929 4837351 13647646 17009704 11521085 761976 -7091579 -6457202 37059 4836898
38921 4836898 4354132 1811273 1022742 1442328 1309775 1649032 3515955 4364817 1901628
38912 1901628 -321888 3234993 11029188 15358729 13711576 12713799 17124906 21034277
38904 21034277 16412951 6200498 708554 2767455 5313895 4099680 3268754 5273439
38896 5273439 4745914 -1424849 -5902192 -1330712 6712213 7085127 167648 -2939186
38888 -2939186 2569767 9613674 12090974 12972738 15594767 16181171 11475236 6768094
38880 6768094 8519975 13450503 13062294 6729233 2179867 2980919 3239287 -2521718 -10042723
38871 -10042723 -10585748 -2758905 5705264 7765941 4703214 2397811 2972262 3449292
38863 3449292 1746820 -43493 264604 929425 -674367 -2830724 -836863 6583080
38855 6583080 14948397 18584576 15910177 10250192 6823726 8471914 12810885 14155160
38847 14155160 9789444 3595870 1877279 6460652 13509473 18039242 17953784 14922178
38839 14922178 12921070 14472968 17181844 16449586 12679377 11522919 14592599 15462729
38831 15462729 9568327 2499408 1617342 4368867 3789444 1788109 5869626 14018756
38823 14018756 15212319 6955153 533119 4196063 11446780 12536362 9046417 9083321
38815 9083321 13891524 17318091 15352173 9705187 3926779 627199 592763 1481801 4311
38806 4311 -2632192 -1683933 2765466 4373080 831295 -995584 4718996 13500942 17550392
38797 17550392 16477519 14366146 11235213 5261032 -331783 -771717 2429637 4752202
38789 4752202 7266498 13822458 21449483 22363071 15419857 7410046 2348122 -2519124
38781 -2519124 -8467117 -11037594 -7624639 -3178675 -3809691 -8444002 -10850512 -7864968
38773 -7864968 -2450663 654432 390487 73116 2601821 5770626 5013025 1230371 1102437
38764 1102437 6490814 8830744 419134 -12255988 -14672480 -3069192 10758060 14504266
38756 14504266 8096506 -735450 -6921534 -10096344 -10860197 -9635338 -7432062 -5065029
38748 -5065029 -2837866 -1933865 -3885943 -7756119 -10292472 -9848486 -7813848 -5480649
38740 -5480649 -2156435 2621421 7491143 11089945 13508768 14952005 14561142 11381958
38732 11381958 5670549 -510676 -3378234 -36342 7056147 10654307 7057754 1662738
38724 1662738 1938669 6864525 8929441 5634969 2367675 2957094 3937727 1006197 -4004369
38715 -4004369 -6255039 -4479811 -1046708 2051690 4231766 4899442 3351405 -508185
38707 -508185 -5981984 -10964525 -12048965 -7870899 -2195654 -531520 -3492342 -6798077
38699 -6798077 -7808167 -7820270 -7299664 -3843220 2917128 8711383 9992873 8743073 8863700
38690 8863700 10097177 8504990 1920829 -6755022 -11024075 -5995374 5369817 12095897
38682 12095897 5928150 -7403675 -13327972 -6556145 2455414 2957111 -1034251 1631346
38674 1631346 11065698 15459223 8401075 -1624012 -2659644 5535420 12645940 11269607
38666 11269607 4127595 -1997657 -5123325 -8289517 -12800264 -14967880 -11097007 -3529173
38658 -3529173 1357901 1163729 478360 4200644 9922605 10109352 2151001 -6525459 -5965828
38649 -5965828 4201042 13267612 11739856 2435558 -4246299 -4244195 -3294600 -6186413 -9553568
38640 -9553568 -8894864 -6557297 -6945472 -8385776 -6527617 -2474693 -208488 1448531
38632 1448531 6096610 10729466 8764898 2091687 380236 6575278 12497640 12012270
38624 12012270 9358273 9814073 10808044 8453518 5464924 5641190 6704465 5730347 5986166
38615 5986166 10567495 14164216 9888253 1036491 -2573215 1884480 8165353 10785001
38607 10785001 9395844 4800481 -1552076 -4895796 -1933969 1929313 -1659587 -10537420
38599 -10537420 -13044942 -4532633 5736100 7852866 3592004 265683 -1048637 -4147632
38591 -4147632 -8627729 -9484360 -4815193 1369622 4037983 1543822 -4049868 -8057745
38583 -8057745 -5876885 1867393 7858266 5770383 -874066 -2020094 5790149 14263573
38575 14263573 14091808 6769532 974685 -188993 -1583684 -5463365 -6202217 136303
38567 136303 7053061 5594536 -2139623 -5666348 -1540427 2456256 111302 -4524969
38559 -4524969 -4893502 -1067524 3723089 9089397 13969668 13088939 4492114 -3818676
38551 -3818676 -3069077 3325637 4347633 -2791389 -9804882 -9745859 -4194556 2144661 6242713
38542 6242713 5402153 -1258128 -8577755 -9701478 -5976520 -5284704 -9214799 -10185494 -4038004
38533 -4038004 2840674 3168253 -1724425 -6523641 -9350539 -9973754 -7265796 -3417470
38525 -3417470 -4249132 -10265410 -14150567 -12426542 -11627277 -15945293 -17459864 -8663634
38517 -8663634 2618234 3084144 -6110181 -12198983 -10596329 -8262533 -8340610 -5705427
38509 -5705427 259577 1816676 -4086863 -10290220 -11215092 -9536580 -6959860 29164
38501 29164 9492994 11140451 2232864 -4682305 113300 7786631 5307272 -3231728
38493 -3231728 -4078252 3188071 5850854 -871105 -8064833 -9008308 -6960297 -4917293
38485 -4917293 -511433 5372112 6917874 4756811 7464954 16182475 19165435 9109182
38477 9109182 -4548175 -9642774 -8280547 -9208263 -11209737 -6995458 1249151 3795163
38469 3795163 -778772 -4296416 -3724597 -4897389 -9145839 -7968788 3525060 16906022
38461 16906022 20813085 15021778 8185148 6134187 7902770 9927401 9307300 5371942
38453 5371942 1591345 3070181 9168144 12551609 9264325 5166699 7131984 12075248
38445 12075248 11731075 5673708 1610002 3301744 6109216 5711063 3786432 2336501
38437 2336501 -815071 -6600829 -10370890 -8289841 -4010856 -3262664 -4822153 -3290114
38429 -3290114 871904 1340989 -3477816 -6883409 -3889802 700972 -1097625 -8925052
38421 -8925052 -14085197 -10141410 488020 10606142 15643437 15985928 14227240 12135325
38413 12135325 10281655 9421595 10565011 12747739 12354412 7330122 1300099 -261351
38405 -261351 1938340 1700877 -2572214 -4621256 -975693 1528699 -4211921 -12875025
38397 -12875025 -13235861 -5013921 943703 -766135 -4020340 -3951565 -4909627 -10187650 -13221165
38388 -13221165 -6928385 4772858 12788926 15072111 15093025 12708121 5699704 -2137532
38380 -2137532 -3592312 1745501 7389793 9715489 10791176 11834982 11125315 8954255
38372 8954255 7947908 7701892 5481681 2908998 5067066 11396320 14161681 8539916
38364 8539916 -1286496 -8380566 -10248651 -7880263 -3132888 321975 -1554617 -7870083
38356 -7870083 -12873271 -13172011 -10749961 -7838957 -4251513 -1267768 -1899338 -4851887
38348 -4851887 -4588422 -418621 1178911 -2716819 -5287337 -52357 8758911 12380254
38340 12380254 9628444 6427744 6481671 8207497 8408671 4469395 -3924316 -11465824
38332 -11465824 -10472758 -1967462 2737247 -2190582 -6880630 -439881 10885346 12869046
38324 12869046 6468178 6592454 17657292 26224463 22709074 15878707 16974297 21070291
38316 21070291 16096635 3135154 -4955334 -2158579 4856067 8963510 10299758 10151009
38308 10151009 6396769 -926728 -6310416 -5752546 -2231841 171257 2975094 8530905
38300 8530905 12389455 8026278 -1889269 -6918491 -3120641 1414499 -1170446 -7318839
38292 -7318839 -8710599 -4808838 -1514700 -721924 573847 2306848 1169644 -1404082
38284 -1404082 155248 5293567 6502134 1942839 67529 6506653 14470552 14957137
38276 14957137 9517300 5098304 2399240 -1592019 -4574277 -2842756 -891221 -5981838
38268 -5981838 -14512348 -15197553 -6457886 511714 -1608621 -7191499 -9123314 -9041975 -9999472
38259 -9999472 -7795938 2052573 14508133 20455878 18497257 14259299 10909479 7498446
38251 7498446 4773203 5249613 7617253 7374542 3738274 575681 -473027 -2592686
38243 -2592686 -7616145 -11806998 -10816261 -5775288 -1306713 524813 1150073 1612116 1100744
38234 1100744 -606899 -2270268 -3817397 -7354700 -13521175 -18470694 -17218439 -9653184
38226 -9653184 -809231 4828785 6738570 5970551 2971781 -415090 -200425 4958055
38218 4958055 9942532 7951586 -1071887 -9671091 -10918922 -5371550 143215 -631721
38210 -631721 -7520914 -14014987 -13961276 -8443609 -3963936 -3464167 -3154957 -229422 1469108
38201 1469108 -1784191 -5708955 -3905969 1165742 1384839 -3655503 -5456670 -450588
38193 -450588 3597474 -956176 -10696960 -16747384 -16092239 -12081016 -7654168 -3423931
38185 -3423931 111472 2976359 6247118 8736329 6237022 -1810760 -8211823 -5989793
38177 -5989793 1729921 5618597 2756948 -716894 257088 2800523 1335173 -4691650
38169 -4691650 -10904288 -13179109 -10714071 -5697241 -1270892 1370324 4102775 8503053
38161 8503053 11879957 9663377 2099249 -4799600 -6339942 -4240816 -2979338 -4005747
38153 -4005747 -5940811 -7775318 -8651899 -6504694 -663654 5382117 7635157 7153350
38145 7153350 7716278 8470726 4396506 -4768296 -11867042 -11556540 -7124534 -4275807 -3148822
38136 -3148822 -1614716 -1458932 -4053124 -3962061 3870551 12868893 11606512 1840425 -2180343
38127 -2180343 4800560 10755171 5679348 -2748590 -2418642 4156941 6085191 2229581
38119 2229581 -238354 -775360 -4781335 -10092794 -8712798 -2557028 -3163963 -12678951
38111 -12678951 -18640256 -12888007 -3289307 318764 560624 3827768 6482904 812130
38103 812130 -10867954 -18642452 -18649094 -15414068 -12521828 -9114924 -4986272 -2149737 -942727
38094 -942727 547613 3319305 7180208 11927054 15211987 12189308 2322182 -6053555
38086 -6053555 -3968113 6771334 16071439 18192511 15793937 12122624 6375465 -1454849
38078 -1454849 -7189765 -7298476 -3539859 35792 2192521 4158624 5972854 5708456
38070 5708456 2066023 -3691708 -8780404 -11546775 -12603752 -13047203 -12507134 -10327934
38062 -10327934 -7655714 -5916883 -4011151 -336017 3015314 2511928 -525262 -1491014
38054 -1491014 -851474 -3813782 -9657832 -9896264 -1658655 5756027 4771806 1674537 5079686
38045 5079686 9516161 3623215 -9325698 -14054217 -6510712 294481 -2746452 -7769518
38037 -7769518 -4704901 2442959 3593379 -1222148 -3930072 -1779064 1054394 2572129
38029 2572129 4887018 7969644 8903817 7411963 6098359 5283563 3226048 1366796
38021 1366796 3416991 8529844 11141178 8989151 5681165 3335478 -1139976 -8588127
38013 -8588127 -12317126 -6788095 2001113 2829760 -4615812 -8140405 -80453 11314184
38005 11314184 12858631 3818281 -4474665 -3872258 2964941 9811543 14417026 16775127
37997 16775127 15993010 12426624 8740034 5695754 639283 -7015497 -13092793 -14882374
37989 -14882374 -15383462 -16842210 -15134603 -7210993 113656 -2288972 -11203604 -13511165
37981 -13511165 -4203974 7067649 10270429 7402654 5862493 6589575 5548140 2353376
37973 2353376 164730 -867285 -3619523 -8045144 -10357256 -8236300 -2955662 3363128
37965 3363128 8882009 11048235 8934269 6847996 10963418 20791591 27921747 25458214
37957 25458214 15551032 5282846 -1558740 -5187175 -5323321 -1365320 3538993 4057622
37949 4057622 -122675 -3170087 -1838193 -1215411 -7315464 -16568445 -18535367 -9109947
37941 -9109947 4214787 11702514 11466810 7887667 4194393 602219 -2761051 -5570495
37933 -5570495 -9118635 -14553876 -19277258 -18456783 -11027234 -1864941 3071547 2481032
37925 2481032 114030 364979 3560813 5191709 857443 -7062055 -9695461 -1453456
37917 -1453456 11598943 16980829 9993497 -808308 -3986954 1981793 9050005 10489208
37909 10489208 7222750 3312516 -335602 -4828614 -8523565 -7909040 -3250088 724209
37901 724209 1056949 -403104 -2356149 -7839707 -18082213 -26362930 -24923191 -16575909
37893 -16575909 -11892234 -14373385 -16206220 -11069211 -3491288 -1053479 -3607907 -5742428
37885 -5742428 -5174156 -3136104 -201817 3084165 4733747 4894126 6851133 10097165
37877 10097165 7978167 -1680395 -9791528 -8383141 -4204833 -8834352 -18803228 -19032120
37869 -19032120 -6193536 5091762 3382920 -4200520 -4301114 4271055 12271863 13692291
37861 13692291 9988214 4845599 1486265 2449784 6582517 8444511 5062480 840723
37853 840723 1762617 7305219 12183189 13689221 13079634 11632146 9576207 7823761 7247628
37844 7247628 7082548 6678849 7437875 10269940 12557637 10611002 4404139 -2361531 -6143388
37835 -6143388 -5952951 -3259274 -1167743 -2223330 -5390517 -6651812 -3963920 109419
37827 109419 2036032 1611697 1119728 2113318 4530650 7221131 8137192 5992889 2820230
37818 2820230 2634483 6430396 10784547 12313763 10938439 8112895 5198498 4551639
37810 4551639 8238808 13943923 16139359 13515383 11304582 13728761 18231016 20255484
37802 20255484 19572693 17886177 13923268 5999383 -2662637 -6050721 -2272152 4704120
37794 4704120 9278012 8079391 1602363 -5478787 -7645632 -4779658 -3119642 -7561819
37786 -7561819 -15070194 -18146054 -12958940 -2275504 7275533 9544928 3962269 -2109709
37778 -2109709 -370188 7232356 9787607 2803246 -4339213 -1594634 7249496 10747774
37770 10747774 6118031 904180 389374 1601812 20223 -4259966 -8011620 -8173473
37762 -8173473 -3638424 2974484 6630671 5951879 5213682 6874770 6549716 696286 -5545948
37753 -5545948 -5583075 -2418812 -3680937 -8370572 -8398448 -2343596 2283970 1196281 -1514858
37744 -1514858 -2003934 -1995066 -3207828 -3840419 -2869806 -1628297 -78500 2168968 1651659
37735 1651659 -4003307 -7745477 -354856 13173629 16770778 6056297 -4841041 -4886761
37727 -4886761 -1523678 -5545684 -12489671 -11480520 -4131851 -877263 -3425267 -4470904
37719 -4470904 -2755004 -5346376 -14007868 -20399334 -17940919 -10445117 -5758825 -6479460
37711 -6479460 -9404527 -10103806 -6694601 -1912101 -749430 -3093633 -1577191 8167962
37703 8167962 18346867 17586415 7041953 -641898 1284074 6144867 5925230 2474579
37695 2474579 2116159 5519577 8576004 9401646 9303965 9049347 8304166 7430474 6898013
37686 6898013 6188082 5463140 6702652 10905955 15494482 16727732 14024415 10278901
37678 10278901 8348856 8327329 8109117 6271942 4303002 4932159 7582940 7735578 3385958
37669 3385958 6124 4551817 15032872 21237545 17301998 9142997 6855325 13026237
37661 13026237 21519921 25652993 24668575 22977162 24797449 29209605 30357016 23927446
37653 23927446 13070213 5305694 3604381 3917515 2122930 -618725 -1184109 544619
37645 544619 2445945 2869157 367121 -6026516 -13621882 -16475882 -12314288 -6298798
37637 -6298798 -4390528 -5528572 -4339736 504439 4964860 5455401 2196172 -2235227
37629 -2235227 -4472238 -2070320 2864787 3755744 -2590682 -10305932 -11645200 -7884254
37621 -7884254 -6815736 -10490449 -12781789 -9713255 -4726091 -1595268 762463 3168085
37613 3168085 2576474 -1936580 -5253936 -3273549 927306 2921408 3949721 6315039
37605 6315039 6733841 1841596 -3261137 -604377 8148408 13375843 11359146 7927748
37597 7927748 7366248 6394755 2094212 -1874335 -1315298 2020724 4149955 4315639 3369701
37588 3369701 1638191 1532096 6454554 13163179 11859886 -189086 -11233354 -8825107
37580 -8825107 3747287 13103976 13727255 10636802 7112641 1245905 -5307694 -6645575
37572 -6645575 -3170913 -2464527 -6089659 -5751586 2282883 9020073 6374740 158700
37564 158700 298159 5303814 7127518 6108809 8983362 14619587 14231350 6235640 -356739
37555 -356739 509187 4895099 7976521 10450689 12094328 8489994 -214017 -5525446
37547 -5525446 -2121561 3834885 4579176 2101543 1806806 1354203 -4152930 -10304979 -8019535
37538 -8019535 1552118 7639346 5675333 2112099 1608658 -244068 -6984903 -12786932
37530 -12786932 -10330658 -1595668 5247063 6150062 3568010 1450742 2010584 5189715
37522 5189715 8228582 8050012 5969145 6432442 9185238 7902028 102914 -7076673
37514 -7076673 -6266076 -296283 3047792 2848179 4182178 7702116 8036455 2547076 -5011825
37505 -5011825 -10249535 -12043411 -10437177 -6206590 -3027700 -4559756 -8482831 -8629947
37497 -8629947 -3804191 1020390 3213744 5998298 11310129 15172013 13670984 8880319
37489 8880319 5273530 3949866 3493232 3151347 2456679 1012683 792833 4673033 10539674
37480 10539674 11836847 7118650 3642741 6832621 11238037 8242924 -799919 -6114953
37472 -6114953 -2550617 5242608 10056664 8978602 3248212 -3374365 -5435681 559369
37464 559369 12026799 22403318 27264366 26117863 20003424 11459292 5649469 6495396
37456 6495396 11502394 14634001 14273384 13884940 14816280 13878257 9539821 5419658 4749741
37447 4749741 5110039 2044454 -4181967 -8341544 -6094891 1231398 7169543 5577986
37439 5577986 -2770189 -9413564 -6411066 4759592 15161145 19125380 19583895 21905720
37431 21905720 25960756 26577106 20186972 9372782 1312300 1508628 7941245 12638804
37423 12638804 11080283 7995229 10113816 15173325 14128973 4413096 -5420966 -6543296
37415 -6543296 -143394 6003707 7069119 4349516 2399714 5415585 13063334 18188039
37407 18188039 13283518 1607141 -3781392 3772840 14635716 15015885 4716021 -4255058
37399 -4255058 -4109772 1458224 5832051 7554224 7952835 6779019 3692512 694564
37391 694564 -33269 756783 217283 -3346508 -8584756 -11831270 -10183813 -4779868 21939
37382 21939 1800294 2661083 5183854 8355191 10096859 11014150 11998270 11169296 8708461
37373 8708461 12462314 30809792 58539483 76881991 71881925 49029381 26256756
37366 26256756 15543656 15108938 17254856 18541158 20692707 24347840 25648774 20983606
37358 20983606 13649815 11570153 16548666 19949400 13500183 1508069 -3856002 1452383
37350 1452383 8767833 9099025 3696456 -351929 249399 3223801 4694191 1930621
37342 1930621 -4577652 -9600334 -7558713 -555958 2627748 -1741346 -6977908 -6123019
37334 -6123019 -1633611 668524 1825950 6161349 11267988 10738118 5642288 4143755
37326 4143755 8653403 11672326 7257717 -135780 -2099747 3292055 11133074 16196121
37318 16196121 16673897 14152424 12295375 13409819 15070886 12740383 6213731 -174999
37310 -174999 -4214060 -7849113 -11381779 -11453115 -7621908 -5208648 -7332827 -9193851 -5521274
37301 -5521274 638848 2731621 886606 406228 2231245 2321364 -104583 -1184531 -187773
37292 -187773 -1610389 -6981235 -10537548 -6791784 1775102 8204635 9093424 5835711
37284 5835711 695219 -4511490 -7447277 -6658433 -3588887 -709749 1889573 5827416
37276 5827416 10796981 14041836 13839610 11537335 9079720 5817849 -372310 -8511901
37268 -8511901 -12833906 -8012575 3647841 12637619 11635142 3037063 -4691082 -6393788
37260 -6393788 -3123735 2631054 9851659 16481989 18601747 14911835 9531652 7506840
37252 7506840 8684912 8177571 2304023 -7429370 -15900685 -18917099 -16365357 -11323704
37244 -11323704 -6404364 -2124253 650318 -731529 -6866654 -13017841 -13960016 -11296031
37236 -11296031 -11104058 -14372509 -15456567 -11293118 -6156434 -4571087 -5192855 -5380855
37228 -5380855 -6260158 -8389398 -7671251 -1885574 3040766 799524 -4296657 -2577614
37220 -2577614 5893005 10357574 4518415 -5410898 -10212816 -8157686 -2881951 2614625
37212 2614625 5556996 2507983 -5983370 -13792004 -16923641 -18963527 -23661184 -25957546
37204 -25957546 -17768447 -1455736 10149917 8933021 853825 -2805738 886820 5606389
37196 5606389 5896824 3455862 3133950 6150011 9183639 8899202 5523109 1876760 244655
37187 244655 1138465 4327904 9239319 13781025 14478246 9621895 1906379 -3728772 -5099677
37178 -5099677 -4310285 -4093016 -4310678 -3035815 390398 4865444 8897755 10646408 7867107
37169 7867107 822828 -5155066 -3987796 2910687 6487523 905498 -8533169 -11973911
37161 -11973911 -7106331 -232729 3028985 2700759 521348 -3044130 -6539267 -7397165
37153 -7397165 -6202639 -6789876 -10125813 -12473839 -11771041 -11022129 -12518010 -13621991 -11855893
37144 -11855893 -9149164 -6780041 -1574484 7039212 11492422 5475953 -4806735 -7692727
37136 -7692727 -2380466 1203731 -1620206 -4594475 -2848172 -1112693 -4670286 -9634684
37128 -9634684 -8723568 -2203829 2915405 2206715 -2267109 -5804480 -5381480 -1336275 2782759
37119 2782759 3119719 -340149 -3898479 -4679605 -2449452 2961038 11625584 19763546
37111 19763546 21121181 15021862 8731736 8280118 10749338 9780175 5266257 2328388
37103 2328388 2615965 2253382 -1408794 -5474551 -5405072 -768929 4280932 5404505 2490231
37094 2490231 -311841 297015 1817350 -1687255 -11295332 -19676341 -18199988 -6689735
37086 -6689735 5877365 10340218 6027092 479235 930590 6480801 9743512 6239115
37078 6239115 -419151 -4142482 -3894304 -2473117 -1022568 570412 525114 -1827406 -2193317
37069 -2193317 2719664 7398899 4084381 -3906466 -5343281 1794949 7291334 5271371
37061 5271371 2128392 3110607 2910446 -2880257 -7966460 -6596457 -4797514 -9066328
37053 -9066328 -12380315 -4715410 8842576 14687210 11126413 7763202 7417078 4362365
37045 4362365 10116 3655472 14436463 18174785 8413292 -2770319 -2779409 4054406
37037 4054406 6076648 1990385 -1263767 -1650341 -2687858 -4711389 -4618830 -2562804 -1749063
37028 -1749063 -2841364 -4160485 -5719921 -7910570 -8197661 -4525421 -423991 -1310186
37020 -1310186 -6558790 -10229479 -9241868 -6160645 -3801929 -1478768 2381991 7148147
37012 7148147 10796335 11964742 10669753 8328425 6914981 6748300 5639004 1803255
37004 1803255 -2860367 -4177851 -509459 5081451 7926080 6653365 4603354 5725689
36996 5725689 9091570 9442337 4602735 -353473 83589 3114740 1458722 -4555625
36988 -4555625 -6023489 898884 7500667 4278873 -4745319 -6821132 2347236 13556767
36980 13556767 16922942 13275661 9801782 9205859 8431292 6521700 7818150 14876474
36972 14876474 22199774 22138459 16051496 13476769 18247972 21743534 15097755 2999167
36964 2999167 -2556039 502365 2790479 -801635 -3828653 212403 8084647 13498718
36956 13498718 15867625 16335222 12346204 4291607 1852605 13536040 32150249 40558608
36948 40558608 32373335 18699707 12734433 15086741 17552227 15511263 11745561 10560221
36940 10560221 12127674 12743568 9512357 4563381 3529958 8618350 14852521 15624725
36932 15624725 10563201 4933478 2440749 2063418 1325321 -720190 -3391058 -4280811
36924 -4280811 -257581 7996013 13775134 11201528 3588108 -38508 3293247 7580336
36916 7580336 7321042 4118192 2013119 1901208 3558306 8037989 13975089 15724751
36908 15724751 10016809 1605226 -2408089 -1632063 -869863 -1281235 959791 6648401
36900 6648401 9700141 4350831 -6572926 -13765251 -11419762 -3366902 1130723 -2745657
36892 -2745657 -10127646 -11621953 -3648100 7655132 13543634 12042435 8297267 6669165
36884 6669165 5645293 1652956 -4514826 -7792406 -5173078 440462 4196791 5762581
36876 5762581 9108297 15330749 18765398 13318780 1441330 -7095229 -6139179 374031
36868 374031 4507541 3918627 2644093 4333378 8199022 11270669 11640389 8954586 3894993
36859 3894993 -1877603 -6330516 -8031182 -6170409 -658274 6409367 10600982 8959343
36851 8959343 3672253 -320088 -1001683 1857 1779149 5357294 9934938 11991971
36843 11991971 10066868 6924051 4820169 2399883 -736754 -599569 5156276 10996312
36835 10996312 9743046 3685936 2467898 9306121 16270628 15870302 11165103 9927392
36827 9927392 13279679 15750116 14381680 12077217 11684701 11229017 7104234 34752
36819 34752 -4471672 -2247996 3795229 5997066 984472 -5938496 -8022274 -6200851
36811 -6200851 -6312389 -8858202 -8236828 -2743364 1856059 1235497 -1722351 -3481360 -5424081
36802 -5424081 -8315647 -7897942 -2016811 3723006 4049140 2358426 3985657 6725168
36794 6725168 5986974 3762330 3391696 1220097 -5745441 -9600993 -2212842 8473475
36786 8473475 8305240 224314 -92183 8607897 10678290 1953421 -923639 11341980
36778 11341980 23316324 19282928 8158130 7619499 16862063 22925365 23836523 27343540
36770 27343540 34221038 40151353 47845645 61052527 74081397 84817649 108479693
36763 108479693 154805577 198437740 201719730 168175141 142871651 151042910 165226285
36756 165226285 148751091 106467237 70443743 53979600 45152175 35405333 29225220
36749 29225220 28032574 25314122 19426191 16242349 17721878 19624634 20432547 21605661
36741 21605661 20062783 11762259 1975793 382685 5858993 7498456 1440748 -4605867
36733 -4605867 -5029471 -3228563 -2414527 -440458 2584457 1731678 -3236441 -5148332 -1122766
36724 -1122766 1882890 -1261356 -5190844 -3644217 58086 -76975 -1801568 580496
36716 580496 5055438 4716354 -462173 -3051737 1013665 7835061 11971368 11873711 8614548
36707 8614548 4351656 3077087 8634256 20079797 31074213 34790388 28697196 15699980
36699 15699980 2341699 -5470727 -7148350 -6926834 -7467568 -6278517 -555349 7304159
36691 7304159 12358920 13189621 11985958 10610922 10017613 11332915 13452249 11653178
36683 11653178 3333514 -6464330 -10325577 -8036352 -5487069 -5142174 -4245175 -2661706
36675 -2661706 -4871926 -11345967 -14562781 -8483203 2211770 7407501 3870014 -2093517
36667 -2093517 -3387155 -19040 2108128 -1542436 -8840271 -13243799 -11653730 -8214797
36659 -8214797 -7952137 -8740643 -4437158 4553391 9862304 5891418 -3475476 -11217590
36651 -11217590 -14800778 -14319065 -8797653 545385 7783494 8906482 7927960 10660255
36643 10660255 15027044 13960634 6466082 -784778 -2780321 -1078694 1204110 3575200
36635 3575200 5593161 4871639 248344 -5940563 -10563740 -12542599 -12134834 -9741055
36627 -9741055 -6425442 -3857314 -3019402 -3774620 -4986280 -4198957 572497 6971440 9539418
36618 9539418 7800612 8642374 15427906 19636416 11854156 -2154121 -7325083 -753712
36610 -753712 4948185 2147153 -1185524 2119375 4014173 -5354478 -18656143 -19838891
36602 -19838891 -7633472 3233130 3894525 1300407 3532057 6915133 3941319 -4338260
36594 -4338260 -11127134 -13784976 -13969252 -11458117 -4975570 2215030 4210551 648516
36586 648516 -2210957 -24269 4566192 7735674 10862562 16366497 19825548 13247884
36578 13247884 -2310039 -13755270 -10576939 1237798 6193201 -1338296 -11803206
36571 -11803206 -15042936 -12218344 -9395941 -6499530 27104 7629843 9399070 4979953
36563 4979953 1944194 4381540 6655961 2242922 -6025966 -9623187 -5930344 -1049885
36555 -1049885 -962510 -4118040 -4782304 -1146125 2996347 4151576 3520600 4021166 5362293
36546 5362293 5155893 3993546 5629547 11319958 17336110 19720702 18459106 14856463
36538 14856463 8247199 -938355 -7464385 -5944310 1070721 4559425 -26194 -7005897
36530 -7005897 -7693605 -579599 8145186 12213540 10391977 4757667 -2636653 -9855909
36522 -9855909 -13916318 -12361012 -6379214 -481913 2000453 1886508 1683231 1905953 1756925
36513 1756925 1847394 3288925 4906968 4671560 3559833 4312390 6249044 5562922 1737440
36504 1737440 -725333 1186852 4867567 6655684 6396272 4869240 1191696 -3460408
36496 -3460408 -3706082 3506502 12933296 16301177 11563879 3072900 -4632384 -8607183
36488 -8607183 -6224499 1592913 7394504 3901959 -6342536 -13432735 -12168325 -6427681
36480 -6427681 -1620029 1133430 2054591 -66346 -4668002 -7660008 -6325658 -3588276
36472 -3588276 -4506933 -9614377 -13685860 -11127232 -2310603 5579184 5411066 -1554648
36464 -1554648 -6647009 -4602334 24478 201636 -3673729 -6023746 -5144196 -3910554
36456 -3910554 -3169980 -864668 2714562 4742133 4953007 5621047 6760560 6659804 6372596
36447 6372596 7688328 7738940 2932726 -2362569 166411 9165298 13438216 8119311
36439 8119311 1570096 1560487 3682116 423422 -5658821 -6416363 -1173411 2975429 1465648
36430 1465648 -4224515 -11571038 -18638015 -21229962 -14896392 -1523329 9918457 11258298
36422 11258298 2811132 -6843857 -8399119 -483608 8667281 9940195 3664257 -1626573
36414 -1626573 -363537 4722990 9029528 12011270 14134014 13393059 8992132 4647403
36406 4647403 4370585 7813237 12334439 16046430 16565478 11583600 3889939 807575
36398 807575 4702348 8952946 7647694 4040062 4040036 6344909 5604939 1546468 -1908042
36389 -1908042 -3791071 -5719343 -6514580 -3555701 1907988 6286136 9013192 11617904
36381 11617904 13664388 14540048 16622943 21404525 25387866 25424068 24646607 26502410 26430654
36372 26430654 17580769 2607902 -8385628 -10210525 -5193234 4483444 17993674 30460954
36364 30460954 35822519 35412312 35397061 36703835 37374841 43438917 63543549 89994858
36356 89994858 99469836 80101511 46993045 22799809 12684865 7663640 3353180
36349 3353180 2634601 4590567 3627500 -921938 -4044622 -4160315 -5010005 -7943849 -9438769
36340 -9438769 -7385835 -3875575 -585053 3379172 7867783 10512960 10289127 8385509
36332 8385509 5171285 604405 -2115503 1245072 8427534 10848239 4756894 -2128064
36324 -2128064 70533 9983874 16304843 12163276 3129356 -836543 2642800 7913801
36316 7913801 10404779 11250477 12483677 12549011 9722152 6664198 6980622 8739483 6562695
36307 6562695 250006 -4099264 -3270416 -1895789 -4715394 -8480003 -6954961 -1206286
36299 -1206286 1476096 -1567815 -4716794 -2643096 2708727 6387066 7458513 8048164
36291 8048164 8263033 6583466 4303393 5271014 10467443 15854410 16919466 13601266
36283 13601266 9775469 9096710 11697220 13667709 10020514 379841 -8295565 -7888779
36275 -7888779 918446 8353016 7210946 1054677 -2443959 -2345205 -3303180 -6467092 -8508481
36266 -8508481 -8930419 -10873553 -13575340 -11523081 -4005306 1431748 -626767 -5786019
36258 -5786019 -7899809 -9028962 -14037163 -19273171 -15531286 -1748683 11819214 15332778
36250 15332778 8737578 -1538938 -9860177 -13429744 -11585146 -6224300 -1199987 479615
36242 479615 -1526639 -5266534 -7483914 -5753768 -1679219 -182978 -3169483 -6161921
36234 -6161921 -4354721 577821 3534669 2962885 106711 -5422674 -12950082 -16265890
36226 -16265890 -9767598 1922527 8559153 8289740 8512451 12223939 13355807 8594664
36218 8594664 4237745 6127420 10694313 11826095 9836638 7595719 4112746 -1383225
36210 -1383225 -4704581 -3239287 -2173279 -6536643 -11597561 -9722750 -3148011 -381544
36202 -381544 -2038975 -480187 6504889 11774605 10769318 8402409 10185174 13692423
36194 13692423 13561584 9650947 5592702 3072714 1477619 177687 -1785062 -5055980
36186 -5055980 -6738382 -2199247 6901221 11669644 7854213 3510857 8052127 18012950
36178 18012950 22822082 22190842 26051529 35991305 40105602 33518207 32233580 53025326
36170 53025326 85083028 97362852 75688350 39417229 16416080 12785237 15056961
36163 15056961 12816851 7523154 3318733 1040466 1751105 7055691 13709820 14545751
36155 14545751 7308975 -1947014 -5931132 -3079792 2830233 6215382 3155498 -4402667
36147 -4402667 -8641825 -4796838 1523331 2282669 447125 6282465 19889144 28172202
36139 28172202 22864078 11438136 4370541 1169796 -2884811 -4648214 1421813 10968320
36131 10968320 14156439 9977860 6019381 5488590 4672165 3022251 5155515 10833729
36123 10833729 12711664 7793714 2840042 3849243 7509782 8419105 8056408 9794973
36115 9794973 10432250 5035962 -2854700 -4895005 -1294230 -1362588 -8218486 -11500818 -1709506
36106 -1709506 13633375 16944909 2984532 -13848766 -17344887 -8112323 759745 2083711
36098 2083711 1045590 4139366 9482863 11441115 9741766 9099810 11826504 15068040
36090 15068040 15169127 11819666 7398272 4086221 2420659 1852282 1828198 1876712 987829
36081 987829 -1510252 -3689311 -1781669 4750036 11118558 13249902 13401729 15128712
36073 15128712 15261067 8274392 -2027221 -4421482 3613652 10761956 7917559 1046166
36065 1046166 627224 5256344 5504612 -132440 -3766147 -1324657 2672732 4304751
36057 4304751 5413924 7464250 7782574 4993017 2263936 2231276 3705505 5646147 8912546
36048 8912546 11421465 7681807 -2393400 -9407904 -5109570 6146715 12639353 10161618
36040 10161618 5369793 4500833 5424812 3632292 915878 2750237 8724761 11190536
36032 11190536 5121314 -4587834 -9114059 -6970232 -4934704 -7838822 -12149591 -12009908
36024 -12009908 -8041865 -6179689 -9060401 -12249785 -9441406 641125 12831701 19797321
36016 19797321 17915437 10002510 2292600 -1326518 -1496883 -833805 -1654995 -5726728
36008 -5726728 -12358805 -16152438 -11485004 -1291342 3922002 -438838 -5809134 -2324801
36000 -2324801 6675178 9899379 5413494 3295373 9810865 17567318 15996380 6066351
35992 6066351 -1223339 1113087 8440312 11295196 6584973 -46150 -2231507 -531068
35984 -531068 -5348 -2004722 -2798189 -703860 644138 -1500735 -4524184 -5665089 -6663014
35975 -6663014 -8510206 -6817069 826949 7106105 3018809 -8554926 -15966454 -14565217
35967 -14565217 -10529706 -8655641 -5607136 1987812 10586757 14747468 13415868 8323228
35959 8323228 1535317 -2938915 -1001651 4866463 6301088 89599 -6410971 -4815401
35951 -4815401 3643466 11033732 12530438 9161590 3870344 -737445 -2323895 -10689
35943 -10689 4824314 10310982 15295490 18255859 17444300 13041861 7110068 1218936 -3687044
35934 -3687044 -6003473 -5261094 -3850177 -3110876 -155166 5873027 7723974 -855681
35926 -855681 -11821593 -10310457 3220729 10906762 2273864 -10924334 -12426928 -3518341
35918 -3518341 2879611 2245137 900095 2970689 6124355 8468021 10273680 9725067
35910 9725067 5050168 319550 1691996 7801042 10337314 4866858 -3863747 -7882935
35902 -7882935 -3862290 4377295 8825949 4798259 -2606036 -3516281 3021445 6628125
35894 6628125 948939 -6245586 -5306132 348094 1211802 -2082436 -764241 7281829
35886 7281829 15917082 21753262 25776816 25756652 18686725 10148324 9336142 14378120 14523588
35877 14523588 7791763 3592378 5589242 5740406 85399 -2995157 2606828 9909694
35869 9909694 11273027 10987663 15397381 19377942 14058260 1946600 -6573932 -7815176
35861 -7815176 -6347507 -5620039 -5950682 -8522765 -12640469 -12121129 -3206633 6842662
35853 6842662 8044783 1764388 -3007366 -4372291 -7027863 -8855604 -1921053 11059796
35845 11059796 15105041 3722254 -10459698 -13796743 -10247093 -11510908 -16421202 -13505506
35837 -13505506 -1221222 7861180 5182402 -2496926 -4836852 -2530459 -3095037 -7435980
35829 -7435980 -9072132 -5251634 -913842 4411 833536 6054851 13209647 15720150
35821 15720150 11859321 6482094 4516596 6595472 10731629 14249411 13968649 8920122
35813 8920122 3697976 4368441 9431136 10058912 2230349 -6820710 -8947698 -6858213
35805 -6858213 -8775841 -14804813 -17027319 -12370100 -6794254 -5120354 -4554198 -1715782
35797 -1715782 666827 -1075407 -4802971 -6323591 -6178929 -7302789 -8726637 -7233421
35789 -7233421 -3561782 -1502461 -1685316 -1383204 -34818 178051 -673984 75898 2281261
35780 2281261 2439968 57766 -654557 2067263 3642721 35065 -5638107 -7865690
35772 -7865690 -6868459 -6819053 -8142662 -7387389 -4126750 -2148482 -2803082 -2463420 1081416
35763 1081416 4130385 2457238 -1897814 -3496176 -1764837 -1889290 -6854258 -12384176
35755 -12384176 -12132262 -5724653 1380675 5339978 7791373 11249699 13968677 12634795
35747 12634795 8502550 6594621 8503229 10041616 7639002 3413103 1273102 1062406
35739 1062406 30450 -2106355 -3428490 -3670085 -3872269 -3154191 25101 3805598 4487595
35730 4487595 2423038 1900730 4061628 4365625 -492568 -6615942 -7086165 -449836 7541018
35721 7541018 10016685 5368595 -1888794 -5799209 -4784621 -2555850 -2763547 -4394656
35713 -4394656 -4356205 -2554557 -907668 1154332 5528593 10287430 10879699 7102041 3862086
35704 3862086 3883558 4697314 4366471 4753174 6634241 6784322 3174539 -1376874 -3837207
35695 -3837207 -4802198 -4720068 -1411389 4661481 7714351 4185131 -1468002 -3806594 -4946879
35686 -4946879 -9802857 -16315618 -17609206 -12271258 -6076078 -4209072 -7065809 -12777593
35678 -12777593 -18773063 -21590529 -19722826 -15806156 -12299526 -7297390 822061 7481399
35670 7481399 6650956 -381883 -6964758 -10108841 -11516030 -11473521 -8649646 -4920789 -3461878
35661 -3461878 -2567255 2057547 9633532 15599908 19193688 22161101 21566418 13368113
35653 13368113 2767367 258413 5729270 7357184 -288764 -7779815 -5767018 1401245
35645 1401245 4072093 1397632 -774286 -342919 189747 -650209 -2779713 -6184705 -8773645
35636 -8773645 -7040821 -2492662 -1441621 -4358153 -3096913 5349333 10799966 4353386
35628 4353386 -6550126 -8636181 -2949642 -1795161 -8239601 -12184672 -7705642 -1760668
35620 -1760668 -1823037 -5010240 -4843764 -1283993 1498674 1992622 1139814 -644153 -2156851
35611 -2156851 -564218 4395159 8017415 5608153 -2051531 -10114482 -14209841 -12310781
35603 -12310781 -5460865 1339283 2378631 -2084196 -5591423 -4611466 -3939756 -8511775
35595 -8511775 -13329828 -8775314 4151610 11534320 3404779 -12240125 -18282168 -9273411
35587 -9273411 3012114 5269912 -2437554 -10585798 -13586779 -13477665 -12923583 -11250902
35579 -11250902 -7776097 -3722201 454950 5295005 8667286 6414408 -1238778 -7878375
35571 -7878375 -8006962 -2758524 3464603 8319277 10917426 9787086 5239208 1233301
35563 1233301 1310548 4259765 6292015 5539439 2350023 -2197979 -5662256 -4938349 -266443
35554 -266443 4088510 5465438 5921140 7320969 7396047 4241864 854314 790982 2438786
35545 2438786 2009786 -439579 -2073979 -1695508 503172 4205114 6316881 1556611
35537 1556611 -9423306 -17175823 -14679076 -6956526 -2879868 -2247446 551441 4256417
35529 4256417 2644011 -3054128 -4237391 2184391 10162825 14286432 14439760 10370780
35521 10370780 1120379 -8683774 -11351346 -7314233 -5117737 -8040192 -9908543 -7147767
35513 -7147767 -5280547 -8849489 -13716556 -14774726 -13490724 -12402024 -9638075 -4456840
35505 -4456840 -848004 39080 3304435 9840124 10878781 1331233 -8950085 -7252841
35497 -7252841 4191949 12636147 12556401 8491579 3863096 -1397879 -3712494 1712329
35489 1712329 10436898 11522769 3005809 -4873805 -4818062 -1652866 -2034380 -3550082 -776787
35480 -776787 3841821 3045350 -3922517 -10016295 -10277684 -7657383 -7491392 -9820637 -10089678
35471 -10089678 -6431881 -3185602 -5405395 -11413524 -14055755 -9752113 -2793322 1146564
35463 1146564 2227742 3957429 6549193 7483862 7230523 9201210 13461374 14752771
35455 14752771 8739059 -1934321 -9472754 -8368319 -729489 5894587 6739110 5116108
35447 5116108 7220810 12885207 16394547 16374699 17616857 20948698 20343468 15628376 18276044
35438 18276044 34387650 49873640 46584618 28925539 18511444 22917304 26941390
35431 26941390 18936415 8644802 9262921 15706990 14091553 3953126 -3009452 -1727963
35423 -1727963 1742336 2895519 4461728 8639815 12536642 12982676 9825837 4196885
35415 4196885 -1329682 -2251198 2263972 5374170 1247108 -4473788 -1761975 7428006
35407 7428006 10578728 3773573 -1746597 3291095 12514498 14378960 8513957 3042485
35399 3042485 755163 -2633899 -8226126 -10558611 -6098232 255144 -94126 -9618223
35391 -9618223 -20501510 -21050225 -8414229 5647016 6179278 -7064762 -19017024 -18757731
35383 -18757731 -12283152 -10977472 -14889762 -15880247 -12198698 -9776173 -11078292 -12217976
35375 -12217976 -10742544 -7895121 -3573328 2498639 5215252 -548239 -8756945 -7430528
35367 -7430528 2890824 7729241 181090 -8157031 -5217344 3432449 4695804 -2115439
35359 -2115439 -6946036 -5144452 -585879 3904532 8554852 11286319 10221171 9691485
35351 9691485 14281685 19103124 16366048 9582332 9047979 13588066 10488105 -3692356
35343 -3692356 -15764638 -15085419 -8146308 -6198665 -8392245 -6889552 -1432218 1632512
35335 1632512 792340 517517 2832469 5061370 4946199 2670203 -718799 -2701524 343775
35326 343775 7887154 13220982 10985391 3842388 -2054893 -4335962 -3307651 1118333
35318 1118333 6152070 5580796 -751176 -2854632 5534599 14849264 12415707 2655622
35310 2655622 915827 8841457 11334976 688416 -11255816 -11713104 -4985493 -2541895
35302 -2541895 -5022943 -5347895 -3214966 -4597484 -9616430 -11711616 -8686082 -5633236
35294 -5633236 -5778055 -5861487 -2682626 1683755 3652507 2588886 -735517 -6135758 -11703817
35285 -11703817 -12608585 -5723605 5507261 13378220 13323204 7987021 3899904 4770925
35277 4770925 8439007 10290521 8678393 5743965 3609361 2315520 1955414 3602243
35269 3602243 6110047 5036627 -1748851 -9339165 -10821749 -6142574 -1500439 23487
35261 23487 2043314 7306343 11561233 9203146 2338344 -638063 4657777 13272825
35253 13272825 16599953 11077314 627760 -7650213 -9431852 -6145556 -2730141 -1940482
35245 -1940482 -1497321 1817754 6420993 7150293 2118289 -4836221 -9069894 -9041427 -4441500
35236 -4441500 4920251 15701161 21338033 20508359 21247327 30179466 40536020 39237229
35228 39237229 25392783 12599822 10681420 14093811 12997820 7406915 3054433 -131713
35220 -131713 -5858592 -11400299 -9912206 -2268016 2853057 2175215 2477547 8780683 15626632
35211 15626632 15593817 10889839 9614298 13212402 14655801 9499206 3149988 4215025
35203 4215025 13222193 21391843 20844371 13561300 8112798 8522799 9882227 6304328
35195 6304328 -285087 -2914565 712938 5562409 6174028 2491270 -1758738 -3404063
35187 -3404063 -1842480 722247 653281 -3154379 -6825354 -5700671 -452082 4299434
35179 4299434 6675232 8409901 9451271 7412335 3461796 2862001 7409923 12920346
35171 12920346 16763060 21569218 27682474 29200609 24277156 23121354 35952050 55763145
35163 55763145 63489005 50998058 30014948 16100606 12118329 11451411 10052679 8823037
35155 8823037 8386241 7994848 7833288 7599871 4459457 -3054239 -10601034 -12386435 -9065229
35146 -9065229 -6088391 -4463197 555685 9895128 16339502 14281675 8918137 9397040
35138 9397040 15372476 17564211 11633219 4281785 3004209 5930793 6518632 4005239
35130 4005239 3145419 5459458 7117578 6209874 6714287 12516397 20823113 24909743 22167682
35121 22167682 16465652 12316530 9123926 3234143 -4886207 -8591302 -2759038 7862736
35113 7862736 12182833 5618743 -4445847 -8243388 -4907343 -706850 514387 -172723
35105 -172723 -2058712 -6367115 -11784386 -13405673 -8280971 840921 8802248 13172096
35097 13172096 15457410 18704615 23970426 28802403 31648783 38769856 60817215 96568215
35089 96568215 124895465 122918911 91989621 56779771 37629257 32728598 29435196
35082 29435196 22537973 15353147 10891801 9535316 10787801 11643153 7652517 299219
35074 299219 -2061726 4223568 11436306 11490013 7702023 8110297 12238511 13227762 9570087
35065 9570087 5947708 4708444 4567286 5596065 7608836 6010581 -2280727 -11054982
35057 -11054982 -12069249 -7982253 -7834148 -11192631 -8793867 556621 6632821 4481806
35049 4481806 1987987 5330150 8525862 5251697 1110057 4242818 10802835 10301702
35041 10301702 1382512 -7386475 -10331813 -9746655 -8996017 -8222070 -7676881 -9362412 -13470489
35032 -13470489 -16515560 -14409727 -6428313 3297240 8133016 5537586 1747348 5405151
35024 5405151 15134748 19430208 12154245 1610593 -1293420 1976374 1762674 -4933606
35016 -4933606 -12027354 -14474092 -13022446 -9968073 -7080327 -6858589 -9458462 -9553792 -2675427
35007 -2675427 6963530 11939944 12679616 14452542 15412332 8937904 -1741038 -4098307
34999 -4098307 4570019 10982776 5833278 -1375370 2383490 12451186 13523068 3171014
34991 3171014 -5350181 -3505137 1695501 511858 -5606791 -8420556 -5098533 -344528
34983 -344528 689793 -2571865 -6703082 -7327440 -2875285 3098578 4715348 65073
34975 65073 -6662224 -10144166 -9502028 -8159932 -9675340 -14587322 -20240383 -23017075 -21438143
34966 -21438143 -17186127 -12734386 -9154737 -7341142 -9091581 -13883404 -16286698 -11157083
34958 -11157083 -1291245 4775588 3487199 71060 -51983 1422703 372540 -2082249
34950 -2082249 -1466017 3058326 8474448 13040681 16532348 16231639 8645700 -3343471
34942 -3343471 -10189409 -5825871 4868477 11865337 11090521 6407485 2152056 -1687677
34934 -1687677 -6079518 -8997426 -8018795 -4697018 -2631136 -1987959 -127714 2005976
34926 2005976 -510750 -7565886 -9763430 434367 15826435 20618166 10134393 -3138224
34918 -3138224 -6074104 -405530 3479131 2338228 1870743 5222409 7841128 4889388
34910 4889388 -2014180 -7715723 -9698302 -9460621 -9778603 -11569500 -12252910 -7690094 2444873
34901 2444873 12121929 14184444 7654598 -1956171 -8333392 -8459734 -3406526 1839236
34893 1839236 1524928 -4357262 -9092408 -8614939 -8361375 -14929222 -24139684 -25382525 -16353796
34884 -16353796 -4920978 3085150 8376036 10026294 4021864 -6517791 -10583691 -4780089
34876 -4780089 -98076 -5952955 -16113261 -19161186 -15232796 -12163212 -11305553 -8835104
34868 -8835104 -6876651 -10745137 -16857363 -15892947 -8435825 -5507087 -11214691 -16157102
34860 -16157102 -12341209 -4583546 -1089250 -1010678 1321799 5737377 7468954 5665204
34852 5665204 3943021 4167659 5049405 5989178 8033985 11245373 13733473 12735205 5705995
34843 5705995 -6959795 -18713302 -20435988 -10843110 42767 2200474 -2435403 -4455128
34835 -4455128 -950986 1802963 -712762 -5004744 -6547376 -6657709 -8137834 -8836197
34827 -8836197 -5215999 329688 1841765 -1222824 -3248154 -1489860 -198330 -3263059
34819 -3263059 -7569276 -7541953 -2970673 1863004 4546585 5929685 6954763 8108097
34811 8108097 10453265 13331292 13074812 8482003 4979258 7365514 10844592 7165509
34803 7165509 -1499203 -4232193 2168567 8235160 6163508 -451722 -5282563 -8120323
34795 -8120323 -9672789 -7015860 -1143426 31063 -5681750 -8028398 142134 9205914
34787 9205914 6221291 -5314748 -12080166 -11001647 -8458232 -4729018 4345604 12936355
34779 12936355 9933408 -1745968 -7532961 -4527543 -5079833 -13612662 -18129544 -11749928
34771 -11749928 -5311142 -8499857 -13762294 -10969106 -4870738 -4515083 -6245101 -1703139
34763 -1703139 5561602 5982430 409305 -3032092 -3666167 -6545751 -9814624 -7014162
34755 -7014162 306370 4621709 5320260 7752972 11010174 8867205 2356983 -718299
34747 -718299 883680 997401 -571512 3572414 13917075 20226962 16977142 11680130
34739 11680130 11934263 13963550 11221563 6261417 5866829 10077568 13811734 15301579
34731 15301579 15817996 14152514 8317827 1111146 -2018693 -124086 2699695 3291462
34723 3291462 2146727 889375 564168 1956451 4480862 5267379 2473747 -790610
34715 -790610 806292 7577476 13273457 12221846 5843339 153465 -1601039 -1028322
34707 -1028322 102985 2702916 6498694 6823780 -45649 -9484047 -12063500 -5750787
34699 -5750787 773826 -117104 -4888607 -5213167 -628082 1435781 -3261113 -10825018
34691 -10825018 -15561422 -15913496 -12963143 -7598558 -1188932 4105640 7558958 10231695
34683 10231695 12096045 11244809 7163037 2494588 -68890 -1049456 -2637960 -4718953
34675 -4718953 -4153731 1377555 9374762 13689816 10815306 4071182 -486111 -1488617
34667 -1488617 -2358300 -4413448 -4801647 -2690986 -2058625 -5012119 -7385502 -5657878 -3751105
34658 -3751105 -6863030 -11929792 -11448817 -5232329 -955021 -2741179 -5947454 -4978871
34650 -4978871 -750052 2207512 2113223 662058 -366373 -1080263 -2744117 -5680036 -7932077
34641 -7932077 -7303836 -4923473 -3826586 -3021101 2390253 12301873 18148075 13609938
34633 13609938 4384308 659414 3059660 3425844 -2325974 -9553498 -12333516 -8952896
34625 -8952896 -715069 8408269 11939226 7230177 590480 -407356 2157965 1082937
34617 1082937 -2588098 -647054 7938228 14322810 13554692 11452121 14446289 20887968
34609 20887968 25990177 28137790 27178080 23177869 19208850 18644599 18534911 13518877
34601 13518877 6683244 6314141 10674202 8540042 -1576966 -6489854 872684 9403939
34593 9403939 8117067 4016177 9299863 20700117 25549000 21413085 15704149 10837814
34585 10837814 3837245 -2474018 -1758894 3431610 4019659 -1137683 -4672862 -4326521
34577 -4326521 -5239932 -7730393 -4774377 5310247 14106767 14854583 10223579 4963733
34569 4963733 -636093 -5959258 -6804199 -1999947 2943097 3381460 1496514 1006499 1360205
34560 1360205 1075172 1598693 3554059 3771450 428726 -2886604 -2498265 -349177 -189205
34551 -189205 -1509586 -1743122 -1513816 -2901661 -4707465 -4283498 -2530409 -2139039 -1659363
34542 -1659363 3354764 12454168 18424018 15991836 9204213 6494539 9751980 12319741
34534 12319741 8551527 1488815 -2071652 -1771013 -4087194 -12317178 -21036471 -23003360
34526 -23003360 -17919239 -11025482 -5893194 -2702847 -1741691 -3756600 -6882185 -7230832
34518 -7230832 -3562336 1002897 2402093 -896041 -7369824 -13309782 -14587546 -9731334
34510 -9731334 -1501550 5439716 7782578 4472250 -2990536 -10058973 -12275443 -10792170
34502 -10792170 -11081445 -14091893 -14002523 -8594672 -5481610 -11066737 -18563711 -16234393
34494 -16234393 -4461686 5384002 7604141 7079735 7510848 6132901 2580750 2099744
34486 2099744 5673728 6926345 3989631 4601801 12752601 19805641 17597356 12003303
34478 12003303 12999352 17958008 16974925 10439748 7996230 11269810 10897745 2623423
34470 2623423 -5640407 -6967579 -5418698 -7225624 -10362606 -9702337 -6297672 -4383488
34462 -4383488 -3521992 -670828 2868296 3062854 -123293 -3339636 -5672518 -8410737
34454 -8410737 -10461831 -9903565 -9129645 -11858732 -15014205 -10979183 160532 8054670
34446 8054670 5864572 110199 705980 6124069 6413034 -1197576 -8251914 -7606854 -2610492
34437 -2610492 -452381 -1815398 -1867689 1338632 4156948 2534291 -3080240 -8178076
34429 -8178076 -8158317 -2384285 4670394 7274921 4506452 1335128 2549302 7001564
34421 7001564 9458269 6973575 1551832 -2838616 -4108310 -3156673 -2561941 -4120359
34413 -4120359 -6800658 -7361011 -3509636 4154602 13586905 23067649 30305085 31466052
34405 31466052 23940143 10593360 -561942 -2621417 3873136 11218728 11837858 5537014
34397 5537014 -1057570 -2230816 1381564 5749667 8882361 10465001 8738555 2715948
34389 2715948 -3388206 -3657849 828063 2499138 -1585669 -5017888 -2054583 3030578
34381 3030578 2081683 -4989537 -10412340 -9017044 -2909008 3644651 8605040 10713663
34373 10713663 8280367 1730284 -4932064 -7291529 -4796240 -1142197 -53424 -493806
34365 -493806 2567506 10692517 17106654 13949867 4084664 -727359 4514610 11135545
34357 11135545 9986632 4864940 5417698 11342860 12902903 5865551 -2860530 -5699249
34349 -5699249 -3292331 -414469 1320260 3054237 4304712 2666822 -2479312 -7508338
34341 -7508338 -6827786 983063 9753351 11854614 8368036 7918190 12925014 13716504 2160479
34332 2160479 -14634581 -22534832 -18655694 -12331216 -9837686 -8016088 -3463244 1333006
34324 1333006 3554232 4366001 4871270 3546449 -96138 -4201832 -7983954 -11465513
34316 -11465513 -11970026 -7272595 -2295021 -4961243 -14044827 -18993500 -14188011 -5754249
34308 -5754249 -1260069 -313647 607741 1167406 84961 -635928 705621 2098532 1634550
34299 1634550 268964 -1782915 -5774009 -8937505 -5086780 5571853 14173408 15139018
34291 15139018 13196892 13337246 11654215 3538297 -5836574 -8119976 -4261156 -1835155
34283 -1835155 -3424806 -5723663 -7050178 -7635294 -5145311 1709644 7107192 4105928
34275 4105928 -4478706 -9355072 -8020157 -6295528 -6889607 -5605806 -567802 3444162
34267 3444162 3233605 2635858 5628886 9684073 10463454 8887106 8944408 11142010 12170506
34258 12170506 9715804 4611222 -1002999 -5482037 -7936704 -7967882 -5284955 138310
34250 138310 6760456 11048317 10148826 5125946 359110 -276635 3778228 9421892 11281458
34241 11281458 5533506 -5215609 -12312533 -9342482 399519 7315702 6203777 1069941
34233 1069941 -1040192 1330619 3211441 504938 -3716703 -2683974 3815689 6799590
34225 6799590 50504 -8702984 -6577388 5039060 10089064 490569 -11118134 -9027555
34217 -9027555 3447956 10137609 4909619 -3734696 -8670601 -11790551 -14140721 -10666199
34209 -10666199 -308338 7570769 3988901 -7558631 -15953588 -15971930 -11356532 -6603676
34201 -6603676 -1556436 5126854 11050812 11315412 4371087 -5106293 -10830583 -11730407
34193 -11730407 -11246665 -9812755 -3321944 8029950 15348045 11931521 4390679 4559299
34185 4559299 12415613 16447464 11175750 4484248 4609079 8582289 8538939 2917791 -3897837
34176 -3897837 -8194818 -8554676 -5176636 -1639118 -2979044 -8173718 -9436812 -3345736
34168 -3345736 2811464 1548708 -3224121 -2570590 3514065 7220726 5884643 4602127
34160 4602127 5947262 6116072 3221281 1126089 1566254 -103849 -6380753 -11169682
34152 -11169682 -8341518 -2219287 -1990337 -7873185 -10707269 -5528897 1825692 4033567
34144 4033567 1816394 -201499 -2403250 -8682810 -17729795 -22129499 -17454769 -7860637
34136 -7860637 -560948 1959113 1791522 690235 -845835 -936679 2789531 8740667 11217038
34127 11217038 6972115 -22371 -2907368 -119250 3467231 3620728 2028951 2899396
34119 2899396 6508935 8934818 7499100 3738046 867892 905436 4737764 12024041
34111 12024041 19541368 22327135 18685613 12172628 6817197 2759313 -1201086 -3762727
34103 -3762727 -3389869 -1944686 -1753837 -849643 4166934 11749172 16797188 17613535 16510502
34094 16510502 14342992 10080819 5374921 3297173 2346806 -1736459 -7714626 -9732339
34086 -9732339 -7587901 -7846195 -12119104 -12910082 -5518124 4015565 8335446 8736143 9697201
34077 9697201 10739262 10642303 12717886 17835582 18793638 10856090 2014559 2360155 8169292
34068 8169292 8176256 2015907 -525098 3029631 5024981 3365815 6135987 16505253
34060 16505253 26104047 30871498 42714344 74349719 117438070 146037250 141998731
34053 141998731 111293836 75053229 48937847 33019518 19476819 6061529 -1744961
34046 -1744961 -1181435 1617463 -86119 -4326993 -5459353 -4136257 -4510354 -4795110 -56901
34037 -56901 7025385 8253893 3081028 -194397 2223158 4969158 4591045 5182712 8992046
34028 8992046 10925649 7732618 4303334 4995524 6242765 3965351 1281002 2028858
34020 2028858 2892080 -620587 -5438753 -5652603 -1976261 642666 1568072 3690837 6645694
34011 6645694 7371530 5610945 3069366 -947970 -7116759 -10858990 -6023416 5707467
34003 5707467 14110506 10839068 -1734737 -12797405 -13365769 -4786335 2964896 2777361
33995 2777361 -1272356 -680156 4446455 6035706 1536708 -2172660 -902437 149639
33987 149639 -3217280 -5982958 -3070666 964946 -288219 -4070686 -4239368 -2688632
33979 -2688632 -5195192 -9965685 -10526645 -7254020 -5857244 -6233339 -3191743 2415251
33971 2415251 3693310 -430544 -3147787 -1419906 -669930 -4978123 -10352116 -11018104
33963 -11018104 -6100428 2377936 11841924 17350999 14299960 6032881 2355714 6763171
33955 6763171 11068532 7132753 -1270813 -3597937 3913237 14849011 20784413 18635913
33947 18635913 10905240 2099362 -4609906 -8360706 -8702723 -4228495 4724505 13345892
33939 13345892 16144002 13431089 10482552 10380313 11551611 12024282 11294698 7952113
33931 7952113 1202571 -4247438 -1102304 10334716 20644247 22853828 19861678 17128935
33923 17128935 14562094 10859307 9620462 13485011 16443777 10785595 -237813 -5667582
33915 -5667582 -2754074 -580877 -5587274 -12208086 -12865930 -10001729 -10754379 -14338585
33907 -14338585 -13658807 -8089992 -5366779 -8649870 -9979025 -1874044 10327255 14762275
33899 14762275 8882133 1811131 1385796 5627414 8459960 7891656 5674720 3521119
33891 3521119 3067594 6011124 10774300 11922638 6450843 -1587879 -5999884 -5937394 -5236803
33882 -5236803 -6225887 -7718050 -7985125 -6755124 -5152196 -5451740 -8809113 -11532898 -7340926
33873 -7340926 3504284 11544937 9517571 2638643 1247456 6154933 8970108 5577969
33865 5577969 819446 -839819 -1007012 -1418174 117920 4043101 5630621 1893744
33857 1893744 -2916075 -3417451 -818133 158236 -1222680 -2338168 -3089807 -5900083 -10605113
33848 -10605113 -13910122 -14140369 -12949000 -11751240 -9499422 -5198646 -629513 900131
33840 900131 -2076163 -7628265 -11879461 -11916238 -7795917 -2160114 1912517 2865292 1379634
33831 1379634 -144764 605852 3663853 6664949 7477231 6314063 4805498 4274986 5700969
33822 5700969 9433235 13318750 13188426 7782929 1637319 127401 2756974 4379183
33814 4379183 2136189 -2065955 -5325932 -6559413 -5700515 -3154012 -21814 3478985
33806 3478985 8833412 15763589 19858255 17729136 12820130 10981457 11571544 9191912
33798 9191912 3822426 1783298 5117377 7536867 4413613 214318 1118524 5421324
33790 5421324 6977528 4763991 3292750 5142355 7803416 7469219 2972369 -3301438
33782 -3301438 -6589516 -3535937 3587428 8760603 9706498 10173171 12958276 15103218
33774 15103218 13273829 9445868 6703534 3441498 -2516432 -7267345 -5235530 1269224
33766 1269224 3968399 174868 -4104786 -3673852 -518484 1531972 2886507 5386935
33758 5386935 7570162 6815440 3739165 824158 -1687966 -5248365 -9396201 -11778952
33750 -11778952 -11392381 -9172298 -5528548 -64254 5598087 7314381 2646967 -5601989
33742 -5601989 -11905055 -13610497 -12498185 -11128199 -9742629 -7376874 -4016475 -113136
33734 -113136 4691711 10504929 15649354 18066249 17745437 15998915 13032552 8526586
33726 8526586 4050892 1862550 1168516 -868701 -3231460 -84685 11042748 22642227
33718 22642227 23362365 11041482 -3783749 -8993563 -3569498 2883288 2450568 -2114222
33710 -2114222 -2269422 4525104 11687973 12627638 8595218 4295214 -535134 -9038601
33702 -9038601 -17855299 -17537162 -5534225 7150021 8016246 -1216972 -7275005 -3060856
33694 -3060856 3960009 3675855 -1872422 -1614786 8143504 17240122 14540352 2666250
33686 2666250 -5599868 -3796084 1767869 2789741 -621509 -4056974 -7346280 -12346102
33678 -12346102 -15561086 -10980373 -336625 6441320 3212208 -4823622 -8037491 -3452873
33670 -3452873 3260187 4656116 -952185 -7502021 -7108805 414215 6203846 3763742
33662 3763742 -1616699 -808280 4731291 5268796 -1196818 -5651095 -2988285 419324
33654 419324 -970147 -2051015 2773203 8021715 5530046 -1352841 -2522356 3205925
33646 3205925 7635879 7112231 6683869 9466495 11097596 7759371 2577752 300737
33638 300737 742703 1120367 1143368 2272456 4109298 4354336 1620968 -2955917 -6548212
33629 -6548212 -7234263 -6366396 -7071943 -9302372 -8775342 -3368672 1861214 27328 -8271966
33620 -8271966 -14869748 -13281081 -5249434 1922009 2712039 -1439786 -3480509 855063
33612 855063 5929871 2115617 -9886249 -17608262 -13752576 -6531119 -5779666 -7004142
33604 -7004142 -906730 7470657 4832627 -6903600 -10599852 -677225 7020064 44173
33596 44173 -11116727 -10333935 -773723 2438101 -3248186 -7161535 -6131193 -8956909
33588 -8956909 -18198511 -22492469 -13356228 1281809 8196883 6082731 3652520 5466253
33580 5466253 7856670 6960990 3696986 700016 -471035 1357657 6143742 10408861
33572 10408861 9714404 4548893 400739 465472 1468379 -1054965 -6119813 -8945397
33564 -8945397 -7281511 -2695539 3097179 9184418 13127194 12130831 7642123 4882423
33556 4882423 5998924 7195241 4941728 1514456 1033514 2820754 2835757 265019 -1171574
33547 -1171574 1907753 8842909 15231195 15633218 9091408 4266873 13907832 38449508
33539 38449508 59489002 58024752 37164084 17507319 10876570 9789949 4771317 -818775
33531 -818775 -223414 3221937 2577472 435834 4191258 11880137 13975700 8137470 1830260
33522 1830260 -21711 -174010 -457207 2221295 8097499 11805900 12124446 16290951 28208167
33513 28208167 39049483 37428283 24546639 11512681 4767397 2149839 1278122 2808625
33505 2808625 4934273 2981425 -3158272 -7924945 -8969031 -10566180 -14714258 -15533431
33497 -15533431 -8311270 824481 1397083 -7500949 -16230158 -16722841 -10038741 -2207809
33489 -2207809 2077023 1146978 -3468158 -7487370 -8047829 -7502029 -9285220 -10928080 -6889779
33480 -6889779 1500505 5739520 1807619 -4362528 -6100561 -4248172 -2134950 1055214
33472 1055214 5881554 7284180 1286709 -6580188 -7302126 -420035 7362581 13164857
33464 13164857 18871178 22391935 18003933 7042821 -801978 -240880 3031553 2109132
33456 2109132 -1820321 -4350292 -5536263 -7174011 -7558485 -4877987 -2036599 -2492245
33448 -2492245 -4386723 -4103136 -2732400 -3446968 -4984783 -3842195 -1342952 -2151415 -6066264
33439 -6066264 -7415632 -3686618 413641 -380822 -4719782 -6420437 -1778370 6082155
33431 6082155 9642906 4574198 -4175611 -6249358 1731482 10632247 9995474 2219284
33423 2219284 -775158 5661386 12794746 11149471 2576346 -4382789 -6050913 -5097032
33415 -5097032 -3598156 -841953 2291508 2131095 -2660051 -7875957 -8136672 -3212528
33407 -3212528 2077530 3931775 3362974 3053246 2671356 406928 -1605881 1853329 10759689
33398 10759689 16899021 13713808 5823374 2645907 4340451 1794213 -8540998 -17767485
33390 -17767485 -16256957 -5901887 4371115 10203732 12804576 12189430 6873951 -723050
33382 -723050 -5126380 -4602197 -2225603 32547 3322895 7296531 8404640 4739309
33374 4739309 -990847 -4961909 -5785792 -3620447 857893 5249701 6461861 4582185
33366 4582185 2994814 3416282 3739218 1959161 -888956 -2841260 -2730985 941116 8450852
33357 8450852 14891013 13228290 4014447 -3438944 -3100117 502071 1722186 3678488
33349 3678488 10942239 17873055 14527312 1781106 -9691544 -14589927 -16531869 -16348611
33341 -16348611 -9280634 2425156 6277666 -3513382 -15295376 -15462860 -7603541 -5638623
33333 -5638623 -12434149 -16841265 -11108542 -585683 5847572 6461271 4377015 1071951
33325 1071951 -3425066 -7546463 -9096805 -7568799 -3974891 -2891 2256651 1977170
33317 1977170 1012361 1059762 50291 -4692760 -9888086 -8344063 476703 7172156 3632373
33308 3632373 -6240665 -12024139 -10564404 -8108197 -8738026 -7645722 -42298 7965050
33300 7965050 4738320 -10606910 -24410275 -24877696 -16927203 -14064655 -18713227 -19965458
33292 -19965458 -11698138 -2800554 -3729160 -10727566 -12081133 -5635672 -451054 -2235342
33284 -2235342 -6389342 -7016613 -5048448 -4175791 -4431099 -3662957 -1947349 -1566272 -4571549
33275 -4571549 -11360211 -19255618 -22663426 -18219255 -9610177 -3215790 242419 4165676
33267 4165676 7111115 3555407 -4844981 -7861973 -1023032 6936497 7234678 4094388
33259 4094388 6206649 11275488 9863678 1737199 -3068815 -84678 2977993 -1451721
33251 -1451721 -10146091 -15183169 -14440137 -11067965 -7214017 -3633534 -2577810 -5693047
33243 -5693047 -10082901 -10828134 -7458562 -4629902 -5849721 -9107959 -9841582 -6523991
33235 -6523991 -1642434 2414973 6470122 12051137 16693279 14875044 5406188 -4542390
33227 -4542390 -6299566 49288 5888527 4964772 271549 -1705489 -199674 -216638 -4905950
33218 -4905950 -11310746 -13889823 -10153372 -2588251 3472960 3930691 -524014 -4728356
33210 -4728356 -4239205 -246391 2040502 -283553 -4957890 -7984572 -7395903 -2996149
33202 -2996149 4378014 11106041 11290401 3012478 -7192088 -10292045 -5041734 1561059
33194 1561059 3956112 3270575 1949385 -895903 -5189653 -5990152 581916 10474207
33186 10474207 16433530 17621685 18477420 19299882 15382640 6743652 1522968 5642353
33178 5642353 13764573 15213697 6518889 -5734210 -13097669 -13017397 -8983389 -5577676
33170 -5577676 -3985560 -1807663 2803543 7807210 9651099 7948489 4989946 1365769
33162 1365769 -3871485 -8515404 -7678006 -940433 5383550 6080121 3590109 3618254 7331199
33153 7331199 11260970 12239345 9119386 2400916 -4112339 -4110680 3994141 12509216 12340339
33144 12340339 4675922 -494571 2079545 6207079 3473047 -4809884 -8908953 -3087321
33136 -3087321 6581734 8515368 -995648 -12762559 -14500768 -4525098 6787288 8958687
33128 8958687 1845898 -6472871 -8949411 -4917310 1310985 5077337 5710733 6621391
33120 6621391 9429308 9486307 1899842 -8629925 -11111415 -3411209 3448067 443582
33112 443582 -7160166 -8886740 -4044715 343000 1796909 3442213 5533430 4934401
33104 4934401 1990639 15784 -1093662 -3227833 -3650334 1274383 7183085 6178371
33096 6178371 47589 -1317887 4206138 7732505 4773511 2393625 5760525 8570938
33088 8570938 4715975 168638 3319768 10063075 9350922 115396 -7707184 -8111049
33080 -8111049 -5862243 -7203952 -10884310 -11379653 -7083104 -2370537 -2172275 -5327804
33072 -5327804 -4657950 4031388 14349110 15874399 8364531 2390248 3966085 7049426
33064 7049426 5609005 3749766 6164726 7188229 296150 -7773001 -5303258 5288245
33056 5288245 10103011 4821586 -416685 1169651 3777983 2064065 995384 5498380
33048 5498380 10263320 8398649 2844577 718822 2222927 3536700 5582452 10796655
33040 10796655 14930270 11750226 4092154 785050 2929664 2606859 -3445066 -8123122
33032 -8123122 -5589090 -614671 -549293 -3777633 -3259288 1635731 4329508 1603696 -1933681
33023 -1933681 -1847063 -661145 -2729090 -6054870 -4513474 2891322 10112193 12133299
33015 12133299 10452405 8603913 6423848 2215124 -2457879 -4391229 -3393660 -1397164
33007 -1397164 1285543 4366193 4166795 -2160357 -9615453 -9386092 -894701 6898575
32999 6898575 8029215 6179381 5770017 4191318 -1696750 -8197268 -10891654 -12504890
32991 -12504890 -16805540 -19448885 -14069544 -4207958 765688 -132939 396577 4267652
32983 4267652 5432801 2079535 20036 805935 -2170578 -10491124 -14667612 -8986101
32975 -8986101 -2637308 -6102250 -14133186 -13779404 -4056702 4737490 8394839 12532514
32967 12532514 19036841 21414331 16642814 10751049 7874322 3101754 -7556935 -17613040
32959 -17613040 -18032689 -10021294 -2836710 -1708881 -4032078 -5519633 -4458011 -970612
32951 -970612 3013367 3769814 -12915 -3992554 -3443723 -712687 -2306527 -8778119 -13156006
32942 -13156006 -10603820 -4169255 1318412 5546870 8971325 7793889 -952528 -11845928
32934 -11845928 -15699803 -11714343 -8477644 -11526973 -16388620 -16957826 -14547243 -13560980
32926 -13560980 -13252112 -10418356 -6867559 -6647647 -7620164 -3827484 3921738 7919006
32918 7919006 5088743 642810 -1745078 -4901002 -9820880 -11111126 -6289782 -1826827
32910 -1826827 -3118131 -5388226 -2240731 3182355 4364947 2937745 4066327 5250967
32902 5250967 1009310 -4852737 -3998581 1382065 1327131 -4301753 -4484233 4859389 14614894
32893 14614894 17631593 17201134 15852140 9013834 -3109433 -9825252 -5497983 -426655
32885 -426655 -5792839 -16334887 -19149044 -13019995 -7491164 -7264148 -8396152 -7195731
32877 -7195731 -3623250 1720195 6208243 4263059 -4488391 -10486646 -6095675 2640735
32869 2640735 5633837 4877475 9050730 16105722 15523831 7031785 2426906 6575038
32861 6575038 10249611 6319821 647928 309185 1459686 -2693470 -9387697 -10689795
32853 -10689795 -6067241 -2584076 -4202924 -7036266 -5492506 393201 4758020 2458255
32845 2458255 -4446006 -8552051 -6754477 -4436542 -6446156 -8590593 -5077117 -520015
32837 -520015 -4448861 -14959668 -19139795 -11752607 -2625603 -1164217 -3430845 -924575
32829 -924575 5920929 10532479 10720170 9046106 6543257 2518835 -2051086 -6064433
32821 -6064433 -10666174 -15753336 -17024223 -11068779 -1199348 5794862 7040345 4918658
32813 4918658 3236529 4495108 8456311 11296790 8936262 2833756 -883429 633435
32805 633435 4118729 6559816 8855761 10844402 8899628 2335040 -3405157 -4407072
32797 -4407072 -4029654 -6349614 -9037765 -8264199 -6053878 -6442504 -7766253 -5211333 1083440
32788 1083440 6114114 6801525 4287707 1023089 -888596 -448354 436086 -1002567 -2410898
32779 -2410898 2261710 11701190 14264681 2641454 -14057714 -21095531 -17237190 -14257669
32771 -14257669 -19314038 -26655206 -27016509 -17941426 -4005744 7332440 9769556 3497108
32763 3497108 -3216166 -2532250 3319101 5791216 2334792 -1128889 -34257 2837289
32755 2837289 2773742 -447056 -3698077 -4771907 -3826467 -2389373 -1371367 675785 5529406
32746 5529406 10362755 8742195 -289976 -8473625 -8555428 -4269821 -3998322 -7953453 -9143786
32737 -9143786 -5057898 -549849 400927 -1224568 -3484377 -5109371 -3440538 2830945
32729 2830945 9087877 9286396 4700662 1888619 2834832 4221142 5464159 8934916
32721 8934916 12199070 9486589 2504971 422411 6159057 11607369 10299833 6112587
32713 6112587 4331644 2316053 -4167950 -11734678 -13918866 -10660482 -6578599 -3035352
32705 -3035352 1736568 6687605 7927126 4110071 -1844302 -5673664 -4396137 1646620
32697 1646620 7095643 4949200 -5342167 -15753329 -18550503 -14664957 -10349284 -8484500
32689 -8484500 -7128119 -4755162 -2775430 -3092305 -5837503 -9489361 -11773269 -10971150
32681 -10971150 -7417214 -3223528 -212080 1203137 1588149 2164535 3936917 5710838
32673 5710838 4823122 1740317 828137 3390580 4089534 -559454 -4675844 -1626648 3726038
32664 3726038 1377497 -7362667 -11237376 -6716230 -2078790 -2162571 -1781759 2006111 3855355
32655 3855355 1677683 1679592 5345056 4296424 -3649756 -6776217 1280717 7783189 514740
32646 514740 -10646052 -9087082 749273 958107 -9605185 -14011656 -5655607 2685705
32638 2685705 1608535 -1900105 -419642 1569828 -409135 -853134 4182698 7419553
32630 7419553 2469725 -4103609 -3262231 1945160 2786311 -646977 -2006009 -1058016 -2907986
32621 -2907986 -7475850 -9285860 -6595402 -2773814 513009 4387281 7854006 8504260
32613 8504260 7630272 8530730 10325913 9622672 7859818 10237216 16546876 19500774 14307039
32604 14307039 4892823 -1602410 -2418696 504941 3591644 2832603 -3982562 -13217654
32596 -13217654 -16835841 -11360570 -3024037 -318996 -3161319 -3865043 1361265 6752543
32588 6752543 5166515 -1513723 -4536133 -237293 4840972 3063139 -3639107 -6805906
32580 -6805906 -3852920 -1580586 -5482513 -10946988 -9829802 -2569748 2418240 908502
32572 908502 -1715739 971641 7507643 11520481 10086472 5243510 -164503 -3542883
32564 -3542883 -1175321 8371517 18875080 20118877 9758411 -2507316 -6008381 -958884
32556 -958884 4843046 7802265 10505630 12963126 9870164 -258370 -9413008 -9083968
32548 -9083968 -1611886 3267542 1747624 -217251 3054282 8817736 10660001 7473868
32540 7473868 3567217 1491603 -1010234 -6303068 -12158174 -13794424 -9617394 -3153640
32532 -3153640 846178 1024045 -410394 -1120755 -949663 -825420 -590894 1224753 5509787
32523 5509787 10585439 12361674 7599517 -1884052 -9116546 -8106163 -379961 6144818
32515 6144818 5185716 -2237513 -9837100 -11580167 -5195164 6693363 17505429 21348061
32507 21348061 18612043 15102007 14474168 14475533 12538806 11167261 13568933 16706555 14356482
32498 14356482 6593268 810056 2058522 6759186 8218153 5125634 1670389 945721
32490 945721 1296608 -433037 -3749992 -4375262 -82893 4709393 3338272 -3607237 -7435939
32481 -7435939 -2954964 3124488 671931 -9590849 -17107692 -16145614 -12007418 -11141624
32473 -11141624 -12436604 -12063860 -10668471 -10386478 -9354128 -5292984 -1501288 -2921250
32465 -2921250 -7879769 -10022987 -8031862 -7272281 -10963763 -15454371 -16376351 -14596804
32457 -14596804 -12976134 -11078810 -6978522 -1918003 801114 478612 -948127 -3022541
32449 -3022541 -7261046 -12784136 -14812593 -10038719 -2048155 1453826 -2697424 -9200627
32441 -9200627 -10520425 -5974401 -2123613 -3665188 -6987711 -5729106 -851625 -91096
32433 -91096 -6318286 -11750005 -8029283 1324210 4704271 -1868959 -9126627 -6793346
32425 -6793346 3468275 10922801 8464047 -1094903 -9283543 -9261286 -687503 9417614
32417 9417614 12203900 6410437 416268 1674788 6810248 7135743 1713034 -1950726
32409 -1950726 21806 2577835 773218 -2248074 -199999 7608365 15981872 19310618
32401 19310618 15074904 5284182 -3498488 -5129477 -722013 3182455 3997612 4840400
32393 4840400 5569743 373786 -11212456 -19167013 -16097478 -8713026 -7705185 -12000797
32385 -12000797 -12941385 -9418574 -7428010 -7407923 -4494803 -842435 -4807274 -15706684
32377 -15706684 -21428958 -15485315 -6027610 -2764524 -4210693 -3773993 -215565 4327449
32369 4327449 9508433 13550229 11516939 3344944 -2639431 -912497 2643727 329091
32361 329091 -5553453 -8585152 -9643885 -12470321 -12990167 -4878442 6881930 10352843
32353 10352843 4424094 402514 4071864 7541287 2962111 -5633470 -9845579 -8318131
32345 -8318131 -4648991 -558366 2483040 447853 -7361445 -13719255 -11889938 -5780850
32337 -5780850 -4654347 -9654379 -12996685 -10011160 -4413055 -402158 3103232 7004640
32329 7004640 7141224 541538 -7021734 -6024131 4928734 17187112 22316948 19946448
32321 19946448 14573606 9268612 5298184 4295017 6407989 7726103 3764941 -4331634
32313 -4331634 -10318985 -10069653 -5416135 -222782 4049594 7033597 6660964 1227391
32305 1227391 -6310284 -9293206 -4149800 4957688 10085353 8452258 5806845 9137159
32297 9137159 17266146 22235911 20311226 16736643 16831719 17456230 12945997 5819811 3798677
32288 3798677 7423036 9089350 5337656 1597718 1804763 1491316 -3726031 -9677434
32280 -9677434 -10213673 -7316632 -7722773 -12570236 -16757960 -16550440 -12401196 -6221745 -890674
32271 -890674 -317044 -4848841 -8620292 -6425547 -961095 1809874 1552465 1766661 2158529
32262 2158529 316794 -1158719 2233721 7523184 7143909 1750490 633305 6947433
32254 6947433 11868112 7942070 101571 -2645805 -86883 1452977 -270008 -1953154
32246 -1953154 -1262126 1348665 5779746 11771084 15980714 14491366 8459739 3405143
32238 3405143 2165856 1359924 -4227996 -15266243 -26277540 -29779746 -22817492 -10511072
32230 -10511072 -2258761 -2958128 -8272746 -9485616 -2643271 7807195 14011434 12459024
32222 12459024 6426606 996866 -2797804 -6782098 -9652456 -6938858 1202862 7235699
$$ [...]
##END NTUPLES=NMR SPECTRUM
##END=
