##TITLE=31Pdec_B3dm-3
 CDCl3, 24 sc
 13.7.2023
##JCAMPDX= 6.0         $$ Bruker NMR JCAMP-DX V2.0
##DATA TYPE= NMR SPECTRUM
##DATA CLASS= NTUPLES
##ORIGIN= UXNMR, Bruker Analytische Messtechnik GmbH
##OWNER= root
$$ XWIN-NMR		Version 3.5
$$ Thu Jul 13 14:21:05 2023 Russian Standard Time (UT+4h)  she@DPX200
##.OBSERVE FREQUENCY= 81.013821
##.OBSERVE NUCLEUS= ^31P
##.ACQUISITION MODE= SIMULTANEOUS
##.ACQUISITION SCHEME= undefined
##.AVERAGES= 24
##.DIGITISER RES= 16
##SPECTROMETER/DATA SYSTEM= spect
##.PULSE SEQUENCE= zgpg30
##.SOLVENT NAME= DMSO
##.SHIFT REFERENCE= (INTERNAL, DMSO, 0, 248.564)
##AUDIT TRAIL= $$ (NUMBER, WHEN, WHO, WHERE, WHAT)
$$ ##TITLE= Audit trail, XWIN-NMR		Version 3.5
$$ ##JCAMPDX= 5.01
$$ ##ORIGIN= Bruker BioSpin GmbH
$$ ##OWNER= she
$$ F:/spectra/data/she/nmr/P31/1/pdata/1/auditp.txt
$$ ##AUDIT TRAIL=  $$ (NUMBER, WHEN, WHO, WHERE, WHAT)
(   1,<2023-07-13 14:20:07.37 +0400>,<she>,<DPX200>,
      <created by zg, POWCHK disabled, PULCHK disabled
       configuration hash MD5:
       00 E9 B6 7A A2 85 ED C7 34 08 36 98 17 FE 4E 26
       data hash MD5: 32K
       7B DE 1D 6C D9 56 C6 B7 57 78 82 D3 83 90 AB 56>)
(   2,<2023-07-13 14:20:10.57 +0400>,<she>,<DPX200>,
      <Start of raw data processing
       efp BC_mod = 2 LB = 1 FT_mod = 6 PKNL = 1 PHC0 = -10765.08 PHC1 = 257.4848 SI = 64K 
       data hash MD5: 64K
       67 07 DD 9C AB 27 FC 38 F3 BD 15 99 54 64 D9 9C>)
(   3,<2023-07-13 14:20:28.42 +0400>,<she>,<DPX200>,
      <pk PHC0 = 10.32944 PHC1 = -50.2 
       data hash MD5: 64K
       9D 33 06 71 53 86 83 C2 F6 6C 91 DF 15 35 55 99>)
(   4,<2023-07-13 14:20:31.78 +0400>,<she>,<DPX200>,
      <abs ABSG = 5 
       data hash MD5: 64K
       69 42 6F FB 19 0B D8 F2 C9 5F E5 04 E6 4D 49 41>)
$$ ##END=
$$ 
$$ hash MD5
$$ 86 47 99 36 04 0B E8 1B 3A E6 C4 C1 A1 BC CE 1E
##$RELAX= 
##$RELAX= 
##$RELAX= 
##$RELAX= 
##$RELAX= 
##$RELAX= 
##$RELAX= 
##$RELAX= 
##$RELAX= 
$$ Bruker specific parameters
$$ --------------------------
##$DU= <F:/spectra>
##$EXPNO= 1
##$NAME= <P31>
##$PROCNO= 1
##$TYPE= <nmr>
##$USER= <she>
##$AMP= (0..31)
100 100 100 100 100 100 100 100 100 100 100 100 100 100 100 100 100 100 
100 100 100 100 100 100 100 100 100 100 100 100 100 100 
##$AQSEQ= 0
##$AQ_mod= 1
##$AUNM= <au_zg>
##$AUTOPOS= <>
##$BF1= 81.014009
##$BF2= 200.13
##$BF3= 200.13
##$BF4= 200.13
##$BF5= 200.13
##$BF6= 200.13
##$BF7= 200.13
##$BF8= 200.13
##$BYTORDA= 1
##$CFDGTYP= 0
##$CFRGTYP= 5
##$CHEMSTR= <none>
##$CNST= (0..31)
1 1 145 1 1 1 1 1 1 1 1 1 1 1 1 1 1 1 1 1 1 1 1 1 1 1 1 1 1 1 1 1 
##$CPDPRG= <waltz16>
##$CPDPRG1= <>
##$CPDPRG2= <waltz16>
##$CPDPRG3= <>
##$CPDPRG4= <mlev>
##$CPDPRG5= <mlev>
##$CPDPRG6= <mlev>
##$CPDPRG7= <mlev>
##$CPDPRG8= <mlev>
##$CPDPRGB= <>
##$CPDPRGT= <>
##$D= (0..31)
0 1 0 0 0 0 0 0 0 0 0 0.03 2e-05 3e-06 0 0 0 0 0 0 0 0 0 0 0 0 0 0 0 0 
0 0 
##$DATE= 1689243606
##$DBL= (0..7)
120 120 120 11 120 120 24 19 
##$DBP= (0..7)
150 150 150 150 150 150 150 150 
##$DBP07= 0
##$DBPNAM0= <>
##$DBPNAM1= <>
$$ [...]
##$SUBNAM3= <"">
##$SUBNAM4= <"">
##$SUBNAM5= <"">
##$SUBNAM6= <"">
##$SUBNAM7= <"">
##$SUBNAM8= <"">
##$SUBNAM9= <"">
##$SW= 501.771253377433
##$SWIBOX= (0..15)
0 1 3 0 0 0 0 0 0 0 0 0 0 0 0 0 
##$SW_h= 40650.406504065
##$TD= 32768
##$TD0= 1
##$TE= 0
##$TE2= 300
##$TE3= 300
##$TEG= 300
##$TL= (0..7)
0 120 53 12 22 120 120 120 
##$TP= (0..7)
150 150 150 150 150 150 150 150 
##$TP07= 0
##$TPNAME0= <>
##$TPNAME1= <>
##$TPNAME2= <>
##$TPNAME3= <>
##$TPNAME4= <>
##$TPNAME5= <>
##$TPNAME6= <>
##$TPNAME7= <>
##$TPOAL= (0..7)
0.5 0.5 0.5 0.5 0.5 0.5 0.5 0.5 
##$TPOFFS= (0..7)
0 0 0 0 0 0 0 0 
##$TUNHIN= 0
##$TUNHOUT= 0
##$TUNXOUT= 0
##$USERA1= <user>
##$USERA2= <user>
##$USERA3= <user>
##$USERA4= <user>
##$USERA5= <user>
##$V9= 5
##$VALIST= <valist>
##$VCLIST= <CCCCCCCCCCCCCCC>
##$VD= 0
##$VDLIST= <DDDDDDDDDDDDDDD>
##$VPLIST= <PPPPPPPPPPPPPPP>
##$VTLIST= <TTTTTTTTTTTTTTT>
##$WBST= 1024
##$WBSW= 4
##$XGAIN= (0..3)
0 0 0 0 
##$XL= 0
##$YL= 0
##$YMAX_a= 3306
##$YMIN_a= -2661
##$ZGOPTNS= <>
##$ZL1= 120
##$ZL2= 120
##$ZL3= 120
##$ZL4= 120
##$ABSF1= 248.5645
##$ABSF2= -253.2056
##$ABSG= 5
##$ABSL= 3
##$ALPHA= 0
##$AQORDER= 0
##$ASSFAC= 0
##$ASSFACI= 0
##$ASSFACX= 0
##$ASSWID= 0
##$AUNMP= <proc_1d>
##$AZFE= 0.1
##$AZFW= 0.5
##$BCFW= 0
##$BC_mod= 2
##$BYTORDP= 0
##$COROFFS= 0
##$CY= -3
##$DATMOD= 1
##$DC= 0
##$DFILT= <>
##$DTYPP= 0
##$F1P= 0
##$F2P= 0
##$FCOR= 1
##$FTSIZE= 65536
##$FT_mod= 6
##$GAMMA= 0
##$GB= 0
##$INTBC= 1
##$INTSCL= 6.047779e-11
##$ISEN= 30
##$LB= 1
##$LEV0= 0
##$LPBIN= 0
##$MAXI= 10000
##$MC2= 0
##$MEAN= 0
##$ME_mod= 0
##$MI= 50
##$NCOEF= 0
##$NC_proc= -6
##$NLEV= 6
##$NOISF1= 182.463
##$NOISF2= 159.3651
##$NSP= 0
##$NTH_PI= 0
##$NZP= 0
##$OFFSET= 248.5645
##$PC= 4
##$PHC0= -10754.75
##$PHC1= 207.2848
##$PH_mod= 1
##$PKNL= yes
##$PPARMOD= 0
##$PSCAL= 0
##$PSIGN= 0
##$REVERSE= no
##$SF= 81.0140089999694
##$SI= 65536
##$SIGF1= 159.3651
##$SIGF2= -187.1042
##$SINO= 113.3802
##$SIOLD= 16384
##$SREGLST= <1H.CDCl3>
##$SSB= 0
##$STSI= 65536
##$STSR= 0
##$SW_p= 40650.406504065
##$SYMM= 0
##$S_DEV= 0
##$TDeff= 32768
##$TDoff= 0
##$TI= <>
##$TILT= no
##$TM1= 0
##$TM2= 0
##$TOPLEV= 0
##$USERP1= <user>
##$USERP2= <user>
##$USERP3= <user>
##$USERP4= <user>
##$USERP5= <user>
##$WDW= 1
##$XDIM= 65536
##$YMAX_p= 384364428
##$YMIN_p= -16030711
$$ End of Bruker specific parameters
$$ ---------------------------------
##NTUPLES= NMR SPECTRUM
##VAR_NAME=  FREQUENCY,     SPECTRUM/REAL,   SPECTRUM/IMAG
##SYMBOL=    X,             R,               I
##VAR_TYPE=  INDEPENDENT,   DEPENDENT,       DEPENDENT
##VAR_FORM=  AFFN,          ASDF,            ASDF
##VAR_DIM=   65536,         65536,           65536
##UNITS=     HZ,            ARBITRARY UNITS, ARBITRARY UNITS
##FACTOR=    0.620285442955139, 1,           1
##FIRST=     20137.2065510682, 0,            0
##LAST=      -20513.1999529968, 0,           0
##MIN=       -20513.1999529968, -16030711,   0
##MAX=       20137.2065510682, 384364428,    0
$$ Real data points
##PAGE= N=1
##DATA TABLE= (X++(R..R)), XYDATA
$$ [...]
$$ plain form
37407 -683845 27682 121121 -654772 -937692 157398 1447518 1197235 -425700 -1535713
37398 -1535713 -952501 616356 1884616 2469692 2673330 2648285 2502259 2693102 3479688
37389 3479688 4215053 4020018 3113193 2597239 2752617 2477425 961793 -870320 -1461642
37380 -1461642 -719654 -14142 -155649 -385504 271490 1428106 1793547 941824 -15647
37371 -15647 297264 1869207 3269543 3339502 2542322 2175806 2541773 2856476 3063975 4332063
37361 4332063 6893908 8906864 9307003 10702598 16514673 25015277 29321799 25033446
37353 25033446 15655879 8271612 5554119 4759335 3388822 2235086 2438502 2842240
37345 2842240 2014362 816047 960868 2165198 2569617 1457641 2049 -547447 -213105
$$ packed form
37407f83845P11527R3439p75893k82920J095090J290120k50283j622935j110013
37398a535713N83212J568857J268260N85076K03638k5045j46026J90843P86586
37389C479688P35365j95035r06825n15954J55378k75192j515632j832113n91322
37380a461642P41988P05512j41507k29855O56994J156616L65441q51723r57471
37371a5647L12911J571943J400336O9959p97180l66516L65967L14703K07499J268088
37361D332063K561845K012956M00139J395595N812075Q500604M306522m288353
37353B5033446r377567p384267k717493p94784j370513j153736K03416M03738
37345B842240q27878j198315J44821J204330M04419j111976j455592n49496L34342
$$ plain form
37336 -213105 214893 160570 -352077 -761418 -490608 225798 386344 -441677 -1323916 -1158671
37326 -1158671 -190301 507005 627879 694399 802406 534960 154891 603337 1902928
37317 1902928 2683991 1970630 555074 -208236 -279648 -631223 -1453985 -1729963 -685789
37308 -685789 1098988 2322019 2253541 1174089 -157872 -1194651 -1827573 -2085430 -1777816
37299 -1777816 -729607 553338 924773 -201354 -1919277 -2687323 -2057251 -954964 -266690
37290 -266690 33666 92547 -516766 -1880787 -2800405 -1917144 359479 2158565 2511717
37281 2511717 2316989 2572192 2827295 2274443 1439911 1487320 2247768 2312469 1130826 -209326
37271 -209326 -600110 -220458 272618 869183 1772933 2588455 2826825 2784692 3105498 3760254
$$ packed form
37336b13105M27998n4323n12647m09341K70810P16406J60546q28021q82239J65245
37326a158671R68370O97306J20874O6520J08007k67446l80069M48446J299591
37317A902928P81063p13361j415556p63310p1412l51575q22762k75978J044174
37308f85789J784777J223031o8478j079452j331961j036779o32922k57857L07614
37299a777816J048209J282945L71435j126127j717923p68046O30072J102287O88274
37290b66690L00356N8881o09313j364021r19618Q83261K276623J799086L53152
37281B511717j94728K55203K55103n52852q34532M7409P60448O4701j181643j340152
37271b09326l90784L79652M93076N96565R03750Q15522K38370m2133L20806O54756
$$ plain form
37261 3760254 4222234 4424105 4764754 5290155 5658216 5942133 6729370 8255071 10032559
37252 10032559 11524200 12647857 13413883 13553570 12812257 11320425 9481715 7702046
37244 7702046 6252275 5110977 3981565 2816800 2199169 2661541 3693804 4101409 3426528
37235 3426528 2313708 1360499 476099 -311959 -388148 472866 1482829 1977244 2426771
37226 2426771 3389002 4219510 4126641 3964692 5282444 7573150 8243619 5950812 2485304
37217 2485304 387200 -56534 -207579 -531150 -351320 272404 206051 -943376 -2063162
37208 -2063162 -2132247 -1534607 -1172079 -1143465 -1004987 -650428 -201255 418757 1076455 1140831
37198 1140831 433741 -23391 747239 1979497 1910999 285281 -1081984 -613627 1173477
$$ packed form
37261C760254M61980K01871L40649N25401L68061K83917P87237J525701J777488
37252A0032559J491641J123657P66026J39687p41313j491832j838710j779669
37244G702046j449771j141298j129412j164765o17631M62372J032263M07605o74881
37235C426528j112820r53209q84400p88058p6189Q61014J009963M94415M49527
37226B426771R62231Q30508r2869j61949J317752K290706O70469k292807l465508
37217B485304k098104m43734j51045l23571J79830O23724o6353j149427j119786
37208b063162o9085N97640L62528K8614J38478L54559M49173O20012O57698O4376
37198A140831p07090m57132P70630J232258o8498j625718j367265M68357J787104
$$ plain form
37189 1173477 2659876 3056136 2633363 1811827 948995 544399 729752 873611 566025
37180 566025 646949 2136083 4255522 4854474 3200023 1150826 755569 1585636 1553556
37171 1553556 -84956 -1777366 -1805435 -361866 944853 1011500 117787 -746848 -851765
37162 -851765 -116878 956528 1624707 1489013 902141 585478 743099 829317 390363 -188030
37152 -188030 -195570 337997 684280 540819 440046 760532 1008337 656088 157063 310374
37142 310374 925219 1078185 661985 640310 1470574 2246360 2002903 1106361 580269 599484
37132 599484 500076 -51884 -752880 -1342907 -1782748 -1856934 -1441440 -1153029 -1800975 -2998347
37122 -2998347 -3260880 -1943901 -262787 282113 -109795 71918 1588083 3549322 4537538
$$ packed form
37189A173477J486399L96260m22773q21536q62832m04596J85353J43859l07586
37180E66025Q0924J489134K119439N98952j654451k049197l95257Q30067l2080
37171A553556j638512j692410k8069J443569J306719O6647q93713q64635j04917
37162h51765P34887J073406O68179j35694n86872l16663J57621Q6218m38954n78393
37152a88030p540N33567L46283j43461j00773L20486K47805l52249m99025J53311
37142C10374O14845J52966m16200k1675Q30264P75786k43457q96542n26092J9215
37132E99484r9408n51960p00996n90027m39841p4186M15494K88411o47946j197372
37122b998347k62533J316979J681114N44900l91908J81713J516165J961239R88216
$$ plain form
37113 4537538 4053350 2779000 1781937 1552697 1680588 1499405 999289 762456 1023600
37104 1023600 1450825 2040358 3304684 4974168 5501418 3982577 1864116 1309376 2234502
37095 2234502 2554298 1308612 -203240 -733222 -717983 -794569 -362332 1096437 2557995
37086 2557995 2799122 2266806 2134935 2288230 1860165 1189177 1443137 2507318 3010966
37077 3010966 2538977 2149312 2395491 2428635 1611526 619824 241111 253877 193567 166797
37067 166797 211089 -129771 -843328 -1025756 -227749 653967 655158 87023 -237005 -277095
37057 -277095 -328587 -121086 537868 887289 203568 -774043 -620265 806352 2241260
37048 2241260 2668373 2091254 866142 -632012 -1708677 -1746779 -1027379 -374447 -33526
$$ packed form
37113D537538m84188j274350r97063k29240J27891j81183n00116k36833K61144
37104A023600M27225N89533J264326J669484N27250j518841k118461n54740R25126
37095B234502L19796j245686j511852n29982J5239p6586M32237J458769J461558
37086B557995K41127n32316j31871J53295m28065o70988K53960J064181N03648
37077C010966m71989l89665K46179L3144q17109r91702l78713J2766o0310k6770
37067A66797M4292l40860p13557j82428P98007Q81716J191n68135l24028m0090
37057b77095n1492K07501O58954L49421o83721r77611J53778J426617J434908
37048B241260M27113n77119j225112j498154j076665l8102P19400O52932L40921
$$ plain form
37039 -33526 270620 318125 -478586 -1842531 -2614234 -2294202 -1681429 -1562952 -1591460 -1009432
37029 -1009432 140021 1134645 1548757 1597523 1654950 1771377 1688211 1264384 844311 963086
37019 963086 1567009 1945780 1772449 1713550 2441119 3498641 3872320 3294219 2183208
37010 2183208 757957 -725895 -1233522 154644 2562824 3879655 3287048 2025302
37002 2025302 1331496 961674 360209 -47056 248887 635784 242418 -598223 -852238
36993 -852238 -397891 -115662 -493522 -1021117 -1039902 -534756 78061 493694 627329 402229
36983 402229 -291620 -1240261 -1575757 -360278 2018840 3544571 2608478 191929 -1079260
36974 -1079260 -150409 1363256 1599150 672883 -206542 -625009 -884170 -919707 -533490
$$ packed form
37039c3526L04146M7505p96711j363945p71703L20032O12773J18477k8508N82028
37029a009432J149453R94624M14112M8766N7427J16427q3166m23827m20073J18775
37019I63086O03923L78771j73331n8899P27569J057522L73679n78101j111011
37010B183208j425251j483852n07627J388166K408180J316831n92607j261746
37002B025302o93806l69822o01465m07265K95943L86897l93366q40641k54015
36993h52238M54347K82229l77860n27595j8785N05146O12817M15633J33635k25100
36983D02229o93849r48641l35496J215479K379118J525731r36093k416549j271189
36974a079260R28851J513665K35894r26267q79425m18467k59161l5537L86217
$$ plain form
36965 -533490 -190053 -433254 -840911 -621622 6003 112663 -379019 -522582 145807 897643
36955 897643 913659 350102 -69517 -6692 311097 553127 654763 833482 1281654 1766450
36945 1766450 1724646 993716 218839 163254 776466 1340562 1406541 1154284 909488 799082
36935 799082 970108 1708658 3023659 4240625 4349219 3032886 1327963 831090 1931214
36926 1931214 3220468 3211037 2245452 1829529 2338294 2625732 2015112 1268503 1041166 745605
36916 745605 -129087 -767326 -287457 690082 1037772 930578 1268592 1874578 1751190 779127
36906 779127 -282935 -1203983 -2183761 -2583777 -1479517 435117 1243143 480230 -256258
36897 -256258 67529 409123 -298486 -1181853 -890244 179051 719217 808232 1650501 3282156
$$ packed form
36965e33490L43437k43201m07657K19289O27625J06660m91682j43563O68389P51836
36955H97643J6016n63557m19619O2825L17789K42030J01636J78719M48172M84796
36945A766450m1804p30930p74877n5585O13212N64096O5979k52257k44796j10406
36935G99082J71026P38550J315001J216966J08594j316333j704923m96873J100124
36926A931214J289254r431r65585m15923N08765K87438o10620p46609k27337k95561
36916G45605q74692o38239M79869R77539L47690j07194L38014O05986j23388r72063
36906G79127j062062r21048r79778m00016J104260J914634Q08026p62913p36488
36897b56258L23787L41594p07609q83367K91609J069295N40166Q9015Q42269J631655
$$ plain form
36887 3282156 4166418 3335143 1659845 495930 22677 -417757 -988396 -1163619 -669853
36878 -669853 40002 370873 235268 -98941 -520669 -1053841 -1410195 -1057855 47856
36869 47856 1189774 1689067 1667624 1600794 1447191 845916 -21874 -526972 -544040 -541465
36859 -541465 -614072 -280323 435722 612764 -218706 -1030484 -495390 1127471 2240091
36850 2240091 1975065 1133837 848560 1087050 1029375 487465 241019 902483 1939801
36841 1939801 2175988 1144058 -370552 -1232622 -1164274 -805936 -710294 -706937 -435881 -114298
36831 -114298 -267612 -777796 -820723 -75361 510309 -147841 -1551321 -1942005 -616447
36822 -616447 995764 1284309 716934 970900 2204105 2725355 1651894 423899 812757
$$ packed form
36887C282156Q84262q31275j675298j163915m73253m40434n70639j75223M93766
36878f69853P09855L30871j35605l34209m21728n33172l56354L52340J105711
36869D7856J141918M99293k1443o6830j53603o01275q67790n05098j7068K575
36859e41465p2607L33749P16045J77042q31470q11778N35094J622861J112620
36850B240091k65026q41228k85277K38490n7675n41910k46446O61464J037318
36841A939801K36187j031930j514610q62070O8348L58338R5642L357K71056L21583
36831a14298j53314n10184m2927P45362N85670o58150j403480l90684J325558
36822f16447J612211K88545n67375K53966J233205N21250j073461j227995L88858
$$ plain form
36813 812757 2473688 3561120 3124097 1822222 686207 213050 457391 1036931 1128323
36804 1128323 305040 -696163 -827663 -196145 222926 224669 632701 1729381 2504133
36795 2504133 2008381 701876 -170599 -81752 440342 707347 653572 762665 1392916 2208682
36785 2208682 2442460 1867054 1172070 992701 948408 281227 -839855 -1462939 -1202212
36776 -1202212 -623549 -270172 -111445 -54301 -213279 -499258 -638006 -724063 -1069251 -1459382
36766 -1459382 -1356615 -878104 -652427 -629709 -136722 649177 533352 -833393 -2085560
36757 -2085560 -1906697 -676244 465994 1240035 1907147 2154210 1494774 320052 -516542
36748 -516542 -842172 -986177 -845733 -107361 890693 1505835 1817106 2365909 3019780 3064920
$$ packed form
36813H12757J660931J087432m37023j301875j136015m73157K44341N79540R1392
36804A128323q23283j001203j31500O31518M19071J743M08032J096680P74752
36795B504133m95752j306505q72475Q8847N22094K67005n3775J09093O30251Q15766
36785B208682K33778n75406o94984j79369m4293o67181j121082o23084K60727
36776a202212N78663L53377J58727N7144j58978k85979j38748q6057l45188l90131
36766a459382J02767M78511K25677K2718M92987P85899j15825j366745j252167
36757b085560J78863J230453J142238P74041O67112K47063o59436j174722q36594
36748e16542l25630j44005J40444P38372R98054O15142L11271N48803O53871M5140
$$ plain form
36738 3064920 2419590 1850661 1887767 2274225 2534305 2359650 1458243 -143512 -1566803
36729 -1566803 -1704907 -613051 470451 736961 698431 1118200 1760459 1783138 998675
36720 998675 216978 382833 1535912 2572705 2201402 441267 -1090885 -970746 185061
36711 185061 512426 -517252 -1407989 -848222 520242 1262257 1149371 1000378 1137576
36702 1137576 1129610 817087 519595 200817 -647716 -2091117 -3422696 -3955663 -3595366
36693 -3595366 -2544254 -1073177 270031 889851 848347 785061 930313 847293 423165
36684 423165 334514 994417 1726380 1687324 1068999 617069 434401 148837 -109619 59988
36674 59988 313430 -88445 -875479 -890321 87529 796361 370319 -256989 267662 1624957
$$ packed form
36738C064920o45330n68929L7106L86458K60080j74655r01407j601755j423291
36729a566803j38104J091856J083502K66510l8530M19769O42259K2679p84463
36720I98675p81697J65855J153079J036793l71303j760135j532152J20139J155807
36711A85061L27365j029678q90737N59767J368464P42015j12886j48993J37198
36702A137576p966l12523k97492l18778q48533j443401j331579n32967L60297
36693c595366J051112J471077J343208O19820m1504o3286J45252q3020m24128
36684D23165q8651O59903P31963l9056o18325m51930j82668k85564k58456J69607
36674E9988K53442m01875p87034j4842R77850P08832m26042o27308N24651J357295
$$ plain form
36664 1624957 2163716 1084645 -624674 -1482807 -1103321 -331093 -162632 -710607 -1184443
36655 -1184443 -897157 -143259 235912 23594 -211321 -125739 -37689 -164170 -215089 -73598
36645 -73598 -57903 -76209 571135 1930369 2847636 2468380 1417642 626759 -31808 -807047
36635 -807047 -803132 731161 2534774 2611505 1122840 188579 807909 1789404 1955215 1574343
36625 1574343 1124892 436383 -174178 367006 1961973 2674180 1306889 -613643 -911391
36616 -911391 190020 738680 99773 -469444 -133985 330134 36886 -604863 -628890 125822
36606 125822 996904 1417734 1375775 1138402 862101 509378 55618 -342077 -533683 -662420
36596 -662420 -949731 -1187941 -888396 -86566 459025 139909 -806528 -1698745 -2083088 -1788343
$$ packed form
36664A624957N38759j079071j709319q58133L79486P72228J68461n47975m73836
36655a184443K87286P53898L79171k12318k34915Q5582Q8050j26481n0919J41491
36645g3598J5695j8306O47344J359234R17267l79256j050738p90883o58567p75239
36635h07047L915J534293J803613P6731j488665r34261O19330R81495J65811l80872
36625A574343m49451o88509o10561N41184J594967P12207j367291j920532k97748
36616i11391J101411N48660o38907n69217L35459M64119k93248o41749k4027P54712
36606A25822Q71082M20830m1959k37373k76301l52723m53760l97695j91606j28737
36596f62420k87311k38210K99545Q01830N45591l19116r46437q92217l84343K94745
$$ plain form
36586 -1788343 -885532 940 -82616 -1266427 -2340433 -2087940 -886864 -253774 -876361
36577 -876361 -1834211 -1911820 -1042935 -96707 333696 416654 481941 469492 229676 45258
36567 45258 360229 1008711 1264733 901521 671748 1248843 2096024 2035486 736739 -983029
36557 -983029 -2177381 -2440448 -1722557 -275867 1163626 1851465 1834666 1746846 1839454 1839145
36547 1839145 1682747 1627612 1622456 1328039 774388 265917 -217023 -609280 -33441 2151318
36537 2151318 4569123 4734087 2234172 -494799 -1269388 -555220 111367 500333 1070367
36528 1070367 1273525 315560 -1054805 -1291096 -340398 374826 195477 -74221 99635
36519 99635 8769 -913725 -1855243 -1689480 -693747 -241898 -845865 -1328583 -408038 1345474
$$ packed form
36586a788343R02811Q86472q3556j183811j074006K52493J201076O33090o22587
36577h76361r57850p7609Q68885R46228M30403Q2958O5287j2449k39816j84418
36567D5258L14971O48482K56022l63212k29773N77095Q47181o0538j298747j719768
36557i83029j194352k63067P17891J446690J439493O87839j6799q7820R2608l09
36547A839145j56398n5135n156k94417n53651n08471m82940l92257N75839K184759
36537B151318K417805J64964k499915k728971p74589P14168O66587L88966N70034
36528A070367K03158r57965j370365k36291R50698P15224j79349k69698J73856
36519I9635r0866r22494r41518J65763R95733M51849o03967m82718R20545J753512
$$ plain form
36509 1345474 1987019 780374 -632574 -399088 973693 1467616 546504 -321549 -186370
36500 -186370 139143 -62300 -88370 549123 728320 -519023 -2006296 -1877989 -347005
36491 -347005 786775 866936 833753 1121310 948845 30246 -599804 -131691 792038 1076730
36481 1076730 555380 -231195 -897128 -1197736 -711913 709484 2361189 3123688 2549388
36472 2549388 1255722 215514 -184582 -325548 -691679 -1218771 -1472363 -1337541 -1145479
36463 -1145479 -1051331 -732839 11193 713811 714147 43588 -540573 -419177 268514 959865
36453 959865 1395920 1730103 1954384 1721593 1124295 1125248 2294629 3384151 2533659 123458
36443 123458 -1187639 -37525 1698696 1821591 986069 1069114 1808879 1583797 648387
$$ packed form
36509A345474O41545j206645j412948K33486J372781M93923r21112q68053J35179
36500a86370L25513k01443k6070O37493J79197j247343j487273J28307J530984
36491c47005J133780Q0161l3183K87557j72465r18599o30050M68113R23729K84692
36481A076730n21350p86575o65933l00608M85823J421397J651705P62499n74300
36472B549388j293666j040208m00096j40966l66131n27092k53592J34822J92062
36463a145479R4148L18492P44032P02618L36o70559n84161J21396O87691O91351
36453I59865M36055L34183K24281k32791n97298R53J169381J089522q50492k410201
36443A23458j311097J150114J736221J22895q35522Q3045P39765k25082r35410
$$ plain form
36434 648387 785698 2040520 2607391 2074563 2026176 3008257 3586130 3089230 2708256 3026245
36424 3026245 2970662 2169565 1843282 2276551 1944941 410143 -482377 239873 889491
36415 889491 202067 -313451 858880 2422094 2459265 1476687 1031748 1116614 1090048 1479196
36405 1479196 2614206 3087700 1851944 404531 681899 2113931 2856370 2628657 2316606
36396 2316606 2053192 1611500 1463237 1781456 1740168 1157021 1098396 1635278 1257028 -131469
36386 -131469 -341904 1344631 2590806 2076489 1825857 3231854 4370660 3898463 3788178
36377 3788178 5203070 5734572 4111645 3263421 4898324 5830949 4082708 3412092 6626761
36368 6626761 9957641 10002101 10196226 13585747 16144207 15566866 18520306 28338017 35216638
$$ packed form
36434F48387J37311J254822N66871n32828m8387R82081N77873m96900l80974L17989
36424C026245n5583q01097l26283M33269l31610j534798q92520P22250O49618
36415H89491o87424n15518J172331J563214L7171r82578m44939Q4866k6566L89148
36405A479196J135010M73494j235756j447413K77368J432032P42439k27713l12051
36396B316606k63414m41692j48263L18219m1288n83147n8625N36882l78250j388497
36386a31469k10435J686535J246175n14317k50632J405997J138806m72197j10285
36377C788178J414892N31502j622927q48224J634903R32625j748241o70616L214669
36368F626761L330880M4460J94125L389521K558460n77341K953440R817711O878621
$$ plain form
36359 35216638 34615215 46057801 89400751 144180527 160526727 119477089 58870088
36352 58870088 25662183 23138911 23321706 13520909 5295524 5924663 7163531 3434339
36344 3434339 827188 3325339 5242370 2550409 -164474 997587 2745217 1891235
36336 1891235 838907 1640836 1833102 25150 -772111 1094211 2581530 1466060 -154428
36327 -154428 -578571 -1417208 -3112797 -2794921 427063 2860459 1928520 52289 -33159
36318 -33159 466267 -187757 -713294 126074 569187 -795242 -1979734 -1021501 525172
36309 525172 569536 159365 1053898 2127593 1433795 -133762 -359054 630667 1039072
36300 1039072 565161 378700 794436 1081064 956324 683019 310498 -53310 -1134 377033
$$ packed form
36359C5216638o01423J1442586M3342950N4779776J6346200m1049638o0607001
36352E8870088l3207905k523272J82795r800797q225385O29139J238868l729192
36344C434339k607151K498151J917031k691961k714883J162061J747630q53982
36336A891235j052328Q01929J92266j807952p97261J866322J487319j115470j620488
36327a54428m24143q38637j695589L17876L221984K433396r31939j876231q5448
36318c3159M99426o54024n25537Q39368M43113j364429j184492R58233J546673
36309E25172M4364m10171Q94533J073695o93798j567557k25292R89721M08405
36300A039072m73911j86461M15736K86628j24740k73305l72521l63808N2176L78167
$$ plain form
36290 377033 474182 423891 1026505 2058081 2346994 1933198 2181111 3216948 3421507 2201184
36280 2201184 1032954 860234 685127 -229242 -970347 -906821 -860055 -1218150 -1027763 -118159
36270 -118159 77481 -918980 -1455512 -495590 606906 476688 -258944 -708138 -1274388
36261 -1274388 -1989420 -1562705 226370 1421652 939099 426918 1165843 1585254 249897
36252 249897 -1092069 -398680 762717 -372303 -2835511 -3088083 -574222 1427556 752130
36243 752130 -930778 -1136016 179168 1525383 2271088 2859891 3652487 4557342 5322853
36234 5322853 5595309 4991930 3516924 1822256 843862 992584 1609783 1547653 612437
36225 612437 -90443 148502 405143 -267782 -849732 212758 2144515 2697143 1706713
$$ packed form
36290C77033R7149n0291O02614J031576K88913m13796K47913J035837K04559j220323
36280B201184j168230j72720j75107r14369p41105O3526M6766l58095J90387R09604
36270a18159J95640r96461n36532R59922J102496j30218p35632m49194n66250
36261a274388p15032M26715J789075J195282m82553n12181P38925M19411j335357
36252B49897j341966O93389J161397j135020k463208k52572K513861K001778o75426
36243G52130j682908k05238J315184J346215P45705N88803P92596R04855P65511
36234E322853K72456o03379j475006j694668r78394J48722O17199o2130r35216
36225F12437p02880K38945K56641o72925n81950J062490J931757N52628r90430
$$ plain form
36216 1706713 1208519 1746853 1464891 -246531 -1157165 144579 1626325 920422 -1066231
36207 -1066231 -1906912 -1337499 -878643 -1021590 -994786 -526693 -23274 357185 473223 -69953
36197 -69953 -888144 -777742 231727 425826 -745382 -1344768 -141211 992846 76395
36188 76395 -1557975 -1465414 -45161 597971 380227 709848 1261329 598030 -543602
36179 -543602 68422 2346205 4008705 4667504 6411241 9561678 11092717 8833257 4765162
36170 4765162 2337946 2240190 2532791 1727670 98494 -1402559 -2202376 -2232548 -1726285
36161 -1726285 -931664 14228 743764 603850 -428610 -1242464 -904541 -41127 149883
36152 149883 -194250 -11426 661607 599692 -596891 -1773733 -1799512 -808019 342516
$$ packed form
36216A706713m98194N38334k81962j711422r10634J301744J481746p05903j986653
36207a066231q40681N69413M58856j42947K6804M68093N03419L80459J16038n43176
36197f9953q18191J10402J009469J94099j171208n99386J203557J134057r16451
36188G6395j634370R2561J420253O43132k17744L29621N51481o63299j141632
36179e43602O12024K277783J662500O58799J743737L150437J531039k259460m068095
36170D765162k427216r7756K92601q05121j629176j501053p99817l0172N06263
36161a726285P94621R45892P29536j39914j032460q13854L37923Q63414J91010
36152A49883l44133J82824O73033o1915j196583j176842k5779R91493J150535
$$ plain form
36143 342516 933180 615488 -371089 -1205095 -1424535 -1598484 -2270001 -2777382 -2271067 -1380984
36133 -1380984 -1430165 -2284848 -2522832 -1664075 -728417 -505392 -706527 -995083 -1478231 -1919860
36123 -1919860 -1721609 -971919 -413069 -197576 231812 943281 1352399 1331451 1298276 1146125
36113 1146125 363896 -659592 -800805 67411 790886 688277 347917 334168 354345 191884
36103 191884 335643 1118362 2114399 2798428 3009595 2587441 1480437 353439 51185
36094 51185 288737 -54395 -1166093 -1953616 -1672690 -774781 74066 646123 635582 -214385
36084 -214385 -1165349 -972755 304490 1274743 1331607 1343891 1758963 1659039 582539 -217071
36074 -217071 467662 1887319 2381846 1530103 231095 -643515 -750751 -92714 795467
$$ packed form
36143C42516N90664l17692r86577q34006k19440j73949o71517n07381N06315Q90083
36133a380984m9181q54683k37984Q58757R35658K23025k01135k88556m83148m41629
36123a919860J98251P49690N58850K15493M29388P11469M09118k0948l3175j52151
36113A146125p82229j023488j41213Q68216P23475j02609l40360j3749K0177j62461
36103A91884J43759P82719R96037O84029K11167m22154j107004j126998l02254
36094E1185K37552l43132j111698p87523K80926Q97909Q48847N72057j0541q49967
36084b14385r50964J92594J277245R70253N6864J2284M15072r9924j076500p99610
36074b17071O84733J419657M94527q51743j299008q74610j07236O58037Q88181
$$ plain form
36065 795467 1018685 366539 -389525 -732903 -1106172 -1795284 -2079182 -1318016 -60140
36056 -60140 775650 1052879 966757 324360 -770379 -1338565 -731822 234125 424272 55151
36046 55151 92888 522570 478252 -187924 -667768 -450920 181609 866642 1478111 1770586
36036 1770586 1487361 822866 184311 -358082 -846922 -1006527 -693613 -394631 -526760
36027 -526760 -643214 -161796 541833 714764 468129 336017 13944 -1078611 -2183752
36018 -2183752 -1774425 44127 1282603 778396 -267871 -263995 548635 905000 530682
36009 530682 92876 -205284 -715458 -1348414 -1591987 -1372698 -989330 -388300 556101 1218010
35999 1218010 739985 -595114 -1527839 -1501815 -1203851 -1223105 -1224846 -880621 -611326 -766530
$$ packed form
36065G95467K23218o52146p56064l43378l73269o89112k83898P61166J257876
36056f0140Q35790K77229q6122o42397j094739n68186O06743R65947J90147l69121
36046E5151L7737M29682m4318o66176m79844K16848O32529O85033O11469K92475
36036A770586k83225o64495o38555n42393m88840j59605L12914K98982j32129
36027e26760j16454M81418P03629J72931k46635j32112l22073j092555j105141
36018b183752M09327J818552J238476n04207j046267L876Q12630L56365l74318
36009E30682m37806k98160n10174o32956k43573K19289L83368O01030R44401O61909
35999A218010m78025j335099r32725K6024K97964j9254j741L44225K69295j55204
$$ plain form
35989 -766530 -905607 -602618 -229249 -200220 -162821 228780 441720 -52447 -683560 -713641
35979 -713641 -647661 -1318350 -2032557 -1355717 335704 964325 -198981 -1409902 -1128334
35970 -1128334 -102026 349454 555848 1419980 2313245 1979316 963245 1176345 3019597
35961 3019597 4651901 4533001 3313667 2550292 2587847 2551435 1849904 885327 404855
35952 404855 652758 1244941 1702313 1966432 2255133 2478103 2208774 1416827 744383 649274
35942 649274 699521 247190 -560542 -1069227 -1139497 -1188140 -1362811 -1388807 -1220769 -1177229
35932 -1177229 -1318294 -1244615 -692231 68031 570221 622283 379361 156022 138847 131050
35922 131050 -262044 -1005961 -1447918 -1053700 -128945 500937 378359 -233682 -680362 -427863
$$ packed form
35989g66530j39077L02989L73369K9029L7399L91601K12940m94167o31113l0081
35979g13641O5980o70689p14207O76840J691421O28621j163306j210921K81568
35970a128334J026308M51480K06394Q64132Q93265l33929j016071K13100J843252
35961C019597J632304j18900j219334p63375L7555l6412p01531r64577m80472
35952D04855K47903N92183M57372K64119K88701K22970k69329p91947o72444r5109
35942F49274N0247m52331q07732n08685p0270m8643j74671k5996J68038M3540
35932a177229j41065P3679N52384P60262N02190N2062k42922k23339j7175p797
35922A31050l93094p43917m41957L94218R24755O29882j22578o12041m46680K52499
$$ plain form
35912 -427863 489827 1409649 1729501 1661646 1816368 2113001 1902938 1222695 870489 954152
35902 954152 584714 -407291 -758561 275901 1453495 1248557 31683 -805168 -1021164
35893 -1021164 -1282936 -1422817 -646272 811835 1794802 1870266 1537033 1017156 240737
35884 240737 -170830 571311 1914390 2402579 1697952 839168 456686 126024 -360418
35875 -360418 -458406 78068 739272 1062799 935116 192613 -952564 -1340102 -132941
35866 -132941 1493451 1503181 -190807 -1697667 -1924569 -1589959 -1348358 -887968 -326690
35857 -326690 -558775 -1535903 -1948851 -1268640 -399157 239202 1331075 2696935 2871392
35848 2871392 1700598 1223266 2584934 4049861 3657361 2030128 833324 180102 -525726
$$ packed form
35912d27863R17690R19822L19852o7855J54722K96633k10063o80243l52206Q3663
35902I54152l69438r92005l51270J034462J177594k04938j216874q36851k15996
35893a021164k61772j39881P76545J458107R82967P5464l33233n19877p76419
35884B40737m11567P42141J343079M88189p04627q58784l82482l30662m86442
35875c60418r7988N36474O61204L23527j27683p42503j145177l87538J207161
35866a32941J626392R730j693988j506860k26902L34610K41601M60390N61278
35857c26690k32085r77128m12948O80211Q69483O38359J091873J365860J74457
35848B871392j170794m77332J361668J464927l92500j627233j196804o53222p05828
$$ plain form
35839 -525726 -750426 74317 926629 724309 272334 649508 964888 38574 -930573 -80303
35829 -80303 1659913 1772620 271134 -478154 93001 46333 -1180576 -1442893 406182
35820 406182 2347382 2355479 1349708 1116032 1249938 318643 -1309284 -1991135 -1393780
35811 -1393780 -636213 -327734 -155953 -118074 -564568 -1089922 -804262 180397 740820 393035
35801 393035 -103907 -9326 506174 1016251 1477102 1796745 1567922 777796 152288 171710
35791 171710 221740 -568533 -1918378 -2577440 -1907778 -637646 112708 7948 -563356
35782 -563356 -1238350 -1899047 -2368389 -2363118 -1796073 -926803 -254438 -335680 -1405142 -2870285
35772 -2870285 -3466329 -2404921 -284494 1541533 2361191 2420333 2085647 1435116 688467
$$ packed form
35839e25726k24700Q24743Q52312k02320m51975L77174L15380r26314r69147Q50270
35829h0303J740216J12707j501486p49288N71155m6668j226909k62317J849075
35820D06182J941200Q097j005771k33676J33906r31295j627927o81851N97355
35811a393780P57567L08479J71781L7879m46494n25354K85660R84659N60423l47785
35801C93035m96942R4581N15500N10077M60851L19643k28823p90126o25508J9422
35791A71710N0030p90273j349845o59062O69662J270132P50354j04760n71304
35782e63356o74994o60697m69342N271N67045Q69270O72365q1242j069462j465143
35772b870285n96044J061408K120427J826027Q19658N9142l34686o50531p46649
$$ plain form
35763 688467 258559 149982 -25679 -220154 123190 993327 1483824 1077186 486854 500765
35753 500765 688121 206583 -613806 -632351 330103 1204543 1276853 1080545 1363575 1978823
35743 1978823 2247678 1829439 822627 -464785 -1429992 -1387607 -410506 430965 246242
35734 246242 -548511 -871473 -472485 -34923 105179 405568 1037956 1281166 628703 -172549
35724 -172549 -46790 829387 1287612 842575 157380 -161694 -220311 -90430 514894 1348095
35714 1348095 1428390 453142 -475496 -389798 81919 -192991 -1029855 -1446977 -1472906 -1983829
35704 -1983829 -2938363 -3243540 -2492590 -1531716 -1085461 -1020957 -1178153 -1655986 -1978448 -1336448
35694 -1336448 -132112 111481 -955519 -1725096 -1043918 15073 40829 -380714 105362
$$ packed form
35763F88467m29908j08577j75661j94475L43344Q70137M90497m06638n90332J3911
35753E00765J87356m81538q20389j8545R62454Q74440P2310j96308K83030O15248
35743A978823K68855m18239j006812j287412r65207M2385R77101Q41471j84723
35734B46242p94753l22962L98988M37562J40102L00389O32388K43210o52463q01252
35724a72549J25759Q76177M58225m45037o85195l19074n8617J29881O05324Q33201
35714A348095Q0295r75248r28638Q5698M71717k74910q36864m17122k5929n10923
35704a983829r54534l05177P50950R60874M46255O4504j57196m77833l22462O42000
35694a336448J204336K43593j067000p69577O81178J058991K5756m21543M86076
$$ plain form
35685 105362 1063698 992351 160021 490776 2349964 3511245 2240097 -190506 -1322819
35676 -1322819 -736317 5825 -14624 -103006 414226 1064166 1244204 1238502 1426282 1291947
35666 1291947 242531 -1053471 -1280864 -333106 543135 589261 419849 691932 983573
35657 983573 702376 216091 192023 452003 361596 -139777 -678042 -1081411 -1133212 -370334
35647 -370334 983144 1645809 935360 15139 190134 787589 396809 -488285 -132242
35638 -132242 1464919 2485262 2229607 1876068 2009055 1764129 1092732 1448111 3080971
35629 3080971 3911840 2583620 611332 -206335 -572471 -1783448 -2738009 -1516498 1004097
35620 1004097 1883107 305430 -1389630 -1172543 246051 1104672 1077556 1127872 1857186
$$ packed form
35685A05362R58336p1347q32330L30755J859188J161281j271148k430603j132313
35676a322819N86502P42142k0449q8382N17232O49940J80038n702J87780j34335
35666A291947j049416j296002k27393R47758Q76241M6126j69412K72083K91641
35657I83573k81197m86285k4068K59980r0407n01373n38265m03369n1801P62878
35647c70334J353478O62665p10449r20221J74995N97455l90780q85094L56043
35638a32242J597161J020343k55655l53539J32987k44926o71397L55379J632860
35629C080971Q30869j328220j972288q17667l66136j210977r54561J221511K520595
35620A004097Q79010j577677j695060K17087J418594Q58621k7116N0316P29314
$$ plain form
35611 1857186 2869699 3376826 2963020 1927305 973578 444300 56028 -442970 -808955
35602 -808955 -845281 -887982 -1262382 -1722664 -1909476 -1890404 -1823398 -1643427 -1476638 -1676706
35592 -1676706 -2042502 -1833712 -1019108 -503036 -551782 -210659 905848 1579411 880906
35583 880906 -189236 -356480 -162645 -730660 -1500958 -1160176 -71395 319639 45719
35574 45719 425955 1482346 1739707 797478 28581 223343 407238 -282257 -1151293 -1216410
35564 -1216410 -609624 77225 736129 1288995 1276872 622653 -8866 -204245 -404299 -1035220
35554 -1035220 -1796915 -2256610 -2407223 -2265677 -1727372 -1198888 -1470627 -2430128 -2763193
35545 -2763193 -1613725 158315 1092840 945296 635607 754638 895689 441116 -512004
$$ packed form
35611A857186J012513N07127m13806j035715r53727n29278l88272m98998l65985
35602h08955l6326m2701l74400m60282j86812J9072O7006J79971J66789k00068
35592a676706l65796K08790Q14604N16072m8746L41123J116507O73563o98505
35583H80906j070142j67244J93835n68015p70298L40782J088781L91034k73920
35574D5719L80236J056391K57361r42229p68897J94762J83895o89495q69036o5117
35564a216410O06786O86849O58904N52866j2123o54219o31519j95379k00054o30921
35554a035220p61695m59695j50613J41546N38305N28484k71739r59501l33065
35545b763193J149468J772040R34525j47544l09689J19031J41051m54573r53120
$$ plain form
35536 -512004 -1172293 -875892 153332 968760 964025 567063 566579 985639 1125660 620339
35526 620339 -80886 -284774 284814 1316905 2044839 1754144 590481 -391004 -438524
35517 -438524 -3214 122376 54449 360584 773571 458839 -562411 -1344257 -1430968 -1336265
35507 -1336265 -1449770 -1418115 -904796 -159310 482881 982836 1208378 804252 -230201
35498 -230201 -1304448 -1796109 -1510963 -621296 389444 821384 371234 -410357 -804118
35489 -804118 -876360 -1110589 -1355530 -1023372 -244800 107167 -358837 -1100942 -1489928 -1354776
35479 -1354776 -678596 405272 1238701 1132220 415841 206098 928861 1811997 2017924
35470 2017924 1534715 763394 -4543 -441628 -256733 246036 292379 -350030 -1002378 -1014295
$$ packed form
35536e12004o60289K96401J029224Q15428m735l96962m84M19060J40021n05321
35526F20339p01225k03888N69588J032091P27934k90695j163663r81485m7520
35517d38524M35310J25590o7927L06135M12987l14732j021250p81846q6711R4703
35507a336265j13505L1655N13319P45486O42191M99955K25542m04126j034453
35498b30201j074247m91661K85146Q89667J010740M31940m50150p81591l93761
35489h04118p2242k34229k44941L32158P78572L51967m66004p42105l88986J35152
35479a354776O76180J083868Q33429j06481p16379k09743P22763Q83136K05927
35470B017924m83209p71321p67937m37085J84895N02769M6343o42409o52348j1917
$$ plain form
35460 -1014295 -623126 -568155 -1130391 -1771926 -1642367 -504825 776556 1025911 222401
35451 222401 -395612 -66177 433979 164237 -371359 -105197 680732 638455 -656848 -2183297
35441 -2183297 -2869348 -2521360 -1512978 -528948 -395940 -1142413 -1483036 -322507 1518469
35432 1518469 2257818 1545870 630725 384743 547498 790872 1125045 1265346 896810
35423 896810 510202 780228 1390295 1719840 2110899 2932018 3311079 2983434 4406769
35414 4406769 9800884 16280011 17728159 12516554 5862154 2896109 2723807 1692984
35406 1692984 -531794 -1524914 -764660 -116390 -385052 -489530 54332 401120 272354
35397 272354 447808 1075907 1265703 700477 179949 209122 276386 -119303 -685641 -849020
$$ packed form
35460a014295L91169N4971n62236o41535J29559J137542J281381K49355q03510
35451B22401o18013L29435N00156k69742n35596K66162P85929m2277j295303j526449
35441b183297o86051L47988J008382R84030J33008p46473l40623J160529J840976
35432A518469P39349p11948r15145k45982J62755K43374L34173J40301l68536
35423H96810l86608K70026O10067L29545L91059Q21119L79061l27645J423335
35414D406769N394115O479127J448148n211605o654400k966045j72302j030823
35406A692984k224778r93120P60254O48270k68662j04478N43862L46788j28766
35397B72354J75454O28099J89796n65226n20528K9173O7264l95689n66338j63379
$$ plain form
35387 -849020 -359143 645927 1570080 1537247 316314 -1134665 -1659584 -1154217 -316569
35378 -316569 318432 467865 -95428 -991401 -1135820 -135877 847087 648653 -146865 -203177
35368 -203177 422376 543978 -126639 -734572 -935957 -1275355 -1765406 -1538710 -371601
35359 -371601 620737 412654 -643934 -1485129 -1642684 -1433020 -1323659 -1460156 -1496742 -796552
35349 -796552 778857 2268196 2380431 1028762 -412324 -592629 478923 1756245 2387438
35340 2387438 2314279 1887467 1280088 448097 -413400 -724153 -203229 473715 324656 -573514
35330 -573514 -1107503 -766967 -398974 -771187 -1264320 -954351 -351702 -798521 -2320937
35321 -2320937 -3357212 -2869829 -1661980 -1064969 -1111015 -757182 461486 1772069 2201277
$$ packed form
35387h49020M89877J005070R24153l2833j220933j450979n24919N05367Q37648
35378c16569O35001J49433n63293q95973j44419R99943R82964j98434p95518n6312
35368b03177O25553J21602o70617o07933k01385l39398m90051K26696J167109
35359c71601R92338k08083j056588q41195j57555K09664J09361j36497l6586P00190
35349g96552J575409J489339J12235j351669j441086j80305J071552J277322O31193
35340B387438p3159m26812o07379q31991q61497l10753N20924O76944j49059q98170
35330e73514n33989L40536L67993l72213m93133L09969O02649m46819j522416
35321b320937j036275M87383J207849N97011m6046L53833J218668J310583M29208
$$ plain form
35312 2201277 1736483 1160740 992305 1004129 819318 536485 441855 432224 253594 162454
35302 162454 703019 1745430 2358252 1888910 705041 -368639 -893129 -842672 -283171
35293 -283171 549932 1134992 1023891 259468 -684660 -1240268 -1046337 -229794 578143 813282
35283 813282 577903 384246 416527 460222 433918 471495 552969 578184 701026 1032609 1182775
35272 1182775 759368 142588 5727 253850 307669 258950 719454 1608918 2194528 2312534
35262 2312534 2377327 2183704 1077642 -486689 -1027603 -133673 865543 857110 258160 -201229
35252 -201229 -605987 -968485 -546840 917854 2334322 2626037 2085649 1534795 1084251
35243 1084251 605812 488429 942794 1324657 1027081 350357 -193015 -610485 -874745
$$ packed form
35312B201277m64794n75743j68435J1824j84811k82833r4630r631j78630r1140
35302A62454N40565J042411O12822m69342j183869j073680n24490N0457N59501
35293b83171Q33103N85060j11101p64423r44128n55608J93931Q16543Q07937K35139
35283H13282k35379j93657L2281M3695k6304L7577Q1474K5215J22842L31583J50166
35272A182775m23407o16780j36861K48123N3819m8719M60504Q89464N85610J18006
35262B312534O4793j93623j106062j564331n40914Q93930R99216q433n98950m59389
35252b01229m04758l62498M21645J464694J416468K91715n40388n50854m50544
35243A084251m78439j17383M54365L81863k97576o76724n43372m17470k64260
$$ plain form
35234 -874745 -677760 -401351 -1118056 -2769025 -3606313 -2508059 -662453 169716 -131949
35225 -131949 -751408 -1519058 -2307251 -2079151 -301264 1616115 2015592 1313914 942065
35216 942065 887362 269007 -411732 110732 1348759 1475521 269208 -574510 -328746
35207 -328746 -235030 -1008940 -1428030 -463475 867312 1080339 443611 271885 800001 1074949
35197 1074949 608179 2502 -67466 308374 609150 511251 -23641 -891791 -1729061 -1851686
35187 -1851686 -837131 704872 1477123 1015626 344502 466653 785831 134669 -1025174
35178 -1025174 -978269 568468 1813724 1397845 114674 -650448 -766301 -717903 -487255
35169 -487255 -191424 -616006 -1870003 -2575222 -1679921 -139305 463173 48844 -454577
$$ packed form
35234h74745J96985K76409p16705j650969q37288J098254J845606Q32169l01665
35225a31949o19459p67650p88193K28100J777887J917379L99477p01678l71849
35216I42065n4703o18355o80739N22464J238027J26762j206313q43718K45764
35207c28746R3716p73910m19090R64555J330787K13027o36728j71726N28116K74948
35197A074949m66770o05677o9968L75840L00776r7899n34892q68150q37270j22625
35187a851686J014555J542003P72251m61497o71124J22151L19178o51162j159843
35178a025174M6905J546737J245256m15879j283171p65122j15853M8398K30648
35169d87255K95831m24582j253997p05219Q95301J540616O02478m14329n03421
$$ plain form
35160 -454577 -777190 -1095167 -1053346 -457183 -156152 -809514 -1562267 -1403738 -993287 -1517158
35150 -1517158 -2515782 -2611146 -1769222 -1061622 -733245 -328448 -218793 -1033988 -1920153 -1419975
35140 -1419975 22110 454463 -599732 -1495658 -1059420 -11284 600756 737014 639831
35131 639831 218150 -319237 -415745 -144886 -174581 -563409 -692997 -496861 -574948 -975347
35121 -975347 -1056894 -686580 -406747 -332943 -76414 195838 -96881 -651783 -453734 549353
35111 549353 1236979 1087200 932793 1531427 2441894 2798194 2399826 1671436 1134225 1058920
35101 1058920 1170038 841853 45223 -383961 -14263 422887 395802 679755 1829204
35092 1829204 2586876 1564160 -255204 -649774 673639 2017729 2446185 2533031 2533667
$$ packed form
35160d54577l22613l17977M1821N96163L01031o53362p52753J58529M10451n23871
35150a517158r98624r5364Q41924P07600L28377M04797J09655q15195q86165N00178
35140a419975J442085M32353j054195q95926M36238J048136O12040J36258r7183
35131F39831m21681n37387r6508K70859k9695l88828j29588J96136p8087m00399
35121i75347q1547L70314K79833P3804K56529K72252k92719n54902J98049J003087
35111E49353O87626j49779j54407N98634R10467L56300l98368p28390n37211p5305
35101A058920J11118l28185p96630m29184L69698M37150k7085K83953J149449
35092A829204P57672j022716j819364l94570J323413J344090M28456Q6846O36
$$ plain form
35083 2533667 1932290 906794 288034 -40718 -805973 -1432051 -597363 1170425 1736067
35074 1736067 594974 -392052 -103476 265277 -387922 -1218227 -1143559 -559635 -96466
35065 -96466 735321 2331697 3726528 3824471 2949897 2140828 1742327 1537870 1487472 1606960
35055 1606960 1735638 1852168 2020316 1951724 1429265 1038008 1437534 2127615 2161992 1763046
35045 1763046 1763139 1848819 1167900 350067 796048 2070356 2313439 1356948 1000959 1862846
35035 1862846 2447385 1919678 1350268 1493218 1709640 1825352 2652568 3958373 4421546
35026 4421546 4242959 5005842 6331975 6036270 4536433 5158503 8493620 11014985 12054836
35017 12054836 17219779 29947620 43214831 45838244 35821078 21960206 12601011
$$ packed form
35083B533667o01377j025496o18760l28752p65255o26078Q34688J767788N65642
35074A736067j141093r87026K88576L68753o53199q30305P4668N83924M63169
35065i6466Q31787J596376J394831R7943q74574q09069l98501k04457n0398J19488
35055A606960J28678J16530J68148o8592n22459l91257L99526O90081L4377l98946
35045A763046R3Q5680o80919q17833M45981J274308K43083r56491l55989Q61887
35035A862846N84539n27707n69410J42950K16422J15712Q27216J305805M63173
35026D421546j78587P62883J326133k95705j499837O22070L335117K521365J039851
35017A2054836N164943J2727841J3267211K623413j0017166j3860872r359195
$$ plain form
35010 12601011 8156696 5299865 3088039 2366236 2696626 2845614 2594905 2180262 1310851
35001 1310851 83123 -482323 25324 597926 553293 795025 2176248 3763902 4139769
34992 4139769 3746170 4523534 7298416 10533290 11874899 10423826 7306955 4343178
34984 4343178 2457302 1416191 741239 319392 76256 -282005 -785094 -917354 -273465
34975 -273465 823398 1682726 1870485 1281507 168403 -629618 -225292 1071401 1747868
34966 1747868 902310 -576522 -1213908 -667920 357695 1182184 1385196 681959 -543452
34957 -543452 -1124360 -431641 624081 762815 94823 -191227 410024 1200472 1402221
34948 1402221 978078 301349 -347055 -833786 -1124700 -1269296 -1282925 -1131086 -870751 -556037
$$ packed form
35010A2601011m444315k856831k211826p21803L30390J48988k50709m14643q69411
35001A310851j227728n65446N07647N72602m4633K41732J381223J587654L75867
34992D139769l93599P77364K774882L234874J341609j451073l116871k963777
34984D343178j885876j041111o74952m21847k43136l58261n03089j32260O43889
34975b73465J096863Q59328J87759n88978j113104p98021M04326J296693O76467
34966A747868q45558j478832o37386N45988J025615Q24489K03012p03237j225411
34957e43452n80908O92719J055722J38734o67992k86050O01251P90448K01749
34948A402221m24143o76729o48404m86731k90914j44596j3629J51839K60335L14714
$$ plain form
34938 -556037 -630 997226 2218518 3266429 4153170 5057985 5637378 5341639 4330724
34929 4330724 3226643 2082740 627260 -593308 -623328 243207 586951 -76900 -733486
34920 -733486 -697908 -529411 -616118 -390084 305877 541604 -89965 -516289 146211 1138553
34910 1138553 1304064 752556 288378 104989 -17285 -13303 220539 649364 1579924 3234214
34900 3234214 4525646 3788542 1351515 -267202 386491 1890575 2374882 2000607 1746000
34891 1746000 1471808 811871 485056 978411 1204798 206025 -988706 -952508 -178373
34882 -178373 -10164 -352630 -377518 -515370 -1619020 -2859124 -2621053 -1109982 -69067
34873 -69067 -157410 -466572 -446041 -477863 -577194 -240019 308900 225682 -462521 -797794 -410388
$$ packed form
34938e56037N55407R97856J221292J047911Q86741R04815N79393k95739j010915
34929D330724j104081j143903j455480j220568l0020Q66535L43744o63851o56586
34920g33486L5578J68497q6707K26034O95961K35727o31569m26324O62500R92342
34910A138553J65511n51508m64178j83389j22274L982K33842M28825R30560J654290
34900C234214J291432p37104k437027j618717O53693J504084M84307l74275k54607
34891A746000k74192o59937l26815M93355K26387r98773j194731L6198P74135
34882a78373J68209l42466k4888j37852j103650j240104K38071J511071J040915
34873f9067q8343l09162K0531l1822r9331L37175N48919q3218o88203l35273L87406
$$ plain form
34862 -410388 102403 357384 628637 1085821 1580054 2126297 2697779 2766555 2021828 1271264
34852 1271264 1562417 2618157 3219789 2989494 2703312 2871826 3066662 2829138 2424420
34843 2424420 2401977 2844226 3221635 2891574 1864685 998900 985598 1303514 970588 183851
34833 183851 62351 764911 1278517 1247599 1376874 1649561 998723 -592629 -1608955
34824 -1608955 -1505919 -1665510 -2718285 -3053735 -1515540 481583 1318029 1681350 2695442
34815 2695442 3468124 2880583 2104330 2657603 3367887 2172162 -96893 -750506 540762
34806 540762 1552359 1272938 956181 1280913 1210776 236139 -593375 -618455 -633883 -1247467
34796 -1247467 -1744843 -1326817 -297799 520755 664860 92455 -786251 -1120261 -473138
$$ packed form
34862d10388N12791K54981K71253M57184M94233N46243N71482O8776p44727p50564
34852A271264K91153J055740O01632k30295k86182J68514J94836k37524m04718
34843B424420k2443M42249L77409l30061j026889q65785j3302L17916l32926p86737
34833A83851j21500P02560N13606l0918J29275K72687o50838j591352j016326
34824a608955J03036j59591j052775l35450J538195J997123Q36446L63321J014092
34815B695442P72682n87541p76253N53273P10284j195725k269055o53613J291268
34806E40762J011597k79421l16757L24732p0137r74637q29514k5080j5428o13584
34796a247467m97376M18026J029018Q18554J44105n72405q78706l34010O47123
$$ plain form
34787 -473138 440596 606467 -8306 -742120 -1299525 -1728008 -1932859 -2019110 -2413474 -2885734
34777 -2885734 -2391717 -761806 563434 499054 -180983 -394373 -422811 -749236 -738733 -62811
34767 -62811 46764 -1217133 -2389668 -1830569 -364884 221572 47543 300726 761882
34758 761882 543331 230277 801029 1330593 335455 -1342556 -1593257 -396202 432543
34749 432543 347794 333096 414142 -427179 -1898922 -2419026 -1630672 -775848 -501596 -247415
34739 -247415 223443 535922 814938 1354838 1499243 585764 -482552 -452430 60925 -457238
34729 -457238 -1764399 -2204425 -1277339 50090 1101102 1701615 1292538 -226669 -1427679
34720 -1427679 -1027354 122355 530229 466151 841650 985100 -63289 -1249967 -1105011
$$ packed form
34787d73138R13734J65871o14773p33814n57405m28483k04851q6251l94364m72260
34777b885734M94017J629911J325240o4380o80037k13390k8438l26425J0503O75922
34767f2811J09575j263897j172535N59099J465685N86456j74029K53183M61156
34758G61882k18551l13054N70752N29564r95138j678011k50701J197055Q28745
34749D32543q4749j4698Q1046q41321j471743n20104P88354Q54824K74252K54181
34739b47415M70858L12479K79016N39900J44405r13479j068316L0122N13355n18163
34729d57238j307161m40026R27086J327429J051012O00513m09077j519207j201010
34720a427679M00325J149709M07874o4078L75499J43450j048389j186678J44956
$$ plain form
34711 -1105011 -501647 -1093387 -2142768 -1867564 -877521 -1049384 -1849556 -1201814 558828
34702 558828 1116442 304210 304271 1605935 2097917 684121 -1087369 -1597292 -964824 91074
34692 91074 1097630 1401944 779650 299894 858846 1443808 668062 -841063 -1511827
34683 -1511827 -1232818 -766729 -88554 728710 630058 -359013 -240863 1535037 2289663
34674 2289663 423357 -1372935 -441456 1357510 1261001 573711 1642726 2877258 1697699
34665 1697699 -256460 -12373 1203851 612553 -541521 362969 1717221 642939 -1033159
34656 -1033159 7480 2009555 1379871 -184421 1147659 3702965 3322572 1406559
34648 1406559 2003092 3519531 1872716 -732470 606737 3657853 2698033 -427454
$$ packed form
34711a105011O03364n91740j049381K75204R90043j71863q00172O47742J760642
34702E58828N57614q12232O1J301664M91982j413796j771490n09923O32468J055898
34692I1074J006556L04314o22294m79756N58952N84962p75746j509125o70764
34683a511827K79009M66089O78175Q17264r8652r89071J18150J775900P54626
34674B289663j866306j796292R31479J798966r6509o87290J069015J234532j179559
34665A697699j954159K44087J216224n91298j154074R04490J354252j074282j676098
34656a033159J040639K002075o29684j564292J332080K555306l80393j916013
34648A406559N96533J516439j646815k605186J339207L051116r59820l125487
$$ plain form
34640 -427454 472525 3927882 3518749 572685 1744566 5583253 4868493 1105401 2399958
34631 2399958 7774511 8923547 6884172 10168482 16765661 16778733 13035101 17899877
34623 17899877 28934394 32344221 32346994 47242053 72002437 83237655 94550184 159642453
34615 159642453 285747295 384364428 361054711 234602051 114178240 67085701 63101175
34608 63101175 50658549 28928819 21463218 25122025 21180164 11049220 8649865 12353734
34600 12353734 10569089 4586713 3892815 6845378 5059738 544330 1504093 6265514
34592 6265514 6617633 2949588 2246799 4497244 3829846 470277 -129145 1958892 1820669
34583 1820669 -542767 -764900 1020098 761314 -1214492 -722008 2318067 3902519 3200460
$$ packed form
34640d27454Q99979L455357m09133k946064J171881L838687p14760l763092J294557
34631B399958N374553J149036k039375L284310O597179J3072l743632M864776
34623A7899877J1034517L409827K773J4895059K4760384J1235218J1312529O5092269
34615A59642453J26104842R8617133k3309717j26452660j20423811m7092539l984526
34608F3101175j2442626k1729730p465601L658807l941861j0130944k399355L703869
34600A2353734j784645n982376o93898K952563j785640m515408R59763M761421
34592F265514L52119l668045p02789K250445o67398l359569n99422K088037j38223
34583A820669k363436k22133J784998k58784j975806M92484L040075J584452p02059
$$ plain form
34574 3200460 2979460 3530939 2554221 519743 287974 1826496 2488123 1924178 1979998
34565 1979998 2542163 1979446 789609 631253 830598 -204212 -1436971 -963681 153605
34556 153605 -317917 -1648822 -1603373 -483296 31964 476795 2204554 3893039 3243894
34547 3243894 897827 -828599 -1696529 -2645859 -2757851 -738192 1907728 2649336 1682791
34538 1682791 820329 149624 -1029236 -1587495 -289532 1329661 1138929 54755 263974
34529 263974 1285676 1156249 150616 -72798 217735 -278610 -859786 27951 1680555
34520 1680555 2358252 2530891 3749508 5356569 5519965 4593688 4307968 4483143 3627798
34511 3627798 2020123 1204589 1126701 589928 -180243 -146587 195602 -231043 -680830 165540
$$ packed form
34574C200460k21000N51479r76718k034478k31769J538522O61627n63945N5820
34565A979998N62165n62717j189837j58356J99345j034810j232759M73290J117286
34556A53605m71522j330905M5449J120077N15260M44831J727759J688485o49145
34547C243894k346067j726426q67930r49330j11992K019659K645920P41608r66545
34538A682791q62462o70705j178860n58259J297963J619193j90732j084174K09219
34529B63974J021702j29427j005633k23414K90533m96345n81176Q87737J652604
34520A680555O77697J72639J218617J607061J63396r26277k85720J75175q55345
34511C627798j607675q15534p7888n36773p70171L3656L42189m26645m49787Q46370
$$ plain form
34501 165540 1446941 1351166 241247 -153616 189455 54395 -302618 309655 1443209
34492 1443209 1649060 1097095 1056403 1406546 1083116 310856 67534 105953 -260609 -397321
34482 -397321 353586 829125 -28187 -732035 503530 2379420 2404624 1033230 658688
34473 658688 1394739 1312822 330443 332709 1502117 1861668 748528 -227489 -104985 152101
34463 152101 -300222 -1117114 -1968205 -2782974 -2845577 -1648661 -378974 -473332 -1151522 -670632
34453 -670632 503681 405480 -879686 -1194569 90434 1185174 938306 258284 -57818
34444 -57818 -591414 -1655989 -2327194 -1910331 -927960 -141381 227594 170393 -72376 181011
34434 181011 1067688 1508404 816879 172171 824870 1722135 1002624 -824622 -1516464
$$ packed form
34501A65540J281401r5775j109919l94863L43071j35060l57013O12273J133554
34492A443209K05851n51965m0692L50143l23430p72260k43322L8419l66562j36712
34482c97321P50907M75539q57312p03848J235565J875890K5204j371394l74542
34473F58688P36051q1917r82379K266J169408L59551j113140r76017J22504K57086
34463A52101m52323q16892q51091q14769o2603J196916J269687r4358o78190M80890
34453f70632J174313r8201j285166l14883J285003J094740k46868o80022l16102
34444e7818n33596j064575o71205M16863R82371P86579L68975n7201k42769K53387
34434A81011Q86677M40716o91525o44708O52699Q97265p19511j827246o91842
$$ plain form
34425 -1516464 -521022 595681 968944 1256139 1530090 798107 -776353 -1279265 375548
34416 375548 2766038 3813396 3435107 3649872 6320913 10854735 14098569 13236447 9076933
34407 9076933 5332873 4184081 4182424 3333717 2052875 1442042 821244 -675251 -1789679
34398 -1789679 -1062396 305944 221088 -817339 -772260 340117 769241 211130 -165529
34389 -165529 -293757 -987740 -1615287 -824300 721214 1100110 361703 231624 840177
34380 840177 639867 -452280 -747977 148787 700807 188027 -439503 -745682 -1374096
34371 -1374096 -2169619 -2182557 -1788004 -2317004 -3314246 -2749248 -404093 1484119 1551122
34362 1551122 880040 634855 464441 2318 -222588 -153761 -536549 -1248418 -1175168 -243414
$$ packed form
34425a516464R95442J116703L73263K87195K73951p31983j574460n02912J654813
34416C75548K390490J047358l78289K14765K671041M533822L243834q62122m159514
34407I076933l744060j148792j657q48707j280842o10833o20798j496495j114428
34398a789679P27283J368340q4856j038427M5079J112377M29124n58111l76659
34389a65529j28228o93983o27547P90987J545514L78896p38407j30079O08553
34380H40177k00310j092147k95697Q96764N52020n12780o27530l06179o28414
34371a374096p95523j2938L94553n29000r97242N64998K345155J888212O7003
34362A551122o71082k45185j70414m62123k24906O8827l82788p11869P3250R31754
$$ plain form
34352 -243414 331651 229151 440700 1090943 968651 -173112 -926556 -584600 -278768
34343 -278768 -953341 -1892580 -2048606 -1391327 -333253 887293 1852705 2173262 2132707
34334 2132707 2015805 1235014 -410700 -1371742 -280949 1433947 1315399 -238126 -601385
34325 -601385 793168 1793549 1303815 665005 719887 447117 -607914 -1212818 -734270
34316 -734270 -168768 -68522 224419 572522 -248167 -2045072 -2922697 -2341793 -1902599
34307 -1902599 -2179741 -1541430 638158 2328863 2023980 1137235 1457277 2346964 2310740
34298 2310740 1522287 994648 751295 429547 374019 749787 798443 107603 -597246 -784004
34288 -784004 -883609 -1060079 -780536 -247279 -529586 -1617626 -2158238 -1715120 -1310044 -1182664
$$ packed form
34352b43414N75065j02500K11549O50243j22292j141763p53444L41956L05832
34343b78768o74573r39239j56026O57279J058074J220546R65412L20557m0555
34334B132707j16902p80791j645714r61042J090793J714896j18548j553525l63259
34325f01385J394553J000381m89734o38810N4882k72770j055031o04904M78548
34316g34270N65502J00246K92941L48103q20689j796905q77625N80904M39194
34307a902599k77142O38311K179588J690705l04883q86745L20042Q89687l6224
34298B310740p88453n27639k43353l21748n5528L75768M8656o90840p04849j86758
34288g84004r9605j76470K79543N33257k82307j088040n40612M43118M05076J27380
$$ plain form
34278 -1182664 -310183 1146742 1444313 262351 -466263 133526 409634 -632032 -1457609
34269 -1457609 -992252 -682988 -1532345 -1774287 3731 1793199 1009276 -1464926 -2845570
34260 -2845570 -2523536 -1880210 -1358931 -460297 277675 -140754 -1216324 -1709183 -1677607
34251 -1677607 -1879532 -2011642 -1479651 -1020991 -1558252 -2280979 -1894892 -991263 -1090684 -1993929
34241 -1993929 -2198626 -1489704 -1083049 -1470859 -1976320 -2262908 -2630852 -2975056 -2883728 -2528075
34231 -2528075 -2210684 -1518531 -213224 675176 99689 -1223881 -1743167 -1224873 -547485
34222 -547485 44364 906357 1711394 1767786 1236028 616815 -420300 -2147167 -3329274
34213 -3329274 -2537831 -611632 109674 -972049 -2046643 -1698303 -646429 -142123 -106745
$$ packed form
34278a182664Q72481J456925K97571j181962p28614N99789K76108j041666q25577
34269a457609M65357L09264q49357k41942J778018J789468p83923k474202j380644
34260b845570L22034O43326N21279Q98634P37972m18429j075570m92859L1576
34251a677607k01925j32110N31991M58660n37261p22727L86087R03629r9421r03245
34241a993929k04697P08922M06655l87810n05461k86588l67944l44204R1328L55653
34231b528075L17391O92153J305307Q88400n75487j323570n19286N18294O77388
34222e47485N91849Q61993Q05037N6392n31758o19213j037115j726867j182107
34213c329274P91443J926199P21306j081723j074594L48340J051874N04306L5378
$$ plain form
34204 -106745 264758 991172 1283582 676052 -357354 -859411 -354040 630255 1174382
34195 1174382 1099237 1029145 1283794 1435231 1205678 979134 1033486 1087096 1001467 1038796
34185 1038796 1061252 573198 -8426 521857 2083127 2841566 1822825 518892 586398
34176 586398 1342511 1202577 462508 714544 2150121 3307256 3218105 2237705 971381
34167 971381 -169660 -529361 276414 1446208 1778867 1272513 839204 633346 -69426
34158 -69426 -1317738 -2042909 -1484907 -184949 762746 869989 495465 382277 1052711
34149 1052711 2344608 3498506 3796222 2992893 1257185 -798918 -2109464 -1990186 -1147246
34140 -1147246 -1026166 -1943915 -2750763 -2559008 -1760211 -984318 -187344 691098 1229663
$$ packed form
34204a06745L71503P26414K92410o07530j033406n02057N05371R84295N44127
34195A174382p5145p0092K54649J51437k29553k26544N4352N3610q5629L7329
34185A038796K2456m88054n81624N30283J561270P58439j018741j303933O7506
34176E86398P56113j39934p40069K52036J435577J157135q9151r80400j266324
34167I71381j141041l59701Q05775J169794L32659n06354m33309k05858p02772
34158f9426j248312p25171N58002J299958R47695J07243l74524j13188O70434
34149A052711J291897J153898K97716q03329j735708k056103j310546J19278Q42940
34140a147246J21080r17749q06848J91755P98797P75893P96974Q78442N38565
$$ plain form
34131 1229663 1296663 1374549 1594991 1416020 702992 67348 -281332 -815424 -1391694 -1065681
34121 -1065681 186216 982002 526256 -278529 -482332 -435444 -631225 -631989 -134290 208141
34111 208141 -19636 -234796 -116671 -243888 -691527 -577444 99136 -92147 -1616168
34102 -1616168 -2775944 -2193464 -805756 -46448 250874 656541 566461 -481595 -1396889
34093 -1396889 -1115797 -265722 223378 688154 1421759 1445960 305723 -505777 236070
34084 236070 1323076 1038636 -149064 -668515 -255641 535334 1835065 3594669 4531549
34075 4531549 3776533 2378606 1614379 1206218 649971 567867 1180340 1319600 548934
34066 548934 190808 710540 558562 -691066 -953039 613166 1697718 1043203 940189
$$ packed form
34131A229663O7000P7886K20442j78971p13028o35644l48680n34092n76270L26013
34121a065681J251897P95786m55746q04785k03803M6888j95781p64M97699L42431
34111B08141k27777k15160J18125j27217m47639J14083O76580j91283j524021
34102a616168j159776N82480J387708P59308K97322M05667r0080j048056r15294
34093a396889K81092Q50075M89100M64776P33605K4201j140237q11500P41847
34084B36070J087006k84440j187700n19451M12874P90975J299731J759604R36880
34075D531549p55016j397927p64227m08161n56247q2104O12473J39260p70666
34066E48934l58126N19732j51978j249628k61973J566205J084552o54515j03014
$$ plain form
34057 940189 2685552 3530187 1687246 203778 1611980 3104323 2087967 1952981 6146433
34048 6146433 11082221 12351723 13547129 20097517 28855910 35275671 47349449 76692399
34040 76692399 114063969 130214998 109137409 68452628 37562083 25529628 21052307
34033 21052307 15296755 10473695 9007602 7836738 5233053 3881029 4784562 4936493
34025 4936493 2981112 1535963 2142775 2747334 1803917 679995 496429 267701 -475238
34016 -475238 -515141 395010 685948 -171916 -726902 -337090 -185020 -646287 -381035 889139
34006 889139 1285850 -251727 -2131478 -2579361 -2015205 -1669050 -1576473 -1335456 -1415879 -2279032
33996 -2279032 -3183485 -3102285 -2172951 -1326029 -997241 -875414 -521545 149202 643815 122698
$$ packed form
34057I40189J745363Q44635j842941j483468J408202J492343j016356j34986M193452
34048F146433M935788J269502J195406O550388Q758393O419761J2073778K9342950
34040G6692399L7371570J6151029k1077589m0684781l0890545j2032455m477321
34033B1052307n755552m823060j466093j170864k603685j352024R03533J51931
34025D936493j955381j445149O06812O04559r43417j123922j83566k28728p42939
34016d75238l9903R10151K90938q57864n54986L89812J52070m61267K65252J270174
34006H89139L96711j537577j879751m47883N64156L46155R2577K41017q0423q63153
33996b279032r04453Q1200R29334Q46922L28788J21827L53869O70747M94613n21117
$$ plain form
33986 122698 -1572177 -3220879 -3344834 -1981454 -516283 170852 412025 597297 454291
33977 454291 -143818 -569820 -242647 433165 416517 -771325 -2337331 -2785385 -1481489
33968 -1481489 349302 793042 -420769 -1591862 -1411549 -568206 -265937 -320779 40943
33959 40943 430724 -104661 -1255358 -1757542 -1287266 -637455 -185587 370470 783428 261544
33949 261544 -1038009 -1841998 -1496460 -745123 -334960 95572 1115195 2311194 2731111
33940 2731111 2089238 1013170 327613 366897 764299 778398 55809 -900015 -1265701 -831236
33930 -831236 -85052 507043 874064 1023471 817990 241668 -340796 -375303 360460 1368876
33920 1368876 1742410 1169035 445802 472939 928976 764966 -48025 -385001 180710 665114
$$ packed form
33986A22698j694875j648702j23955J363380J465171O87135K41173J85272j43006
33977D54291n98109m26002L27173O75812j6648j187842j566006m48054J303896
33968a481489J830791M43740j213811j171093J80313Q43343L02269n4842L61722
33959D0943L89781n35385j150697n02184M70276O49811M51868N56057M12958n21884
33949B61544j299553q03989L45538P51337M10163M30532J019623J195999M19917
33940B731111o41873j076068o85557L9284L97402J4099p22589r55824l65686M34465
33930h31236P46184N92095L67021J49407k05481n76322n82464l4507P35763J008416
33920A368876L73534n73375p23233K7137M56037j64010q12991l36976N65711M84404
$$ plain form
33910 665114 416607 267376 933516 1438717 553663 -987813 -1321200 -150858 937354
33901 937354 843075 194752 -34348 108448 111525 -8119 70818 290208 327228 152212
33891 152212 66210 220403 310377 -125913 -1047034 -1711225 -1465222 -633377 -117057 -151835
33881 -151835 -176132 -7045 -191637 -815618 -979974 -172780 697770 517476 -450135 -1085463
33871 -1085463 -959435 -465324 91726 601764 745960 397113 98291 294483 430086
33862 430086 -312869 -1672066 -2564828 -2450592 -1649397 -594154 421114 1020231 1077237
33853 1077237 1034542 1210162 1188593 631684 130706 294352 535865 -71666 -1150491 -1507670
33843 -1507670 -1008552 -623405 -690666 -487161 344434 1176281 1442087 1242259 722277 -118947
$$ packed form
33910F65114k48507j49231O66140N05201q85054j541476l33387J170342J088212
33901I37354r4279o48323k29100J42796L077j19644P8937K19390L7020j75016
33891A52212q6002J54193Q9974m36290r21121o64191K46003Q31845N16320l4778
33881a51835k4297J69087j84592o23981j64356Q07194Q70550j80294r67611o35328
33871a085463J26028M94111N57050N10038J44196l48847k98822J96192J35603
33862D30086p42955j359197q92762J14236Q01195J055243J015268N99117N7006
33853A077237m2695J75620k1569n56909n00978J63646K41513o07531j078825l57179
33843a507670M99118L85147o7261K03505Q31595Q31847K65806j99828n19982q41224
$$ plain form
33833 -118947 -843198 -855272 -446059 -467980 -789745 -299608 1186385 2285829 1957922 948481
33823 948481 537288 757925 773811 359842 59985 208399 561921 750820 582584 56955
33813 56955 -561731 -866784 -728033 -362858 76719 581620 909613 738961 370788 577028
33803 577028 1389312 1724307 763473 -837926 -1760616 -1666412 -1366128 -1525932 -1845462 -1602756
33793 -1602756 -620157 488863 961677 745173 610874 1223818 2233508 2677114 2196682
33784 2196682 1310617 485754 -320545 -964992 -786671 424755 1694296 1831628 870540
33775 870540 -91006 -320352 -116688 -85897 -292639 -302021 181182 841313 965264 298722
33765 298722 -423774 -321768 240810 -46532 -1380943 -2112449 -982995 789466 1045179
$$ packed form
33833a18947p24251j2074M09213k1921l21765M90137J485993J099444l27907j009441
33823I48481m11193K20637J5886m13969k99857J48414L53522J88899j68236n25629
33813E6955o18686l05053J38751L65175M39577N04901L27993j70652l68173K06240
33803E77028Q12284L34995r60834j601399r22690R4204L00284j59804l19530K42706
33793a602756R82599J109020M72814k16504j34299O12944J009690M43606m80432
33784B196682q86065q24863q06299o44447J78321J211426J269541J37332r61088
33775H70540r61546k29346K03664L0791k06742r382M83203O60131J23951o66542
33765B98722p22496J02006N62578k87342j334411p31506J129454J772461K55713
$$ plain form
33756 1045179 -242850 -1122436 -765331 -465350 -1053711 -1306450 -137723 1246383 1088320
33747 1088320 -114996 -437438 461708 1102903 775230 427070 742786 1088234 893300
33738 893300 573284 448341 108493 -458374 -399470 552397 1340829 1123984 453288 127519
33728 127519 33715 -24169 382226 1160335 1167078 56290 -674068 66556 1004792 556569
33718 556569 -441903 -192163 934026 1189539 655785 914129 1801539 1408406 -400650
33709 -400650 -1302817 -130870 1405681 1672445 1401512 1696050 1912539 1192068 346975
33700 346975 452641 915595 641212 15619 83623 636310 674535 127677 -243106 -118181
33690 -118181 309168 927072 1398063 993796 -281753 -1196314 -910394 -238883 -261074 -638263
$$ packed form
33756A045179j288029q79586L57105K99981n88361k52739J168727J384106j58063
33747A088320j203316l22442Q99146O41195l27673l48160L15716L45448j94934
33738H93300l20016j24943l39848n66867N8904R51867P88432k16845o70696l25769
33728A27519r3804n7884M06395P78109O743j110788p30358P40624R38236m48223
33718E56569r98472K49740J126189K55513n33754K58344Q87410l93133j809056
33709d00650r02167J171947J536551K66764k70933K94538K16489p20471q45093
33700C46975J05666M62954k74383o25593O8004N52687L8225n46858l70783J24925
33690a18181M27349O17904M70991m04267j275549r14561K85920O71511k2191l77189
$$ plain form
33680 -638263 -546853 -350697 -881717 -1753782 -1880837 -1172945 -331670 546658 1713722 2526124
33670 2526124 2032016 701713 138998 966122 2194427 2802821 2816373 2600479 2078585
33661 2078585 1058985 -255221 -1381855 -1926762 -1865731 -1652461 -1787026 -2112004 -2001933
33652 -2001933 -1400093 -949863 -876587 -700005 -428653 -851641 -1989842 -2523481 -1692301
33643 -1692301 -542909 -190261 -90566 606891 1199939 594673 -620394 -1049348 -740717
33634 -740717 -782840 -1221498 -1229250 -960564 -1351400 -2217730 -2342431 -1469068 -573429 -102782
33624 -102782 489780 1363443 1945514 2118550 2372560 2667375 2484303 2069134 2241627 2870960
33614 2870960 2914583 2095262 1186606 537564 -251953 -1013150 -856895 296947 1372260
$$ packed form
33680f38263R1410J96156n31020q72065j27055P07892Q41275Q78328J167064Q12402
33670B526124m94108j330303n62715Q27124J228305O08394J3552k15894n21894
33661B078585j019600j314206j126634n44907O1031K13270j34565l24978J10071
33652b001933O01840M50230P3276J76582K71352m22988j138201n33639Q31180
33643a692301J149392L52648R9695O97457N93048o05266j215067m28954L08631
33634g40717m2123m38658p752K68686l90836q66330j24701Q73363Q95639M70647
33624a02782N92562Q73663N82071J73036K54010K94815j83072m15169J72493O29333
33614B870960M3623q19321r08656o49042p89517p61197J56255J153842J075313
$$ plain form
33605 1372260 1697308 1700424 1767566 1676244 1482745 1674998 2043473 1664493 464884 -422401
33595 -422401 -378055 -195607 -678192 -1420356 -1628444 -1218724 -504764 343751 971649 796721
33585 796721 -121585 -877727 -885495 -579473 -502128 -385532 284396 1279623 1757581 1177990
33575 1177990 -153292 -1286753 -1368982 -424631 692898 1311528 1531582 1529446 941152
33566 941152 -391943 -1640705 -1789669 -837386 480054 1629147 2244512 1873018 660938
33557 660938 -342843 -435451 -104385 124272 614569 1444170 1601512 630281 -256597 -117705
33547 -117705 156377 -198616 -101788 1170143 2102847 1709467 1899931 4101273 6319805
33538 6319805 7846271 13805732 28235701 43836848 46818251 33835599 16992761 8808079
$$ packed form
33605A372260L25048L116O7142r1322j93499J92253L68475l78980j199609q87285
33595d22401M4346J82448m82585p42164k08088M09720P13960Q48515O27898j74928
33585G96721r18306p56142p768L06022P7345J16596O69928R95227M77958n79591
33575A177990j331282j133461q2229R44351J117529O18630K20054k136n88294
33566I41152j333095j248762j48964R52283J317440J149093O15365l71494j212080
33557F60938j003781r2608L31066K28657M90297Q29601J57342r71231q86878J38892
33547a17705K74082l54993R6828J271931R32704l93380J90464K201342K218532
33538F319805J526466N959461J4429969J5601147K981403j2982652j6842838q184682
$$ plain form
33530 8808079 8644030 8358049 5293176 3108628 3428888 3786058 2861950 2063516 1852119
33521 1852119 932248 -662601 -1266784 -575709 46157 224340 783641 1466421 1141757
33512 1141757 162941 -37279 471548 414849 -94454 149344 786214 256322 -1176069
33503 -1176069 -1503745 -332851 480895 -6601 -560066 -289718 -60779 -546777 -995802
33494 -995802 -839411 -646548 -597626 233635 2155892 3970827 4650330 4484096 3874159
33485 3874159 2539435 754597 -140065 465670 1361889 1254325 557369 457496 1054622
33476 1054622 1427258 975594 -52922 -935270 -931284 77105 1107382 909724 -470505
33467 -470505 -1719686 -2048907 -2046375 -2437740 -2999085 -3211959 -3100318 -2810538 -2122789 -1009277
$$ packed form
33530H808079j64049k85981l064873k184548L20260L57170r24108p98434k11397
33521A852119r19871j594849o04183O91075O21866J78183N59301O82780l24664
33512A141757r78816k00220N08827n6699n09303K43798O36870n29892j432391
33503a176069l27676J170894Q13746m87496n53465K70348K28939m85998m49025
33494i95802J56391J92863M8922Q31261J922257J814935O79503j66234o09937
33485C874159j334724j784838q94662O05735Q96219j07564o96956r9873N97126
33476A054622L72636m51664j028516q82348L986J008389J030277j97658j380229
33467d70505j249181l29221K532l91365n61345k12874J11641K89780O87749J113512
$$ plain form
33457 -1009277 -45467 331324 431404 640114 664342 66771 -809174 -1060812 -277805 985303
33447 985303 1744514 1464063 522798 -147090 -1512 623148 1082576 1180388 1036856 602067
33437 602067 -125741 -661808 -469271 287026 989146 1421063 1795609 2074727 1880250 1046659
33427 1046659 -180262 -1352127 -1902078 -1454414 -529709 -366178 -1357010 -2287546 -1994531
33418 -1994531 -1109713 -988723 -1492163 -1337543 -409560 -49598 -824316 -1546870 -1119085
33409 -1119085 -142748 73082 -691630 -1462703 -1279932 -52006 1432576 2105416 1576109
33400 1576109 581574 144394 378711 562721 207961 -466682 -921919 -677760 318217
33391 318217 1179432 574830 -1469333 -2998745 -2462971 -896229 -384141 -1034934 -1249126
$$ packed form
33457a009277R63810L76791J00080K08710K4228n97571q75945k51638P83007J263108
33447I85303P59211k80451r41265o69888J45578O24660M59428R7812j43532m34789
33437F02067p27808n36067J92537P56297P02120M31917L74546K79118j94477q33591
33427A046659j226921j171865n49951M47664R24705J63531r90832r30536K93015
33418a994531Q84818J20990n03440J54620R27983L59962p74718p22554M27785
33409a119085R76337K15830p64712p71073J82771J227926J484582O72840n29307
33400A576109r94535m37180K34317J84010l54760o74643m55237K44159R95977
33391C18217Q61215o04602k044163j529412N35774J566742N12088o50793k14192
$$ plain form
33382 -1249126 -570525 -174622 -515057 -657936 -356256 -645984 -1651377 -1884206 -798652
33373 -798652 -74238 -918594 -1839283 -903334 1129580 1945259 1067839 63431 -187980
33364 -187980 -365675 -817826 -702105 415053 1519560 1491128 565110 -244103 -501066
33355 -501066 -450033 -250650 134457 455672 262952 -377055 -710556 -147896 949572 1671133
33345 1671133 1637197 1305975 1227644 1445230 1730858 1908197 1727422 979618 76654 -87271
33335 -87271 651377 1258669 883960 84946 -154391 -40655 -515183 -1539092 -2035110 -1488709
33325 -1488709 -548272 13251 17239 -422199 -1015418 -1176707 -709133 -469735 -1310815 -2522728
33315 -2522728 -2574491 -1376336 -452853 -725295 -1500251 -1921136 -1984836 -1682622 -613374
$$ packed form
33382a249126O78601L95903l40435j42879L01680k89728j005393k32829J085554
33373g98652P24414q44356r20689R35949K032914Q15679q77420j004408k51411
33364a87980j77695m52151J15721J117158J104507k8432r26018q09213k56963
33355e01066N1033J99383L85107L21215j92720o40007l33501N62660J097468P21561
33345A671133l3936l31222p8331K17586K85628J77339j80775p47804r02964j63925
33335h7271P38648O07292l74709p99014k39337J13736m74528j023909m96018N46401
33325a488709R40437N61523L988m39438n93219j61289M67574K39398q41080j211913
33315b522728n1763J198155R23483k72442p74956m20885o3700L02214J069248
$$ plain form
33306 -613374 828045 1206513 -95683 -1819521 -2488478 -2197023 -1906770 -1852170 -1611640
33297 -1611640 -1130977 -769002 -669666 -673455 -558050 -136875 420141 411148 -453966 -1101451
33287 -1101451 -326234 1079554 1091524 -390910 -1125026 -9446 1116429 515618 -551239
33278 -551239 97461 2076940 3244532 3028867 2681420 2750348 2563759 2109677 2307883
33269 2307883 3153288 3414265 2604993 1686364 1334037 988301 254856 -106259 524823
33260 524823 1371994 1300213 473466 21555 340490 572457 -137811 -1438758 -2179322 -1866506
33250 -1866506 -1285632 -1406819 -2041269 -2247184 -1921368 -1970368 -2616722 -2676229 -1311362 442498
33240 442498 994660 368929 -166769 -175128 -365758 -950634 -1087599 -297590 651302 796658
$$ packed form
33306f13374J441419L78468j302196j723838o68957K91455K90253N4600K40530
33297a611640M80663L61975R9336l789J15405M21175N57016q993q65114o47485
33287a101451P75217J405788J1970j482434p34116J115580J125875o00811j066857
33278e51239O48700J979479J167592k15665l47447O8928j86589m54082J98206
33269B307883Q45405K60977q09272r18629l52327l45736p33445l61115O31082
33260E24823Q47171p1781q26747m51911L18935K31967p10268j300947p40564L12816
33250a866506N80874j21187o34450k05915L25816m9000o46354n9507J364867J753860
33240D42498N52162o25731n35698q359j90630n84876j36965P90009R48892J45356
$$ plain form
33230 796658 222373 -177563 293979 1610496 3076823 3756015 3229698 2016712 905795
33221 905795 -24446 -1216344 -2543137 -3094387 -2299059 -804039 119957 -84198 -716927
33212 -716927 -673248 173290 682221 -105399 -1467871 -1713661 -428329 955469 1181586
33203 1181586 716707 613121 864126 902767 898383 1322847 1769002 1439072 466458 -373035
33193 -373035 -902489 -1340422 -1279770 -263366 857856 678165 -587166 -1164909 -251715
33184 -251715 893629 839592 -253084 -1293662 -1612848 -1075382 180245 1445784 1650739
33175 1650739 500674 -1113751 -2200866 -2585271 -2567780 -2455446 -2655239 -3349373 -3787268
33166 -3787268 -2872615 -841293 694472 898276 780827 1363702 1913306 1172791 -454351
$$ packed form
33230G96658n74285l99936M71542J316517J466327O79192n26317j212986j110917
33221I05795r30241j191898j326793n51250P95328J495020R23996k04155o32729
33212g16927M3679Q46538N08931p87620j362472k45790J285332J383798K26117
33203A181586m64879j03586K51005L8641m384M24464M46155l29930r72614q39493
33193c73035n29454m37933O0652J016404J121222j79691j265331n77743R13194
33184b51715J145344n4037j092676j040578l19186N37466J255627J265539K04955
33175A650739j150065j614425j087115l84405J7491J12334j99793o94134m37895
33166c787268R14653K031322J535765K03804j17449N82875N49604p40515j627142
$$ plain form
33157 -454351 -1319441 -797521 78653 206539 -371546 -937121 -959583 -307975 765620 1625400
33147 1625400 1680413 1030435 419328 422613 859462 1068341 650479 -90600 -451090 -124222
33137 -124222 422190 590392 508038 792059 1536626 2138402 2208006 2006733 1788120 1403245
33127 1403245 883422 693551 909492 805113 -99160 -1115903 -1240733 -525674 123473
33118 123473 216296 10076 -199372 -362081 -355427 -89212 115039 -88642 -352521 -30654
33108 -30654 665793 702837 -338771 -1590374 -2080811 -1975500 -2041548 -2322104 -2107341 -1113244
33098 -1113244 55287 793414 1221770 1641574 1797160 1354090 828256 1113199 1934816
33089 1934816 1762583 -90633 -2066367 -2103669 -394151 817919 185410 -1251258 -1902546
$$ packed form
33157d54351q65090N21920Q76174J27886n78085n65575k2462O51608J073595Q59780
33147A625400N5013o49978o11107L285M36849K08879m17862p41079l60490L26868
33137a24222N46412J68202q2354K84021P44567O01776O9604k01273k18613l84875
33127A403245n19823j89871K15941j04379r04273j016743j24830P15059O49147
33118A23473R2823k06220k09448j62709O654K66215K04251k03681k63879L21867
33108c0654O96447L7044j041608j251603m90437J05311o6048k80556K14763R94097
33098a113244J168531P38127M28356M19804J55586m43070n25834K84943Q21617
33089A934816j72233j853216j975734l7302J709518J212070o32509j436668o51288
$$ plain form
33080 -1902546 -1747770 -1790076 -2282425 -2572196 -2287152 -1692129 -1041254 -415784 -131134 -530573
33070 -530573 -1315166 -1703020 -1341934 -586463 105506 536180 583297 263283 32659 421766
33060 421766 1210860 1512474 891849 -66863 -569525 -582027 -670083 -1111861 -1466719 -1021474
33050 -1021474 331657 1625542 1543012 -13607 -1409109 -1017448 691544 1696110 1091793
33041 1091793 123734 124730 565748 136924 -1034121 -1559086 -911008 -56179 198187 313993
33031 313993 951296 1697010 1671151 908806 286961 200237 77786 -586426 -1302272 -1164182
33021 -1164182 -178412 506419 -92805 -1546632 -2449808 -2027748 -880081 -58542 83427
33012 83427 -147971 -434337 -536713 -185240 441678 495342 -427788 -1238513 -553385 1120144
$$ packed form
33080a902546J54776m2306m92349k89771K85044N95023O50875O25470K84650l99439
33070e30573p84593l87854L61086P55471O91969M30674M7117l20014k30624L89107
33060D21766P89094L01614o20625r58712n02662j2502q8056m41778l54858M45245
33050a021474J353131J293885q2530j556619j395502L91661J708992J004566o04317
33041A091793r68059R96M41018m28824j171045n24965O48078Q54829K54366J15806
33031C13993O37303P45714k5859p62345o21845q6724j22451o64212p15846J38090
33021a164182R85770O84831n99224j453827r03176M22060J147667Q21539J41969
33012H3427k31398k86366j02376L51473O26918N3664r23130q10725O85128J673529
$$ plain form
33002 1120144 1770502 760456 -199697 267843 1095369 695760 -304769 -177879 852236
32993 852236 923311 -235066 -728603 317608 1182014 261942 -1433632 -1980481 -1357299
32984 -1357299 -900187 -914652 -620367 57437 378531 276805 390187 640312 282075 -528921
32974 -528921 -707891 -59994 334189 12621 -69925 604991 891392 -227449 -1731396
32965 -1731396 -1897507 -850302 -221688 -542927 -584860 469143 1648140 1709408 976492
32956 976492 676905 1039699 1131615 449857 -331324 -454928 -103408 198133 577090 1395867
32946 1395867 2133728 1713306 154953 -1026776 -665237 533304 1110099 951219 1171866
32937 1171866 2104360 2667240 2048223 899717 224266 -17906 -325872 -407686 333070
$$ packed form
33002A120144O50358j010046r60153M67540Q27526l99609j000529J26890J030115
32993H52236P1075j158377m93537J046211Q64406r20072j695574n46849O23182
32984a357299M57112j4465K94285O77804L21094j01726J13382K50125l58237q10996
32974e28921j78970O47897L94183l21568q2546O74916K86401j118841j503947
32965a731396j66111J047205O28614l21239m1933J054003J178997O1268p32916
32956I76492k99587L62794R1916o81758p81181j23604L51520L01541L78957Q18777
32946A395867P37861m20422j558353j181729L61539J198541N76795j58880K20647
32937A171866R32494N62880o19017j148506o75451k42172l07966q1814P40756
$$ plain form
32928 333070 1380027 1428957 278287 -716192 -532716 131273 124926 -252714 271245 1839707
32918 1839707 3071382 3028591 2480508 2519522 2775165 2071307 445073 -709188 -572989
32909 -572989 128232 433886 420105 578049 797469 779446 795455 1118841 1199768 396994
32899 396994 -821879 -1442654 -1394620 -1352555 -1256882 -410502 851784 1111361 21776 -892899
32889 -892899 -473789 272898 -193890 -1471837 -1829763 -803935 308023 467503 60083
32880 60083 -172177 -204291 -299402 -414319 -567709 -1117687 -2100003 -2784781 -2491456 -1570118
32870 -1570118 -1032980 -1308798 -1807038 -1770763 -1250309 -1027672 -1621515 -2554313 -2820572 -2087868
32860 -2087868 -1113620 -742836 -798830 -418364 645202 1589866 1533489 509020 -656964
$$ packed form
32928C33070J046957M8930j150670r94479J83476O63989o347l77640N23959J568462
32918A839707J231675m2791n48083L9014K55643p03858j626234j154261J36199
32909e72989P01221L05654j3781J57944K19420j8023J6009L23386Q0927q02774
32899C96994j218873o20775M8034M2065R5673Q46380J262286K59577j089585r14675
32889h92899M19110P46687m66788j277947l57926J025828J111958J59480m07420
32880F0083k32260l2114r5111j14917j53390n49978r82316o84778K93325R21338
32870a570118N37138k75818m98240L6275N20454K22637n93843r32798k66259P32704
32860b087868R74248L70784n5994L80466J063566R44664n6377j024469j165984
$$ plain form
32851 -656964 -1150176 -725759 244353 1107343 1487120 1566091 1634332 1454321 484258 -1227763
32841 -1227763 -2841631 -3598345 -3497893 -2944255 -2216603 -1600662 -1509650 -1925491 -2085575
32832 -2085575 -1358749 -210807 370040 272326 307039 812124 1086000 577789 -148502 -294984
32822 -294984 -93610 -314915 -796026 -479744 913693 2154804 1965087 618766 -553969
32813 -553969 -904221 -956892 -1234521 -1376722 -797071 271239 948935 845406 552762 820624
32803 820624 1497663 1638262 719999 -520345 -782124 282319 1600436 1946336 1384146
32794 1384146 1009729 1353612 1648446 977317 -323319 -1011212 -589005 26059 -251437
32785 -251437 -1204816 -1592298 -767566 500502 998892 493215 -133716 27276 1031757
$$ packed form
32851f56964m93212M24417R70112Q62990L79777P8971O8241j80011r70063j712021
32841a227763j613868p56714J00452N53638P27652O15941R1012m15841j60084
32832b085575P26826J147942N80847r7714L4713N05085K73876n08211p26291j46482
32822b94984K01374k21305m81111L16282J393437J241111j89717j346321j172735
32813e53969l50252n2671k77629j42201N79651J068310O77696j03529k92644K67862
32803H20624O77039J40599r18263j240344k61779J064443J318117L45900n62190
32794A384146l74417L43883K94834o71129j300636o87893M22207O15064k77496
32785b51437r53379l87482Q24732J268068M98390n05677o26931J60992J004481
$$ plain form
32776 1031757 2223846 2880977 2637269 1617058 406886 -267077 -84522 660011 1477391
32767 1477391 2176248 2775939 3087377 2720302 1606611 308989 -391144 -214268 395933
32758 395933 790942 779440 686492 805206 992486 914514 518763 69799 -168463 -93194
32748 -93194 256969 661688 851065 958698 1535106 2621446 3164920 2198590 461018
32739 461018 -230394 616292 1550920 1399590 822559 805150 840508 -6197 -1111658 -1060303
32729 -1060303 10450 526948 -146502 -1103675 -1744380 -2438200 -2925112 -1935996 607108
32720 607108 2614592 2399089 1022616 620173 1335793 1585243 777830 -14808 -25597
32711 -25597 196285 13799 -396530 -786595 -1330923 -1851533 -1552943 -218890 1082314
$$ packed form
32776A031757J192089O57131k43708j020211j210172o73963J82555P44533Q17380
32767A477391O98857N99691L11438l67075j113691j297622p00133J76876O10201
32758C95933L95009j1502r2948J18714J87280p7972l95751m48964k38262P5269
32748i3194L50163M04719J89377J07633N76408J086340N43474r66330j737572
32739D61018o91412Q46686R34628j51330n77031j7409L5358q46705j105461N1355
32729a060303J070753N16498o73450r57173o40705o93820m86912R89116K543104
32720F07108K007484k15503j376473m02443P15620K49450q07413p92638j0789
32711b5597K21882j82486m10329l90065n44328n20610K98590J334053J301204
$$ plain form
32702 1082314 1214230 359970 -468130 -838305 -1081445 -1377381 -1484269 -1367388 -1381228 -1625612
32692 -1625612 -1664877 -1201242 -633760 -537609 -809198 -806568 -329581 17174 -337182 -1082345
32682 -1082345 -1391641 -956853 -241347 257733 555473 869837 1162076 1253504 1174665 1131836
32672 1131836 1212375 1277906 1085283 465165 -489171 -1388261 -1866029 -1909976 -1658837 -1009278
32662 -1009278 105800 1072396 921081 -380319 -1552825 -1439322 -383738 379823 335149
32653 335149 -25273 -281411 -585858 -967335 -928624 -187637 653309 704962 -103310 -919126
32643 -919126 -942122 -204143 645042 1037511 830990 215084 -397836 -483069 162477 973292
32633 973292 1021816 156423 -654255 -536729 88532 124667 -640358 -1339785 -1311844 -770370
$$ packed form
32702A082314J31916q54260q28100l70175k43140k95936j06888J16881j3840k44384
32692a625612l9265M63635N67482R6151k71589K630M76987L46755l54356p45163
32682a082345l09296M34788P15506M99080K97740L14364K92239R1428p8839m2829
32672A131836Q0539O5531j92623o20118r54336q99090m77768m3947K51139O49559
32662a009278J115078R66596j51315j301400j172506J13503J055584P63561m4674
32653C35149l60422k56138l04447l81477L8711P40987Q40946N1653q08272q15816
32643i19126k2996P37979Q49185L92469k06521o15906o12920q5233O45546Q10815
32633I73292M8524q65393q10678J17526O25261L6135p65025o99427K7941N41474
$$ plain form
32623 -770370 -135272 450249 718883 279636 -562292 -785237 -556 864211 837284 231540
32613 231540 4445 306270 441127 -39079 -894503 -1653313 -1970759 -1734810 -1222794 -890077
32603 -890077 -731048 -310611 321309 478392 16910 -237223 101092 141185 -736696 -1504096
32593 -1504096 -1016683 -125140 -562364 -2122468 -2766292 -1588460 28565 600809 388634
32584 388634 450995 1034714 1581434 1538465 743287 -302322 -456571 807092 2130209
32575 2130209 1518514 -859679 -2482857 -1641413 489203 1681713 1372538 607393 267335
32566 267335 427267 841694 1140397 975777 582018 625458 1060137 986215 189350 -258443
32556 -258443 245236 631475 -90089 -896829 -132408 1796824 2793560 1968774 605926
$$ packed form
32623g70370O35098N85521K68634m39247q41928k22945P84681Q64767k6927o05744
32613B31540k27095L01825J34857m80206q55424p58810l17446K35949N12016L32717
32603h90077J59029M20437O31920J57083m61482k54133L38315M0093q77881p67400
32593a504096M87413Q91543m37224j560104o43824J177832J617025N72244k12175
32584C88634O2361N83719N46720m2969p95178j045609j54249J263663J323117
32575B130209o11695k378193j623178Q41444K130616J192510l09175p65145l40058
32566B67335J59932M14427K98703j64620l93759M3440M34679p3922p96865m47793
32556b58443N03679L86239p21564q06740P64421J929232R96736q24786j362848
$$ plain form
32547 605926 105862 387210 726800 984680 1325409 1507869 1154087 380336 -293200 -525177
32537 -525177 -459330 -525743 -923057 -1275509 -1072689 -516006 -384166 -794000 -834071 -15937
32527 -15937 674043 100815 -1228631 -1832724 -1346288 -696692 -338644 326493 1561694
32518 1561694 2595566 2831044 2755499 3012685 3315525 2945683 1838984 599017 -253139
32509 -253139 -623157 -675033 -593422 -347987 321352 1378009 2105940 1874822 1229148 1365291
32499 1365291 2333035 2689649 1459945 -368453 -1080113 -431010 260688 20304 -613103
32490 -613103 -473166 702376 1930742 2063424 1071063 128467 270164 1119731 1389421
32481 1389421 630474 -134236 213715 1481717 2622053 3105115 3167280 2980014 2380606
$$ packed form
32547F05926n00064K81348L39590K57880L40729J82460l53782p73751o73536k31977
32537e25177O5847o6413l97314l52452K02820N56683J31840m09834m0071Q18134
32527a5937O89980n73228j329446o04093M86436O49596L58048O65137J235201
32518A561694J033872K35478p5545K57186L02840l69842j106699j239967q52156
32509b53139l70018n1876Q1611K45435O69339J056657P27931k31118o45674J36143
32499A365291R67744L56614j229704j828398p11660O49103O91698k40384o33407
32490f13103J39937J175542J228366J32682r92361r42596J41697Q49567K69690
32481A389421p58947p64710L47951J268002J140336M83062O2165j87266n99408
$$ plain form
32472 2380606 1489420 896835 918964 1113929 918453 492572 478912 962630 1142354 341341
32462 341341 -889914 -1197952 -111077 1154933 1054432 -348342 -1443583 -1138466 -159207
32453 -159207 86860 -642703 -1386555 -1457637 -1130663 -832661 -468097 76839 382320 34054
32443 34054 -642669 -1013138 -1097853 -1417108 -1911858 -1823898 -923143 -108995 -246300 -978322
32433 -978322 -1395979 -1436809 -1704452 -2091836 -1653574 -86850 1556157 2104507 1577698
32424 1577698 787342 193601 -265247 -595297 -617363 -283795 270748 869532 1245632 1097727
32414 1097727 441124 -348885 -1013998 -1581613 -1934418 -1771426 -1274862 -1189901 -1806814 -2458157
32404 -2458157 -2516775 -2250913 -2081720 -1674870 -587850 741040 1548232 1826944 1958521
$$ packed form
32472B380606q91186n92585K2129J94965j95476m25881j3660M83718J79724q01013
32462C41341j231255l08038J086875J266010j00501j402774j095241L05117R79259
32453a59207K46067p29563p43852p1082L26974K98002L64564N44936L05481l48266
32443C4054o76723l70469q4715l19255m94750Q7960R00755Q14148j37305p32022
32433i78322m17657m0830k67643l87384M38262J566724J643007N48350n26809
32424A577698p90356n93741m58848l30050k2066L33568N54543N98784L76100j47905
32414A097727o56603p90009o65113n67615l52805J62992M96564Q4961o16913o51343
32404b458157n8618K65862J69193M06850J087020J328890Q07192K78712J31577
$$ plain form
32395 1958521 1767376 995600 272716 391541 917986 833350 355878 620199 1505715 1448251
32385 1448251 -95633 -1526014 -1292782 -11776 621012 167675 -344284 -48558 827281
32376 827281 1438754 1168161 179037 -611616 -473242 121568 34985 -853516 -1356249 -692419
32366 -692419 450078 1114769 1403720 1815490 2051489 1486441 370004 -392093 -446448
32357 -446448 -233914 -181440 -272379 -306878 -114764 364142 889287 1037137 753994 456603
32347 456603 386362 326258 151518 67272 70123 -118188 -313226 78080 900986 1161466
32337 1161466 634729 437116 1190161 1781186 1080204 -161276 -519602 -152807 -257388
32328 -257388 -872983 -956400 -380758 -143348 -531977 -648976 -4321 773995 1096506 1056945
$$ packed form
32395A958521j91145p71776p22884J18825N26445q4636m77472K64321Q85516n7464
32385A448251j543884j430381K33232J281006O32788m53337n11959K95726Q75839
32376H27281O11473k70593r89124p90653J38374N94810q6583q88501n02733O63830
32366f92419J142497O64691K88951M11770K35999n65048j116437p62097n4355
32357d46448K12534N2474r0939l4499J92114M78906N25145J47850k83143k97391
32347D56603p0241o0104j74740q4246K851j88311j95038L91306Q22906K60480
32337A161466n26737j97613P53045N91025p00982j241480l58326L66795j04581
32328b57388o15595q3417N75642K37410l88629j16999O44655P78316L22511l9561
$$ plain form
32318 1056945 690101 -184457 -1093358 -1107603 -289819 192828 -216971 -763107 -774261 -584418
32308 -584418 -565442 -429916 -107948 -148769 -531971 -261727 952903 1763667 1089251 -31356
32298 -31356 80492 1060353 895125 -1134393 -3359494 -3868082 -2670658 -1275202 -835864
32289 -835864 -1227643 -1579933 -1317599 -722377 -542891 -1041814 -1632938 -1636086 -1123600 -716199
32279 -716199 -781708 -1207104 -1768208 -2296754 -2559263 -2346457 -1696973 -832496 28368 622411
32269 622411 642999 89893 -551169 -778062 -584304 -260043 82743 427367 489546 -91248
32259 -91248 -1181821 -2101331 -2178712 -1209031 469944 2034527 2481302 1415921 -331960
32250 -331960 -1285693 -764628 473216 1216470 1156886 919862 922669 778122 51598 -873994
$$ packed form
32318A056945l66844q74558r08901j4245Q17784M82647m09799n46136j1154J89843
32308e84418J8976J35526L21968m0821l83202K70244J214630Q10764o74416j120607
32298c1356J11848R79861j65228k029518k225101n08588J197424J395456M39338
32289h35864l91779l52290K62334N95222J79486m98923n91124l148N12486M07401
32279g16199o5509m25396n61104n28546k62509K12806O49484Q64477Q60864N94043
32269F22411K0588n53106o41062k26893J93758L24261L42786L44624O2179n80794
32259i1248j090573r19510p7381R69681J678975J564583M46775j065381j747881
32250c31960r53733N21065J237844P43254n9584k37024K807j44547p26524r25592
$$ plain form
32240 -873994 -1220089 -878393 -412496 -18761 734646 1854407 2417207 1761370 580115
32231 580115 16821 113051 97735 -94137 249055 1164228 1693395 1367258 957435 1189208
32221 1189208 1599055 1405013 820511 629256 836316 613708 -436221 -1597673 -1817846
32212 -1817846 -932050 35697 -87966 -1178117 -1701234 -507364 1546974 2527285 1837710
32203 1837710 721930 282909 216823 -14566 19472 814537 1699336 1597071 544709
32194 544709 -459886 -770398 -485201 82512 564767 521722 -3998 -239429 353947 1244768
32184 1244768 1596716 1409095 1223775 1231909 1413412 1938602 2542064 2173760 388974 -1503714
32174 -1503714 -1947010 -1291834 -1058058 -1474328 -1414541 -643641 -326364 -1015928 -1779871 -1851532
$$ packed form
32240h73994l46095L41696M65897L93735P53407J119761N62800o55837j181255
32231E80115n63294R6230j5316j91872L43192R15173N29167l26137m09823K31773
32221A189208M09847j94042n84502j91255K07060k22608j049929j161452k20173
32212a817846Q85796R67747j23663j090151n23117J193870K054338R80311o89575
32203A837710j115780m39021o6086k31389L4038P95065Q84799j02265j052362
32194E44709j004595l10512K85197N67713M82255m3045n25720k35431N93376Q90821
32184A244768L51948j87621j85320Q134J81503N25190O03462l68304j784786j892688
32174a503714m43296O55176K33776m16270N9787P70900L17277o89564p63943p1661
$$ plain form
32164 -1851532 -1709328 -1881382 -1961574 -1527877 -949490 -613329 -329564 -67266 -251927 -767587
32154 -767587 -742700 43074 620725 354568 -123838 -214468 -359147 -877035 -1044700 -431702
32144 -431702 34097 -408590 -900490 -475345 49952 -570223 -1625340 -1394546 24268
32135 24268 891801 672457 618048 1300346 1581495 676089 -485401 -802497 -509290 -243085
32125 -243085 167643 979052 1557085 1185949 250622 -247775 75899 855077 1584433 1834744
32115 1834744 1353428 441950 -226112 -492791 -812844 -1184163 -858130 345407 1322525
32106 1322525 1049801 -72938 -1040764 -1648177 -2082417 -1790533 -88121 2277643 3437227
32097 3437227 2562080 913779 393073 1487883 2891880 2974310 1576368 282003 582896
$$ packed form
32164a851532J42204j72054q0192M33697N78387L36161K83765K62298j84661n15660
32154g67587K4887P85774N77651k66157m78406r0630j44679n17888j67665O12998
32144d31702M65799m42687m91900M25145N25297o20175j055117K30794J418814
32135B4268Q67533k19344n4409O82298K81149r05406j161490l17096K93207K66205
32125b43085M10728Q11409N78033l71136r35327m98397L23674P79178P29356K50311
32115A834744m81316r11478o68062k66679l20053l71319L26033J203537R77118
32106A322525k72724j122739r67826o07413m34240K91884J702412K365764J159584
32097C437227q75147j648301n20706J094810J403997Q2430j397942j294365L00893
$$ plain form
32088 582896 1918990 2370644 1397712 650872 1438117 2730057 2859104 2018250 1480876
32079 1480876 1278560 609616 -33194 609345 2004518 2118174 641374 -321099 460177
32070 460177 1523222 1313224 576797 636386 1015030 623359 -55697 16835 269657 -480282
32060 -480282 -1538212 -1099544 698460 1670429 740818 -728360 -1216877 -917565 -679957
32051 -679957 -607949 -540816 -698976 -990111 -700264 264204 725695 -250536 -1885847 -2649795
32041 -2649795 -2187934 -1415151 -1035741 -844804 -425894 169380 601846 735518 758332 846007
32031 846007 766008 66109 -1108773 -1747371 -1104298 140363 649982 268264 126785
32022 126785 800116 1432908 1157202 398745 59638 130424 -85139 -818589 -1614334 -1977417
$$ packed form
32088E82896J336094M51654r72932p46840P87245J291940J29047q40854n37374
32079A480876k02316o68944o42810O42539J395173J13656j476800r62473P81276
32070D60177J063045k09998p36427N9589L78644l91671o79056P2532K52822p49939
32060d80282j057930M38668J798004R71969r29611j469178m88517K99312K37608
32051f79957P2008O7133j58160k91135K89847R64468M61491r76231j635311p63948
32041b649795M61861P72783L79410J90937M18910N95274M32466J33672K2814Q7675
32031H46007p9999o99899j174882o38598O43073J244661N09619l81718j41479
32022A26785O73331O32792k75706p58457l39107P0786k15563p33450p95745l63083
$$ plain form
32012 -1977417 -1744823 -1103724 -603525 -762915 -1341777 -1477483 -850837 -112820 218345
32003 218345 546062 1315470 2073686 2166768 1783125 1476628 1146023 392742 -457169 -626120
31993 -626120 -36084 601372 746559 424818 -153532 -661051 -516175 540172 1761338
31984 1761338 2006629 1102055 -8985 -543750 -748397 -1318482 -2344204 -3048982 -2494972
31975 -2494972 -580412 1644783 2863527 2688377 1678207 386634 -851478 -1309492
31967 -1309492 -285814 1497957 2221974 1412644 749323 1408514 1984870 618766 -1906921
31958 -1906921 -3146323 -2455282 -1462182 -1302400 -1375395 -999969 -474784 -80219 429989
31949 429989 907556 750524 130915 -35247 365682 507150 282084 517276 1102859 647262
$$ packed form
32012a977417K32594O41099N00199j59390n78862j35706O26646P38017L31165
32003B18345L27717P69408P58216R3082l83643l06497l30605p53281q49911j68951
31993f26120N90036O37456J45187l21741n78350n07519J44876J056347J221166
31984A761338K45291r04574j111040n34765k04647n70085j025722p04778N54010
31975b494972J914560K225195J218744j75150j010170j291573j238112m58014
31967a309492J023678J783771P24017q09330o63321O59191N76356j366104k525687
31958a906921j239402O91041R93100J59782p2995L75426N25185L94565N10208
31949D29989M77567j57032o19609j66162M00929J41468k25066K35192N85583m55597
$$ plain form
31939 647262 -1186031 -2597155 -2002724 -189345 996444 1011339 567760 208094 57022
31930 57022 195594 251764 -628435 -2424972 -3629386 -3034155 -1487328 -829937 -1609819
31921 -1609819 -2788811 -3243065 -2696780 -1596976 -777314 -799795 -1139056 -715646 347120
31912 347120 592650 -485662 -1370418 -804487 189663 39487 -818371 -907438 -314312 -260489
31902 -260489 -624458 -93663 1311979 2018636 1481805 1012425 1457838 1852688 1226066
31893 1226066 245882 31090 466807 738439 674839 556672 241016 -521848 -1271981 -1257207
31883 -1257207 -606279 -403619 -1407658 -2992803 -3602999 -2363079 -178674 1108259 798950
31874 798950 71451 281530 1193836 1653885 1441386 1343458 1622077 1612555 959183 197306
$$ packed form
31939F47262j833293j411124N94431J813379J185789J4895m43579l59666j51072
31930E7022J38572N6170q80199j796537j204414N95231J546827O57391p79882
31921a609819j178992m54254N46285J099804Q19662k2481l39261M23410J062766
31912C47120K45530j078312q84756N65931R94150j50176q57858q9067N93126N3823
31902b60489l63969N30795J405642P06657n36831m69380M45413L94850o26622
31893A226066r80184k14792M35717K71632o3600j18167l15656p62864p50133J4774
31883a257207O50928K02660j004039j585145o10196J239920K184405J286933l09309
31874G98950p27499K10079R12306M60049k12499r7928K78619r522o53372p61877
$$ plain form
31864 197306 -170394 -302400 -407493 -248473 383724 1213235 1722311 1512754 527414 -639816
31854 -639816 -983875 -335176 26229 -1051920 -2761708 -3258212 -2179557 -893863 -316086
31845 -316086 693 438481 578849 343840 382138 737734 558110 -230781 -440886 371070
31835 371070 895886 110543 -1059161 -1319275 -975091 -969538 -1122357 -831304 -505694 -671638
31825 -671638 -550052 665012 1834346 1222721 -536210 -968189 627933 2099296 1484286
31816 1484286 -563159 -2106006 -2267736 -1431162 -247306 671533 881291 654034 751958
31807 751958 1190713 1059456 121315 -362212 693233 2388612 2786834 1385985 -321858
$$ packed form
31864A97306l67700j32006j05093J59020O32197Q29511N09076k09557r85340j167230
31854f39816l44059O48699L61405j078149j709788m96504J078655J285694N77777
31845c16086L16779M37788J40368k35009L8298L55596j79624p88891k10105Q11956
31835C71070N24816p85343j169704k60114L44184N553j52819K91053L25610j65944
31825f71638J21586J215064J169334o11625j758931m31979J596122J471363o15010
31816A484286k047445j542847j61730Q36574J183856R18839K09758k27257R7924
31807G51958M38755j31257r38141m83527J055445J695379L98222j400849j707843
$$ [...]
##END NTUPLES=NMR SPECTRUM
##END=
