##TITLE=31Pdec_B3dm-2
 CDCl3, 24 sc
 13.7.2023
##JCAMPDX= 6.0         $$ Bruker NMR JCAMP-DX V2.0
##DATA TYPE= NMR SPECTRUM
##DATA CLASS= NTUPLES
##ORIGIN= UXNMR, Bruker Analytische Messtechnik GmbH
##OWNER= root
$$ XWIN-NMR		Version 3.5
$$ Thu Jul 13 14:39:40 2023 Russian Standard Time (UT+4h)  she@DPX200
##.OBSERVE FREQUENCY= 81.013821
##.OBSERVE NUCLEUS= ^31P
##.ACQUISITION MODE= SIMULTANEOUS
##.ACQUISITION SCHEME= undefined
##.AVERAGES= 24
##.DIGITISER RES= 16
##SPECTROMETER/DATA SYSTEM= spect
##.PULSE SEQUENCE= zgpg30
##.SOLVENT NAME= DMSO
##.SHIFT REFERENCE= (INTERNAL, DMSO, 0, 248.564)
##AUDIT TRAIL= $$ (NUMBER, WHEN, WHO, WHERE, WHAT)
$$ ##TITLE= Audit trail, XWIN-NMR		Version 3.5
$$ ##JCAMPDX= 5.01
$$ ##ORIGIN= Bruker BioSpin GmbH
$$ ##OWNER= she
$$ F:/spectra/data/she/nmr/P31/1/pdata/1/auditp.txt
$$ ##AUDIT TRAIL=  $$ (NUMBER, WHEN, WHO, WHERE, WHAT)
(   1,<2023-07-13 14:38:37.92 +0400>,<she>,<DPX200>,
      <created by zg, POWCHK disabled, PULCHK disabled
       configuration hash MD5:
       00 E9 B6 7A A2 85 ED C7 34 08 36 98 17 FE 4E 26
       data hash MD5: 32K
       80 EE 7E B9 8D D2 08 70 65 8D 2A E8 71 A9 6A C3>)
(   2,<2023-07-13 14:38:41.23 +0400>,<she>,<DPX200>,
      <Start of raw data processing
       efp BC_mod = 2 LB = 1 FT_mod = 6 PKNL = 1 PHC0 = -10756.24 PHC1 = 213.2848 SI = 64K 
       data hash MD5: 64K
       3E 7B 39 74 07 10 2B 7D 1A EC 9E 5A 47 41 33 E8>)
(   3,<2023-07-13 14:39:00.31 +0400>,<she>,<DPX200>,
      <pk PHC0 = 81.72578 PHC1 = -173 
       data hash MD5: 64K
       90 DC 9D A2 EF C2 07 8C 12 C2 16 33 36 52 2E 36>)
(   4,<2023-07-13 14:39:04.73 +0400>,<she>,<DPX200>,
      <abs ABSG = 5 
       data hash MD5: 64K
       0F 67 D6 28 70 11 9E AB BB 46 A5 D9 F0 4F 12 F8>)
$$ ##END=
$$ 
$$ hash MD5
$$ 92 5C 28 31 9A 89 45 5A 0A DA 54 7F 9B 4F 42 D4
##$RELAX= 
##$RELAX= 
##$RELAX= 
##$RELAX= 
##$RELAX= 
##$RELAX= 
##$RELAX= 
##$RELAX= 
##$RELAX= 
$$ Bruker specific parameters
$$ --------------------------
##$DU= <F:/spectra>
##$EXPNO= 1
##$NAME= <P31>
##$PROCNO= 1
##$TYPE= <nmr>
##$USER= <she>
##$AMP= (0..31)
100 100 100 100 100 100 100 100 100 100 100 100 100 100 100 100 100 100 
100 100 100 100 100 100 100 100 100 100 100 100 100 100 
##$AQSEQ= 0
##$AQ_mod= 1
##$AUNM= <au_zg>
##$AUTOPOS= <>
##$BF1= 81.014009
##$BF2= 200.13
##$BF3= 200.13
##$BF4= 200.13
##$BF5= 200.13
##$BF6= 200.13
##$BF7= 200.13
##$BF8= 200.13
##$BYTORDA= 1
##$CFDGTYP= 0
##$CFRGTYP= 5
##$CHEMSTR= <none>
##$CNST= (0..31)
1 1 145 1 1 1 1 1 1 1 1 1 1 1 1 1 1 1 1 1 1 1 1 1 1 1 1 1 1 1 1 1 
##$CPDPRG= <waltz16>
##$CPDPRG1= <>
##$CPDPRG2= <waltz16>
##$CPDPRG3= <>
##$CPDPRG4= <mlev>
##$CPDPRG5= <mlev>
##$CPDPRG6= <mlev>
##$CPDPRG7= <mlev>
##$CPDPRG8= <mlev>
##$CPDPRGB= <>
##$CPDPRGT= <>
##$D= (0..31)
0 1 0 0 0 0 0 0 0 0 0 0.03 2e-05 3e-06 0 0 0 0 0 0 0 0 0 0 0 0 0 0 0 0 
0 0 
##$DATE= 1689244717
##$DBL= (0..7)
120 120 120 11 120 120 24 19 
##$DBP= (0..7)
150 150 150 150 150 150 150 150 
##$DBP07= 0
##$DBPNAM0= <>
##$DBPNAM1= <>
$$ [...]
##$SUBNAM3= <"">
##$SUBNAM4= <"">
##$SUBNAM5= <"">
##$SUBNAM6= <"">
##$SUBNAM7= <"">
##$SUBNAM8= <"">
##$SUBNAM9= <"">
##$SW= 501.771253377433
##$SWIBOX= (0..15)
0 1 3 0 0 0 0 0 0 0 0 0 0 0 0 0 
##$SW_h= 40650.406504065
##$TD= 32768
##$TD0= 1
##$TE= 0
##$TE2= 300
##$TE3= 300
##$TEG= 300
##$TL= (0..7)
0 120 53 12 22 120 120 120 
##$TP= (0..7)
150 150 150 150 150 150 150 150 
##$TP07= 0
##$TPNAME0= <>
##$TPNAME1= <>
##$TPNAME2= <>
##$TPNAME3= <>
##$TPNAME4= <>
##$TPNAME5= <>
##$TPNAME6= <>
##$TPNAME7= <>
##$TPOAL= (0..7)
0.5 0.5 0.5 0.5 0.5 0.5 0.5 0.5 
##$TPOFFS= (0..7)
0 0 0 0 0 0 0 0 
##$TUNHIN= 0
##$TUNHOUT= 0
##$TUNXOUT= 0
##$USERA1= <user>
##$USERA2= <user>
##$USERA3= <user>
##$USERA4= <user>
##$USERA5= <user>
##$V9= 5
##$VALIST= <valist>
##$VCLIST= <CCCCCCCCCCCCCCC>
##$VD= 0
##$VDLIST= <DDDDDDDDDDDDDDD>
##$VPLIST= <PPPPPPPPPPPPPPP>
##$VTLIST= <TTTTTTTTTTTTTTT>
##$WBST= 1024
##$WBSW= 4
##$XGAIN= (0..3)
0 0 0 0 
##$XL= 0
##$YL= 0
##$YMAX_a= 7206
##$YMIN_a= -4623
##$ZGOPTNS= <>
##$ZL1= 120
##$ZL2= 120
##$ZL3= 120
##$ZL4= 120
##$ABSF1= 248.5645
##$ABSF2= -253.2056
##$ABSG= 5
##$ABSL= 3
##$ALPHA= 0
##$AQORDER= 0
##$ASSFAC= 0
##$ASSFACI= 0
##$ASSFACX= 0
##$ASSWID= 0
##$AUNMP= <proc_1d>
##$AZFE= 0.1
##$AZFW= 0.5
##$BCFW= 0
##$BC_mod= 2
##$BYTORDP= 0
##$COROFFS= 0
##$CY= -3
##$DATMOD= 1
##$DC= 0
##$DFILT= <>
##$DTYPP= 0
##$F1P= 0
##$F2P= 0
##$FCOR= 1
##$FTSIZE= 65536
##$FT_mod= 6
##$GAMMA= 0
##$GB= 0
##$INTBC= 1
##$INTSCL= 6.047779e-11
##$ISEN= 30
##$LB= 1
##$LEV0= 0
##$LPBIN= 0
##$MAXI= 10000
##$MC2= 0
##$MEAN= 0
##$ME_mod= 0
##$MI= 50
##$NCOEF= 0
##$NC_proc= -5
##$NLEV= 6
##$NOISF1= 182.463
##$NOISF2= 159.3651
##$NSP= 0
##$NTH_PI= 0
##$NZP= 0
##$OFFSET= 248.5645
##$PC= 4
##$PHC0= -10674.51
##$PHC1= 40.28481
##$PH_mod= 1
##$PKNL= yes
##$PPARMOD= 0
##$PSCAL= 0
##$PSIGN= 0
##$REVERSE= no
##$SF= 81.0140089999694
##$SI= 65536
##$SIGF1= 159.3651
##$SIGF2= -187.1042
##$SINO= 113.3802
##$SIOLD= 16384
##$SREGLST= <1H.CDCl3>
##$SSB= 0
##$STSI= 65536
##$STSR= 0
##$SW_p= 40650.406504065
##$SYMM= 0
##$S_DEV= 0
##$TDeff= 32768
##$TDoff= 0
##$TI= <>
##$TILT= no
##$TM1= 0
##$TM2= 0
##$TOPLEV= 0
##$USERP1= <user>
##$USERP2= <user>
##$USERP3= <user>
##$USERP4= <user>
##$USERP5= <user>
##$WDW= 1
##$XDIM= 65536
##$YMAX_p= 389770053
##$YMIN_p= -22436905
$$ End of Bruker specific parameters
$$ ---------------------------------
##NTUPLES= NMR SPECTRUM
##VAR_NAME=  FREQUENCY,     SPECTRUM/REAL,   SPECTRUM/IMAG
##SYMBOL=    X,             R,               I
##VAR_TYPE=  INDEPENDENT,   DEPENDENT,       DEPENDENT
##VAR_FORM=  AFFN,          ASDF,            ASDF
##VAR_DIM=   65536,         65536,           65536
##UNITS=     HZ,            ARBITRARY UNITS, ARBITRARY UNITS
##FACTOR=    0.620285442955139, 1,           1
##FIRST=     20137.2065510682, 0,            0
##LAST=      -20513.1999529968, 0,           0
##MIN=       -20513.1999529968, -22436905,   0
##MAX=       20137.2065510682, 389770053,    0
$$ Real data points
##PAGE= N=1
##DATA TABLE= (X++(R..R)), XYDATA
$$ [...]
37545f28959L12201M52557P07337O19379L1383n65677o83854m09816r6023J45348
$$ -628959 -316758 135799 843136 1462515 1493898 928221 244367 -165449 -261472 -116124
37535a16124L51928M08665J91351j25209k20044n7364O9277o8114l65141n38391
$$ -116124 235804 644469 835820 710611 490567 433203 502480 434366 69225 -469166
37525d69166m35122j73530k1850r4506j48150J66627P54939J003356N05411l17289
$$ -469166 -904288 -1077818 -1099668 -1194174 -1342324 -1175697 -420758 582598 1088009 770720
37515G70720o80327m23525q4566K495J07238L99796M52997o4638o35254m86818
$$ 770720 90393 -333132 -417698 -415203 -307965 91831 544828 480190 -155064 -641882
37505f41882K53857O76549L46848j92008l16205j23598l7011q7739k8867J21920
$$ -641882 -388025 288524 635372 443364 127159 3561 -33450 -121189 -150056 -28136
37495b8136J07392r6986k12215q1770J03355R4172p4618j61036o2830O3436P3254
$$ -28136 79256 -17730 -229945 -311715 -208360 -114188 -188806 -349842 -412672 -349236 -275982
37484b75982P0459J91586K64201J6308l58494k94614K84475O73095L34348k97785
$$ -275982 -205523 -13937 250264 266572 -91922 -386536 -102061 571034 905382 607597
37474F07597m95814l04381k21748j61584L25118R12946O74991m01496j108000
$$ 607597 111783 -192598 -414346 -575930 -250812 662134 1337125 935629 -172371
37465a72371o72122J83601M22140J14325m7804L4159N321q2411M3680J58185j01194
$$ -172371 -844493 -660892 -238752 -124427 -172231 -138072 -132751 -215162 -171482 -13297 -114491
37454a14491l74582r971P22199P95762n2877q44306p06753K5669M89686M65051
$$ -114491 -489073 -499044 223155 1018917 966040 121734 -585019 -559350 -69664 395387
37444C95387L23106K12084o6537m73568n85319j92030K91008K84305j88842m88945
$$ 395387 718493 930577 864040 390472 -194847 -386877 -95869 188436 -406 -489351
37434d89351k06263K55498K47564j51832k44474J78229M55546R9077l70863j94599
$$ -489351 -695614 -440116 -192552 -344384 -588858 -410629 44917 143994 -226869 -421468
37424d21468M42183O99591L33405r9516k24178k63232l64094k67047O6849J64894
$$ -421468 20715 720306 1053711 954195 730017 466785 102691 -164356 -97507 67387
37414F7387j91826m54900q4080N66042P19691K92502p7058k4805J01058j01653
$$ 67387 -124439 -579339 -663419 -97377 622314 914816 837758 812953 914011 812358
37404H12358m73462n66653k43269K12050M04884J35576m22496p46836m01356L86506
$$ 812358 338896 -227757 -471026 -258976 145908 281484 -141012 -887848 -1289204 -902698
37394i02698Q15426M17397l19682n43494j00473L87247M51189L08375L45819N18437
$$ -902698 -87272 330125 10443 -533051 -633524 -246277 204912 513287 859106 1377543
37384A377543N31561L04302m3436m15273o70581n91500k31772l2522k19963l69594
$$ 1377543 1909104 2213406 2169970 1754697 1084116 492616 260844 228322 8359 -361235
37374c61235m6962L87026K56355k87092l79494K08102O34532K39080m60315n58771
$$ -361235 -408197 -21171 235184 -51908 -431402 -223300 411232 650312 189997 -368774
37364c68774o7180K30262p325k56581J5996N58574O42933n912q13393r59206l12799
$$ -368774 -435954 -205692 -213017 -469598 -453602 104972 747905 741993 -71400 -1030606 -1343405
37353a343405M09825N10746J07473j71276n5985K02791L91183N26053N20852K20203
$$ -1343405 -933580 -422834 -315361 -486637 -542622 -339831 51352 577405 1098257 1318460
37343A318460j58249j80024Q1972P4562k97633m26328k4344K80982r0277o80258
$$ 1318460 1160211 980187 1062159 1136721 839088 412760 388416 669398 579121 -101137
37333a01137o39996N255M52273L08887J4747O1636L39676M18810J59138j39382
$$ -101137 -741133 -735878 -283605 25282 40029 101665 441341 860151 1019289 879907
37323H79907j19233J60062K27517j63081n67615m25316K0799J8328m36080m53977
$$ 879907 760674 920736 1148253 985172 417557 -7759 13040 31368 -404712 -858689
37313h58689L10552R40918N86196k22757l99758R5307M01151J61935j72787l35001
$$ -858689 -548137 392781 978977 756220 356462 451769 852920 1014855 842068 507067
37303E07067n91258r87812j018474l56055N55788R37620N16449j79637l43853
$$ 507067 -84191 -1072003 -2090477 -2446532 -1890744 -953124 -436675 -616312 -960165
37294i60165J81924N78184O5709q05280o92118N05997J233539N35178m28981k21629
$$ -960165 -778241 -200057 -134348 -939628 -1631746 -1125749 107790 642968 213987 -7642
37284g642N80011M86162k98929l20323M13442L47067p58865j101409J93722J384457
$$ -7642 572369 1058531 759602 439279 852721 1199788 440923 -660486 -466764 917693
37274I17693P43806p34386r51669J07854O79651R7612n06392k90154J82238K03670
$$ 917693 1661499 927113 -24556 83298 762949 860561 354169 64015 246253 449923
37264D49923l1236j10712j12369j37502M3125M13392M91573J50502j95M17758
$$ 449923 418687 307975 195606 58104 101229 514621 1006194 1156696 1156501 1574259
37254A574259P97215M18641l68042o00041j24001K27405q1485n50611m72496M0316
$$ 1574259 2371474 2790115 2422073 1822032 1698031 1925436 1843951 1293340 820844 861160
37244H61160L04853N9355k75541k83166r2760q8938l19617m32556j78450K11262
$$ 861160 1166013 1225368 949827 666661 573901 484963 165346 -267210 -445660 -234398
37234b34398K93410K3881j16843K27367O84219N51331j96024p25605l94846L99185
$$ -234398 59012 82893 -33950 193417 877636 1428967 1232943 507338 112492 511677
37224E11677P76671M98195Q9841L7609L38496P35458R01572M82528m87260j254627
$$ 511677 1288348 1786543 1876384 1913993 2252489 2987947 3889519 4372047 3884787 2630160
37214B630160j056910j96879K50423j07349n55974m85164j84341n7537J01923
$$ 2630160 1573250 1376371 1626794 1519445 963471 478307 293966 236429 338352
37205C38352M60546N32165k3056n91467m29181J71460L80980J14736n5869L3178
$$ 338352 798898 1331063 1308007 716540 287359 458819 839799 954535 898666 931844
37195I31844P0910M8549J81620K04662k98888r23394p88669P9749O91379N49958
$$ 931844 1002754 1051303 1232923 1437585 1138697 215303 -573366 -493617 197762 747720
37185G47720J90603L8758k22052p17361q20176j76589N13962M83623K7815j04002
$$ 747720 938323 977081 755029 37668 -782508 -959097 -445135 38488 66303 -37699
37175c7699Q4202O4481j56883r2103K71134L89272P3623k12471j08093J58808
$$ -37699 46503 110984 -45899 -138002 133132 522404 596027 383556 275463 434271
37165D34271K36930J45763O6670j857j13422j55865m1016N0804j08483l99636
$$ 434271 671201 816964 883634 881777 768355 612490 571474 622278 513795 114159
37155A14159m43017j12048K49371K37130j05335l37205j55415K42958L86135P6286
$$ 114159 -328858 -440906 -191535 45595 -59740 -396945 -552360 -309402 76733 153019
37145A53019l44586l39980J74658O37176M74326j21904l76564K9047N09614M30454
$$ 153019 -191567 -531547 -356889 280287 754613 632709 256145 285192 794806 1225260
37135A225260j4181k35090j91359k63691m33909l50524j07076j28025k70199N7608
$$ 1225260 1211079 975989 784630 520939 87030 -263494 -370570 -498595 -768794 -711186
37125g11186P33220Q50353J34874n32942m81939j79657j89263j60532L12139O82126
$$ -711186 22034 872387 1007261 474319 -7620 -187277 -376540 -537072 -224933 457193
37115D57193L01400l82806n13069j66296J5425M1344L13203N57705K10298l82060
$$ 457193 758593 375787 -137282 -303578 -288153 -246809 66394 624099 834397 452337
37105D52337l45080K36690L90265j59862n89352l12419K66516N54417M84342K42194
$$ 452337 107257 343947 734212 574350 -15002 -327421 -60905 493512 977854 1220048
37095A220048m693j6299K35769K64467k59966p57039n11519P5271O7650m05852
$$ 1220048 1215355 1199056 1434825 1699292 1439326 682287 170768 246039 313689 -92163
37085i2163l95163J30537K11588l05306m01651K84080P25462K52042l07911o4350
$$ -92163 -487326 -356789 -145201 -450507 -852158 -568078 157384 409426 101515 37165
37075C7165M99531M85260M3038j27336l2393j51053m26075l84357J1600L29372
$$ 37165 536696 1021956 1064994 937658 905265 754212 328137 -56220 -44620 284752
37065B84752L13597J11249K5378K73464P22682Q29100K92427l06511k05179L09754
$$ 284752 598349 709598 734976 1008440 1731122 2560222 2852649 2546138 2340959 2650713
37055B650713L07347j87271j83685N24503R44992O21640L76197O85439P58415
$$ 2650713 2958060 2770789 2587104 3111607 4056599 4678239 5054436 5739875 6498290
37046F498290J32977k13583M50699J064799L67990r33882j196658l76274Q5802
$$ 6498290 6631267 6417684 6868383 7933182 8301172 7367290 6170632 5794358 5880160
37037E880160m25493j031108r29928l29695K43391M96971K21691m77292q65407
$$ 5880160 5454667 4423559 3493631 3163936 3407327 3904298 4125989 3648697 2783290
37028B783290l88791L41390L00811l94236p20692m11813k27219m92468n53635
$$ 2783290 2394499 2735889 3036700 2642464 1921772 1509959 1282740 790272 236637
37019B36637k4703M56502K46539l05519m49892r7596K28975J78106j10931k94950
$$ 236637 211934 668436 914975 609456 159564 61968 290943 469049 358118 63168
37009F3168j77529J34933L35925K57201N6576m1589l7219j6201O1374K02276K37849
$$ 63168 -114361 20572 356497 613698 670274 628685 591466 575265 636639 838915 1076764
36998A076764R0142o0908j00465j57824k40574j09126K00431K39365q4396j81664
$$ 1076764 1166906 1105998 1005533 847709 607135 498009 698440 937805 853409 671745
36988F71745K44930N13442k4600q09852q08415p7294L60622O5997l21087j84440
$$ 671745 916675 1430117 1405517 595665 -212750 -290044 70578 136575 -184512 -368952
36978c68952K73859N25382M05015J17086o1031m086R1275j06794m86335m61695
$$ -368952 -95093 430289 835304 952390 891359 887273 978548 871754 385419 -76276
36968g6276J15306N05902J15988n08094m56123J80211N68539M55418L05253L17725
$$ -76276 39030 544932 660920 152826 -303297 -123086 445453 900871 1206124 1523849
36958A523849K55650J62171L07173M36809J9080p13053r14470m51312j16939k99581
$$ 1523849 1779499 1941670 2248843 2685652 2704732 1991679 1077209 625897 508958 209377
36948B09377l91781Q4849O36842O10214J62793j28477j22819p2947j08231j79610
$$ 209377 -182404 -97555 539287 1149501 1312294 1183817 1060998 988051 879820 700210
36938G00210k33518j65902R6417L12061J39820k01095r045Q75852J629112J414394
$$ 700210 466692 300790 397207 709268 849088 647993 638948 1514800 3143912 4558306
36928D558306M02446n69055r95183r47690o42573k71299j05902k93943n62319
$$ 4558306 4960752 4391697 3396514 2448824 1806251 1534952 1429050 1135107 572788
36919E72788m88113q2046K08091J24969o4347j431K36431K86803O0546j54312
$$ 572788 84675 2629 210720 335689 271342 269911 506342 793145 853691 699379
36909F99379j65000j24876j59741p6466K41443M34122J33336l41980l27877J88536
$$ 699379 534379 409503 249762 173296 414739 848861 982197 640217 312340 500876
36899E00876N26957L36951L0046J3533J20810Q4986P150K5949K4980l5996R782
$$ 500876 1027833 1364784 1394830 1408363 1529173 1614159 1621309 1647258 1672238 1636242 1646024
36888A646024J13975L0192p5051K32668O80459L96153o05438j101533m72734K48139
$$ 1646024 1759999 1790191 1715140 1947808 2628267 3024420 2418982 1317449 844715 1092854
36878A092854L2114m91975k09267N53758O64260R9469k34063j48357j47666o4420
$$ 1092854 1124968 632993 423726 977484 1641744 1741213 1507150 1358793 1211127 1146707
36868A146707O88592J574875J261883k71620j419441j156681k83583L3091k08135
$$ 1146707 1835299 3410174 4672057 4400437 2980996 1824315 1540732 1573823 1365688
36859A365688l90376l70509l14013j44869K05938M83672M75607K97146R4989q6995
$$ 1365688 975312 604803 290790 145921 351859 835531 1311138 1608284 1703273 1616278
36849A616278o6777K88562N93235L09578l68066o91677m62203k01416j80003j12280
$$ 1616278 1549501 1838063 2431298 2740876 2372810 1681133 1218930 1017514 837511 725231
36839G25231P0220J7202k76561l48975j17708k0964j38615o5480J57073j3848
$$ 725231 795451 812653 536092 187117 69409 48445 -90170 -155650 1423 -12425
36829a2425m73057l57962M60081Q76091J99893o92804o66271N9634N04201M70585
$$ -12425 -485482 -843444 -383363 492728 692621 -183 -666454 -606820 -102619 367966
36819C67966N16662P89574Q26117L93745j65263m20840k67589Q1944K70675J12092
$$ 367966 884628 1674202 2500319 2894064 2728801 2307961 2040372 2122316 2392991 2505083
36809B505083j61680k18751j58018k71054l69349n2859L66285J25924o36000q29010
$$ 2505083 2343403 2124652 1966634 1695580 1326231 1273372 1639657 1765581 1129581 300571
36799C00571q4636N86308L85751r1302n4208J31336j76988n33873j59538N51502
$$ 300571 215935 802243 1187994 1096692 1042484 1173820 996832 462959 303421 854923
36789H54923N86974J5661j86062J66023K67865j16590k19277K78773N52990j1653
$$ 854923 1441897 1457558 1271496 1437519 1705384 1588794 1369517 1648290 2201280 2189627
36779B189627p40811p09673j55821Q985l34027m41209J3191M27742K24760l23162
$$ 2189627 1448816 739143 583322 592307 258280 -182929 -169738 258004 482764 159602
36769A59602n54726k95652R8231L08418K92805J28014k5862O6782L76893M30668
$$ 159602 -395124 -690776 -592545 -284127 8678 136692 110830 177612 554505 985173
36759I85173o6417n77313l52053L45393M58783k39533o91968j76678N60881N39214
$$ 985173 918756 341443 -10610 334783 793566 554033 -137935 -314613 246268 785482
36749G85482M9024o2616P8180k32131p90581p18039k2768L44993N7417j61061
$$ 785482 834506 771890 850070 617939 -172642 -890681 -913449 -568456 -511039 -672100
36739f72100J42493M89064M21535J63293K2054k8631M6644L46347N12719Q5046
$$ -672100 -529607 -40543 380992 544285 566339 537708 584352 930699 1443418 1528464
36729A528464n63264o20263j91995j08600l36214q870P24745N57114o66041j213141
$$ 1528464 965200 344937 152942 44342 -291872 -300742 424003 981117 315076 -898065
36719h98065p9913J243587R88367k49634o96723j79127R2570j75564j60773K60174
$$ -898065 -977978 265609 1253976 1004342 307619 128492 221062 45498 -115275 144899
36709A44899K80201k19318l99461l702K52994J03711J76166O13648N63754l22927
$$ 144899 425100 205782 -193679 -197381 55613 159324 335490 949138 1512892 1189965
36699A189965j037942o83799J18953K28557k92920m70792l0465L34339K27350
$$ 1189965 152023 -531776 -412823 -184266 -477186 -947978 -978443 -644104 -416754
36690d16754J10077L70295O18298L72120q9470j47739J57121J90469k35074n18275
$$ -416754 -306677 63618 681916 1054036 964566 816827 973948 1164417 929343 411068
36680D11068j99603L11264L68618M9768r0131J7950p6975m30329m60446J27429
$$ 411068 211465 522729 891347 941115 850984 868934 791959 361630 -98816 28613
36670B8613P43734O55926k0839n09932l84022P202J15415j09269k54348n7040
$$ 28613 772347 1428273 1407434 897502 513480 520682 636097 526828 272480 215440
36660B15440K45539K89762J26046P2705J00866j48673o13521o55764k5408N63549
$$ 215440 460979 750741 876787 949492 1050358 901685 288164 -367600 -393008 170541
36650A70541L74468k65641m78138j08425K29926J81310j0385r1279o0328J05046
$$ 170541 545009 279368 -198770 -307195 -77269 104041 93656 2377 -57951 47095
36640D7095L95728N24686K74386o6861j43562j24971k55341k19037K52944N66266
$$ 47095 442823 967509 1241895 1175034 1031472 906501 651160 432123 685067 1251333
36630A251333N6279p29702o90512Q2187M48703M8526l18780k24577j76249l76326
$$ 1251333 1307612 577910 -112602 -30415 418288 466814 148034 -76543 -252792 -629118
36620f29118k35639L99775P17886K26154m22092m59520j1207M17026O48544O12240
$$ -629118 -864757 -464982 252904 479058 56966 -402554 -413761 3265 651809 1264049
36610A264049K00322k81823k98245J7483j1159l79693l09816L42188O74905J65092
$$ 1264049 1464371 1182548 884303 901786 890627 510934 201118 543306 1218211 1383303
36600A383303n33366o95289m63282k12670P7457L48037K58880j01120j64286J28892
$$ 1383303 849937 154648 -308634 -521304 -443847 -95810 163070 61950 -102336 26556
36590B6556J98913r2805k52714k04667l55420m75024R9300R29990P47417l64285
$$ 26556 225469 132664 -120050 -324717 -680137 -1155161 -1055861 -125871 621546 257261
36580B57261p79249Q7741Q24074M45807q6922J49921L90261j37336n62092J2102
$$ 257261 -521988 -434247 389827 835634 748712 898633 1288894 1151558 589466 601568
36570F01568P05599L63837l92798l46085J71877P3133m26870l15525K95739M20172
$$ 601568 1307167 1671004 1278206 932121 1103998 1177131 750261 434736 730475 1150647
36560A150647p7827m48763l75760j23128J85681M10940J26625n40983o19024J76648
$$ 1150647 1072820 624057 248297 125169 310850 721790 848415 307432 -311592 -134944
36550a34944O31480p3174p97310k38338P88534O18561n25326r38627j13874P64404
$$ -134944 496536 423362 -373948 -612286 176248 794809 269483 -669144 -783018 -18614
36540a8614Q00200L11031j41886l48815j58551L48694N72482J41221m08487m54791
$$ -18614 781586 1092617 950731 601916 443365 792059 1364541 1505762 1097275 642484
36530F42484k09484p4902J16521M12615K65571l46394m38657L15122P07208j0279
$$ 642484 433000 358098 474619 887234 1152805 806411 367754 682876 1390084 1379805
36520A379805o45186m4373Q50402O51260r4887j07224K53418q4059o43940l06810
$$ 1379805 734619 690246 1540648 2191908 2097021 1989797 2243215 2159156 1515216 1208406
36510A208406M00992K02708m71961k48118N79795N78406j18943n3815Q45065J162250
$$ 1208406 1609398 1812106 1340145 1092027 1671822 2250228 2131285 2077470 2922535 4084785
36500D084785N59966J89387M72292O04220M21760P53855J675109K215826K012467
$$ 4084785 4644751 4834138 5306430 5910650 6332410 7086265 8761374 10977200 12989667
36491A2989667J629248J212636M26097l67280m86203l38359q20640j579504j572021
$$ 12989667 14618915 15831551 16257648 15890368 15404165 15065806 14245166 12665662 11093641
36482A1093641j027541j025843j451393j298864p28776p94476j311425j055848
$$ 11093641 10066100 9040257 7588864 6290000 5561224 4766748 3455323 2399475
36474B399475j7941N29449J84866k34300l91273o25869o52538L7016P16262L04803
$$ 2399475 2381534 2910983 3095849 2861549 2470276 1844407 1191869 1228885 1945147 2249950
36464B249950o07508o13944M8992N7401m32138j62007O06918M00229o68203r49407
$$ 2249950 1642442 1028498 1077490 1134891 702753 540746 1147664 1547893 879690 -69717
36454f9717j41679L64814J12718J04277N69539N88548R5875j2769J73782k21400
$$ -69717 -211396 153418 266136 370413 939952 1528500 1624375 1611606 1785388 1563988
36444A563988q29312n31940K34952J48705l64727J41068J132998Q04137m75565
$$ 1563988 734676 202736 437688 586393 221666 362734 1495732 2299869 1824304
36435A824304o11088M05733M97368n83720q27884J97790O05633j58144l97541
$$ 1824304 1213216 1618949 2116317 1532597 704713 902503 1508136 1349992 952451
36426I52451L67001M57490n56474q78122Q4715N62376k26093p03579k4610M72811
$$ 952451 1319452 1776942 1220468 342346 427061 989437 763344 59765 35155 507966
36416E07966p308l97258j28525o0513l11652O2111P28021L24001o78120m77294
$$ 507966 500658 103400 -25125 -85638 -397290 -335179 392842 716843 38723 -438571
36406d38571N99012N61083l57141p7813J105119Q72701n27082n50724O61921M47306
$$ -438571 160441 721524 364383 286570 1391689 2264390 1737308 1186584 1848505 2295811
36396B295811j009382p13945J275229J602690q6120m62141J005240J084365o15288
$$ 2295811 1286429 572484 1847713 3450403 3364283 2902142 3907382 4991747 4376459
36387D376459o67272J166958R50517j666751k083241O68387J701782o83901j789786
$$ 4376459 3709187 4876145 5826662 4159911 2076670 2745057 4446839 3762938 1973152
36378A973152M66067J629462m72402j514367N58291J325268r98095j451489J695010
$$ 1973152 2439219 4068681 3596279 2081912 2640203 3965471 2967376 1515887 3210897
36369C210897K652769o89413j838383J848183L338740l13009j230595L767593
$$ 3210897 5863666 5174253 3335870 5184053 8522793 8209784 6979189 10746782
36361A0746782N372959O4160k87985R074375J2574766L364809N395183L6612984
$$ 10746782 16119741 16183901 15895916 24970291 37545057 40909866 46305049 82918033
36353H2918033O5511786M3829812k0672948o5109824n2837183j5958603j222685
$$ 82918033 148429819 192259631 171586683 106476859 53639676 37681073 36458388
36346C6458388r015739j1308196k265590J602402l540059n137746r47J913227
$$ 36458388 27442649 16134453 13868863 15471265 11931206 6793460 6792513 8705740
36338H705740j945121l229251K04972J277140j597683k040351J109312J748060
$$ 8705740 6760619 3531368 3736340 5013480 3415797 1375446 2484758 4232818
36330D232818j245692k048915O23495J430637r11793j484670Q52140J330444j207336
$$ 4232818 2987126 938211 1561706 2992343 2080550 595880 1448020 2778464 1571128
36321A571128k046833K77886J395839l76985j205999M61531J103904o09724j161959
$$ 1571128 -475705 -197819 1198020 821035 -384964 76567 1180471 570747 -591212
36312e91212P99068J732602m605j154578R3827Q94397m73128j372546j06050Q87225
$$ -591212 207856 1940458 1935853 781275 875102 1769499 1296371 -76175 -182225 705000
36302G05000j10397r28207J00644J072223M10478l22098J02489K28059p33864
$$ 705000 594603 -333604 -232960 839263 1249741 927643 1030132 1258191 524327
36293E24327r80050L22001J143122K74068n46571m3697M32567q1681l14083L78948
$$ 524327 -455723 -133722 1009400 1283468 736897 693200 1125767 1044086 730003 1108951
36283A108951N39414l88684p79941m3875J36060p71557q60913N08102J137619
$$ 1108951 1648365 1259681 479740 435865 571925 -199632 -1060545 -552443 585176
36274E85176j33121j291900p40075J72771R1943J9694P55436R82394j6381n75498
$$ 585176 452055 -839845 -1579920 -1407149 -1315206 -1295512 -540076 442318 425937 -149561
36264a49561L28210R92417M6237j026212n94832L36571K51746k53590j26874p716
$$ -149561 178649 1171066 1217303 191091 -403741 -67170 184576 -69014 -195888 -203604
36254b03604o05549r08014m8015Q76302P25467K52256L74566M11055k18059m70782
$$ -203604 -809153 -1717167 -1765182 -888880 -163413 88843 463409 874464 656405 185623
36244A85623L21126Q41518M2440q40243m43276L29086O3680o46191m86145K11321
$$ 185623 506749 1348267 1390707 550464 107188 436274 499954 -146237 -632382 -421061
36234d21061L64226J48430K64811L65844p1815m11170K2063N50557L14072k57732
$$ -421061 -56835 91595 356406 722250 650435 239265 261328 811885 1125957 868225
36224H68225m17173l60162l43315J18401R87116J093169M0383p81308l64588L10819
$$ 868225 451052 90890 -252425 -134024 853092 1946261 1986644 1205336 840748 1151567
36214A151567J77458r0035L57586Q08971M71814J15530N17047P74948k7787r12561
$$ 1151567 1329025 1238990 1596576 2405547 2877361 2992891 3509938 4284886 4257099 3344538
36204C344538o35900Q7362q0623p29978o22503L8965J79030j55452j49347J62933
$$ 3344538 2708638 2796000 2715377 1985399 1362896 1401861 1580891 1425439 1276092 1439025
36194A439025K05908N6302j8312l22764q21694o14624M21681Q44277r9924r71759
$$ 1439025 1644933 1701235 1682923 1360159 538465 -76159 345522 1189799 1089875 118116
36184A18116m98309K45145q6596n82187Q4254R10062L38247n92139J24686J657609
$$ 118116 -380193 -135048 -221644 -803831 -719577 190485 528732 -63407 61279 1718888
36174A718888J412512n33358j375297j05313J045677L78061q38214q14515Q8565
$$ 1718888 3131400 2598042 1222745 1117432 2163109 2541170 1702956 888441 977006
36165I77006M62265L0501m89798o48673m71911j39700K8338j26893j99270K02381
$$ 977006 1439271 1469772 979974 331301 -140610 -280310 -251972 -378865 -578135 -375754
36155c75754O34273M60159K3377Q6433M01193J21737n59302o01882P2828L83686
$$ -375754 258519 718678 742055 828488 1229681 1351418 792116 190234 263062 646748
36145F46748j34363o69979n38075q4768J46507J69665J56495R1585N5504J83324
$$ 646748 512385 -157594 -695669 -780437 -633930 -464265 -307770 -216185 -160681 22643
36135B2643K67535J9498l45887l97993j68685O2151L14073N86051M82635p5031
$$ 22643 290178 309676 -36211 -434204 -602889 -540738 -226665 359386 842021 766990
36125G66990l57415O0445L68088k27463j008036p74471K26384P85290O30499L92258
$$ 766990 409575 470020 838108 610645 -397391 -1171862 -945478 -160188 470311 862569
36115H62569J32259n09200j027419n73017L95435N94100k5954l03407P9765K29797
$$ 862569 994828 485628 -541791 -1114808 -719373 -125273 -151227 -454634 -374869 -145072
36105a45072j68995l47768R729K73079K07052L20312N64530J87523p20126j011508
$$ -145072 -314067 -661835 -652106 -379027 -171975 148337 712867 900390 180264 -831244
36095h31244l13403L27472J76881j46555J8747K85564J43284j08031m4107J60470
$$ -831244 -1144647 -817175 -640294 -786849 -768102 -482538 -339254 -447285 -491392 -330922
36085c30922K44789K70646J52949l21163p42859l88175M58573O42620o0993n23526
$$ -330922 -86133 184513 337462 16299 -726560 -1114735 -656162 -13542 -74535 -598061
36075e98061r7201M05779K00962k18790j10765K83627L61535J61803O522j03673
$$ -598061 -695262 -289483 -88521 -307311 -418076 -134449 227086 388889 395411 291738
36065B91738j33571J67188N68432L47299m97801r40599m13040L35980M79316K42204
$$ 291738 158167 325355 893787 1241086 743285 -197314 -610354 -274374 204942 447146
36055D47146J13844q0291n06700o42326j59341L09252J73087j08116P7299L41425
$$ 447146 560990 480699 -26001 -668327 -827668 -518416 -345329 -453445 -376146 -34721
36045c4721M8791m34803l32855J85439L22554N432j09816J86576M12501K80322
$$ -34721 14070 -420733 -753588 -568149 -245595 -240163 -349979 -163403 249098 529420
36035E29420M3819o6035j30601k26507k77412k31490q3886J85878M81208N83927
$$ 529420 573239 507204 376603 150096 -127316 -358806 -442692 -256814 224394 808321
36025H08321M47701K26966p3038n53942r51181p87600j76081J82306M4041m3500
$$ 808321 1256022 1482988 1409950 856008 -95173 -882773 -1058854 -876548 -832507 -876007
36015h76007K43627M50810K34047q96R8665J54909j79973m98638l63294r6286
$$ -876007 -632380 -181570 52477 51581 150246 305155 125182 -373456 -736750 -833036
36005h33036j34048k26431k4268J61527j1008j30253K59384P21348O19355K28845
$$ -833036 -967084 -1193515 -1217783 -1056256 -1067264 -1197517 -938133 -216785 402570 631415
35995F31415J72473K22587k27319q48088p40619J6460L79590k2223l66059l357
$$ 631415 803888 1026475 799156 -48932 -789551 -773091 -393501 -415724 -781783 -785140
35985g85140O03302O96607K50039k19007l36713o1856M05176O83012N09873R2773
$$ -785140 -181838 514769 764808 545801 209088 147232 552408 1235420 1745293 1838066
35975A838066j50186j78178k63906l84917j93255L11423N62711J27981o52708
$$ 1838066 1687880 1509702 1245796 860879 667624 979047 1541758 1669739 1017031
35966A017031r62487l73450O53533J163418P23770n709n3499N21600O55326j44295
$$ 1017031 54544 -318906 334627 1498045 2221815 2216106 2162607 2684207 3339533 3195238
35956C195238r79204q67912k00505o1410n54348p82029l26420K12492K34568r9625
$$ 3195238 2216034 1348122 1147617 1086207 531859 -250170 -576590 -364098 -129530 -229155
35946b29155l10162k03164J10170L35527J24227m58080p06750j06819P49524Q07108
$$ -229155 -539317 -742481 -632311 -296784 -172557 -630637 -1337387 -1444206 -694682 112426
35936A12426N7664m32191r2599M35928M25910M1502k35591l84846m94795l00320
$$ 112426 170090 -262101 -354700 81228 507138 548640 313049 -71797 -566592 -866912
35926h66912K61708N69087J36562m63016l16072M03597O01402j03986p69805m87677
$$ -866912 -605204 -36117 100445 -362571 -678643 -275046 326356 222370 -547435 -1035112
35916a035112L39774O60075K91172N4947M44124Q58708M94488m62338j036623
$$ -1035112 -695338 -35263 255909 310856 754980 1613688 2108176 1645838 609215
35907F09215p12360N767L26931O2982l80892n80916m15446j4698L63910N03514
$$ 609215 -103145 -97378 229553 292535 -88357 -669273 -1084719 -1099417 -735507 -231993
35897b31993M21649L04801J91231p4310m63574o13755k83309K34280M09806R1727
$$ -231993 189656 494457 685688 611378 147804 -465951 -749260 -514980 -105174 -13447
35887a3447l65986n00906j49553M14960O75879L82130r5029j77895J25167K48595
$$ -13447 -379433 -880339 -1029892 -614932 60947 443077 348048 170153 295320 543915
35877E43915k4489k35830q9358n560l56631o89460l80662L12044N99016L33265
$$ 543915 519426 283596 194238 188678 -167953 -857413 -1238075 -926031 -327015 6250
35867F250P0802O1173k9249l21051m01514m5079L35201K68320j45034m34598k95779
$$ 6250 77052 138225 108976 -212075 -613589 -658668 -323467 -55147 -200181 -634779 -930558
35856i30558K19065P52073Q13427K41577m54085n80312j36747K15625J20727n6793
$$ -930558 -711493 40580 854007 1095584 641499 61187 -75560 140065 260792 203999
35846B03999M1631J80723L5779j66504j5482L33177L14303j80910n65248l28077
$$ 203999 245630 426353 462132 295628 280146 613323 927626 746716 181468 -146609
35836a46609K59619M70204N4317m20734k94041L02653N76337R6767o55451r40508
$$ -146609 113010 583214 637531 216797 -77244 225409 801746 898513 243062 -697446
35826f97446o39948j88216J02238K39292K56006J81368K22680N12967P15944L82748
$$ -697446 -1337394 -1525610 -1423372 -1184080 -928074 -746706 -524026 -11059 704885 1087633
35816A087633k73626n11146j15930K19948j15766p45164q14821j59874N04778
$$ 1087633 814007 302861 186931 406879 291113 -454051 -1268872 -1428746 -923968
35807i23968N06173k5258m03292k16860K25994L18889m5793l15105m1004M53390
$$ -923968 -417795 -443053 -846345 -1063205 -837211 -518322 -564115 -879220 -920224 -466834
35797d66834N22026J38762j07296N1777J95820l1128l26709k40376J12103K67890
$$ -466834 55192 193954 86658 138435 334255 303127 -23582 -263958 -151855 116035
35787A16035J06544r3243j40065q8693J1460J76001L09209K64554Q8861m3327
$$ 116035 222579 129336 -10729 -99422 -87962 88039 397248 661802 750663 707336
35777G07336j23898k64581l55845j16409L91808O29925K36319m03814n92570k22839
$$ 707336 583438 318857 -36988 -153397 238411 868336 1104655 700841 108271 -114568
35767a14568J53572J82542J58776L81258N10392P4363o35075q15282k95247K10988
$$ -114568 39004 221546 380322 761580 1271972 1346335 711260 -104022 -399269 -188281
35757a88281J57487j40583j77799l9104l9434p9658M7823J05493j61757l56705
$$ -188281 -30794 -171377 -349176 -388280 -427714 -507372 -459549 -354056 -515813 -872518
35747h72518K8511N90826M38394l51983o56944L8707Q03467N94622k86607p47943
$$ -872518 -844007 -253181 185213 -166770 -823714 -785007 18460 613082 326475 -421468
35737d21468m18391J17892L21590K31730Q2102k4484j8052J31270K68426K38133
$$ -421468 -839859 -721967 -400377 -168647 -86545 -111029 -129081 2189 270615 508748
35727E08748J71301K48304K66843j00638o16971n77751J91762Q79916O04369m46792
$$ 508748 680049 928353 1195196 1094558 477587 -100164 91598 971514 1575883 1129091
35717A129091j177177q36897J87131Q78797O67860j07926o76671o12251j45629
$$ 1129091 -48086 -884983 -697852 180945 848805 740879 64208 -548043 -693672
35708f93672J89323J24156j42683k40109k8053L08393M92159M11931J66730p4250
$$ -693672 -504349 -380193 -522876 -762985 -791038 -482645 9514 421445 588175 513925
35698E13925k16658k61668k25769r6927R0904J87107M8663k26878l23428q0744
$$ 513925 297267 35599 -190170 -287097 -196193 -9086 39577 -187301 -510729 -591473
35688e91473K51487L03052O0895j51715j32856K3946K06775L98678M44750J10541
$$ -591473 -339986 -36934 23961 -127754 -260610 -236664 -29889 368789 813539 924080
35678I24080m35468o18397k42806J32814J8786k34566n9555L20497K64903j51406
$$ 924080 488612 -129785 -372591 -239777 -220991 -455557 -515112 -194615 70288 -81118
35668h1118k71067m1456q3809m58165m03850L19481Q37389N01878o4143k7973
$$ -81118 -352185 -393641 -477450 -935615 -1339465 -1019984 -182595 319283 255140 227167
35658B27167L08681J49397l88184n37374k21956q6214k97341l07005J03879M17288
$$ 227167 535848 685245 297061 -240313 -462269 -548483 -845824 -1152829 -1048950 -631662
35648f31662K58617k0483K9554K67523K67572o377j69594M1862L98205M11761
$$ -631662 -373045 -393528 -363974 -96451 171121 164744 -4850 37012 435217 846978
35638H46978k4747l66227p4352N25712N80116j9861m05436p6219L18226J01332
$$ 846978 822231 456004 381652 907364 1487480 1467619 1062183 985964 1304190 1405522
35628A405522l15075k34103J09475J09550l2516J85650L72219j52833q71250o20429
$$ 1405522 1090447 856344 965819 1075369 1042853 1228503 1600722 1447889 576639 -43790
35618d3790M34066Q61722J85496m21452q1415N15042M30736j05220l77928l13759
$$ -43790 390276 1251998 1437494 1016042 934627 1449669 1880405 1775185 1397257 1083498
35608A083498j58535J38560M82537L42998l59844p98285m00817K20472K65531
$$ 1083498 924963 1063523 1546060 1889058 1529214 730929 330112 550584 816115
35599H16115k0044L6269K99963J79915k37113l77963k10648j52072j58804J66081
$$ 816115 796071 832340 1132303 1312218 1075105 697142 486494 334422 175618 341699
35589C41699O41154N82293r9166o51984n45473j45482n2555k48431k65354M9987
$$ 341699 982853 1565146 1465980 813996 268523 123041 70486 -177945 -443299 -393312
35579c93312L10090J43612k47531l16372M5164K90653L5022k90457j10482K96661
$$ -393312 -83222 60390 -187141 -503513 -458349 -167696 -132674 -423131 -533613 -236952
35569b36952K44300j14961J3537N88888O07970k06284p61900k74409M84810M60711
$$ -236952 7348 -107613 -94076 494812 1102782 896498 134598 -139811 344999 805710
35559H05710r5316l02112j37662j39233k10012J01040N20403L96046j23633l27893
$$ 805710 710394 408282 270620 131387 -78625 22415 542818 938864 815231 487338
35549D87338j72063k13749m50112k94452K85479O24699M45367J58756k728k33869
$$ 487338 315275 101526 -348586 -643038 -357559 267140 712507 871263 868535 634666
35539F34666m19179j07030N34485O55345j1367o35525m88531M9504J98566p1964
$$ 634666 215487 108457 642942 1298287 1286920 651395 162864 212368 410934 338970
35529C38970j80149J30058N10374N33290J54841l03999m87731l48749j40695j3344
$$ 338970 158821 288879 799253 1332543 1487384 1183385 695654 346905 206210 192866
35519A92866J80177M86447N81285K62030r8730o2788K06888L29987M25681P56415
$$ 192866 373043 859490 1440775 1702805 1604075 1541287 1748175 2078162 2503843 3260258
35509C260258R57942M80148l68456p35359n26445m34600o43290n57412l0885K16302
$$ 3260258 4218200 4698348 4329892 3594533 3068088 2633488 1990198 1432786 1401901 1618203
35499A618203j73832n33468k86784J31070J07768j51198j68611r7204l09008n67750
$$ 1618203 1444371 910903 624119 755189 862957 711759 543148 445944 136936 -430814
35489d30814l81167J39982M60347M24562K92553J82363K8048p3589L1205K22593
$$ -430814 -811981 -671999 -211652 212910 505463 687826 715874 642285 673490 896083
35479H96083K69315J66793R205k24085m47361l70406J1262K02719p5558l48807
$$ 896083 1165398 1332191 1341396 1117311 669950 299544 310806 513525 437967 89160
35469H9160r0650M04476M71923J00538j70491j54846j12382j00842K7231Q3432
$$ 89160 -1490 402986 874909 975447 804956 650110 537728 436886 464117 547549
35459E47549k16433n12338j63542N73306O75617o7998n89197j66112M07151Q3903
$$ 547549 331116 -181222 -344764 228542 904159 836161 246964 80852 488003 571906
35449E71906p34963q14610L0O16798L87537j08975k00862q2892j76563k96798
$$ 571906 -163057 -977667 -977637 -360839 26698 -82277 -283139 -366031 -542594 -839392
35439h39392r1276K12026J77611l9303O6576M87158P14189N50282K99737J29040
$$ -839392 -930668 -718642 -541031 -580334 -513758 -26600 687589 1237871 1537608 1666648
35429A666648j59886n77780p29282m04459N7516K75119K99940K88706J00398l65541
$$ 1666648 1506762 928982 199700 -204759 -147243 127876 427816 716522 816920 451379
35419D51379p30302n27484R7064N20841M43811J67847O5691J31865J65741J20812
$$ 451379 -278923 -806407 -709343 -188502 255309 423156 488847 620712 786453 907265
35409I07265R6784J21831R5003p2203l16208m45106l25261l4156K23177L23131
$$ 907265 1004049 1125880 1220883 1148680 832472 387366 62105 27949 251126 574257
35399E74257K69204R5663j20754k19434j42453r9768k65710l79426n6733M92467
$$ 574257 843461 939124 818370 598936 456483 356715 91005 -288421 -345154 147313
35389A47313N77545K0808m96966l90775L3591J71195N3669J16855L43534L02218
$$ 147313 724858 745666 248700 -142075 -108484 62711 116380 233235 576769 878987
35379H78987o3843l13496k21791q1765j45432k05287K0501L75037M24356L6869
$$ 878987 815144 501648 279857 198092 52660 -152627 -132126 242911 667267 704136
35369G04136m24577n34974k98590n7188N0584K42230N54613N44808k9767n57413
$$ 704136 279559 -255415 -554005 -611193 -560609 -318379 236234 781042 751275 193862
35359A93862l01883L63293L34676n25934j065351n56481K55931M29765K02437
$$ 193862 -108021 255272 589948 64014 -1001337 -1557818 -1301887 -872122 -669685
35350f69685K40284L21940j37416p87045p39689n991N64211O34487O15817O04456
$$ -669685 -429401 -107461 -244877 -1031922 -1771611 -1777602 -1213391 -578904 36913 641369
35340F41369J97333m76347n92152J23168Q27925P02478m637n17289n85949n16708
$$ 641369 838702 362355 -229797 -106629 721296 1423774 1419137 901848 315899 -200809
35330b00809m96851l64950L5642N43598P61943M64956n8870k52344J2177K63385
$$ -200809 -697660 -1062610 -1026968 -483370 278573 743529 684659 432315 444492 707877
35320G07877J35412j56355l19609m60988o28025m33336K49092P36956M41571j45632
$$ 707877 843289 686934 367325 -93663 -721688 -1155024 -905932 -168976 272595 126963
35310A26963k06727J02723P2776k24680j38920K50318K28184j96658k23325L42671
$$ 126963 -79764 22959 95735 -128945 -267865 -17547 210637 13979 -209346 133325
35300A33325P47594N45669J56185n4043k40652m03094k32220J02610j0052n29292
$$ 133325 880919 1426588 1582773 1528730 1288078 884984 652764 755374 745322 216030
35290B16030o73240j91737K66746L26696L59339M68139J48624n81560q50135l01883
$$ 216030 -457210 -648947 -382201 -55505 303834 771973 920597 339037 -511098 -812981
35280h12981K61827K14205J0032J14337J26158k42020l66272J93690P42229N46884
$$ -812981 -551154 -336949 -326917 -212580 -86422 -328442 -694714 -501024 241205 788089
35270G88089L3635q2743k4170k63196m11202M0938N36857K46528m56308n49024
$$ 788089 821724 738981 714811 451615 40413 81351 618208 864736 408428 -140596
35260a40596l3785J74781j66521l41104N4181N70651P07134M30814j00103o20031
$$ -140596 -174381 400 -166121 -507225 -453044 117607 824741 1255555 1155452 535421
35250E35421o63085j00047L85690J02867n43733n60577J64614P59538O81925K77088
$$ 535421 -127664 -227711 157979 260846 -282887 -843464 -678850 80688 762613 1039701
35240A039701j7840j95186k64607p4530K41209K65224n1221k77268k01460j13091
$$ 1039701 1021861 826675 562068 487538 728747 993971 942750 665482 464022 350931
35230C50931k12287k51658j3575K67628K44883m2524k48237j59667R4843K32631
$$ 350931 138644 -113014 -126589 141039 385922 343398 95161 -64506 30337 262968
35220B62968J49682K7457L8792N1479j28178l13546j62764J78912K18782l8395
$$ 262968 412650 440107 478899 530378 402200 88654 -74110 104802 323584 285189
35210B85189o5183J96760J32482m00945o14924p1816M38982J28288m56521l32124
$$ 285189 220006 416766 549248 148303 -466621 -538437 -99455 28833 -427688 -759812
35200g59812K93864M46722L3337j47485J33279K59278j3303j61058J00589L66948
$$ -759812 -465948 -19226 14111 -133374 -95 259183 245880 84822 185411 552359
35190E52359L37941K35602J91762j5856l67901m63120k39659j57441l74102m01033
$$ 552359 890300 1125902 1317664 1301808 933907 470787 231128 73687 -300415 -701448
35180g01448O0964N39613M74729J9665k66669j74534J01017L73424N44784M54045
$$ -701448 -640484 -100871 373858 393523 126854 -47680 53337 426761 971545 1425590
35170A425590J3002n38049p65454m97712m2726J38595j3724o3211K95826O70248
$$ 1425590 1438592 900543 135089 -362623 -405349 -266754 -280478 -343689 -47863 622385
35160F22385M41933k17283m17228J43780O18813K42386m92850n91906l2958L40133
$$ 622385 1064318 847035 429807 573587 1192400 1434786 941936 350030 317072 657205
35150F57205J29862k66879n04988o38482o05846j76667M44851O72353L88344J23588
$$ 657205 787067 520188 15200 -623282 -1229128 -1405795 -960944 -288591 99753 223341
35140B23341J98855K95263J12971j31760j82987k00368l58120m06300o2578M29382
$$ 223341 422196 717459 830430 698670 515683 315315 -42805 -449105 -511683 -82301
35130h2301N51382K01135j97929k48705n762J91049J70895J09721K24666L80719
$$ -82301 469081 670216 472287 223582 217820 408869 579764 689485 914151 1294870
35120A294870J96610m07503r87353j044735n44554J68470P39361R08241N27295
$$ 1294870 1491480 1083977 96624 -948111 -1492665 -1324195 -584834 323407 850702
35111H50702k05097o97488m93196K01149P35969P00093K26666k49979l74374j31180
$$ 850702 645605 -51883 -545079 -343930 392039 1092132 1318798 1068819 694445 563265
35101E63265J42148J28659n1456l5772J66549J49483k04274m72365l35116k2482
$$ 563265 705413 834072 782616 746844 913393 1062876 858602 386237 51121 28639
35091B8639J44715K26510L64321M07661J81030j93073m97660o27779m48421R7033
$$ 28639 173354 399864 764185 1171846 1352876 1159803 662143 34364 -414057 -317024
35081c17024N87298M19105k62200n67489j02520M74372M91309J39467j16131k46565
$$ -317024 270274 689379 427179 -140310 -242830 231542 722851 862318 746187 499622
35071D99622k74816M1316N57796N58156j33928o51185l88957M2321k6610j47385
$$ 499622 224806 266122 823918 1382074 1248146 596961 208004 250325 223715 76330
35061G6330K45485N53106k697q09763o70301K72439P69774L54709k68575n20540
$$ 76330 321815 874921 872224 62461 -607840 -335401 434373 789082 520507 -33
35051c3m46211r4869M62589O59634P1658o57469n98431J0739K34842N5724J98906
$$ -33 -446244 -541113 -78524 581110 652768 -4701 -603132 -592393 -357551 -301827 -102921
35040a02921N56299K48928o93101j131135n35643L29708O93103O22558L71753
$$ -102921 453378 702306 9205 -1121930 -1657573 -1327865 -634762 -12204 359549
35031C59549l9829l65410k40386Q5863N0218k01130j03595J41295j08582n40997
$$ 359549 319720 -45690 -286076 -200213 -149995 -351125 -454720 -313425 -422007 -963004
35021i63004k49108N07207N01033k88999m20504N98835J346512P43618k69547
$$ -963004 -1212112 -704905 -203872 -492871 -913375 -314540 1031972 1775590 1506043
35012A506043l50230K65606N50509L87928K86127J93402k36909p36876p74172
$$ 1506043 1155813 1421419 1971928 2359856 2645983 2839385 2602476 1865600 1091428
35003A091428m32398j80144j29886j18828j19318j04496K6618O9710l00491p03027
$$ 1091428 659030 478886 349000 230172 110854 6358 32976 102686 -197805 -900832
34993i00832k94543P65431J146945K81023o28467m10247K84027J53469o13211
$$ -900832 -1195375 -429944 717001 998024 369557 -40690 243337 396806 -216405
34984b16405p50218L052O32219N32728J89506N9523j00936m65380o02330j95629
$$ -216405 -966623 -963571 -331352 201376 390882 450405 349469 -115911 -718241 -913870
34974i13870L19355L37317q6487m28724m61962l78456k64644N6506N30026O60917
$$ -913870 -594515 -257198 -343685 -772409 -1234371 -1612827 -1877471 -1820965 -1290939 -630022
34964f30022J90145l11189j08366N34068O01149j18551n88348q7833O27529M89443
$$ -630022 -439877 -751066 -859432 -325364 275785 157234 -431114 -518947 108582 598025
34954E98025k71760o39858l99477j33913j7633K34787M34892J21242l82434k74481
$$ 598025 326265 -313593 -713070 -846983 -864616 -629829 -194937 -73695 -456129 -730610
34944g30610L47810N70421J86749m5574J73797K27491j62467l97147j38108J09175
$$ -730610 -382800 187621 374370 328796 502593 730084 567617 170470 32362 141537
34934A41537K6008O8845M92400P33901L65456j63792l10052k21897k20536j89208
$$ 141537 167545 236390 728790 1462691 1828147 1664355 1354303 1132406 911870 722662
34924G22662J3887J62535J23785J20450J86951q77m33774n81425k32821J33771
$$ 722662 736549 899084 1022869 1143319 1330270 1329393 895619 314194 81373 215144
34914B15144J47489P3678K37539N15767O59092N75860J77465m65508q22728m71473
$$ 215144 362633 436311 673850 1189617 1848709 2424569 2602034 2136526 1313798 842325
34904H42325J11884J55228j66844j07521K11469O603n69942n14890J75750L16203
$$ 842325 954209 1109437 942593 835072 1046541 1053144 483202 -31688 144062 460265
34894D60265m05113p71791r8843N95536L51488j96538p9168M12933N00359K89151
$$ 460265 55152 -716639 -815482 -219946 131542 -64996 -144164 268769 769128 1058279
34884A058279K80705L17111K2759l76446n22998n54893n65364k10731M61728O72270
$$ 1058279 1338984 1656095 1678854 1302408 779410 224517 -340847 -551578 -89850 582420
34874E82420J42729k50547J12030M84824L8131o61595o06555m8140J2878m47309
$$ 582420 725149 474602 586632 1071456 1109587 447992 -158563 -206703 -193825 -641134
34864f41134n06328J49920P92498P75385K66070k23623m35593l96365k21404J4080
$$ -641134 -1147462 -997542 -205044 570341 836411 612788 177195 -219170 -440574 -426494
34854d26494K79254M12605J26473m83652p12567j22095O30999O36927J27853K0890
$$ -426494 -147240 265365 391838 -91814 -804381 -926476 -295477 341450 469303 490193
34844D90193L03535J44033m54150n53652j668K49871j06308j77274M05498P02468
$$ 490193 793728 937761 483611 -70041 -71709 178162 71854 -105420 300078 1002546
34834A002546J26955n07046m44078k17081m83713p68775l69651L94402P51858
$$ 1002546 1129501 622455 178377 -38704 -522417 -1291192 -1660843 -1266441 -514583
34825e14583N55883R3667m25786o43560j48213P04906R45660L68734j83352k28791
$$ -514583 41300 134967 -290819 -934379 -1082592 -377686 567974 936708 753356 524565
34815E24565k28832m29307l60323P4166K55278N0979J03030M94919M62757j38405
$$ 524565 295733 -133574 -493897 -419731 -164453 -113474 -10444 484475 947232 808827
34805H08827m68606k28517j03221k78562p2103N21353N61280r1028m44716k25614
$$ 808827 340221 111704 8483 -270079 -342182 179171 740451 649423 204707 -20907
34795b0907k39529n16626j42421O31169M18456n86860n03634Q26266J142843l28977
$$ -20907 -260436 -777062 -919483 -288314 130142 -456718 -960352 -134086 1008757 679780
34785F79780j243139p2133J219946N83147p07457n47261M10072L75332k91798
$$ 679780 -563359 -635492 584454 1167601 460144 -87117 322955 698287 406489
34776D06489j90065L05446M0995m11169J41982J005033O84850m20875p42849j58412
$$ 406489 216424 521870 562865 151696 293678 1298711 1983561 1562686 819837 661425
34766F61425K16091J00247J1373q4392l87263l82256J69339M08246j04987l98799
$$ 661425 877516 977763 989136 904744 517481 135225 304564 712810 607823 209024
34756B09024M1072R5453p79547j096889J03372J250818Q49138L9921K94253O39037
$$ 209024 250096 345549 -433998 -1530887 -1427515 -176697 672441 712362 1006615 1645652
34746A645652k23144j047762k12993J041619O33263o53973o55942L19412L85134
$$ 1645652 1422508 374746 161753 1203372 1836635 1182662 526720 846132 1231266
34737A231266l06523j56900N32239J17297j047919j023108K63982R23543L29575
$$ 1231266 924743 767843 1300082 1417379 369460 -653648 -389666 533877 863452
34728H63452k26222l5245K47631K49585K60806J69396k65162n44345l03694j77758
$$ 863452 637230 601985 849616 1099201 1360007 1529403 1264241 719896 416202 238444
34718B38444m38488j47668Q62402J001488l12045j054229P6654J087324N0045
$$ 238444 -200044 -347712 514690 1516178 1204133 149904 226558 1313882 1363927
34709A363927j359538p56831P57271P15266l70438l75057M19550L08590l07316
$$ 1363927 4389 -752442 4829 720095 349657 -25400 394150 702740 395424
34700C95424N0524P29408K19004o92359l72068M52901J96620m56622j54166K04139
$$ 395424 445948 1175356 1394360 702001 329933 782834 979454 522832 368666 572805
34690E72805n40619r57052L24430J388782K43351j187094l61932J122212N29868
$$ 572805 32186 -924866 -600436 788346 1031697 -155397 -517329 604883 1134751
34681A134751q35818k81039R61132K20825j184467m32412J157742N74139r81451
$$ 1134751 298933 17894 979026 1199851 15384 -417028 740714 1314853 333402
34672C33402m42836J032001L72133j146093k87669J561115Q26086j212214p06131
$$ 333402 -109434 922567 1294700 148607 -139062 1422053 2248139 1035925 329794
34663C29794J294563Q35019j228331r23420J030968P34328j098628o54637J168783
$$ 329794 1624357 2459376 1231045 307625 1338593 2072921 974293 319656 1488439
34654A488439M92391j553710q54861J324910O39217j494599m62784K102924J177455
$$ 1488439 1980830 427120 -427741 897169 1536386 41787 -420997 1681927 2859382
34645B859382j471391m17459K318899P03959k952698j538867K914900K349861
$$ 2859382 1387991 970532 3289431 3993390 1040692 -498175 2416725 4766586
34637D766586j911603j487433K653716J957684k419772j286013L963097L056478
$$ 4766586 2854983 1367550 4021266 5978950 3559178 2273165 6236262 9292740
34629I292740k604411j497055N149702M631402j603987Q29892R799458Q006923
$$ 9292740 6688329 5191274 10340976 14972378 13368391 14198283 23997741 32004664
34621C2004664j471045M022156K1769671K1988452Q392466K9776475R5043776
$$ 32004664 30533619 34555775 56325446 78313898 86706364 116482839 211526615
34614B11526615J25805657N2437781p3883826j33424466r0141080k3384316n832979
$$ 211526615 337332272 389770053 315886227 182461761 92320681 68936365 63103386
34607F3103386k0095043j8373806j735541J254333p982508p626018J499646K017132
$$ 63103386 43008343 24634537 22898996 24153329 16170821 8544803 10044449 12061581
34599A2061581n165743n092537J785746K550346k701983k845736K015036K063808
$$ 12061581 6895838 1803301 3589047 6139393 3437410 591674 2606710 4670518
34591D670518k428541k399896J955292K160969j888757k422172R44457J310287
$$ 4670518 2241977 -157919 1797373 3958342 2069585 -352587 591870 1902157
34583A902157j627963j582838J562624J788078j119146j513709R19165J022375
$$ 1902157 274194 -1308644 253980 2042058 922912 -590797 328368 1350743
34575A350743j393082j441057R84149J139573j138644j281520J016385J464159
$$ 1350743 -42339 -1483396 -499247 640326 -498318 -1779838 -763453 700706
34567G00706m07986q18877N77614M86010r62453n40457J204401P93922j124012
$$ 700706 292720 -526157 51457 537467 -424986 -965443 238958 1032880 -91132
34558i1132q32623J113545Q85954j079959r12013J035678Q12934j322087j249328
$$ -91132 -923755 189790 1075744 -4215 -916228 119450 932384 -389703 -1639031
34549a639031J055805J409509o09648j003605Q62685J142543r47292j557099N17969
$$ -1639031 -583226 826283 216635 -786970 75715 1218258 270966 -1286133 -768164
34540g68164J690823L07366p26885K08650P94583k11843o93366K80857O13291
$$ -768164 922659 1230025 503140 711790 1506373 1294530 601164 882021 1495312
34531A495312m36057p29809L59288N92637o80934j148079K8926P06187r851k58330
$$ 1495312 1059255 329446 688734 1281371 600437 -547642 -518716 187471 177620 -80710
34521h0710N89951O38334n55219q27859M16100Q98686k87024j028380k07230M18845
$$ -80710 509241 1147575 592356 -235503 180597 1079283 792259 -236121 -443351 -24506
34511b4506j88223n02740L14872P60960N3059l84025J51035L34688l38408m88814
$$ -24506 -212729 -715469 -400597 360363 413422 29397 180432 515120 176712 -312102
34501c12102K60942M11374l72372m70818M32246N09437p08210j212239j05201
$$ -312102 -51160 360214 -12158 -482976 -50730 458707 -249503 -1461742 -1566943
34492a566943Q34750M45164k3726K94128K83221n79738r21745j32433L90542m3105
$$ -1566943 -732193 -287029 -310755 -16627 266594 -313144 -1234889 -1367322 -976780 -1019885
34482a019885j35839P10690J114147L86815j51421K13761L03985l83300n04760
$$ -1019885 -1155724 -445034 669113 1055928 904507 1118268 1422253 1038953 534193
34473E34193M11555P66116j74257p83325l7995O11682l3674q06634n04205J888
$$ 534193 945748 1711864 1537607 754282 716287 1327969 1294295 487661 -16544 -14656
34463a4656k39298l59894L99912R17635K06989o42650l70317L07134K06030k44688
$$ -14656 -253954 -613848 -213936 703699 910688 268038 -102279 204855 410885 166197
34453A66197j43593J21850j00365k79982J61879N18680O1896n31833l79781J02025
$$ 166197 22604 144454 44089 -235893 -74014 444666 506562 -25271 -405052 -303027
34443c03027J57955M8818K40712L23215q5794l79495k1389M06539K45923j08763
$$ -303027 -145072 -96254 144458 467673 381879 2384 -19005 387534 633457 524694
34433E24694j05117r7468n15579q42675m29119L65579P20462M87707J10362q0139
$$ 524694 419577 322109 -193470 -1036145 -1465264 -1099685 -379223 108484 218846 138707
34423A38707L416K82913M28911J79092j86502k26347m1197M5394J54295M31742
$$ 138707 142123 425036 853947 1033039 846537 620190 578993 624387 778682 1210424
34413A210424N41006N05398J181135K576571K772461M26795k533688l059261j261991
$$ 1210424 1751430 2256828 3437963 6014534 8786995 9213790 6680102 3620841 2358850
34404B358850j9614n71876j257494p90605k9657J21156R3087J78903j23214n97931
$$ 2358850 2339236 1767360 509866 -280739 -310396 -189240 -96153 82750 -40464 -638395
34394f38395k31914P47212Q39457j59894p05891j70927K70569K8021K7601N33984
$$ -638395 -870309 -123097 716360 556466 -149425 -320352 -49783 -21762 5839 539823
34384E39823M27365m73925p47184J2991L01400m96647q52074R3450Q73715L43043
$$ 539823 967188 493263 -253921 -240930 60470 -436177 -1288251 -1194801 -321086 21957
34374B1957l14439J25485P41571L38914l86338l36390K7428p9472j59844K93506
$$ 21957 -292482 -166997 574574 913488 527150 190760 218188 138716 -21128 272378
34364B72378M66347k18111p04575p3130P40558N66799o6090j73189q5552m16456
$$ 272378 738725 520614 -183961 -257091 483467 1050266 984176 810987 725435 308979
34354C08979o21361j61519K09673j45553l86053K36493Q14345L85427k66982q1459
$$ 308979 -312382 -473901 -264228 -409781 -795834 -559341 255004 640431 373449 291990
34344B91990L50131N8384l87906p3110L64185o6024o85689k97484N84493O25735
$$ 291990 642121 700505 312599 239489 603674 537650 -148039 -445523 138970 764705
34334G64705n972j63544J13587r2478o24834n11638J55319L62516k7619k11690
$$ 764705 758733 595189 708776 616298 -8536 -520174 -364855 -2339 -29958 -241648
34324b41648J3641J10025K4374J97180M82733K97596k63411n31731l40492q5607
$$ -241648 -228007 -117982 -93608 103572 586305 883901 620490 88759 -251733 -337340
34314c37340M6307J12183K4357j62850n1913L82258N20381J49612n2300K58821
$$ -337340 -291033 -178850 -154493 -317343 -369256 13002 533383 682995 630695 889516
34304H89516M03855j2918k69473O7448J64758n03613r01970j37971P98693N86476
$$ 889516 1293371 1280453 1010980 1078428 1243186 739573 -162397 -300368 498325 1084801
34294A084801k23182k72619K58401K09973l69027m48017M7094K70801P7932k354
$$ 1084801 861619 589000 847401 1057374 688347 240330 287424 558225 636157 633803
34284F33803n4431m76890p71362k22976N46217L41546n39442o77287J56154P20468
$$ 633803 579372 102482 -668880 -891856 -345639 -4093 -543535 -1220822 -1064668 -344200
34274c44200L85264j04824j41287p8613k36071l14807j50185k4068J0620K11153
$$ -344200 41064 -63760 -205047 -283660 -519731 -834538 -984723 -1008791 -998171 -787018
34264g87018M39093K66084j52987j95080J91899M10984K15106k3935q4047j73059
$$ -787018 -347925 -81841 -234828 -429908 -238009 172975 388081 364146 280099 107040
34254A07040l74822m51946k55587J13416M58842N00993P9749l67159j32666N82316
$$ 107040 -267782 -719728 -975315 -861899 -403057 97936 177685 -189474 -322140 260176
34244B60176O63195j91545p61204j51083P30479O62984N7791L4860M33955L22731
$$ 260176 923371 731826 -29378 -180461 550018 1213002 1270793 1305653 1739608 2062339
34234B062339j66110j70026J70939j1291n64262m83377K68381O74299M05151J60156
$$ 2062339 1896229 1726203 1897142 1885851 1321589 838212 1106593 1780892 2186043 2346199
34224B346199J99446j1794n21129o22432j36299K59154K16499J14183J01272j10340
$$ 2346199 2545645 2533851 2012722 1390290 1253991 1513145 1729644 1843827 1945099 1834759
34214A834759l41999j5657O56534P19167k057n44234l04822J80585L13683K29206
$$ 1834759 1492760 1477103 2133637 2852804 2850747 2306513 2001691 2182276 2495959 2725165
34204B725165J04681k88373q31384q12872l9320O25583M60768p8798j79068R3084
$$ 2725165 2829846 2541473 1710089 897217 857897 1483480 1944248 1865450 1686382 1779466
34194A779466R7969k44993l98818j45379Q2998p7729l40124k06189K19734K92357
$$ 1779466 1877435 1632442 1233624 1088245 1171243 1093514 753390 547201 766935 1059292
34184A059292j96617n60285j66176N25476N74848p151l55809k22131k30974n10837
$$ 1059292 862675 302390 136214 661690 1236538 1229387 873578 651447 420473 -90364
34174i0364l45896L53321N70525r4566n41910K8959P11494M66097j17037l8897
$$ -90364 -436260 -82939 487586 393020 -148890 -119931 591563 1057660 940623 901726
34164I01726K43789j79210p49523l67943M50444L09548o05818p88872M7803O44346
$$ 901726 1145515 966305 216782 -151161 299283 608831 3013 -785859 -738056 -93710
34154i3710M34148K15683L71482K36368l46223n05428P2533M97755J79266l09435
$$ -93710 340438 556121 927603 1163971 817748 312320 384853 882608 1061874 752439
34144G52439l71870j99368m338L81075P34959M47254l12199n88051j62915J15773
$$ 752439 380569 181201 176863 557938 1292897 1740151 1427952 839901 676986 792759
34134G92759j20538j99857J67522K77853j55021l24877J90760N51527J01687m71112
$$ 792759 672221 472364 639886 917739 762718 437841 628601 1180128 1281815 810703
34124H10703l48049J02097J69427Q760L3408j045l15178l51574K55378P31628
$$ 810703 462654 564751 734178 742938 776346 775301 460123 108549 363927 1095555
34114A095555K93465m56062m33168J87735L81220J3658j18985J73090J79166l61834
$$ 1095555 1389020 932958 499790 687525 1068745 1082403 963418 1136508 1315674 953840
34104I53840p37364m06582K00271M20339K42848M7459o3785k37362m19481l19272
$$ 953840 216476 -190106 10165 430504 673352 720811 657026 419664 183 -319089
34094c19089J78869P43543Q52940L82152j62488k21241O2363N5748l41470m51086
$$ -319089 -140220 603323 1456263 1838415 1675927 1454686 1517049 1572797 1231327 780241
34084G80241J10706O89010M84401k31288n09246r2544M01848N92770P51715R67758
$$ 780241 890947 1579957 2064358 1833070 1323824 1231280 1633128 2225898 2977613 3945371
34074C945371Q17947L09445L01219J273274K368139K573242K303339K687906L776760
$$ 3945371 4763318 5072763 5373982 6647256 9015395 11588637 13891976 16579882 20356642
34065B0356642N011551P229028J1857685J7212291J7926816J0405238k165617
$$ 20356642 25368193 32597221 44454906 61667197 79594013 89999251 87833634
34058H7833634j2473409j6303897j5134493j2191782q875944n633126l474808
$$ 87833634 75360225 59056328 43921835 31730053 22854109 17220983 13746175
34051A3746175k825765k519711j550878o33740p19987j217471j100372o50361
$$ 13746175 10920410 8400699 6849821 6216081 5496094 4278623 3178251 2527890
34043B527890n99179n75534J6821N14221P1587n83454k51104N55954M07045n51881
$$ 2527890 1928711 1353177 1369998 1884219 1955806 1372352 1121248 1677202 2084247 1532366
34033A532366q48867j72727L33050J93954J11684K57127n7229p26343o93735J24405
$$ 1532366 683499 510772 843822 1037776 1149460 1406587 1349358 623015 -70720 53685
34023E3685M81150q5219m37624J53414P53698M06893l25909m67246j55018o7911
$$ 53685 534835 449616 11992 165406 919104 1325997 1000088 532842 377824 309913
34013C09913k00612j60477j3579k4661q7664l5443j0636p0953K2620K70778L08668
$$ 309913 109301 -51176 -64755 -89416 -177080 -212523 -223159 -294112 -271492 -714 307954
34002C07954J03406Q5755L26777L54404M6996j36924q4054k33921n46547l28587
$$ 307954 411360 497115 823892 1178296 1225292 1088368 1004314 770393 223846 -104741
33992a04741M41997P29445M2146o34342l40906L61157L87475j39281k61706J91407
$$ -104741 337256 1066701 1108847 474505 133599 494756 882231 742950 481244 672651
33982F72651M49006Q3200m60166o27512l96026p9421P4397L8980j5247O7102J84903
$$ 672651 1121657 1204857 744691 117179 -278847 -358268 -283871 -244891 -260138 -193036 -8133
33971h133J33616j8378k7756P7468O1870m1855p353Q0889l6998k00121j4548L77761
$$ -8133 125483 107105 79349 156817 218687 176832 169479 250368 213370 13249 -1299 376462
33959C76462M24155P2466j82028j79443k29308l34570j51604K02589K14092o5069
$$ 376462 800617 873083 691055 511612 282304 -52266 -203870 -1281 212811 147742
33949A47742p9612J12083j38633p64658q75071k46554K74926K40568K22984M97833
$$ 147742 68130 180213 41580 -723078 -1598149 -1844703 -1569777 -1329209 -1106225 -608392
33939f08392M13982k52755n96760o9557M99846K89474j91957j36438K24700L32771
$$ -608392 -194410 -447165 -1043925 -1113482 -613636 -324162 -516119 -652557 -427857 -95086
33929i5086L87121O44613N56210k40057r03464n76682J71585L20170O9037K05623
$$ -95086 292035 936648 1492858 1252801 349337 -227345 -55760 264410 333447 539070
33919E39070M83988J40181m65627l19684L75321L93137m50655r43416m20492K96882
$$ 539070 1023058 1163239 697612 377928 753249 1146386 695731 -247685 -668177 -371295
33909c71295L21500r6090k97684k15507q5124J26248M66132O57432M39857n9188
$$ -371295 -49795 -145885 -443569 -659076 -744200 -617952 -151820 505612 945469 886281
33899H86281n19263p07675m94265O1182N76953O37353K49331k33344n30051n04605
$$ 886281 367018 -340657 -834922 -773740 -196787 440566 689897 456553 -73498 -578103
33889e78103p2508N39445P03479J07986o23291o16271P7009N89005M40227K918
$$ -578103 -650611 -111166 592313 700299 77008 -539263 -462254 126751 566978 569896
33879E69896k34928k47296k12095k03224k67063l83137k92789J98442P15020O06570
$$ 569896 334968 87672 -124423 -327647 -594710 -977847 -1270636 -1072194 -357174 249396
33869B49396j25293o70312m09009L04475O45350L57547l3750N684L11818K65822
$$ 249396 124103 -546209 -955218 -650743 -5393 352154 318404 324088 635906 901728
33859I01728l12531q05982n78228J03669L95358P5836j87016O1115L50987J04236
$$ 901728 589197 -216785 -795013 -691344 -295986 -220150 -407166 -346051 4936 109172
33849A09172l96770m52231j831L88727M03629K57402J86767J71754J48337R4241
$$ 109172 -287598 -739829 -741660 -352933 50696 308098 494865 666619 814956 909197
33839I09197p7151l70709n14294k42391K66571N38336L64509k5602l07850l63300
$$ 909197 832046 461337 -52957 -295348 -28777 509559 874068 848466 540616 177316
33829A77316k77342j98769j63434k4100K98508N26110L03156k01685l95417q8087
$$ 177316 -100026 -298795 -462229 -486329 -187821 338289 641445 439760 44343 -43744
33819d3744K39640J92177j1832m4482R36m9961n6806P1002O1881k04064l05997
$$ -43744 195896 388073 376241 331759 332695 282734 225928 296930 358811 154747 -151250
33808a51250O2571M47647K49728l19903n33264j99103J89586K51502J00592k4682
$$ -151250 -88679 358968 608696 288793 -244471 -443574 -253988 -2486 98106 73424
33798G3424l8455P3472K33968K21794m3705k73145j71906J13978K37405J62661
$$ 73424 34969 108441 342409 564203 520498 247353 75447 189425 426830 589491
33788E89491R0361L9880j12163k92762k94652j18950K5965J1702j14621k13031
$$ 589491 679852 719732 607569 314807 20155 -98795 -72830 -61128 -175749 -388780
33778c88780j05290K55632N69317M30808r2926m83672m89416l74744l04800n1090
$$ -388780 -494070 -238438 330879 761687 668761 185089 -304327 -679071 -983871 -1034961
33768a034961M08451O06525L17308J671N3670J66802j9122k19249q7809M9649
$$ -1034961 -626510 -19985 297323 298994 352664 519466 500344 281095 193286 242935
33758B42935k09414m98255k56494K35086K83604l5990o4023K46367K83854p4795
$$ 242935 33521 -464734 -721228 -486142 -202538 -238528 -302551 -56184 227670 152875
33748A52875k20929J17409M10386K21665j38968k16059q9332n8020q3406K6753
$$ 152875 -68054 49355 459741 681406 542438 326379 237047 179027 95621 122374
33738A22374J50837j1580m15345o04927k66642L10167N12853J74230j71789k4448
$$ 122374 273211 261631 -153714 -758641 -1025283 -715116 -202263 -28033 -199822 -224270
33728b24270L31250K52133k25098m05731l3322L46578L12705J18980Q111k38104
$$ -224270 106980 359113 134015 -271716 -305038 41540 354245 473225 481336 243232
33718B43232n99367m75742L01302Q57073M67889k77529l98188k3982M0436k04675
$$ 243232 -356135 -831877 -530575 326498 794387 516858 118670 94688 135124 -69551
33708f9551p6297M01759M14537k70858q65165p03909l9421N07647O26172L12334
$$ -69551 -145848 255911 670448 399590 -465575 -1169484 -1208905 -701258 -75086 237248
33698B37248k04964m47389j51699K33842Q1140m42494n78653j31003K95451K71279
$$ 237248 32284 -415105 -566804 -332962 -251822 -694316 -1272969 -1403972 -1108521 -837242
33688h37242O1248J9859R8444J48826J93440K24225J69959J43289K95088M27117
$$ -837242 -775994 -756135 -657691 -508865 -315425 -91200 78759 222048 517136 944253
33678I44253K17049k15521m77051n47232o70365o96086k38760N00520Q18754N27239
$$ 944253 1161302 945781 468730 -78502 -748867 -1444953 -1683713 -1183193 -364439 162800
33668A62800J73442J13019R1267n6888n2302J70522J70436k28698n18086l15160
$$ 162800 336242 449261 540528 483640 431338 601860 772296 543598 25512 -289648
33658b89648o32j9093r3074K15613N90692L80286k76118n37695j16430K96188
$$ -289648 -290280 -309373 -402447 -186834 403858 784144 508026 -29669 -146099 150089
33648A50089J13923k70032j88198J71210N8175n44386p41936r6350N88745M34931
$$ 150089 264012 -6020 -194218 -23008 35167 -509219 -1251155 -1347505 -758760 -323829
33638c23829j60393j89469L34371M73429K80k41403J59690M85938K05960j03218
$$ -323829 -484222 -673691 -339320 134109 134389 -107014 52676 538614 744574 641356
33628F41356J17781L45801k8607m70900j68951M94100N20670n3662k90561Q2967
$$ 641356 759137 1104938 1076331 605431 436480 930580 1451250 1397588 1107027 1189994
33618A189994L84456K01953j39506l75455o10456p42536m57669P3845K76730N6399
$$ 1189994 1574450 1776403 1636897 1261442 650986 -91550 -549219 -475374 -198644 -142245
33608a42245j07864p295P8450M1958Q7974J66349Q930k10917j6783M87169O43408
$$ -142245 -250109 -257404 -178954 -136996 -49022 117327 126257 -84660 -101443 385726 1029134
33597A029134K87932R765J72934M01576K82298o9974l95834o55515p78907n89243
$$ 1029134 1317066 1326831 1499765 1901341 2183639 2113665 1717831 1062316 283409 -305834
33587c05834j92210L1646k1976q2083k8617k9626q6952M4162L79371N99248M93590
$$ -305834 -498044 -466398 -488374 -570457 -599074 -628700 -715652 -671490 -292119 307129 800719
33576H00719J36721l34557p17168o60662q6229M57448L89884r3561l40985j79318
$$ 800719 937440 602883 -114285 -774947 -861176 -403728 -13844 -107405 -448390 -627708
33566f27708L9018J08290Q3886n3986k58719k14948J43825L12377L3411j09995
$$ -627708 -588690 -480400 -396514 -450500 -709219 -924167 -780342 -467965 -434554 -544549
33556e44549L12250O55325K42486l66929l17290L7779p9893l00851R5670N15011
$$ -544549 -232299 423026 665512 298583 -18707 19072 -60821 -361672 -266002 249009
33546B49009L9855n41422J22393J267911J015771k11361j80481J151688J472284
$$ 249009 288864 -252558 -130165 1137746 2153517 1942156 1761675 2913363 4385647
33537D385647O11309J422312M439811N414121J211834m693309o359799l240718
$$ 4385647 4996956 6419268 10859079 16273200 17485034 12791725 6431926 3191208
33529C191208p3885J39661q81884p86674J4233J43224k69748l98155k82941l28743
$$ 3191208 3117323 3256984 2375100 1588426 1602659 1745883 1476135 1077980 795039 466296
33519D66296l78465j84814N6051J82710K88146K13751k75797o95286k79721O31903
$$ 466296 87831 -96983 -40932 141778 429924 643675 367878 -327408 -607129 24774
33509B4774Q24227O5359m89103j51156K82731m289m98188l20578L05923M93719
$$ 24774 849001 914360 425257 274101 556832 552543 54355 -266223 39700 533419
33499E33419O1113l81117m23984k48307j39971j14061r410K77506N97243N64300
$$ 533419 594532 213415 -210569 -458876 -598847 -712908 -722318 -444812 152431 716731
33489G16731r51o69176p98235l40869J48864L20235L46247L79655K45888j21034
$$ 716731 715780 46604 -751631 -1092500 -943636 -623401 -277154 102501 348389 227355
33479B27355m21886m29792l01828k31029j39613P0440K83898L82357L95104K97355
$$ 227355 -194531 -624323 -926151 -1157180 -1296793 -1226353 -942455 -560098 -164994 132361
33469A32361j5089l99615m73099j53492J35613N7470j21452Q7880O72128J066167
$$ 132361 117272 -282343 -755442 -908934 -773321 -715851 -837303 -749423 -77295 988872
33459I88872P92249j9969p42218q23170l07446K24092L13815J41113J84658M65245
$$ 988872 1781121 1761152 1018934 195764 -111682 112410 426225 567338 751996 1217241
33449A217241M80337k9319o09111o48283j95673J13202r0138m35981l39355J98675
$$ 1217241 1697578 1668259 1059148 410865 215192 328394 238256 -197725 -537080 -338405
33439c38405N68600L24085k70738n92108l69612J37152N19075N33661J72826k82068
$$ -338405 230195 554280 283542 -308566 -678178 -541026 -21951 511710 684536 402468
33429D02468l67139N2526M48143K18686m17363o33082j61915L29717K70742L467
$$ 402468 35329 87855 535998 754684 337321 -295761 -457676 -127959 142783 146250
33419A46250J38432N38856N28359p4148o63190o28042q1355L17303J36002l39694
$$ 146250 284682 823538 1351897 1277749 614559 -13483 -94838 222465 358467 18773
33409A8773m66185q4401K55709J14040j49063K5651M10248L20071k18130m80884
$$ 18773 -447412 -531813 -276104 -162064 -311127 -285476 124772 444843 226713 -254171
33399b54171k45974m3200n6562J86566O79973O02977k56140q03659k44879N49118
$$ -254171 -500145 -543345 -599907 -413341 266632 869609 613469 -190190 -435069 114049
33389A14049L66279m14615n00377J97758N21874J0177m71460k39996K25904K50385
$$ 114049 480328 65713 -434664 -236906 284968 295145 -176315 -416311 -190407 59978
33379E9978L153J4158K45358K33032j25996m02713k27366J98357L11608p2297
$$ 59978 63131 77289 322647 555679 429683 26970 -200396 -2039 309569 237272
33369B37272m09423j12662N24045O24468L222n46492m70143j80573j47868q6904
$$ 237272 -172151 -284813 239232 863700 866922 320430 -149713 -330286 -478154 -565058
33359e65058L00570N51917K37131j45712J7924L54183J89495k29289k86591k23676
$$ -565058 -264488 287429 524560 378848 396772 750955 940450 711161 424570 200894
33349B00894n77379q60715k18879Q78780J113797L96745p9313P4773m9778p51061
$$ 200894 -376485 -1237200 -1456079 -577299 536498 933243 853930 928703 878925 127864
33339A27864r91190k39143M75741K45196k80300j54888K73564J83272j92497q0448
$$ 127864 -863326 -1102469 -626728 -381532 -661832 -816720 -543156 -359884 -552381 -632829
33329f32829L79269L77821j85874n94710m21248O1784M44897N07084J62771l40943
$$ -632829 -253560 124261 -61613 -656323 -1077571 -1015787 -570890 -63806 98965 -241978
33319b41978m14266J30893O14791L63869k47783l15294K50394O33164L27100k41951
$$ -241978 -656244 -525351 89440 453309 205526 -109768 140626 773790 1100890 858939
33309H58939m26279j61202J33063J25939j21301k88430j66223R9808K33413K37743
$$ 858939 432660 271458 404521 530460 409159 120729 -45494 54314 287727 525470
33299E25470K89298K62003j41587o84022o52727O0126N76904K34599m04696l89401
$$ 525470 814768 1076771 935184 251162 -401565 -341439 235465 470064 65368 -324033
33289c24033K29574N88213K97993k10000m71757m14939q7476L65596N02489K6689
$$ -324033 -94459 493754 791747 581747 109990 -304949 -392425 -26829 475660 502349
33279E02349n71379m83015K41091O57942K55838l27345k24709N21259J116383
$$ 502349 -69030 -552045 -310954 346988 602826 275481 50772 572031 1688414
33270A688414R84805K59220m77986p00425l49820R5496J01817l13583o45144n62107
$$ 1688414 2673219 2932439 2454453 1754028 1404208 1499704 1601521 1287938 642794 80687
33260H0687k21517J01108L30194M28653K78866p8099l65190m17050l55557k68309
$$ 80687 -140830 -39722 290472 719125 997991 919892 554702 137652 -217905 -486214
33250d86214j5857M21988O97897M92596l0008m28743m92552l19694p8652N5438
$$ -486214 -502071 -80083 617814 1110410 1080402 651659 159107 -160587 -239239 -183801
33240a83801q3535l97644m50577N801N58108N80937R8804k37491p2851K02603
$$ -183801 -267336 -664980 -1115557 -1109756 -551648 29289 128093 -109398 -182249 20354
33230B0354R1910l11428n35947l70049O504L50684N28340M61144J67480j68427
$$ 20354 112264 -199164 -735111 -1105160 -1098656 -747972 -219632 241512 408992 240565
33220B40565l50012l59318k72255r1825J59410K96983J68728o2880q5671J18890
$$ 240565 -109447 -468765 -741020 -832845 -673435 -376452 -207724 -270604 -356275 -237385
33210b37385K41875R0456j69328k88704k42679j47193m8996N0644Q6842J9309
$$ -237385 4490 94946 -74382 -363086 -605765 -752958 -801954 -751310 -664468 -645159
33200f45159k1232J52314M80356N96268K10689m51801p76854m52356J13537L11823
$$ -645159 -666391 -514077 -33721 562547 773236 321435 -455419 -907775 -794238 -482415
33190d82415J48930J34576L63700K95688k91147p31669m05061K41442L33778p1692
$$ -482415 -333485 -198909 164791 460479 169332 -562337 -967398 -725956 -392178 -463870
33180d63870j49553K72545M28127n8677m89193j98327M02908N04266Q6888k04550
$$ -463870 -613423 -340878 87249 28572 -460621 -658948 -256040 248226 335114 130564
33170A30564m9830K65464L62785J13379l64823p09044n30754N8893M27965K46201
$$ 130564 80734 346198 708983 822362 457539 -251505 -782259 -723366 -295401 -49200
33160d9200l4810P2822K74458j777n75998o84175j02688N22640N59422J25328
$$ -49200 -84010 -11188 263270 261493 -314505 -998680 -1101368 -578728 -19306 106022
33150A06022k02987j03766K03442K48627j33546n28476m01435J56689N09400L88269
$$ 106022 -96965 -200731 2711 251338 117792 -410684 -812119 -655430 -146030 242239
33140B42239K09144K58214K02851j66330l77710q9134J65061j74055o36897m55473
$$ 242239 451383 709597 912448 746118 368408 279274 444335 270280 -366617 -822090
33130h22090J01705J87460j53685j54014J98640J29862m09821m97195K01858Q26899
$$ -822090 -720385 -532925 -686610 -840624 -641984 -512122 -921943 -1419138 -1217280 -390381
33120c90381P19885L12564R2497k19764p73389q88821j28870P48118Q19651L19999
$$ -390381 329504 642068 734565 514801 -258588 -1147409 -1276279 -528161 291490 611489
33110F11489L1062k9810l15675o23746l49349L58281O88732L59854j16162l15374
$$ 611489 642551 612741 297066 -326680 -676029 -317748 370984 730838 614676 299302
33100B99302l02980j89686O874P9312j39401l17078m0738M00446L61517j09136
$$ 299302 -3678 -193364 -186490 -107178 -246579 -563657 -604395 -203949 157568 48432
33090D8432l51295j92643j02138j87092P633M74655N05743r4094m87305j02004
$$ 48432 -302863 -495506 -597644 -784736 -777103 -302448 203295 109201 -378104 -480108
33080d80108L94887J89038l43616l28991J07194R9845m55544p36550l29132K44008
$$ -480108 -85221 103817 -239799 -568790 -461596 -361751 -817295 -1553845 -1882977 -1638969
33070a638969M98929O21116Q15261P87831L18770k25625m05206k99060j93726
$$ -1638969 -1140040 -518924 296337 1084168 1402938 1177313 772107 473047 279321
33061B79321q5842R6727J43948j22030m53879n02337k96760o0825J65756L57135
$$ 279321 193479 290206 434154 312124 -141755 -644092 -940852 -1001677 -835921 -478786
33051d78786K83656r1602l20687r1619J68824p0749m79115k84642M61820Q74495
$$ -478786 -195130 -286732 -607419 -699038 -530214 -600963 -1080078 -1364720 -902900 -28405
33041b8405N41964M0943o7789O93j45668l61454l06228l8962J56861J98536J22762
$$ -28405 513559 554502 486713 487406 341738 -19716 -325944 -364906 -208045 -9509 113253
33030A13253q5834l01292k43777O9799K31300O2177p2454J31318M06042L54230
$$ 113253 27419 -273873 -517650 -447851 -216551 -154374 -226828 -95510 310532 664762
33020F64762L2837k48285l73284l53956j71286K4902n4899l35272l48053J4149
$$ 664762 697599 449314 76030 -277926 -449212 -424310 -479209 -814481 -1162534 -1148385
33010a148385K61555J52682J17664L76798L75645k26523p13507l31465M40210
$$ -1148385 -886830 -734148 -616484 -239686 135959 -90564 -804071 -1135536 -695326
33001f95326O40559L65906M08280O80402L15066o72259j131243n03891L21730
$$ -695326 -54767 311139 719419 1399821 1714887 1042628 -88615 -592506 -270776
32992b70776L85725m0933j47585J32842K37802l7899l05862j97587J91345M39989
$$ -270776 114949 74016 -73569 59273 297075 259176 -46686 -244273 -52928 387061
32982C87061K26429l15901o67339m97014o9255J54362J37960J46298J94294R0786
$$ 387061 613490 297589 -369750 -866764 -936019 -781657 -643697 -497399 -303105 -212319
32972b12319r7857j25223k2809j2047o8524l9468k2650j16446l5509M07422P15371
$$ -212319 -310176 -435399 -458208 -470255 -538779 -578247 -600897 -717343 -752852 -345430 369941
32961C69941L62526k21817k29296J64468P9406m88640n80548N5237M53737M1445
$$ 369941 732467 510650 281354 445822 525228 36588 -543960 -488723 -34986 6459
32951F459m02982n8436O39746P92100L75652M610q5149q6121p2080o261L3556
$$ 6459 -396523 -454959 184787 976887 1352539 1357149 1272000 1185879 1113799 1107538 1141094
32940A141094N5260J94176K83545n6965o27514o62601k5090M14906J09979l01728
$$ 1141094 1196354 1390530 1674075 1617110 989596 326995 301905 716811 826790 525062
32930E25062j38427J68642n6146m44886k25467L73431M70199j8497l34996j40774
$$ 525062 386635 555277 499131 54245 -171222 202209 672408 653911 318915 178141
32920A78141J50369K33656K15293P2574l43127p33320n78217k805L30663K61373
$$ 178141 328510 562166 777459 850033 506906 -226414 -804631 -807436 -476773 -215400
32910b15400K81852N23904M35716j90289o27574k10988N85452P02528q4186q66570
$$ -215400 66452 590356 1026072 835783 208209 -2779 582673 1285201 1201015 334445
32900C34445p64147K3194N35977K46404l69778n22052q9005L82328M97439L80792
$$ 334445 -429702 -406508 129469 375873 6095 -515957 -604962 -222634 274805 655597
32890F55597K22248j4147k58476k29344N4517J38467j45119l04329K2671L84206
$$ 655597 877845 863698 605222 375878 430395 568862 423743 119414 142085 526291
32880E26291J91080l18633m55283j52040L5512j24117k67240j08828J95392M16801
$$ 526291 717371 398738 -56545 -208585 -173073 -297190 -564430 -673258 -477866 -61065
32870f1065N02714M10249J17794j58162j37087J11036K55052J78291L9023p5057
$$ -61065 441649 851898 969692 811530 674443 785479 1040531 1218822 1257845 1182788
32860A182788k00617k78762k36992k08602l14831l47087o7907K96223L25438Q1014
$$ 1182788 982171 703409 466417 257815 -57016 -404103 -472010 -175787 149651 230665
32850B30665O852J92781K65752N6738j48048j42160j03493j82924k07692k3991
$$ 230665 237517 430298 696050 752788 604740 462580 359087 176163 -31529 -55520
32840e5520J91184J91631K626j77797k29291j38052M1681J60929R3176m4453K3040
$$ -55520 135664 327295 329921 152124 -77167 -215219 -173538 -12609 80567 36114 59154
32829E9154L32704N54156L79744p6453m01013l63308j64966j42765k69708j56968
$$ 59154 391858 946014 1325758 1249305 848292 484984 320018 177253 -92455 -249423
32819b49423L03499N62202J03678o23984o19262K18939P80989K87154n53939n86321
$$ -249423 54076 616278 719956 95972 -523290 -304351 476638 763792 209853 -376468
32809c76468J30227N46563K17721k45266k71541j2872K15729M16456N49818L26816
$$ -376468 -246241 300322 518043 272777 1236 -11636 204093 620549 1170367 1497183
32799A497183k67192p05811n65190j18603N3183j72646l85461k20009K06565M26654
$$ 1497183 1229991 524180 -41010 -159613 -106430 -279076 -664537 -884546 -677981 -251327
32789b51327J47138l36794l82830J87879P26100N33390j55157m40463J9630N87006
$$ -251327 -104189 -440983 -823813 -635934 90166 623556 468399 27936 47566 634572
32779F34572N60932K4680m62942o08164m98961k82838o2905O6656J51722L85914
$$ 634572 1195504 1220184 757242 149078 -349883 -632721 -695626 -628970 -477248 -91334
32769i1334P49819Q30485L15033m51122p63097m28689n039l7512l55078l84413
$$ -91334 658485 1488970 1804003 1352881 589784 161095 156056 118544 -236534 -620947
32759f20947J2716L81460L60860J57236J43569K87236K97614J52979P9247P1952
$$ -620947 -608231 -226771 134089 291325 434894 722130 1019744 1172723 1251970 1323922
32749A323922j21550m77268n74785k00088K55826K59543j99979o34867o32070
$$ 1323922 1202372 725104 150319 -49769 206057 465600 265621 -369246 -1001316
32740a001316k39521J60606K80659K33381L28596N27934L93384j80544n66598
$$ -1001316 -1240837 -1080231 -799572 -566191 -237595 290339 683723 503179 -63419
32731f3419k33303L68409M49275J38776J73919M69991J71387p13628j015147k50025
$$ -63419 -296722 71687 520962 659738 833657 1303648 1475035 761407 -253740 -503765
32721e03765M67486J65819m50463k58389M33737N53713R4090r5240P8994o1933
$$ -503765 -36279 129540 -320923 -579312 -145575 408138 502228 406988 485982 424049
32711D24049n37306n93027o7556L26159K46198J66329L47079L66312q339l58923
$$ 424049 -113257 -706284 -773840 -447681 -201483 -35154 311925 678237 669898 310975
32701C10975l68502k68879k43070j15488Q1352k5737l97375m28718O7712M22753
$$ 310975 -57527 -326406 -569476 -684964 -603612 -629349 -1026724 -1455442 -1387730 -964977
32691i64977J14340m08259m31193l801L04713L14375L29655N02390N87853L43148
$$ -964977 -850637 -1258896 -1690089 -1693890 -1389177 -1074802 -745147 -242757 345096 688244
32681F88244j10307l82280k15581J93233L53362O9127k87568k91511l5470J05119
$$ 688244 577937 195657 -19924 173309 526671 595798 308230 16719 -18751 86368
32671H6368L8405q5168k23556l12858p7013M89962P52386K15520n71030o67532
$$ 86368 124773 39605 -183951 -496809 -573822 -83860 668526 884046 313016 -354516
32661c54516j25484J43973j92409m98613k80405J89147N01125N67204L19972k47048
$$ -354516 -480000 -336027 -528436 -1027049 -1307454 -1118307 -617182 -49978 269994 22946
32651B2946o50232l78466J47442M7240m96401l54804O30975J150456M31213m98900
$$ 22946 -627286 -1005752 -858310 -811070 -1307471 -1662275 -1031300 119156 550369 51469
32641E1469m27172K37308L41325j54361l69878l3023L12512L38625K07380j916
$$ 51469 -375703 -138395 202930 48569 -321309 -354332 -41820 296805 504185 502269
32631E02269l14967m62057j78883K28905K53090m4773j95075m8398J98041M45046
$$ 502269 187302 -274755 -453638 -224733 28357 -16416 -211491 -259889 -61848 383198
32621C83198O11628M09537k01508o29812l67311J82176K58695j26077l27433j20109
$$ 383198 994826 1404363 1202855 573043 205732 387908 646603 520526 193093 72984
32611G2984J28995J90787J49594k5784l63795m73604j5984N18986L44524l60537
$$ 72984 201979 392766 542360 516576 152781 -320823 -336807 182179 526703 166166
32601A66166o33919k28605M8414k86002o57277m81070l9445K26966M73162Q28880
$$ 166166 -467753 -696358 -647944 -933946 -1591223 -2072293 -2111738 -1884772 -1411610 -582730
32591e82730P73296k1736p85488n51064L54418P04480J48142l86555j75981L37705
$$ -582730 190566 168830 -616658 -1167722 -813304 -108824 39318 -347237 -523218 -185513
32581a85513M25381J44119n683M3994M561j33293j22249K9381O9009l5897p1362
$$ -185513 239868 383987 378304 422298 426859 293566 171317 200698 269707 233810 162448
32570A62448J0722L6222m3786j04412j37359k38809l21497k09706m708N2031N4478
$$ 162448 173170 209392 165606 61194 -76165 -314974 -636471 -846177 -850885 -798854 -744376
32559g44376K79125N52530L77989j87190m48903j26450J92237K4622k50076j22479
$$ -744376 -465251 87279 465268 278078 -170825 -297275 -105038 -80416 -330492 -452971
32549d52971J82774K00604M1871L4889L7950j65869k49421R7335M26049K05427
$$ -452971 -270197 -69593 -27722 7167 45117 -120752 -370173 -272838 153211 358638
32539C58638j84435p9951K49400R3195l39767k84477R8221k3277n09417l75130
$$ 358638 174203 94252 343652 436847 97080 -187397 -89176 -112453 -621870 -997000
32529i97000L38312M44705k73501n31722K02830O25683j81388j001667l88563
$$ -997000 -658688 -213983 -487484 -1019206 -816376 -190693 -372081 -1373748 -1762311
32520a762311R18883J147368K09327m59733k92851r6307l00517l23495J20568
$$ -1762311 -843428 303940 513267 53534 -239317 -335624 -636141 -959636 -839068
32511h39068M33450K24399q2340j13066j21243l21060m14476j72234J37623K41372
$$ -839068 -405618 -181219 -263559 -376625 -497868 -818928 -1233404 -1405638 -1268015 -1026643
32501a026643K50822K93708K50197R6343M0405J06654M9543j20977k9900L88648
$$ -1026643 -775821 -482113 -231916 -135573 -95168 11486 61029 -59948 -89848 298800
32491B98800O00615K17762l61827m79477j12953J84763J02280j01454j03383Q183
$$ 298800 899415 1117177 755350 275873 162920 347683 449963 348509 245126 253309
32481B53309n0935k63085k97893j2556K85698K51123o164j18403m1016n3085j91992
$$ 253309 202374 -60711 -358604 -371160 -85462 165661 159497 41094 78 -53007 -244999
32470b44999j50808J36669K89416J11221k2602K26574N53364M50956l1003m28776
$$ -244999 -395807 -259138 30278 141499 118897 345471 898835 1349791 1318788 890012
32460H90012n39579n01920l93608k18235j45883k92158l68027m1914M17644L92676
$$ 890012 350433 -151487 -545095 -763330 -909213 -1201371 -1569398 -1611312 -1193668 -800992
32450h00992j57331n37777k38048M26725Q00387O53042K18087k30453n04405l94009
$$ -800992 -958323 -1496100 -1734148 -1307423 -507036 146006 364093 133640 -370765 -764774
32440g64774J54485P26021O70931j12432q48654o93145J82285P24337L26462m27833
$$ -764774 -610289 115732 786663 674231 -174423 -867568 -685283 39054 365516 -62317
32430f2317o39389k70504M3021J5328r6051j34706j85006j23755K58578O61116
$$ -62317 -701706 -972210 -929189 -913861 -1009912 -1144618 -1329624 -1453379 -1194801 -533685
32420e33685N23433k6667k26792J39324L91797P1599l61034l47252n2007R6819
$$ -533685 -10252 -36919 -263711 -124387 267410 339009 -22025 -369277 -421284 -324465
32410c24465Q2150N1978m4841j59648l3824K43607J82044k46185l95676j6579
$$ -324465 -242315 -190337 -235178 -394826 -428650 -185043 -2999 -249184 -644860 -661439
32400f61439K60325K3930j79900J35874M94673L48175N7375R9722R2862l75120
$$ -661439 -401114 -377184 -557084 -421210 73463 421638 479013 578735 671597 296477
32390B96477o90643j67802N59577L86741m61207p98553l61411J0888n3926k3153
$$ 296477 -394166 -561968 -2391 384350 -76857 -875410 -1236821 -1225933 -1279859 -1303012
32380a303012L52145N93763M07357O0499k39715m64312l14490L84883R50477N75991
$$ -1303012 -950867 -357104 50253 110752 -128963 -593275 -907765 -522882 427595 1003586
32370A003586k74396l96907K33158M04013k89820p58329k49449M36038K97529
$$ 1003586 729190 332283 565441 969454 679634 -78695 -328144 107894 405423
32361D05423l55594n89486k58807Q8545J77594J59258J41722R7462J4213j23553
$$ 405423 49829 -539657 -798464 -709919 -532325 -373067 -231345 -133883 -119670 -243223
32351b43223k50523j11368L22462M56258j96943r81199p30301M89834J303647
$$ -243223 -493746 -605114 -282652 173606 -23337 -1004536 -1734837 -1245003 58644
32342E8644R30332J10238k44771k47398l27165l38637r1348O7791p5787q7344
$$ 58644 988976 1099214 854443 607045 279880 -58757 -150105 -82314 -158101 -245445
32332b45445K83421M83815Q4584l88647l09271M2021J18459R0464L04752L80635
$$ -245445 37976 521791 606375 217728 -91543 -49522 68937 159401 464153 844788
32322H44788j45485p49585n59730K37934O68383M48987J81756J56617K61l83064
$$ 844788 699303 -50282 -610012 -372078 296305 745292 927048 1083665 1083926 700862
32312G00862m80852o1643L72016L52329P1369p3336o1861p8337j52100k38601
$$ 700862 220010 158367 530383 882712 954081 880745 818884 740547 588447 349846
32302C49846l33765l08570K9256N02577N62131J8673n33402m24210J50999L67252
$$ 349846 16081 -292489 -263233 239344 801475 820148 286746 -137464 13535 380787
32292C80787q0521n61297m28032R0180L11987J13590l7717O6945J41310P3044
$$ 380787 300266 -261031 -689063 -598883 -286896 -173306 -211023 -144078 -2768 70276
32282G0276J30110K71953R188o18165p11326J42075R20810N28294m74069o65579
$$ 70276 200386 472339 481527 -136638 -847964 -705889 214921 743215 269146 -396433
32272c96433O0436M63934K3961l80634j12140K49946J06700j47869k17K50797
$$ -396433 -335997 127937 151898 -228736 -340876 -90930 15770 -132099 -132316 118481
32262A18481J61643n1278p3028j34772m08667m42194Q0182O19229N47968R4934
$$ 118481 280124 228846 155818 21046 -387621 -829815 -749633 -130404 417564 512498
32252E12498j63433k08034k74365j89524K21990N40104L31167p7246j39254Q173
$$ 512498 349065 141031 -133334 -322858 -100868 439236 770403 693157 553903 562076
32242E62076n5039j58819Q3957L88306J91330k98432l52682R6143L82127J71408
$$ 562076 507037 348218 432175 820481 1011811 713379 360697 456840 838967 1010375
32232A010375j83649l41533k89113J8859N90382R42613M92123m64700q97491m15006
$$ 1010375 826726 485193 196080 214939 805321 1747934 2240057 1775357 877866 462860
32222D62860J73466L2420n27352n72486P7674N99093L20043l48300m86172L1476
$$ 462860 636326 668746 141394 -431092 -353418 245675 565718 217418 -268754 -237278
32212b37278L48618r1380o58927m70805K42760N22784J81937p4808K2962j3383
$$ -237278 111340 19960 -638967 -1109772 -867012 -344228 -162291 -237099 -214137 -227520
32202b27520k78625k06334J97664J28396m75957n19745L49538Q43429J15883o57126
$$ -227520 -506145 -712479 -514815 -386419 -862376 -1382121 -1032583 -189154 -73271 -730397
32192g30397k07138O02988K65033p00461o29497L94337P60894J66427m0959N55628
$$ -730397 -937535 -334547 -69514 -769975 -1399472 -1005135 -244241 -77814 -118773 436855
32182D36855P33687l3882n94284k06606K16406j25794n38598k54799J77585M5580
$$ 436855 1170542 1136660 542376 335770 552176 426382 -112216 -367015 -189430 -143850
32172a43850k13226P947K51185q4436m95967k42005K93581K81962j06542r0503
$$ -143850 -357076 -349129 -97944 -182380 -678347 -920352 -626771 -344809 -451351 -541854
32162e41854L37097M97709J96416j60697l76782n33214m67256J5286N62582O17060
$$ -541854 -204757 292952 489368 328671 -48111 -581325 -1048581 -1033295 -470713 146347
32152A46347K09578j55547k25827j09009R1501K61287J76219j29081k26853M9068
$$ 146347 355925 200378 -25449 -134458 -42957 218330 394549 265468 38615 87683
32142H7683K42065J5810k54235j62253P719j33351l20836j58508J22499J57095
$$ 87683 329748 345558 91323 -70930 -63211 -196562 -517398 -675906 -553407 -396312
32132c96312J63262L83695L93639j23021m93451l8242N76823K31390p55730j003363
$$ -396312 -233050 150645 544284 421263 -72188 -110430 466393 697783 -57947 -1061310
32122a061310k07278N03030M12241M1041j06235k58011m41586j30462O10419Q13602
$$ -1061310 -1268588 -765558 -353317 -312276 -418511 -676522 -1118108 -1248570 -638151 175451
32112A75451J18636m94070k39937K26491J4301m67804k61792N12164R03143O01565
$$ 175451 294087 -199983 -439920 -213429 -199128 -666932 -928724 -416560 486583 1088148
32102A088148J28683j80001m16783m91439j91458J98514J52589k22712l11934
$$ 1088148 1216831 1036830 620047 128608 -62850 135664 288253 65541 -246393
32093b46393L858J99491K9359j28260j7342P3891j00867k98569k34649l7882M3509
$$ -246393 -242535 -43044 -13685 -141945 -159287 -85396 -186263 -484832 -719481 -757363 -713854
32082g13854L9647Q6121J34651Q1069l1114j09657j24257k6768J97415L34807
$$ -713854 -674207 -588086 -453435 -372366 -403480 -513137 -637394 -664162 -466747 -131940
32072a31940J15957l12331m37446p5936L26862L22889O1158l7154P0095Q3064
$$ -131940 -15983 -328314 -765760 -841696 -514834 -191945 -130787 -167941 -97846 -14782
32062a4782j12530l04348k80990m3496K56197L98724K26209j23204k57812k4336
$$ -14782 -127312 -431660 -712650 -756146 -499949 -101225 124984 1780 -256032 -280368
32052b80368K30379J66186j121J38715M48965M01755m4815l12666r7999J63043
$$ -280368 -49989 116197 115076 253791 702756 1104511 1059696 747030 649031 812074
32042H12074K2427k84682k98845q5427K523J6918K53729N45523L86568j93147
$$ 812074 834501 549819 250974 165547 168070 184988 438717 984240 1370808 1177661
32032A177661n21207k45717J63530J73348o3913j27397o9009k14433m81379m44591
$$ 1177661 656454 410737 574267 747615 683702 556305 487296 272863 -208516 -653107
32022f53107k117M67859N93120L16417j93243n99761n08891P8728N60032M30771
$$ -653107 -655224 -187365 405755 722172 528929 -70832 -579723 -500995 59037 489808
32012D89808L6969N7016L81718K76861l28314o22769k46420Q3443k01606n19959
$$ 489808 526777 583793 965511 1242372 914058 291289 44869 128312 -73294 -593253
32002e93253j24989N90490P00719K02225j18177p810M7935j47897k35769j10565
$$ -593253 -718242 -127752 572967 775192 657015 649205 697140 549243 313474 202909
31992B02909j05463k29694p3615L28428L82339m1913l05783r6242Q124m08574
$$ 202909 97446 -132248 -205863 122565 504904 462991 157208 60966 69090 -339484
31982c39484p52717l36373M52788O91161K55139j50176r0634J68477K59433J45212
$$ -339484 -1092201 -1428574 -975786 -284625 -29486 -179662 -270296 -101819 157614 302826
31972C02826n9121k46413k68121n0462K41437L74113K97353P0079k60422n25268
$$ 302826 243705 -2708 -270829 -321291 -79854 294259 591612 661691 401269 -123999
31962a23999m65665j38327K2559j74563l43628j38978J64915J40909p2871k3643
$$ -123999 -589664 -727991 -705432 -879995 -1223623 -1362601 -1197686 -1056777 -1129648 -1153291
31952a153291L11667N19273L56765j6267k95975k52709J11392M24989K81666j28454
$$ -1153291 -841624 -322351 34414 18147 -277828 -530537 -419145 5844 287510 159056
31942A59056j99897R6714R9104l49927m69692J16169N55496J47544l79584j04127
$$ 159056 -40841 55873 154977 -194950 -664642 -548473 7023 154567 -225017 -329144
31932c29144M16978J15363o16460n62027J21370J45738n74000p05610J66263Q31585
$$ -329144 87834 203197 -413263 -975290 -853920 -708182 -1282182 -1987792 -1821529 -989944
31922i89944N63878J80883L02939K42565m31477p87673j53933N12267J80600m83520
$$ -989944 -426066 -245183 57756 300321 -131156 -918829 -1072762 -560495 -379895 -863415
31912h63415l11768L74529M67373K7031k2048L35657K79569k29272l49065J30431
$$ -863415 -1175183 -800654 -333281 -306250 -328298 7359 286928 57656 -291409 -160978
31902a60978M48394J73901k31802l26904k47659j85853r3798m4212j89876k94519
$$ -160978 287416 461317 229515 -97389 -345048 -530901 -624699 -668911 -858787 -1153306
31892a153306K4341N45037O12238J24661k95398k24547N2784R2582j26197k97623
$$ -1153306 -1128965 -583928 28310 152971 -142427 -366974 -314190 -221608 -347805 -645428
31882f45428j59674K32009M19984j1526o91508o69660K19606Q64264M29791k97158
$$ -645428 -805102 -573093 -153109 -164635 -856143 -1525803 -1306197 -441933 -12142 -309300
31872c09300j21641O04484N51143l81511q90992l51680L63571M58293K87532L30149
$$ -309300 -430941 173543 724686 343175 -547817 -899497 -535926 -77633 209899 540048
31862E40048K71622j64094m33304m7555M88071M19667r9095l43460j29706Q3077
$$ 540048 811670 647576 214272 166717 654788 1074455 975360 631900 502194 585271
31852E85271l6674l53312n32812l16938K45291O40111L49888l25981m51120K21911
$$ 585271 548597 195285 -337527 -654465 -409174 230937 580825 254844 -196276 25635
31842B5635P25361K09750p51519r26941j59458M80508K22830m50605n81742K9965
$$ 25635 750996 960746 209227 -717714 -877172 -396664 -173834 -624439 -1206181 -1176216
31832a176216O88488P02601J60585k56466j49222J25698K9692l24017l38467J15794
$$ -1176216 -487728 214873 375458 118992 -30230 95468 125160 -198857 -537324 -421530
31822d21530M60242K65503j72566l72217k88989o6303L36394P99596P85547N2398
$$ -421530 38712 304215 131649 -240568 -529557 -595860 -259466 540130 1325677 1378075
31812A378075o87697n55099J86219L93578k90193q42846l33267O70223Q55891
$$ 1378075 690378 135279 321498 715076 424883 -417963 -751230 -81007 774884
31803G74884J6376o79509l57227L73818L84876l15145o41469n3316O86365O52875
$$ 774884 791260 111751 -245476 128342 513218 198073 -443396 -496712 189653 842528
31793H42528J1609l98021k91819r8379r9793j01995K6395Q6575l9376j74690j86395
$$ 842528 854137 456116 164297 65918 -33875 -135870 -109475 -22900 -62276 -236966 -423361
31782d23361j40883k4475K63745N26395L51242k19611n67459l23430J02532J51149
$$ -423361 -564244 -588719 -324974 201421 552663 333052 -234407 -557837 -455305 -304156
31772c04156j11194k44838j39437j739J25786L32243M50028K14677j91608k45601
$$ -304156 -415350 -660188 -799625 -801364 -675578 -343335 106693 321370 129762 -115839
31762a15839J59735M93059L11637j54024m00325l23293j52139L8739K98183M07741
$$ -115839 43896 536955 848592 694568 294243 -29050 -181189 -142450 155733 563474
31752E63474P6769m12807l49225L51413P99573L30836m38291m60877J57416L27563
$$ 563474 640243 227436 -121789 229624 1029197 1360033 921742 460865 618281 945844
31742I45844l17962q65419n37436K07107M87140K09964j29221l04136l66315k12886
$$ 945844 627882 -237537 -774973 -567866 -80726 129238 17 -304119 -670434 -883320
31732h83320J98019M79414K60793j94438l19682q302L75222N24575L61695l9448
$$ -883320 -685301 -205887 54906 -139532 -459214 -467516 -92294 432281 793976 754528
31722G54528l58520k18457K11188K80579j36143l54657m6391J22224l14092o64436
$$ 754528 396008 177551 388739 669318 533175 178518 132127 254351 -59741 -724177
31712g24177k48177L31158K23937j36803R8651M97905J07237o21060m70913K73204
$$ -724177 -972354 -641196 -417259 -554062 -455411 42494 149731 -471329 -942242 -669038
31702f69038J90816o70982o92146M71989J100881K34314p43493m56216L38724
$$ -669038 -478222 -1149204 -1841350 -1369361 -268480 -34166 -777659 -1233875 -895151
31693h95151L48334p6861P0745N11070L67938q7086M956M17026K41389m59805
$$ -895151 -546817 -623678 -552933 -41863 326075 238989 243945 660971 902360 442555
31683D42555p87784m88240p9661K12825N13547N73480J12535l58653j43515M30589
$$ 442555 -345229 -833469 -913130 -700305 -186758 386722 499257 140604 -2911 427678
31673D27678M67453l9470k88277o4536M3160k09057l97718l05243j78854p0425
$$ 427678 895131 855661 567384 502848 546008 336951 -60767 -366010 -544864 -615289
31663f15289K00302L96100O1842n65207p04368j84381L58002N02043M52969L57448
$$ -615289 -414987 -18887 42955 -522252 -1226620 -1411001 -1052999 -550956 -97987 259461
31653B59461O5111k76732k24736J49437K28756j35632l40759l3961L42392L45030
$$ 259461 324572 47840 -176896 -27459 201297 65665 -275094 -309055 33337 378367
$$ [...]
##END NTUPLES=NMR SPECTRUM
##END=
