##TITLE=31Pdec_B3dm-1
 CDCl3, 24 sc
 11.7.2023
##JCAMPDX= 6.0         $$ Bruker NMR JCAMP-DX V2.0
##DATA TYPE= NMR SPECTRUM
##DATA CLASS= NTUPLES
##ORIGIN= UXNMR, Bruker Analytische Messtechnik GmbH
##OWNER= root
$$ XWIN-NMR		Version 3.5
$$ Tue Jul 11 14:18:37 2023 Russian Standard Time (UT+4h)  she@DPX200
##.OBSERVE FREQUENCY= 81.013821
##.OBSERVE NUCLEUS= ^31P
##.ACQUISITION MODE= SIMULTANEOUS
##.ACQUISITION SCHEME= undefined
##.AVERAGES= 24
##.DIGITISER RES= 16
##SPECTROMETER/DATA SYSTEM= spect
##.PULSE SEQUENCE= zgpg30
##.SOLVENT NAME= CDCl3
##.SHIFT REFERENCE= (INTERNAL, CDCl3, 0, 248.564)
##AUDIT TRAIL= $$ (NUMBER, WHEN, WHO, WHERE, WHAT)
$$ ##TITLE= Audit trail, XWIN-NMR		Version 3.5
$$ ##JCAMPDX= 5.01
$$ ##ORIGIN= Bruker BioSpin GmbH
$$ ##OWNER= she
$$ F:/spectra/data/she/nmr/P31/1/pdata/1/auditp.txt
$$ ##AUDIT TRAIL=  $$ (NUMBER, WHEN, WHO, WHERE, WHAT)
(   1,<2023-07-11 14:17:29.70 +0400>,<she>,<DPX200>,
      <created by zg, POWCHK disabled, PULCHK disabled
       configuration hash MD5:
       00 E9 B6 7A A2 85 ED C7 34 08 36 98 17 FE 4E 26
       data hash MD5: 32K
       01 35 43 C9 C2 BD 48 A5 D4 11 12 04 3F 92 30 1C>)
(   2,<2023-07-11 14:17:35.28 +0400>,<she>,<DPX200>,
      <Start of raw data processing
       efp BC_mod = 2 LB = 1 FT_mod = 6 PKNL = 1 PHC0 = -10553.8 PHC1 = -230.7153 SI = 64K 
       data hash MD5: 64K
       AF 70 F4 EB 84 59 B8 0B A8 23 71 14 81 C5 6B 37>)
(   3,<2023-07-11 14:17:57.93 +0400>,<she>,<DPX200>,
      <pk PHC0 = -91.47799 PHC1 = 226.2 
       data hash MD5: 64K
       D0 7B AF 45 F6 46 7C 62 6D A2 4B 59 3E 89 EF 01>)
(   4,<2023-07-11 14:18:15.98 +0400>,<she>,<DPX200>,
      <abs ABSG = 5 
       data hash MD5: 64K
       72 92 20 9B CF 25 CB CB F5 5E 18 D4 9F 56 7E CB>)
$$ ##END=
$$ 
$$ hash MD5
$$ 16 91 AB DE CB A9 93 C9 9D F4 82 06 EA 2E 4F 2B
##$RELAX= 
##$RELAX= 
##$RELAX= 
##$RELAX= 
##$RELAX= 
##$RELAX= 
##$RELAX= 
##$RELAX= 
##$RELAX= 
$$ Bruker specific parameters
$$ --------------------------
##$DU= <F:/spectra>
##$EXPNO= 1
##$NAME= <P31>
##$PROCNO= 1
##$TYPE= <nmr>
##$USER= <she>
##$AMP= (0..31)
100 100 100 100 100 100 100 100 100 100 100 100 100 100 100 100 100 100 
100 100 100 100 100 100 100 100 100 100 100 100 100 100 
##$AQSEQ= 0
##$AQ_mod= 1
##$AUNM= <au_zg>
##$AUTOPOS= <>
##$BF1= 81.014009
##$BF2= 200.13
##$BF3= 200.13
##$BF4= 200.13
##$BF5= 200.13
##$BF6= 200.13
##$BF7= 200.13
##$BF8= 200.13
##$BYTORDA= 1
##$CFDGTYP= 0
##$CFRGTYP= 5
##$CHEMSTR= <none>
##$CNST= (0..31)
1 1 145 1 1 1 1 1 1 1 1 1 1 1 1 1 1 1 1 1 1 1 1 1 1 1 1 1 1 1 1 1 
##$CPDPRG= <waltz16>
##$CPDPRG1= <>
##$CPDPRG2= <waltz16>
##$CPDPRG3= <>
##$CPDPRG4= <mlev>
##$CPDPRG5= <mlev>
##$CPDPRG6= <mlev>
##$CPDPRG7= <mlev>
##$CPDPRG8= <mlev>
##$CPDPRGB= <>
##$CPDPRGT= <>
##$D= (0..31)
0 1 0 0 0 0 0 0 0 0 0 0.03 2e-05 3e-06 0 0 0 0 0 0 0 0 0 0 0 0 0 0 0 0 
0 0 
##$DATE= 1689070649
##$DBL= (0..7)
120 120 120 11 120 120 24 19 
##$DBP= (0..7)
150 150 150 150 150 150 150 150 
##$DBP07= 0
##$DBPNAM0= <>
##$DBPNAM1= <>
$$ [...]
##$SUBNAM3= <"">
##$SUBNAM4= <"">
##$SUBNAM5= <"">
##$SUBNAM6= <"">
##$SUBNAM7= <"">
##$SUBNAM8= <"">
##$SUBNAM9= <"">
##$SW= 501.771253377433
##$SWIBOX= (0..15)
0 1 3 0 0 0 0 0 0 0 0 0 0 0 0 0 
##$SW_h= 40650.406504065
##$TD= 32768
##$TD0= 1
##$TE= 0
##$TE2= 300
##$TE3= 300
##$TEG= 300
##$TL= (0..7)
0 120 53 12 22 120 120 120 
##$TP= (0..7)
150 150 150 150 150 150 150 150 
##$TP07= 0
##$TPNAME0= <>
##$TPNAME1= <>
##$TPNAME2= <>
##$TPNAME3= <>
##$TPNAME4= <>
##$TPNAME5= <>
##$TPNAME6= <>
##$TPNAME7= <>
##$TPOAL= (0..7)
0.5 0.5 0.5 0.5 0.5 0.5 0.5 0.5 
##$TPOFFS= (0..7)
0 0 0 0 0 0 0 0 
##$TUNHIN= 0
##$TUNHOUT= 0
##$TUNXOUT= 0
##$USERA1= <user>
##$USERA2= <user>
##$USERA3= <user>
##$USERA4= <user>
##$USERA5= <user>
##$V9= 5
##$VALIST= <valist>
##$VCLIST= <CCCCCCCCCCCCCCC>
##$VD= 0
##$VDLIST= <DDDDDDDDDDDDDDD>
##$VPLIST= <PPPPPPPPPPPPPPP>
##$VTLIST= <TTTTTTTTTTTTTTT>
##$WBST= 1024
##$WBSW= 4
##$XGAIN= (0..3)
0 0 0 0 
##$XL= 0
##$YL= 0
##$YMAX_a= 3041
##$YMIN_a= -2596
##$ZGOPTNS= <>
##$ZL1= 120
##$ZL2= 120
##$ZL3= 120
##$ZL4= 120
##$ABSF1= 248.5645
##$ABSF2= -253.2056
##$ABSG= 5
##$ABSL= 3
##$ALPHA= 0
##$AQORDER= 0
##$ASSFAC= 0
##$ASSFACI= 0
##$ASSFACX= 0
##$ASSWID= 0
##$AUNMP= <proc_1d>
##$AZFE= 0.1
##$AZFW= 0.5
##$BCFW= 0
##$BC_mod= 2
##$BYTORDP= 0
##$COROFFS= 0
##$CY= -3
##$DATMOD= 1
##$DC= 0
##$DFILT= <>
##$DTYPP= 0
##$F1P= 0
##$F2P= 0
##$FCOR= 1
##$FTSIZE= 65536
##$FT_mod= 6
##$GAMMA= 0
##$GB= 0
##$INTBC= 1
##$INTSCL= 6.047779e-11
##$ISEN= 30
##$LB= 1
##$LEV0= 0
##$LPBIN= 0
##$MAXI= 10000
##$MC2= 0
##$MEAN= 0
##$ME_mod= 0
##$MI= 50
##$NCOEF= 0
##$NC_proc= -6
##$NLEV= 6
##$NOISF1= 182.463
##$NOISF2= 159.3651
##$NSP= 0
##$NTH_PI= 0
##$NZP= 0
##$OFFSET= 248.5645
##$PC= 4
##$PHC0= -10645.28
##$PHC1= -4.515305
##$PH_mod= 1
##$PKNL= yes
##$PPARMOD= 0
##$PSCAL= 0
##$PSIGN= 0
##$REVERSE= no
##$SF= 81.0140089999694
##$SI= 65536
##$SIGF1= 159.3651
##$SIGF2= -187.1042
##$SINO= 113.3802
##$SIOLD= 16384
##$SREGLST= <1H.CDCl3>
##$SSB= 0
##$STSI= 65536
##$STSR= 0
##$SW_p= 40650.406504065
##$SYMM= 0
##$S_DEV= 0
##$TDeff= 32768
##$TDoff= 0
##$TI= <>
##$TILT= no
##$TM1= 0
##$TM2= 0
##$TOPLEV= 0
##$USERP1= <user>
##$USERP2= <user>
##$USERP3= <user>
##$USERP4= <user>
##$USERP5= <user>
##$WDW= 1
##$XDIM= 65536
##$YMAX_p= 354301288
##$YMIN_p= -5473372
$$ End of Bruker specific parameters
$$ ---------------------------------
##NTUPLES= NMR SPECTRUM
##VAR_NAME=  FREQUENCY,     SPECTRUM/REAL,   SPECTRUM/IMAG
##SYMBOL=    X,             R,               I
##VAR_TYPE=  INDEPENDENT,   DEPENDENT,       DEPENDENT
##VAR_FORM=  AFFN,          ASDF,            ASDF
##VAR_DIM=   65536,         65536,           65536
##UNITS=     HZ,            ARBITRARY UNITS, ARBITRARY UNITS
##FACTOR=    0.620285442955139, 1,           1
##FIRST=     20137.2065510682, 0,            0
##LAST=      -20513.1999529968, 0,           0
##MIN=       -20513.1999529968, -5473372,    0
##MAX=       20137.2065510682, 354301288,    0
$$ Real data points
##PAGE= N=1
##DATA TABLE= (X++(R..R)), XYDATA
$$ [...]
$$ plain form
39162 -1102334 -1746564 -2049083 -2254576 -2253680 -2005850 -1801170 -1759306 -1691327 -1709089 -2255642
39152 -2255642 -3203486 -3659699 -3113357 -2131222 -1470480 -1157390 -958729 -1097997 -1794210
39143 -1794210 -2540624 -2558481 -1744018 -657590 163433 440291 55741 -735043 -1249883
39134 -1249883 -1066533 -600812 -544550 -875024 -854124 61448 1614651 2934867 3112581
39125 3112581 1839270 -199007 -1735075 -2013302 -1365065 -590243 -70436 304488 677523
39116 677523 1016887 1168200 923545 272287 -337950 -384172 -22599 42934 -383655 -682557
39106 -682557 -456377 -184157 -353019 -589683 -309318 287765 567471 398567 66045 -341306
39096 -341306 -741331 -665083 127801 956542 977204 340856 -275440 -929507 -2074796 -3177707
$$ packed form
39162a102334o44230l02519k05493Q96K47830K04680M1864O7979j7762n46553
39152b255642r47844m56213N46342R82135O60742L13090J98661j39268o96213
39143a794210p46414j7857Q14463J086428Q21023K76858l84550p90784n14840
39134a249883J83350M65721N6262l30474K0900R15572J553203J320216J77714
39125C112581j273311k038277j536068k78227O48237P74822N19807L74924L73035
39116F77523L39364J51313k44655o51258o10237m6222L61573O5533m26589k98902
39106f82557K26180K72220j68862k36664K80365N97083K79706j68904l32522m07351
39096c41306m00025P6248P92884Q28741K0662o36348o16296o54067j145289j102911
$$ plain form
39086 -3177707 -3052166 -1735712 -677338 -636055 -720622 -195601 96417 -762130 -1905054
39077 -1905054 -1791815 -578512 163391 -117242 -368674 41653 281074 -316235 -888841
39068 -888841 -379184 656529 783520 -232902 -1271426 -1580376 -1483329 -1310855 -807302
39059 -807302 17353 469913 214087 -90711 118712 318110 -134169 -644053 -110833 1273847
39049 1273847 2138765 1888026 1394097 1383870 1184797 -174939 -2268230 -3538255 -3092925
39040 -3092925 -1612355 -463756 -307701 -646023 -553350 213245 892798 659372 -243376
39031 -243376 -743932 -388641 -11574 -620499 -2009541 -2953732 -2610303 -1302205 37532
39022 37532 815283 1068210 1059240 844257 353733 -184447 -219681 484577 1389309 1692134
$$ packed form
39086c177707J25541J316454J058374M1283q4567N25021K92018q58547j142924
39077a905054J13239J213303P41903k80633k51432M10327K39421n97309n72606
39068h88841N09657J035713J26991j016422j038524l08950R7047J72474N03553
39059h07302Q24655M52560k55826l04798K09423J99398m52279n09884N33220J384680
39049A273847Q64918k50739m93929j0227j99073j359736k093291j270025M45330
39040c092925J480570J148599J56055l38322R2673P66595O79553k33426r02748
39031b43376n00556L55291L77067o08925j389042r44191L43429J308098J339737
39022C7532P77751K52927q970k14983m90524n38180l5234P04258R04732L02825
$$ plain form
39012 1692134 1176231 212386 -867704 -1866083 -2353740 -1962130 -1111556 -692812 -811903
39003 -811903 -615906 294770 1073575 787082 -320238 -1369883 -2049287 -2494493 -2474671
38994 -2474671 -1635109 -346710 556723 860032 1064247 1420568 1574646 1256681 699981
38985 699981 224933 -97216 -271834 -336776 -528548 -978223 -1199831 -506298 856576 1594695
38975 1594695 788087 -963548 -2212255 -2199745 -1364999 -576242 -321050 -584133 -1065535
38966 -1065535 -1362410 -1214404 -790420 -598052 -899330 -1311827 -1274239 -880009 -811847 -1257509
38956 -1257509 -1413504 -611615 455980 496408 -474992 -976656 -94630 1280154 1820314
38947 1820314 1507842 1167832 952524 431877 -114552 269023 1730774 3145058 3493578
$$ packed form
39012A692134n15903r63845j080090r98379m87657L91610Q50574M18744j19091
39003h11903J95997R10676P78805k86493j107320j049645o79404m45206J9822
38994b474671Q39562J288399R03433L03309K04215L56321J54078l17965n56700
38985F99981m75048l22149j74618o4942j91772m49675k21608O93533J362874P38119
38975A594695q06608j751635j248707J2510Q34746P88757K55192k63083m81402
38966a065535k96875J48006M23984J92368l01278m12497L7588L94230O8162m45662
38956a257509j55995Q01889J067595M0428r71400n01664Q82026J374784N40160
38947A820314l12472l40010k15308n20647n46429L83575J461751J414284L48520
$$ plain form
38938 3493578 2998143 2493853 2261347 1957861 1350512 656062 250399 301105 682125 1176342
38928 1176342 1714206 2236609 2308436 1353554 -361727 -1500078 -1124795 -77486 -1765
38919 -1765 -1128794 -2054888 -1820157 -1087378 -810232 -783716 -318433 414464 691473 471689
38909 471689 384482 662318 924610 966470 956244 768484 -80144 -1504837 -2493000 -2170297
38899 -2170297 -880878 264529 711114 843958 1113149 1340010 1176361 865750 1003233
38890 1003233 1561501 1717480 964503 2127 -19392 983438 1845226 1596139 560027
38881 560027 -287345 -616547 -885080 -1352495 -1543608 -916507 247655 986170 717349
38872 717349 -79584 -458815 -191385 -19018 -602176 -1568196 -1958266 -1385662 -289961
$$ packed form
38938C493578m95435n04290k32506l03486o07349o94450m05663N0706L81020M94217
38928A176342N37864N22403P1827r54882j715281j138351L75283J047309P5721
38919a765j127029r26094K34731P32779K77146K6516M65283P32897K77009k19784
38909D71689q7207K77836K62292M1860j0226j87760q48628j424693r88163L22703
38899b170297J289419J145407M46585J32844K69191K26861j63649l10611J37483
38890A003233N58268J55979p52977r62376k1519J002830Q61788k49087j036112
38881E60027q47372l29202k68533m67415j91113O27101J164162P38515k68821
38872G17349p96933l79231K67430J72367n83158r66020l90070N72604J095701
$$ plain form
38863 -289961 800778 1651466 1970875 1440670 427625 16316 751301 1752732 1714500
38854 1714500 543430 -644594 -1050922 -1005883 -1132974 -1364077 -1199534 -576714 7958
38845 7958 195015 247139 711736 1691556 2577010 2612461 1740506 722529 306471 457526
38835 457526 618053 497175 183474 -405793 -1561455 -3048430 -3883179 -3344368 -1948093
38826 -1948093 -911513 -738057 -820839 -477253 127931 342293 -32141 -510459 -528309 -1015
38816 -1015 709484 1197085 1338602 1306858 1298258 1284198 1129337 929102 996066 1394950 1727249
38805 1727249 1609724 1177942 799563 431260 -292794 -1308673 -1942144 -1723599 -1041819
38796 -1041819 -673969 -892628 -1350007 -1646992 -1637736 -1304156 -792019 -570434 -1047110 -1852479
$$ packed form
38863b89961J090739Q50688L19409n30205j013045m11309P34985J001431l8232
38854A714500j171070j188024m06328M5039j27091k31103J64543O22820N84672
38845G958J87057N2124M64597R79820Q85454L5451q71955j017977m16058J51055
38835D57526J60527j20878l13701n89267j155662j486975q34749N38811J396275
38826a948093J036580J73456q2782L43586O05184K14362l74434m78318j7850N27294
38816a015P10499M87601J41517l1744q600j4060j54861k00235O6964L98884L32299
38805A727249j17525m31782l78379l68303p24054j015879o33471K18545O81780
38796a041819L67850k18659m57379k96985R256L33580N12137K21585m76676q05369
$$ plain form
38786 -1852479 -2009365 -1204365 -482928 -1050648 -2538074 -3227114 -2204286 -551013 148940
38777 148940 -116269 -108375 528291 642992 -548515 -2006695 -2154141 -1026169 -111968
38768 -111968 -255001 -755937 -718138 -334953 -330464 -741829 -881432 -263837 865578 1799099
38758 1799099 1916526 1150357 111178 -424994 -276986 119276 466631 932258 1549984
38749 1549984 1835703 1405193 596282 49831 -46505 63110 163391 137109 -86858 -275344
38739 -275344 11151 624439 657890 -272680 -1087433 -506252 1055783 1923625 1420911 572512
38729 572512 392453 628675 684261 714850 995537 974950 -31212 -1570696 -2415152 -2108378
38719 -2108378 -1393613 -1062649 -1064963 -963903 -720133 -631100 -769150 -887095 -870859 -988096
$$ packed form
38786a852479j56886Q05000P21437n67720j487426o89040J022828J653273O99953
38777A48940k65209P894O36666J14701j191507j458180j47446J127972R14201
38768a11968j43033n00936L7799L83185M489m11365j39603O17595J129415R33521
38758A799099J17427p66169j039179n36172J48008L96262L47355M65627O17726
38749A549984K85719m30510q08911n46451r6336J09615J00281k6282k23967j88486
38739b75344K86495O13288L3451r30570q14753N81181J562035Q67842n02714q48399
38729E72512j80059K36222N5586L0589K80687k0587j006162j539484q44456L06774
38719b108378P14765L30964k314J01060K43770Q9033j38050j17945J6236j17237
$$ plain form
38709 -988096 -1508937 -2190596 -2389489 -1766438 -688095 204753 617691 595052 167352 -608312
38699 -608312 -1428466 -2013131 -2490337 -3040898 -3301203 -2775592 -1830295 -1486584 -2004977 -2447388
38689 -2447388 -2031459 -1178041 -665089 -436607 -21256 368166 47588 -1048598 -2286485
38680 -2286485 -3226238 -3868968 -4093006 -3609556 -2556780 -1488555 -679455 -28141 316899
38671 316899 -61077 -1073654 -2016357 -2494231 -2836982 -3308947 -3575381 -3374117 -3065450
38662 -3065450 -2922203 -2421733 -1001048 803891 1744609 1278442 -18419 -1305731 -2059839
38653 -2059839 -1911788 -768861 709447 1506773 1452863 1405421 1890658 2258723 1752323
38644 1752323 785920 353554 568065 721813 618397 789934 1242352 1050124 -228096
$$ packed form
38709i88096n20841o81659j98893O23051J078343Q92848M12938k2639m27700p75664
38699f08312q20154n84665m77206n50561k60305N25611R45297L43711n18393m42411
38689b447388M15929Q53418N12952K28482M15351L89422l20578j096186j237887
38680b286485r39753o42730k24038M83450J052776J068225Q09100O51314L45040
38671C16899l77976j012577r42703m77874l42751m71965k66434K01264L08667
38662c065450J43247N00470J420685J804939R40718m66167j296861j287312p54108
38653b059839J48051J142927J478308P97326n3910m7442M85237L68065n06400
38644A752323r66403m32366K14511J53748j03416J71537M52418j92228j278220
$$ plain form
38635 -228096 -1526817 -1480954 -251930 633985 124980 -1331309 -2544552 -2757328 -2023549
38626 -2023549 -980351 -427147 -718475 -1363114 -1479241 -741582 364735 1202963 1497444
38617 1497444 1158305 141282 -1206239 -2058031 -1830584 -889934 -212542 -341427 -883753
38608 -883753 -1084874 -761847 -478553 -661878 -750311 201759 1897032 2569862 1149037
38599 1149037 -982700 -1595859 -655385 -174561 -910542 -1147294 282913 1627988 684045
38590 684045 -1590027 -2188729 -338381 1625867 1800197 941762 504939 437700 93021
38581 93021 -205281 111631 636166 761652 772900 947636 527246 -974829 -2281799 -1888729
38571 -1888729 -536721 -269271 -1248584 -1539380 -261235 1095773 1171227 641559 542379
$$ packed form
38635b28096j298721M5863J229024Q85915n09005j456289j213243k12776P33779
38626b023549J043198N53204k91328o44639j16127P37659J106317Q38228K94481
38617A497444l39139j017023j347521q51792K27447R40650O77392j28885n42326
38608h83753k01121L23027K83294j83325q8433R52070J695273O72830j420825
38599A149037k131737o13159R40474M80824p35981k36752J430207J345075r43943
38590F84045k274072n98702J850348J964248J74330q58435m36823o7239l44679
38581I3021k98302L16912N24535J25486J1248J74736m20390j502075j306970L93070
38571a888729J352008K67450r79313k90796J278145J357008P5454n29668r9180
$$ plain form
38562 542379 359448 -699092 -1773559 -1464496 -167490 460076 75496 13170 992546
38553 992546 2006947 1948405 1097295 341738 -150276 -724772 -1326261 -1527947 -1166255 -397914
38543 -397914 647710 1812524 2666569 2744532 2015174 884799 -206949 -1014040 -1407839
38534 -1407839 -1334580 -935020 -590441 -661391 -1043302 -1087920 -282199 952171 1557366 1145081
38524 1145081 518910 496632 739702 430827 -306854 -592525 -214116 146109 185325 463900
38514 463900 1315147 2172115 2383305 1906629 833148 -866003 -2604425 -3169604 -2235827
38505 -2235827 -1070257 -858492 -1114207 -796841 -257493 -688774 -2041324 -2965978 -2782842
38496 -2782842 -2131183 -1536066 -697798 425461 1102398 977900 666888 592471 276721
$$ packed form
38562E42379j82931j058540j074467L09063J297006O27566l84580o2326R79376
38553I92546J014401n8542q51110p55557m92014n74496o01489k01686L61692P68341
38543c97914J045624J164814Q54045P7963p29358j130375j091748q07091l93799
38534a407839P3259L99560L44579p0950l81911m4618Q05721J234370O05195m12285
38524A145081o26171k2278K43070l08875p37681k85671L78409L60225L9216K78575
38514D63900Q51247Q56968K11190m76676j073481j699151j738422n65179R33777
38505b235827J165570K11765k55715L17366N39348m31281j352550r24654J83136
38496b782842O51659N95117Q38268J123259O76937j24498l11012p4417l15750
$$ plain form
38487 276721 -476422 -743101 135225 1139656 773388 -796373 -2010574 -2092951 -1748195
38478 -1748195 -1698213 -1708550 -1374910 -890620 -539376 -147867 441111 892805 879564 664288
38468 664288 752543 1268562 2001295 2700557 2981597 2383604 1050529 14613 168645
38459 168645 1109745 1600245 1099914 243421 -196357 -182603 -122305 -295672 -814342 -1628940
38449 -1628940 -2300756 -2260881 -1621007 -1215659 -1409039 -1384820 -269671 1404389 2155386
38440 2155386 1388759 60636 -588622 -377080 -86815 -466040 -1476071 -2226129 -1676461
38431 -1676461 202741 2053476 2438159 1497154 689462 869502 1384247 1277467 575623
38422 575623 -64234 -304102 -190210 168863 451280 166226 -599638 -992042 -528822 125023
$$ packed form
38487B76721p53143k66679Q78326J004431l66268j569761j214201q2377L44756
38478a748195M9982j0337L33640M84290L51244L91509N88978M51694j3241k15276
38468F64288Q8255N16019P32733O99262K81040n97993j333075j035916J54032
38459A68645R41100M90500n00331q56493m39778J3754O0298j73367n18670q14598
38449a628940o71816L9875O39874M05348j93380K4219J115149J674060P50997
38440B155386p66627j328123o49258K11542K90265l79225j010031p50058N49668
38431a676461J879202J850735L84683r41005q07692J80040N14745j06780p01844
38422E75623o39857k39868J13892L59073K82417k85054p65864l92404M63220O53845
$$ plain form
38412 125023 213486 115078 566025 1146111 747310 -604682 -1641243 -1675205 -1334333 -1170292
38402 -1170292 -774784 73560 516164 -106676 -892495 -544492 520740 617027 -630440
38393 -630440 -1546735 -821814 506413 531814 -778774 -1646555 -1095657 -128687 23174
38384 23174 -468717 -901883 -1419514 -2320698 -2769420 -1708217 202701 1084541 370908
38375 370908 -595038 -744681 -547678 -565815 -328365 393550 614221 -271738 -1065945 -419198
38365 -419198 956898 1308013 454576 -224574 -45783 343757 407610 279176 -51938 -672515
38355 -672515 -935375 -210521 589889 -109189 -1975238 -2808211 -1603031 84209 505316
38346 505316 -78056 -422119 -178403 257514 696817 987149 738667 -2490 -604902 -925496
$$ packed form
38412A25023Q8463r8408M50947N80086l98801j351992j036561l3962L40872J64041
38402a170292L95508Q48344M42604o22840p85819L48003J065232R6287j247467
38393f30440r16295P24921J328227K5401j310588q67781N50898R66970J51861
38384B3174m91891m33166n17631r01184m48722J061203J910918Q81840p13633
38375C70908r65946j49643J97003j8137K37450P21915K20671q85959p94207O46747
38365d19198J376096L51115q53437o79150J78791L89540O3853j28434l31114o20577
38355f72515k62860P24854Q00410o99078j866049q32973J205180J687240M21107
38346E05316n83372l44063K43716M35917M39303K90332k48482p41157o02412l20594
$$ plain form
38336 -925496 -1535062 -2339115 -2210616 -750080 849955 1575350 1893157 2233535 1630820
38327 1630820 -600967 -3022230 -3654953 -2611341 -1464478 -750435 63975 710851 316903
38318 316903 -638672 -581423 661751 1405649 643123 -537884 -755205 -199695 156692
38309 156692 177001 402369 882197 1055649 649923 168004 401971 1506791 2572422
38300 2572422 2453508 1251045 423191 924836 1885720 1924251 1111128 524166 396808
38291 396808 96982 -328083 -109518 699070 1084570 693665 226645 -42379 -713378 -1818407
38281 -1818407 -2388861 -2096224 -1932699 -2438133 -2583836 -1502358 -189292 -182198 -1339995
38272 -1339995 -2245128 -2267275 -1930704 -1557889 -869942 29356 412129 318 -502584 -359879
$$ packed form
38336i25496o09566q04053J28499J460536J600035P25395L17807L40378o02715
38327A630820k231787k421263o32723J043612J146863P14043Q14410O46876l93948
38318C16903r55575N7249J243174P43898p62526j181007k17321N55510L56387
38309A56692K0309K25368M79828J73452m05726m81919K33967J104820J065631
38300B572422j18914j202463q27854N01645R60884L8531q13123n86962j27358
38291C96808k99826m25065K18565Q08588L85500l90905m67020k69024o70999j105029
38281a818407n70454K92637J63525n05434j45703J081478J313066P094j157797
38272a339995r05133k2147L36571L72815O87947Q99298L82773m11811n02902J42705
$$ plain form
38262 -359879 209393 402195 -51145 -576509 -660926 -717234 -1513987 -2722155 -2841007 -1179507
38252 -1179507 806736 1208680 209988 -417555 -121724 -157885 -1123183 -1751880 -1019897
38243 -1019897 162182 547777 511388 1043331 1888231 2163834 1950694 1761250 1234876
38234 1234876 -3610 -913238 -340229 745926 388810 -1180227 -1745225 -687777 824
38225 824 -923156 -1840516 -927203 878864 1389644 431435 -339588 -188181 71701 -15338
38215 -15338 150357 749523 945838 376517 11784 680946 1602049 1371079 -24999 -1165733
38205 -1165733 -1103737 -437670 -201240 -375423 -143558 665355 1181441 747879 -60159 -199147
38195 -199147 420890 949118 913163 785667 1085935 1614119 1943190 2092144 2209812 2035306
$$ packed form
38262c59879N69272J92802m53340n25364q4417n6308p96753j208168j18852J661500
38252a179507J986243M01944r98692o27543K95831l6161r65298o28697P31983
38243a019897J182079L85595l6389N31943Q44900K75603k13140j89444n26374
38234A234876j238486r09628N73009J086155l57116j569037n64998J057448O88601
38225H24r23980r17360R13313J806067N10780r58209p71023J51407K59882q7039
38215a5338J65695N99166J96315n69321l64733O69162R21103k30970j396078j140734
38205a165733O1996O66067K36430j74183K31865Q08913N16086m33562q08038j38988
38195a99147O20037N28228l5955j27496L00268N28184L29071J48954J17668j74506
$$ plain form
38185 2035306 1255726 122974 -807118 -1285411 -1225940 -371553 1114994 2036191 1216337
38176 1216337 -743057 -1822263 -1049089 371291 904151 640412 533659 571291 3243
38167 3243 -1008463 -1353330 -662669 124796 155857 -351902 -812237 -1009160 -770577 107572
38157 107572 1081394 985711 -327450 -1376010 -955567 182206 621976 456670 785120
38148 785120 1592003 1773010 1147743 780395 1067164 1107418 495210 202457 826127 1285915
38138 1285915 398163 -1235603 -2108578 -1887724 -1478162 -1518254 -1866949 -2195614 -2135277 -1235960
38128 -1235960 288979 1230255 796673 -117035 -199399 266194 80934 -560563 -209647
38119 -209647 1318810 2399491 2083171 1428878 1508480 1636571 796060 -408341 -658028
$$ packed form
38185B035306p79580j132752r30092m78293N9471Q54387J486547R21197q19854
38176A216337j959394j079206P73174J420380N32860k63739j06753L7632n68048
38167C243j011706l44867O90661P87465L1061n07759m60335j96923K38583Q78149
38157A07572R73822r5683j313161j048560M20443J137773M39770j65306L28450
38148G85120Q06883J81007o25267l67348K86769M0254o12208k92753O23670M59788
38138A285915q87752j633766q72975K20854M09562m0092l48695l28665O0337Q99317
38128a235960J524939R41276m33582r13708q2364M65593j85260o41497L50916
38119b09647J528457J080681l16320o54293P9602J28091q40511j204401k49687
$$ plain form
38110 -658028 27280 546346 483296 286083 63378 -476068 -1088685 -1261870 -1301053 -1881563
38100 -1881563 -2541074 -2022566 -382050 653986 39189 -1125941 -1318698 -712507 -459620
38091 -459620 -656361 -410329 352201 546706 -355107 -1379612 -1381870 -576956 -54857 -201167
38081 -201167 -364967 -16763 481026 517549 126586 -246938 -593875 -1305215 -2243226 -2534474
38071 -2534474 -1718469 -621892 -465717 -1348283 -2279117 -2582102 -2476007 -2215506 -1585672
38062 -1585672 -671838 -309123 -1019650 -2004693 -2013583 -981168 -33485 54281 -336787 -483520
38052 -483520 -251851 71725 390454 837125 1363304 1540065 842687 -721693 -2196437
38043 -2196437 -2289421 -868424 474613 97732 -1538445 -2298367 -1174735 317952 230215
$$ packed form
38110f58028O85308N19066o3050j97213k22705n39446o12617j73185l9183n80510
38100a881563o59511N18508J640516J036036o14797j165130j92757O06191K52887
38091d59620j96741K46032P62530J94505r01813j024505k258Q04914N22099j46310
38081b01167j63800L48204M97789L6523l90963l73524l46937p11340r38011k91248
38071b534474Q16005J096577J56175q82566r30834l02985J06095K60501O29834
38062a585672R13834L62715p10527r85043q890J032415R47683Q7766l91068j46733
38052d83520K31669L23576L18729M46671N26179J76761o97378j564380j474744
38043b196437r2984J420997J343037l76881j636177p59922J123632J492687q7737
$$ plain form
38034 230215 -1131306 -1705329 -590023 788681 765314 -327430 -833841 -138727 687817
38025 687817 602464 -36963 -239082 233027 907099 1454777 1630343 815682 -1161848 -2880272
38015 -2880272 -2459999 -237183 1167934 273248 -1172199 -757735 1180195 2428578 2269204
38006 2269204 1906490 1935462 1615128 789900 376084 443302 -140326 -1424480 -1794039 -730259
37996 -730259 -153338 -1529301 -3392428 -3522350 -2128812 -944908 -416864 73137 224180
37987 224180 -569360 -1284576 -408002 1291937 1555129 133838 -942485 -774740 -687075
37978 -687075 -1331795 -1310562 148593 1423531 947827 -398023 -961329 -836027 -1008984
37969 -1008984 -1297473 -970394 -483456 -794311 -1564188 -1648832 -892250 6004 873848 1850653
$$ packed form
38034B30215j361521n74023J115306J378704k3367j092744n06411O95114Q26544
38025F87817q5353o39427k02119M72109O74072N47678J75566q14661j977530j718424
38015b880272M20273K222816J405117q94686j445447M14464J937930J248383j59374
38006B269204l62714K8972l20334q25228m13816O7218n83628j284154l69559J063780
37996g30259N76921j375963j863127j29922J393538J183904N28044M90001J51043
37987B24180p93540p15216Q76574J699939K63192j421291j076323J67745Q7665
37978f87075o44720K1233J459155J274938m75704j345850n63306J25302j72957
37969a008984k88489L27079M86938l10855p69877q4644P56582Q98254Q67844R76805
$$ plain form
37959 1850653 2333581 1764457 1084956 1668259 2949628 2929353 1197381 -320686 -142067
37950 -142067 847651 1029594 273762 -472892 -833217 -1138348 -1486280 -1623730 -1493610 -1206182
37940 -1206182 -711222 -82689 128907 -539913 -1649670 -2169973 -1651837 -670310 -28816
37931 -28816 96028 44243 37628 31840 132028 722626 1920033 3115122 3411941 2507423
37921 2507423 935262 -434145 -903911 -286555 733013 841219 -502756 -2010108 -1857213
37912 -1857213 -92237 1358652 1317405 663468 465961 291261 -539744 -1335084 -1185465
37903 -1185465 -745578 -1152889 -1871593 -1471397 -133652 578672 306564 216969 604467
37894 604467 295097 -994990 -1733088 -947831 219718 455005 175613 218520 87039
$$ packed form
37959A850653M82928n69124o79501N83303J281369k0275j731972j518067J78619
37950a42067R89718J81943p55832p46654l60325l05131l47932j37450J30120K87428
37940a206182M94960O28533K11596o68820j109757n20303N18136R81527O41494
37931b8816J24844n1785o615n788J00188N90598J197407J195089K96819r04518
37921B507423j572161j369407m69766O17356J019568J08206j343975j507352J52895
37912a857213J764976J450889m1247o53937j97507j74700q31005p95340J49619
37903a185465M39887m07311p18704M00196J337745P12324k72108q9595L87498
37894F04467l09370j290087p38098P85257J167549K35287k79392M2907j31481
$$ plain form
37885 87039 -910710 -1907277 -1609774 -478041 -77735 -667920 -1026812 -505580 231489 560044
37875 560044 669543 779425 690517 412875 358793 618190 725924 368586 -203712 -536869
37865 -536869 -294404 613494 1642550 1638647 79888 -1854829 -2384593 -1303254 -137790
37856 -137790 -21915 -374243 -44241 1033172 1833559 1411897 -262575 -2261113 -3311784
37847 -3311784 -2861480 -1620631 -684177 -228808 353169 1223335 1882430 2195110 2627171
37838 2627171 3200218 3188639 2323740 1429864 1269877 1494474 1381641 965757 701395 514041
37828 514041 -34132 -918301 -1655148 -1979997 -2046292 -2096351 -2233483 -2297321 -1834521 -650642
37818 -650642 491784 453729 -705545 -1587598 -1357198 -810155 -828273 -850443 -34091 964861
$$ packed form
37885H7039r97749r96567K97503J131733M00306n90185l58892N21232P37069L28555
37875E60044J09499J09882q8908k77642n4082K59397J07734l57338n72298l33157
37865e36869K42465R07898J029056l903j558759j934717n29764J081339J165464
37856a37790J15875l52328L30002J077413Q00387m21662j674472j998538j050671
37847c311784M50304J240849R36454M55369N81977Q70166O59095L12680M32061
37838B627171N73047j1579q64899q93876j59987K24597j12833m15884k64362j87354
37828E14041n48173q84169p36847l24849o6295n0059j37132o3838M62800J183879
37818f50642J142426l8055j159274q82053K30400N47043j8118k2170Q16352R98952
$$ plain form
37808 964861 875882 -41470 -321684 436610 1172821 1236055 1102691 1011721 440159 -553408
37798 -553408 -874377 -4345 1096089 1433980 1277897 1246849 1136336 555643 -133300 -448696
37788 -448696 -627158 -950931 -978830 -394401 83761 -316246 -1127226 -1406123 -1241680 -1341649
37778 -1341649 -1567784 -1142813 -69188 863067 1328919 1591785 1555702 909412 104309
37769 104309 -94611 -6512 -618519 -1689382 -1758578 -378184 1149027 1786767 2027122
37760 2027122 2362251 1985715 240754 -1748343 -2292873 -1334778 -192984 377735 675922
37751 675922 940793 932552 577875 134429 -284931 -711283 -1008199 -1142125 -1453373 -2027380
37741 -2027380 -2203688 -1473393 -471355 -209418 -652323 -963532 -850797 -663002 -416241
$$ packed form
37808I64861q8979r17352k80214P58294P36211O3234j33364r0970n71562r93567
37798e53408l20969Q70032J100434L37891j56083l1048j10513n80693o88943l15396
37788d48696j78462l23773k7899N84429M78162m00007q10980k78897J64443r9969
37778a341649k26135M24971J073625R32255M65852K62866l6083o46290q05103
37769A04309j98920Q8099o12007j070863o9196J380394J527211O37740K40355
37760B027122L35129l76536j744961j989097n44530R58095J141794N70719K98187
37751F75922K64871q241l54677m43446m19360m26352k96916j33926l11248n74007
37741b027380j76308P30295J002038K61937m42905l11209J12735J87795K46761
$$ plain form
37732 -416241 132008 543823 43858 -1088019 -1593881 -940026 74685 655359 936237
37723 936237 1237854 1376959 1158201 742719 183148 -597248 -1123064 -663632 437919
37714 437919 841774 163549 -277445 571891 1838129 2025017 1125217 323439 203922
37705 203922 359678 394033 305217 110406 -108801 -32534 391131 654303 482728 345424
37695 345424 528659 464227 -177786 -595438 -163844 242105 -344544 -1036610 -330231 1195250
37685 1195250 1418741 -142009 -1679891 -1868669 -1352988 -1000222 -574244 70611 225655
37676 225655 -247942 -260598 685103 1427059 1010364 263720 283880 644633 506659 323655
37666 323655 871247 1558092 1370695 739000 782545 1290683 1132113 246723 -396556 -494591
$$ packed form
37732d16241N48249M11815m99965j131877n05862O53855J014711N80674K80878
37723I36237L01617J39105k18758m15482n59571p80396n25816M59432J101551
37714D37919M03855o78225m40994Q49336J266238J86888q99800q01778j19517
37705B03922J55756L4355q8816j94811k19207P6267M23665K63172j71575j37304
37695C45424J83235o4432o42013m17652M31594M05949n86649o92066P06379J525481
37685A195250K23491j560750j537882j88778N15681L52766M25978O44855J55044
37676B25655m73597j2656R45701P41956m16695p46644K0160L60753j37974j83004
37666C23655N47592O86845j87397o31695M3545N08138j58570q85390o43279r8035
$$ plain form
37656 -494591 -500415 -365620 186363 450849 -431600 -1622241 -1428607 -16915 645295 -206776
37646 -206776 -1130817 -966449 -438531 -504465 -818469 -839486 -1030484 -1857948 -2698224 -2730498
37636 -2730498 -2074133 -1339083 -890339 -1003848 -1713542 -2153341 -1329344 88376 281771
37627 281771 -924930 -1594440 -736253 190409 -15016 -194535 895217 2159817 2102842
37618 2102842 1530539 1958718 2676911 2014996 550245 289906 1249353 1626570 1093683
37609 1093683 1076941 1711694 1405009 -61399 -730192 344181 1564508 1535006 1075220
37600 1075220 1201388 1190406 252228 -609637 -190114 749124 634250 -517275 -1407557
37591 -1407557 -1456995 -1072620 -488563 331075 993472 1007858 583582 268089 99039 -208827
$$ packed form
37656d94591n824J34795N51983K64486q82449j190641J93634J411692O62210q52071
37646b06776r24041J64368N27918o5934l14004k1017j90998q27464q40276l2274
37636b730498O56365P35050M48744j13509p09694m39799Q23997J417720J93395
37627B81771j206701o69510Q58187R26662k05425j79519J089752J264600n6975
37618B102842n72303M28179P18193o61915j464751k60339R59447L77217n32887
37609A093683j6742O34753l06685j466408o68793J074373J220327k9502m59786
37600A075220J26168j0982r38178q61865M19523R39238j14874j151525q90282
37591a407557m9438L84375N84057Q19638O62397J4386m24276l15493j69050l07866
$$ plain form
37581 -208827 -637032 -1006103 -1260761 -1149493 -299045 909876 1409454 1007964 915686 1892197
37571 1892197 2851534 2375562 803070 -354062 -460889 -96806 143287 98075 -282223
37562 -282223 -713665 -477806 515634 1110341 393061 -752185 -781388 247540 839848
37553 839848 249607 -772880 -1354883 -1444442 -1301761 -1051067 -886660 -972490 -1091827 -953199
37543 -953199 -647286 -303478 201758 591837 68781 -1226128 -1614212 -115941 1643807
37534 1643807 1561835 333608 359775 1739102 1992443 144237 -1546883 -979377 915567
37525 915567 2074918 2169325 1951236 1372456 247023 -409741 294291 1244202 714057
37516 714057 -833250 -1287650 -75560 1113846 1026024 508736 821577 1636591 1628105 254639
$$ packed form
37581b08827m28205l69071k54658J11268Q50448J208921M99578m01490r2278R76511
37571A892197R59337m75972j572492j157132j06827L64083K40093m5212l80298
37562b82223m31442K35859R93440N94707p17280j145246k9203J028928N92308
37553H39848n90241j022487n82003q9559J42681K50694J64407q5830j19337J38628
37543i53199L05913L43808N05236L90079n23056j294909l88084J498271J759748
37534A643807q1972j228227K6167J379327K53341j848206j691120N67506J894944
37525I15567J159351R4407k18089n78780j125433o56764P04032R49911n30145
37516G14057j547307m54400J212090J189406q7822n17288L12841Q15014q486j373466
$$ plain form
37506 254639 -1798237 -3466485 -4100716 -3810321 -3341808 -3273843 -3272324 -2692308 -1880817 -1937100
37496 -1937100 -2890191 -3197926 -1814191 132745 787112 96772 -356148 202388 861230
37487 861230 783180 476829 627367 745647 16895 -1158531 -1593680 -998752 -187629 319864
37477 319864 858943 1602825 1941406 1338704 161452 -808747 -1227322 -1189490 -825185 -269091
37467 -269091 289119 774567 1130744 1015312 189075 -697542 -580439 378032 597760 -735047
37457 -735047 -2173846 -1767556 283372 1929398 1926423 971384 263201 163534 518716 1219379
37447 1219379 1953597 2177709 1805444 1363523 1134249 732163 -107219 -887894 -972248 -458477
37437 -458477 -36940 -239329 -1093832 -2207982 -2931626 -2760376 -1879210 -1079055 -923104
$$ packed form
37506B54639k052876j668248o34231K90395M68513O7965J519N80016Q11491n6283
37496a937100r53091l07735J383735J946936O54367o90340m52920N58536O58842
37487H61230p8050l06351J50538J18280p28752j175426m35149N94928Q11123N07493
37477C19864N39079P43882L38581o02702j177252r70199m18575L7832L64305N56094
37467b69091N58210M85448L56177j15432q26237q86617J17103R58471K19728j332807
37457g35047j438799M06290K050928J646026k975r55039p08183r9667L55182P00663
37447A219379P34218K24112l72265m41921k29274m02086q39382p80675q4354N13771
37437d58477M21537k02389q54503j114150p23644J71250Q81166Q00155J55951
$$ plain form
37428 -923104 -1234827 -1545280 -1678173 -1653862 -1405172 -985762 -802433 -1180863 -1772341 -1789746
37418 -1789746 -905211 323799 980006 574810 -670004 -2043535 -2700326 -2079239 -408287
37409 -408287 1169976 1416914 253291 -1055798 -1297184 -631847 -98039 -119809 -262601
37400 -262601 -368420 -948970 -2098571 -2842199 -2181502 -310681 1687472 2917426 3062819
37391 3062819 2286708 1291332 997563 1593543 2279464 2376652 2135524 1956942 1546827 628062
37381 628062 -149116 9858 773899 1179301 1074461 1074902 1301349 1223078 755395 549781
37371 549781 998942 1641441 1739522 1038019 -28686 -611571 -221461 526381 565386 138886
37361 138886 902269 3456577 5868197 5928321 3996968 2090862 951316 -109936 -989727
$$ packed form
37428i23104l11723l10453j32893K4311K48690M19410J83329l78430n91478j7405
37418a789746Q84535J229010O56207m05196j244814j373531o56791O21087J670952
37409d08287J578263K46938j163623j309089k41386O65337N33808k1770j42792
37400b62601j05819n80550j149601p43628O60697J870821J998153J229954J45393
37391C062819p76111r95376k93769N95980O85921R7188k41128j78582m10115r18765
37381F28062p77178J58974P64041M05402j04840M41K26447p8271m67683k05614
37371E49781M49161O42499R8081p01503j066705n82885L90110P47842L9005m26500
37361A38886P63383K554308K411620O0124j931353j906106j139546j061252q79791
$$ plain form
37352 -989727 -651919 718829 1517018 1133821 757294 1167196 1415903 493329 -1108268
37343 -1108268 -2293605 -2656130 -2248296 -1248528 -441259 -802486 -1975038 -2364037 -1397346
37334 -1397346 -447352 -756264 -1677094 -1897250 -1348019 -881406 -803058 -602516 342119 2259158
37324 2259158 4679207 6651203 8180252 11188161 17405629 25174988 30259333 30378229
37316 30378229 27079273 22585559 17204202 11106955 6202670 4043029 3481787 2546003
37308 2546003 1344235 1052626 1252470 630069 -480495 -588303 359328 1010678 984684
37299 984684 1228064 2105690 2931883 3352840 3563439 3253721 1941266 258661 -636555
37290 -636555 -808129 -1173414 -1628794 -1253948 -259325 103752 -336622 -447620 90074 224067
$$ packed form
37352i89727L37808J370748P98189l83197l76527M09902K48707r22574j601597
37343a108268j185337l62525M07834R99768Q07269l61227j172552l88999R66691
37334a397346R49994l08912r20830k20156N49231M66613P8348K00542R44635J917039
37324B259158K420049J971996J529049L007909O217468P769359N084345J18896
37316C0378229l298956m493714n381357o097247m904285k159641n61242r35784
37308B546003j201768k91609J99844o22401j110564j07808R47631O51350k5994
37299I84684K43380Q77626Q26193M20957K10599l09718j312455j682605q95216
37290f36555j71574l65285m55380L74846R94623L63077m40374j10998N37694J33993
$$ plain form
37280 224067 -520438 -1241958 -1341645 -1401886 -1760493 -1704296 -822679 161879 656163 1059714
37270 1059714 1626702 1666389 752969 -268110 -354712 437015 1407274 2133094 2301466 1539131
37260 1539131 193690 -517663 15539 831163 736186 32197 -17975 906268 1734397 1466793
37250 1466793 447670 -46308 706149 1972979 2374960 1656215 1113582 1752746 2653305
37241 2653305 2221299 672195 -177111 346769 785917 -156334 -1729501 -2416906 -1989810
37232 -1989810 -1236690 -453852 682756 2193495 3666370 4753553 5132959 4416537 2810633
37223 2810633 1431095 1184147 1678189 1975625 2005911 2316858 2719546 2298127 860306
37214 860306 -619496 -1348021 -1686259 -2253861 -2709823 -2216833 -900257 -27699 -487706
$$ packed form
37280B24067p44505p21520r9687o0241l58607N6197Q81617R84558M94284M03551
37270A059714N66988L9687r13420j021079q6602P91727R70259P25820J68372p62335
37260A539131j345441p11353N33202Q15624r4977p03989n0172R24243Q28129k67604
37250A466793j019123m93978P52457J266830M01981p18745n42633O39164R00559
37241B653305m32006j549104q49306N23880M39148r42251j573167o87405M27096
37232a989810P53120P82838J136608J510739J472875J087183L79406p16422j605904
37223B810633j379538k46948M94042K97436L0286L10947M02688m21419j437821
37214H60306j479802p28525l38238n67602m55962M92990J316576Q72558m60007
$$ plain form
37205 -487706 -1627430 -2056094 -1325589 -270574 243959 279269 343833 567163 777646 942234
37195 942234 1005327 651383 -190778 -908314 -909668 -504688 -342442 -196999 732565 2269344
37185 2269344 3011294 2045392 186153 -969502 -711523 465107 1736163 2629342 3048236
37176 3048236 3036989 2589976 1716175 778564 474454 1015794 1547059 1057351 -202115
37167 -202115 -1009177 -932076 -837920 -1297738 -1493171 -500399 1042584 1585958 761004 -116463
37157 -116463 225581 1455775 2128842 1383593 -167802 -1168022 -951445 -186516 -72379
37148 -72379 -961936 -1943011 -1837581 -460967 1225294 2090496 1802643 893094 107486
37139 107486 -166975 2892 240097 39030 -831872 -1864473 -2105489 -1321279 -499516
$$ packed form
37205d87706j139724m28664P30505J055015N14533L5310O4564K23330K10483J64588
37195I42234O3093l53944q42161p17536j354M04980J62246J45443R29564J536779
37185B269344P41950r65902j859239j155655K57979J176630J271056Q93179M18894
37176C048236j1247m47013q73801r37611l04110N41340N31265m89708j259466
37167b02115q07062P7101R4156m59818j95433R92772J542983N43374q24954q77467
37157a16463L42044J230194O73067p45249j551395j000220K16577P64929J14137
37148g2379q89557r81075J05430J376614J686261Q65202k87853r09549p85608
37139A07486k74461J69867K37205k01067q70902j032601k41016P84210Q21763
$$ plain form
37130 -499516 -567293 -958667 -408669 953253 1506635 408570 -1221760 -1940297 -1723366
37121 -1723366 -1370354 -1183336 -1105648 -1264012 -1474503 -1132219 -512065 -1019903 -2880010
37112 -2880010 -3823609 -1925320 1192465 2220377 745000 -474347 156774 1030507 397055
37103 397055 -846093 -836281 381544 1213890 833012 -141551 -713723 -355874 721789
37094 721789 1497080 887205 -887132 -2277167 -2186495 -1128364 -243955 44448 -30899
37085 -30899 -156277 81988 1013335 2154044 2413234 1537527 594824 511366 905784 919217
37075 919217 433615 -116715 -455584 -489252 -306489 -487464 -1517370 -2564481 -2034732
37066 -2034732 60374 1586176 1047421 -362544 -650605 150223 517238 -12541 -503862
$$ packed form
37130d99516o7777l91374N49998J361922N53382j098065j630330p18537K16931
37121a723366L53012J87018P7688j58364k10491L42284O20154n07838j860107
37112b880010r43599J898289L117785J027912j475377j219347O31121Q73733o33452
37103C97055j243148R812J217825Q32346l80878r74563n72172L57849J077663
37094G21789P75291o09875j774337j390035R0672J058131Q84409K88403p5347
37085c0899j25378K38265R31347J140709K59190q75707r42703q3458L94418J3433
37075I19217m85602n50330l38869l3668J82763j80975j029906j047111N29749
37066b034732K095106J525802n38755j409965k88061Q00828L67015n29779m91321
$$ plain form
37057 -503862 -500759 -658062 -1393473 -2134056 -2203781 -1681581 -1171367 -1164999 -1572916 -1601530 -508978
37046 -508978 1171219 1877346 1072714 169653 500431 1284900 918687 -450379 -1260421
37037 -1260421 -1076624 -1014645 -1553880 -1668994 -664477 578185 935262 483824 -168754
37028 -168754 -988314 -2000677 -2453390 -1618833 -98914 709251 455696 292230 1208526
37019 1208526 2530807 2652451 1139624 -469160 -377065 1180220 2048319 831258 -1230450
37010 -1230450 -1823584 -609629 403715 -329395 -1860895 -2224120 -1109697 -13186 -58278
37001 -58278 -790103 -1211592 -999001 -307456 733036 1669305 1579151 164742 -1398943
36992 -1398943 -1620049 -500903 670396 1155966 1381257 1756367 2035770 2068047 2107396
$$ packed form
37057e03862L103j57303p35411p40583o9725N22200N10214O368m07917k8614J092552
37046e08978J680197P06127q04632r03061L30778P84469l66213j369066q10042
37037a260421J83797O1979n39235j15114J004517J242662L57077m51438o52578
37028a68754q19560j012363m52713Q34557J519919Q08165k53555j63466R16296
37019A208526J322281J21644j512827j608784R2095J557285Q68099j217061k061708
37010a230450n93134J213955J013344p33110j531500l63225J114423J096511m5092
37001e8278p31825m21489K12591O91545J040492R36269r0154j414409j563685
36992a398943k21106J119146J171299M85570K25291L75110K79403L2277L9349
$$ plain form
36983 2107396 2127688 1930973 2105535 3474170 5387462 6511121 7884945 12536978 20273106
36974 20273106 25433345 22922425 14947070 8358608 6183612 5543464 3764972 2220485
36966 2220485 2756965 4035216 3825694 2486769 1792297 2028206 2350303 2609631 2884668
36957 2884668 2429400 936782 -218140 251155 1486365 1832334 1266471 823696 563180
36948 563180 -90883 -757234 -645893 -95154 95970 214710 820305 1105581 30188
36939 30188 -1415068 -1204541 579129 1646980 762274 -723166 -1012687 -16624 1148278
36930 1148278 1604496 1202920 468726 289201 928376 1471065 1055100 255182 144562
36921 144562 447534 60354 -867143 -992350 36989 994093 900608 116372 -589716 -806647
$$ packed form
36983B107396K0292j96715J74562J368635J913292J123659J373824M652033P736128
36974B0273106N160239k510920p975355o588462k174996o40148j778492j544487
36966B220485N36480J278251k09522j338925o94472K35909L22097K59328K75037
36957B884668m55268j492618j154922M69295J235210L45969n65863m42775k60516
36948E63180o54063o66351J11341N50739J91124J18740O05595K85276j075393
36939C0188j445256K10527J783670J067851q84706j485440k89521R96063J164902
36930A148278M56218m01576p34194j79525O39175N42689m15965p99918j10620
36921A44562L02972l87180r27497j25207J029339R57104r3485p84236p06088k16931
$$ plain form
36911 -806647 -221714 1083762 1986783 1373661 -48182 -495086 221751 567493 206432
36902 206432 980316 3908678 7010734 7665737 5940720 4010974 3128992 2767071 2282368
36893 2282368 1821394 1519089 1062016 394552 46490 399469 1141271 1760745 2258290
36884 2258290 3034703 4143957 4924360 4591915 3206048 1793419 1339357 1855787 2621228
36875 2621228 3041587 2971007 2488306 1792486 1180384 843194 848866 1366459 2394867 3228896
36865 3228896 3140965 2899836 4294105 7319313 9314756 8405139 6507807 6776636 8866412
36856 8866412 9341619 6732714 3497404 2246932 2442698 2156757 1189791 723474 1082458
36847 1082458 1527567 1666911 1726787 1743581 1487010 970958 371350 -280757 -871560 -1099047
$$ packed form
36911h06647N84933J305476R03021o13122j421843m46904P16837L45742l61061
36902B06432P73884K928362L102056O55003j725017j929746q81982l61921m84703
36893B282368m60974l02305m57073o67464l48062L52979P41802O19474M97545
36884B258290P76413J109254P80403l32445j385867j412629m54062N16430P65441
36875B621228M20359p0580m82701o95820o12102l37190N672N17593J028408Q34029
36865C228896q7931k41129J394269L025208J995443r09617j897332K68829K089776
36856H866412M75207k608905l235310j250472J95766k85941r66966m66317L58984
36847A082458M45109J39344N9876J6794k56571n16052n99608o52107n90803k27487
$$ plain form
36837 -1099047 -969442 -877604 -885245 -559601 169989 731312 792024 623674 338922 -231019
36827 -231019 -595519 200389 1882594 2811519 2365637 2043832 3032014 4089939 3503708
36818 3503708 1998225 1650373 2529935 2655919 1266149 -39921 44633 625596 338789
36809 338789 -443157 -398103 606405 1407654 1228699 468382 -97597 -157996 126992 424831
36799 424831 446656 196141 22183 169124 351806 119082 -394980 -533511 -100282 143847
36789 143847 -608221 -2006299 -2781244 -2243311 -1054910 -287420 -162482 -141995 83298
36780 83298 296451 341498 404084 596072 743901 782262 965228 1437291 1890507 1932037
36770 1932037 1623128 1399211 1524337 1826517 1996388 2016987 2151822 2457346 2498649 1855944
$$ packed form
36837a099047J29605R1838p641L25644P29590N61323O0712j68350k84752n69941
36827b31019l64500P95908J682205R28925m45882l21805R88182J057925n86231
36818C503708j505483l47852Q79562J25984j389770j306070Q4554N80963k86807
36809C38789p81946M5054J004508Q01249j78955p60317n65979o0399K84988K97839
36799D24831K1825k50515j73958J46941J82682k32724n14062j38531M33229K44129
36789A43847p52068j398078p74945N37933J188401P67490J24938K0487K25293
36780H3298K13153M5047O2586J91988J47829L8361J82966M72063M53216M1530
36770A932037l08909k23917J25126L02180J69871K0599J34835L05524M1303o42705
$$ plain form
36760 1855944 857107 352560 643281 1134977 1284175 1275180 1339998 1130815 558202 638488
36750 638488 2325571 4688030 5519661 4034703 1907424 1158370 1858512 2541597 2241825
36741 2241825 1365088 814464 897743 1153255 982874 387980 13574 298939 762801 565824
36731 565824 -294968 -922394 -718398 -49935 480833 829700 1187844 1329529 809616 -331728
36721 -331728 -1438268 -1833609 -1421856 -719396 -314089 -277588 -221680 66790 410397 806165
36711 806165 1611946 2679903 2940220 1729557 75681 -496948 -218877 -725165 -2301517
36702 -2301517 -3070113 -1711174 364184 852780 -291798 -1066177 -452675 321661 -127975
36693 -127975 -1296367 -1637927 -700844 556957 1298459 1669330 1960891 1783277 716906
$$ packed form
36760A855944r98837n04547K90721M91696J49198q995O4818k09183n72613Q0286
36750F38488J687083K362459Q31631j484958k127279p49054P00142O83085k99772
36741B241825q76737n50624Q3279K55512j70381n94894l74406K85365M63862j96977
36731E65824q60792o27426K03996O68463N30768L48867L58144J41685n19913j141344
36721c31728j106540l95341M11753P02460M05307L6501N5908K88470L43607L95768
36711H06165Q05781J067957K60317j210663j653876n72629K78071n06288j576352
36702b301517p68596J358939K075358M88596j144578p74379O13502P74336m49636
36693a27975j168392l41560R37083J257801P41502L70871K91561j77614j066371
$$ plain form
36684 716906 -671234 -1262311 -764528 46640 511626 757638 979586 875708 299031
36675 299031 -230386 -322088 -452059 -1157507 -1973951 -2029363 -1375099 -853331 -850087 -1042257
36665 -1042257 -1229390 -1506002 -1638753 -1170120 -231699 546363 1025700 1661633 2490890
36656 2490890 2842503 2325280 1402275 691103 284607 7163 -222450 -520329 -1012855
36647 -1012855 -1485465 -1529587 -1151592 -730964 -339949 262952 900322 1002358 584252 420375
36637 420375 869901 1255086 930900 347519 364678 916803 1118013 566642 -165185 -479535
36627 -479535 -602517 -1060400 -1602396 -1276839 238774 1900735 2401100 1732519 1016211
36618 1016211 899136 920813 566867 71510 -192397 -353423 -623146 -922245 -1325952 -2107560
$$ packed form
36684G16906j388140n91077M97783Q11168M64986K46012K21948j03878n76677
36675B99031n29417r1702j29971p05448q16444n5412O54264N21768L244j92170
36665a042257j87133k76612j32751M68633R38421P78062M79337O35933Q29257
36656B490890L51613n17223r23005p11172m06496k77444k29613k97879m92526
36647a012855m72610m4122L77995M20628L91015O02901O37370J02036m18106j63877
36637D20375M49526L85185l24186n83381J7159N52125K01210n51371p31827l14350
36627d79535j22982m57883n41996L25557J515613J661961N00365o68581p16308
36618A016211j17075K1677l53946m95357k63907j61026k69723k99099m03707p81608
$$ plain form
36608 -2107560 -2892832 -2689490 -1388706 -289239 -329900 -739784 -397038 391209 598620
36599 598620 151693 -351007 -886682 -1659253 -2100411 -1595072 -756555 -646033 -1092413 -1052921
36589 -1052921 -282835 548536 982999 890730 90987 -930360 -767867 947859 2258774
36580 2258774 1355063 -547959 -963198 28781 289882 -481256 -364717 1064662 1667268
36571 1667268 269236 -1413788 -1630459 -1066506 -1023792 -1121195 -451964 520894 869353
36562 869353 847361 1151057 1423775 825264 -536181 -1772915 -2280681 -1903096 -695625
36553 -695625 779592 1522142 1054054 -136690 -1354949 -2266417 -2601976 -2144912 -1231373
36544 -1231373 -520977 -173670 86977 315603 563499 1272285 2357474 2539754 1046977
$$ packed form
36608b107560p85272K03342J300784J099467m0661m09884L42746P88247K07411
36599E98620m46927n02700n35675p72571m41158N05339Q38517J10522m46380L9492
36589a052921P70086Q31371M34463r2269p99743j021347J62493J715726J310915
36580B258774r03711j903022m15239R91979K61101p71138J16539J429379O02606
36571A667268j398032j683024k16671N63953M2714r7403O69231R72858L48459
36562H69353k1992L03696K72718n98511j361445j236734n07766L77585J207471
36553f95625J475217P42550m68088j190744j218259r11468l35559M57064R13539
36544a231373P10396L47307K60647K28626K47896P08786J085189J82280j492777
$$ plain form
36535 1046977 -654509 -597843 787445 1535912 1344160 1497641 1981160 1483620 333865
36526 333865 422483 1700679 1796761 23058 -1213873 -280161 1210865 1344784 740476
36517 740476 664978 646871 -81763 -734746 -470407 -37663 -208301 -235404 474840 838366
36507 838366 -58602 -1173111 -1240547 -784833 -792714 -896605 -467799 -14761 61440 557018
36497 557018 1772905 2385739 1637518 932159 1467685 2027743 1158879 -87290 159814
36488 159814 1516826 2245390 2101069 2018457 1880790 879779 -511145 -1001036 -512960
36479 -512960 3336 333118 926804 1500439 1290387 463905 -26595 198260 713829 1124032
36469 1124032 1355506 1434740 1418765 1163544 227778 -1190381 -1665508 -357538 1087617
$$ packed form
36535A046977j701486N6666J385288P48467j91752J53481M83519m97540j149755
36526C33865Q8618J278196R6082j773703j236931R33712J491026J33919o04308
36517G40476p5498j8107p28634o52983K64339M32744j70638k7103P10244L63526
36507H38366q96968j114509o7436M55714p881j03891M28806M53038P6201M95578
36497E57018J215887O12834p48221p05359N35526N60058q68864j246169K47104
36488A59814J357012P28564j44321q2612j37667j001011j390924m89891M88076
36479e12960N16296L29782N93686N73635k10052q26482m90500K24855N15569M10203
36469A124032K31474P9234j5975k55221r35766j418159m75127J307970J445155
$$ plain form
36460 1087617 540346 -1094305 -1050613 720660 1423113 257217 -287063 968147 1814981
36451 1814981 880615 163859 1113982 1764498 498480 -663758 313172 1527925 277798
36442 277798 -2290370 -3209765 -2428261 -2066597 -2489511 -2378895 -1572972 -984686 -672460
36433 -672460 -308491 -400375 -1056326 -987118 415485 1676273 1589749 1022565 838751 401575
36423 401575 -296357 212568 1874172 2327927 909923 33200 704891 628280 -1004531
36414 -1004531 -1321518 767029 1654502 -855941 -3232903 -2102704 126422 38438 -857971
36405 -857971 127923 1462662 886327 260853 1695723 2835649 1255294 -572374 56007
36396 56007 930730 -162073 -446825 2057752 3331465 531060 -1529945 1500936 5047748
$$ packed form
36460A087617n47271j634651M3692J771273P02453j165896n44280J255210Q46834
36451A814981r34366p16756R50123O50516j266018j162238R76930J214753j250127
36442B77798k568168r19395P81504L61664m22914J10616Q05923N88286L12226
36433f72460L63969r1884o55951O9208J402603J260788q6524n67184j83814m37176
36423D01575o97932N08925J661604M53755j418004q76723O71691p6611j632811
36414a004531l16987K088547Q87473k510443k376962J130199K229126q7984q96409
36405h57971R85894J334739n76335o25474J434870J139926j580355j827668O28381
36396E6007Q74723j092803k84752K504577J273713k800405k061005L030881L546812
$$ plain form
36387 5047748 3556001 652761 2133024 5069201 4055706 2058687 4067247 6336155
36379 6336155 3837290 1638116 5807835 10420717 8304889 6396209 13226423 20523033
36371 20523033 18313168 18228939 34870884 53809556 54641930 61499700 122340775 225186661
36363 225186661 283943320 239087892 135880534 64665362 51797189 53558505 38171754
36356 38171754 21124769 20126528 23285240 16464714 8029869 9016638 12757869 9982953
36348 9982953 5717405 7166837 9645909 6931539 3224643 3938621 5367264 3143541
36340 3143541 1183722 3413359 5606971 3643060 1485348 3231573 5137958 3020400
36332 3020400 182672 723414 1885859 170715 -1417596 733992 3601801 2979543
$$ packed form
36387E047748j491747k903240J480263K936177j013495j997019K008560K268908
36379F336155k498865k199174M169719M612882k115828j908680O830214P296610
36371B0523033k209865q4229J6641945J8938672Q32374O857770O0841075J02845886
36363B25186661N8756659m4855428j03207358p1215172j2868173J761316j5386751
36356C8171754j7046985r98241L158712o820526q434845R86769L741231k774916
36348I982953m265548J449432K479072k714370l706896P13978J428643k223723
36340C143541j959819K229637K193612j963911k157712J746225J906385k117558
36332C020400k837728N40742J162445j715144j588311K151588K867809o22258
$$ plain form
36324 2979543 841447 848542 1581182 449797 -526879 1020742 2398657 733398 -1128502
36315 -1128502 340414 2561617 1299175 -1807101 -2410048 -1005626 -1133255 -2587110
36307 -2587110 -2404801 -708237 -45726 -417741 85877 1060887 759749 9270 916182
36298 916182 2776023 3115784 1771052 527377 -116599 -700565 -658599 593641 1778838
36289 1778838 1646567 1194027 1558745 1660793 528080 -216867 956211 2459739 2225015
36280 2225015 1290972 1716116 2913695 3172629 2897556 3173028 2972136 1081064 -868782
36271 -868782 -595348 1035882 1535924 753895 306879 403438 214936 149845 884747 1363732
36261 1363732 494892 -483882 3388 993988 811549 141731 402232 745690 -136454
$$ packed form
36324B979543k138096P095P32640j131385r76676J547621J377915j665259j861900
36315a128502J468916K221203j262442l106276o02947J404422j27629j453855
36307b587110J82309J696564O62511l72015N03618R75010l01138p50479R06912
36298I16182J859841L39761j344732j243675o43976n83966M1966J252240J185197
36289A778838j32271m52540L64718J02048j132713p44947J173078J503528k34724
36280B225015r34043M25144J197579K58934k75073K75472k00892j891072j949846
36271h68782K73434J631230N00042p82029m47016R6559j88502o5091P34902M78985
36261A363732q68840r78774M87270R90600j82439o69818K60501L43458q82144
$$ plain form
36252 -136454 -837377 656398 3005936 3293707 1774201 1230959 2272828 2848677 2096110
36243 2096110 1266970 903642 208765 -735876 -911842 -494071 -497941 -550140 443069 1776849
36233 1776849 1762517 740858 594948 1522050 1975931 1575559 1331997 1180288 123254
36224 123254 -1221113 -1099901 216999 613436 -236185 -238821 1544736 3371730 3662973
36215 3662973 3025881 2586428 2355257 2050556 1783117 1354705 492995 -2489 862598
36206 862598 2210154 2141035 707898 -228390 -233189 -800990 -2175881 -2440338 -765527
36197 -765527 998335 1268216 917077 1047445 826733 -602273 -1949571 -1652604 -552809
36188 -552809 -543899 -1466473 -1454878 76207 1700230 2168799 1758928 1260072 864223 426276
$$ packed form
36252a36454p00923J493775K349538K87771j519506n43242J041869N75849p52567
36243B096110q29140l63328o94877r44641j75966M17771l870n2199R93209J333780
36233A776849j4332j021659j45910R27102M53881m00372k43562j51709j057034
36224A23254j344367J21212J316900L96437q49621k636J783557J826994K91243
36215C662973o37092m39453k31171l04701k67439m28412q61710m95484Q65087
36206H62598J347556o9119j433137r36288m799n67801j374891k64457J674811
36197g65527J763862K69881l51139J30368k20712j429006j347298K96967J099795
36188e52809Q910r22574J1595J531085J624023M68569m09871m98856l95849m37947
$$ plain form
36178 426276 -2625 -272927 -335478 -189000 88638 259434 113196 -310154 -816328 -1221631
36168 -1221631 -1328494 -977660 -248579 610734 1490485 2352367 2853630 2506527 1401895
36159 1401895 367838 113027 470078 752333 644437 411936 299660 90232 -519660
36150 -519660 -1275684 -1489644 -918660 -129465 308068 563000 979055 1266810 1131748 1313466
36140 1313466 2701016 4436803 4458993 2430203 579931 674473 1561103 1129506 -415172
36131 -415172 -1075143 -285167 397129 -41684 -546660 106027 1233516 1217827 -119549
36122 -119549 -1299404 -1287972 -817865 -1114851 -1907695 -1612653 443814 2877787 3884984
36113 3884984 3362172 2569118 2182353 1806424 1222433 863499 875974 825108 629657 771604
$$ packed form
36178D26276m28901k70302o2551J46478K77638J70796j46238m23350n06174m05303
36168a221631j06863L50834P29081Q59313Q79751Q61882N01263l47103j104632
36159A401895j034057k54811L57051K82255j07896k32501j12276k09428o09892
36150e19660p56024k13960N70984P89195M37533K54932M16055K87755j35062J81718
36140A313466J387550J735787K2190k028790j850272R4542Q86630m31597j544678
36131d15172o59971P89976O82296m38813n04976O52687J127489j5689j337376
36122a19549j179855J1432M70107k96986p92844K95042K056467K433973J007197
36113C884984n22812p93054l86765l75929n83991l58934J2475n0866j95451J41947
$$ plain form
36103 771604 1257858 1376407 853680 299111 149914 125633 16533 -26496 -234456 -1041479
36093 -1041479 -1864365 -1460243 18059 820049 128087 -728405 -430966 508848 1142988
36084 1142988 1755130 2799564 3533229 3205788 2497978 2291494 2031957 852633 -580171
36075 -580171 -934763 -223128 513764 854544 962623 659740 -18361 -74268 1118162 2383934
36065 2383934 2192095 934926 202287 344641 406853 59518 -68570 266520 745670
36056 745670 1368338 2104983 2102608 788659 -652937 -609057 461262 626028 -604108
36047 -604108 -1814170 -2116551 -2099665 -2073518 -1276512 499771 2040224 2241892 1387887
36038 1387887 331662 -521332 -943532 -666373 22202 343652 118396 -50770 4907
$$ packed form
36103G71604M86254J18549n22727n54569j49197k4281j09100m3029k07960q07023
36093a041479q22886M04122J478302Q01990o91962q56492K97439R39814O34140
36084A142988O12142J044434P33665l27441p07810k06484k59537j179324j432804
36075e80171l54592P11635P36892L40780J08079l02883o78101n5907J192430J265772
36065B383934j91839j257169p32639J42354O2212l47335j28088L35090M79150
36056G45670O22668P36645k375j313949j441596M3880J070319J64766j230136
36047f04108j210062l02381J6886K6147P97006J776283J540453K01668q54005
36038A387887j056225q52994m22200K77159O88575L21450k25256j69166N5677
$$ plain form
36029 4907 -395679 -1489001 -2268751 -1714582 -279502 540584 -54005 -1299746 -1782997
36020 -1782997 -1075145 -253449 -526387 -1551892 -1862204 -992072 -100715 -68119 -231009
36011 -231009 150392 431655 -155069 -854820 -534856 339017 522164 171062 446824 1330507
36001 1330507 1648418 1155845 852975 1153854 1365252 1171026 1109358 1283454 983975 -44976
35991 -44976 -1130042 -1700653 -1736304 -1151351 53401 973278 448607 -1258875 -2604255
35982 -2604255 -2699478 -1983751 -1016167 22589 591676 90063 -863686 -945504 -199337 -9044
35972 -9044 -605732 -391975 1414327 3127013 2828756 1024293 -294442 -363772 -49315
35963 -49315 -28420 68891 650580 1245213 972290 -371612 -1920000 -2527958 -2025756 -1421429
$$ packed form
36029D907m00586j093322p79750N54169J435080Q20086n94589j245741m83251
36020a782997P07852Q21696k72938j025505l10312Q70132Q91357L2596j62890
36011b31009L81401K81263n86724o99751L19964Q73873J83147l51102K75762Q83683
36001A330507L17911m92573l02870L00879K11398j94226o1668J74096k99479j028951
35991d4976j085066n70611l5651N84953J204752R19877n24671j707482j345380
35982b604255r5223P15727R67584J038756N69087n01613r53749q1818P46167J90293
35972i044n96688K13757J806302J712686k98257j804463j318735o9330L14457
35963d9315K0895R7311N81689N94633k72923j343902j548388o07958N02202O04327
$$ plain form
35953 -1421429 -1554521 -1933859 -1523801 -364322 441811 268254 -342700 -565055 -143803
35944 -143803 657442 1313784 1312724 817313 860160 2107591 3650498 3917563 2634851 962703
35934 962703 -139495 -666850 -823622 -665709 -558845 -951842 -1532568 -1477951 -626825 351632
35924 351632 843711 561553 -705636 -2528637 -3370198 -2021689 596012 2360536 2571709
35915 2571709 2296779 2261748 2066079 1632525 1673831 2182303 2004960 645927 -772843
35906 -772843 -1056776 -398064 258385 311260 -438677 -1737980 -2492914 -1589766 439978
35897 439978 1712862 1390379 586951 431006 569903 300148 -116908 -199371 -246971 -630117
35887 -630117 -893646 -442228 524111 1414426 1918186 1773913 708412 -797263 -1505005
$$ packed form
35953a421429j33092l79338M10058J159479Q06133j73557o10954k22355M21252
35944a43803Q01245O56342j060m95411M2847J247431J542907K67065j282712j672148
35934I62703j102198n27355j56772J57913J06864l92997n80726N4617Q51126R78457
35924C51632M92079k82158j267189j823001q41561J348509K617701J764524K11173
35915B571709k74930l5031j95669m33554M1306N08472j77343j359033j418770
35906g72843k83933O58712O56449N2875p49937j299303p54934R03148K029744
35897D39978J272884l22483q03428j55945J38897k69755m17056q2463m7600l83146
35887f30117k63529M51418R66339Q90315N03760j44273j065501j505675p07742
$$ plain form
35878 -1505005 -833143 429434 1326625 1842464 2284221 2464145 2191506 1819221 1622575
35869 1622575 1306820 717726 319644 352053 222476 -594310 -1665658 -2227191 -2144743 -1729684
35859 -1729684 -1198448 -845560 -1128210 -1954872 -2380574 -1620180 -70069 1078130 989616
35850 989616 -196361 -1508587 -1847081 -1030253 -124164 -189006 -876244 -1007976 -304372
35841 -304372 434669 659114 434979 -337343 -1700705 -2686094 -2141217 -686831 -213370
35832 -213370 -1085546 -1580854 -678252 406030 358314 -297467 -606222 -985189 -2156387
35823 -2156387 -3439505 -3608868 -2664035 -1491538 -501154 265091 450592 15186 -116305
35814 -116305 799893 2095915 2649472 2451692 2160222 1752393 854056 -77930 -189319
$$ packed form
35878a505005O71862J262577Q97191N15839M41757J79924k72639l72285j96646
35869A622575l15755n89094l98082L2409j29577q16786j071348n61533Q2448M15059
35859a729684N31236L52888k82650q26662m25702P60394J550111J148199q8514
35850I89616j185977j312226l38494Q16828R06089o4842o87238j31732P03604
35841c04372P39041K24445k24135p72322j363362r85389N44877J454386M73461
35832b13370q72176m95308R02602J084282m7716o55781l08755l78967j171198
35823b156387j283118j69363R44833J172497R90384P66245J85501m35406j31491
35814a16305R16198J296022N53557j97780k91470m07829q98337r31986j11389
$$ plain form
35805 -189319 374582 622462 154816 -498901 -862726 -941970 -729954 -128818 555575 708460
35795 708460 175519 -455402 -471948 215215 937594 908631 172168 -254831 429480 1725560
35785 1725560 2531594 2632323 2626054 2621676 2150227 1308443 724784 307756 -626472 -1815930
35775 -1815930 -2132736 -1518166 -1234357 -1672639 -1607638 -418166 630055 366475 -552075
35766 -552075 -1049365 -1313000 -1775554 -1784860 -770124 396105 658659 392222 372076 210929
35756 210929 -645710 -1366046 -864715 289117 756634 545973 590272 843444 564566 41707
35746 41707 195821 682634 213756 -1159587 -1778689 -752101 783787 1278411 634480
35737 634480 -17116 226889 1119379 1495101 500663 -1224475 -2107444 -1679418 -1181887
$$ packed form
35805a89319N63901K47880m67646o53717l63825p9244K12016O01136O84393J52885
35795G08460n32941o30921j6546O87163P22379k8963p36463m26999O84311J296080
35785A725560Q06034J00729o269m378m71449q41784n83659m17028r34228j189458
35775a815930l16806O14570K83809m38282O5001J189472J048221k63580r18550
35766e52075m97290k63635m62554r306J014736J166229K62554k66437k0146j61147
35756B10929q56639p20336N01331J153832M67517k10661M4299K53172k78878n22859
35746D1707J54114M86813m68878j373343o19102J026588J535888M94624o43931
35737F34480o51596K44005Q92490L75722r94438j725138q82969M28026M97531
$$ plain form
35728 -1181887 -1552630 -1911359 -1095000 325931 954928 716517 567117 621407 202888
35719 202888 -515711 -553181 164939 550251 8127 -794768 -1018428 -583339 105982 630697
35709 630697 755143 720140 1081417 1754895 1831903 1014212 357924 583224 598879 -878222
35699 -878222 -2989943 -3651317 -2337638 -394739 1019000 1678230 1357301 -45324 -1553137
35690 -1553137 -1973547 -1655338 -1764473 -2036764 -1217515 299376 547102 -836477 -1726125
35681 -1726125 -692543 912643 1205066 370729 -318375 -618715 -935712 -966028 -290520
35672 -290520 443196 381184 -61700 62438 499177 200389 -781475 -1241268 -738730 -241256
35662 -241256 -470139 -752887 -210081 758937 1071172 559082 -9945 -363698 -1091183 -2281473
$$ packed form
35728a181887l70743l58729Q16359J420931O28997k38411j49400N4290m18519
35719B02888p18599l7470P18120L85312n42124q02895k23660M35089O89321N24715
35709F30697J24446l5003L61277O73478P7008q17691o56288K25300J5655j477101
35699h78222k111721o61374J313679J942899J413739O59230l20929j402625j507813
35690a553137m20410L18209j09135k72291Q19249J516891K47726j383579q89648
35681a726125J033582J605186K92423q34337o89104l00340l16997l0316O75508
35672b90520P33716o2012m42884J24138M36739k98788r81864m59793N02538M97474
35662b41256k28883k82748N42806R69018L12235n12090n69027l53753p27485j190290
$$ plain form
35652 -2281473 -2842827 -1994680 -704270 -503874 -1247536 -1352441 -249148 835287 913974
35643 913974 652387 980013 1514037 1413552 871761 631953 720231 737703 797858 1123589
35633 1123589 1313943 1079184 1074456 1835502 2524999 2089350 1128533 1100631 2015540 2541855
35623 2541855 2288846 2291872 3005736 3384045 2499441 888250 -274793 -461920 106697
35614 106697 844849 1046036 493049 -91889 47877 483744 251235 -474957 -609627 -19975
35604 -19975 286698 40896 218682 1132574 1543113 604923 -573624 -501003 478954 821509
35594 821509 94428 -615055 -457688 120034 248156 -254316 -983811 -1631575 -2101450 -2180122
35584 -2180122 -1593434 -529173 244508 141079 -506748 -867772 -663094 -271779 135113
$$ packed form
35652b281473n61354Q48147J290410K00396p43662j04905J103293J084435P8687
35643I13974k61587L27626N34024j00485n41791k39808Q8278J7472O0155L25731
35633A123589J90354k34759m728P61046O89497m35649r60817k7902R14909N26315
35623B541855k53009L026P13864L78309q84604j611191j163043j87127N68617
35614A06697P38152K01187n52987n84938J39766M35867k32509p26192j34670N89652
35604a9975L06673k45802J77786R13892M10539r38190j178547P2621R79957L42555
35594H21509p27081p09483J57367N77722J28122n02472p29495o47764m69875p8672
35584b180122N86688J064261P73681j03429o47827l61024K04678L91315M06892
$$ plain form
35575 135113 789164 1494744 1478484 497577 -668834 -1310366 -1592213 -1785959 -1623430 -1102058
35565 -1102058 -980577 -1597307 -2081084 -1684106 -988496 -732572 -419122 615883 1664130
35556 1664130 1658225 955453 584312 485060 175316 349232 1757906 3074040 2232944 -200806
35546 -200806 -1355939 -13321 1951489 2560310 2050206 1461304 874800 112132 -363635
35537 -363635 -316790 -327081 -677011 -748162 -209900 290127 249222 51218 41619 -40001 -198074
35526 -198074 109561 877525 1278589 959792 497146 170651 -459586 -1311088 -1444560 -534671
35516 -534671 568904 1233069 1677807 1808509 988013 -389543 -745484 365352 1306337
35507 1306337 713771 -648605 -1408420 -1483532 -1306263 -596927 735652 1724305 1739542
$$ packed form
35575A35113O54051P05580j6260r80907j166411o41532k81847j93746J62529N21372
35565a102058J21481o16730m83777L96978O95610K55924L13450J035005J048247
35556A664130n905p02772l71141r9252l09744J73916J408674J316134q41096k433750
35546b00806j155133J342618J964810O08821n10104n88902n86504p62668m75767
35537c63635M6845j0291l49930p1151N38262N00027m0905j98004r599q1620j58073
35526a98074L07635P67964M01064l18797m62646l26495o30237q51502j33472R09889
35516e34671J103575O64165M44738J30702q20496j377556l55941J110836R40985
35507A306337n92566j362376p59815p5112J77269P09336J332579R88653J5237
$$ plain form
35498 1739542 1597590 1946352 1800360 258400 -1450680 -1453913 18391 1159979 1308854
35489 1308854 1374246 1839034 2028930 1454169 581027 83410 157248 531879 593612 -96886
35479 -96886 -876807 -349879 1574823 3011539 2526157 1199970 900374 1476319 1413077
35470 1413077 573260 290326 964379 1494780 1234299 800008 641641 320071 -380091
35461 -380091 -922559 -1007653 -945634 -739243 46255 1175438 1680333 1297440 824167 640658
35451 640658 137109 -783152 -957112 270875 1604496 1400208 46076 -622872 21756
35442 21756 726610 449425 -196089 -212176 59430 -474088 -1739751 -2278237 -1141853 794825
35432 794825 1870254 1441234 170377 -990353 -1438047 -926762 191766 863478 370232
$$ packed form
35498A739542j41952L48762j45992j541960j709080l233J472304J141588J48875
35489A308854O5392M64788J89896n74761q73142m97617P3838L74631O1733o90498
35479i6886p79921N26928J924702J436716m85382j326187k99596N75945o3242
35470A413077q39817k82934O74053N30401k60481m34291j58367l21570p00162
35461c80091n42468q5094O2019K06391P85498J129183N04895l82893m73273j83509
35451F40658n03549r20261j73960J227987J333621k04288j354132o68948O44628
35442B1756P04854k77185o45514j6087K71606n33518j265663n38486J136384J936678
35432G94825J075429m29020j270857j160730m47694N11285J118528O71712m93246
$$ plain form
35423 370232 -487898 -184858 1368855 2472501 1900615 553232 108202 800425 1458613
35414 1458613 1245930 392776 -562934 -1326216 -1600679 -1069634 106239 1194692 1539962
35405 1539962 1160378 643148 523191 746371 769534 303754 -206619 -184944 172940 172102
35395 172102 -251519 -394955 94892 727085 1042085 1206190 1356988 1131755 376565 -350867
35385 -350867 -565282 -540765 -650994 -663542 -364344 -263196 -823356 -1429414 -1062921 166149
35375 166149 1015663 678776 -298343 -812390 -484613 50404 -4085 -592893 -845329 -318236
35365 -318236 185782 -271667 -1099549 -747623 898494 1973866 1137366 -508402 -973775
35356 -973775 13395 1124431 1570124 1822771 2321237 2603854 2035210 765533 -329718
$$ packed form
35423C70232q58130L03040J553713J103646n71886j347383m45030O92223O58188
35414A458613k12683q53154r55710p63282k74463N31045J175873J088453L45270
35405A539962l79584n17230j19957K23180K3163m65780n10373K1675L57884q38
35395A72102m23621j43436M89847O32193L15000J64105J50798k25233p55190p27432
35385c50867k14415K4517j10229j2548K99198J01148n60160o06058L66493J229070
35375A66149Q49514l36887r77119n14047L27777N35017n4489n88808k52436N27093
35365c18236N04018m57449q27882L51926J646117J075372q36500j645768m65373
35356i73775R87170J111036M45693K52647M98466K82617n68644j269677j095251
$$ plain form
35347 -329718 -493606 87166 267957 -858350 -2643865 -3381411 -2403306 -966786 -566660
35338 -566660 -1082212 -1260474 -443877 901876 1918864 1974988 999613 -229541 -626858
35329 -626858 -128578 147249 -418518 -966798 -619069 16370 -112802 -720443 -740774 -161350
35319 -161350 65792 -297845 -482081 -44694 626013 1145275 1451900 1322874 589684 -132389
35309 -132389 75710 1130949 2023254 2250678 2243380 2266928 1928265 1083395 321883 68651
35299 68651 -114673 -816333 -1794579 -2158097 -1357769 190904 1385806 1417948 655009 329373
35289 329373 1082270 2147625 2342560 1437307 53196 -1258534 -2089165 -1829102 -298726
35280 -298726 1453729 2010491 1286266 513063 497595 788059 713768 355256 121027 37468
$$ packed form
35347c29718j63888N80772J80791j126307j785515p37546R78105J436520M00126
35338e66660n15552j78262Q16597J345753J016988N6124r75375j229154l97317
35329f26858M98280K75827n65767n48280L47729O35439j29172o07641k0331N79424
35319a61350K27142l63637j84236M37387O70707N19262L06625j29026p33190p22073
35309a32389K08099J055239Q92305K27424p298K3548l38663q44870p61512k53232
35299F8651j83324p01660r78246l63518Q00328J548673J194902L2142p62939l25636
35289C29373P52897J065355J94935r05253j384111j311730q30631K60063J530376
35280b98726J752455N56762p24225p73203j5468K90464p4291l58512k34229q3559
$$ plain form
35270 37468 -123473 -413621 -670174 -647705 -160790 602395 1033058 787342 357990 476310
35260 476310 1142953 1803143 2215896 2440071 2214498 1274446 230588 166187 1199964
35251 1199964 2283223 2582198 2209542 1399458 -26153 -1836783 -2877861 -2166053 -142873
35242 -142873 1699900 2196807 1226153 -496465 -1902320 -2195428 -1481646 -641473 -326502
35233 -326502 -324096 -125387 272685 520797 552926 589349 683194 717138 719281 705414 313627
35222 313627 -783674 -2016945 -2167911 -891708 573590 849438 165635 -162708 201679
35213 201679 166557 -946449 -2194050 -2310807 -1391063 -457760 -10626 87149 -157460 -695462
35203 -695462 -910494 -352133 362298 521841 762724 2063872 3583729 3349423 1323009
$$ packed form
35270C7468j60941k90148k56553K2469M86915P63185M30663k45716m29352J18320
35260D76310O66643O60190M12753K24175k25573r40052j043858o4401J033777
35251A199964J083259K98975l72656q10084j425611j810630j041078P11808K023180
35242a42873J842773M96907r70654j722618j405855k93108P13782Q40173L14971
35233c26502K406J98709L98072K48112L2129L6423R3845L3944K143j3867l91787
35222C13627j097301j233271j50966J276203J465298K75848o83803l28343L64387
35213B01679l5122j113006j247601j16757R19744R33303M47134R7775k44609n38002
35203f95462k15032N58361P14431J59543K40883J301148J519857k34306k026414
$$ plain form
35194 1323009 -101195 670599 2394532 3092229 2630737 2031535 1560001 940498 522906
35185 522906 784154 1249897 1143112 635885 383054 286040 -209853 -956699 -1253746 -929243
35175 -929243 -451526 -167478 -88377 -207938 -527609 -994483 -1623177 -2222759 -2036994 -588464
35165 -588464 1071042 1274278 199872 -135417 1097762 2273516 1935105 790069 -152571
35156 -152571 -1419790 -3269349 -3948603 -2117159 402632 861659 -432239 -978712 -165933
35147 -165933 329734 -107629 -177368 610621 994988 368179 -137931 264563 797024 786338
35137 786338 850223 1533838 2164916 1907493 889223 -304695 -1318031 -1862714 -1802647
35128 -1802647 -1564355 -1570292 -1390021 -520428 327839 123295 -608528 -438679 610183 1148884
$$ packed form
35194A323009j424204P71794J723933O97697m61492n99202m71534o19503m17592
35185E22906K61248M65743j06785n07227k52831r7014m95893p46846k97047L24503
35175i29243M77717K84048P9101j19561l19671m66874o28694n99582J85765J448530
35165e88464J659506K03236j074406l35289J233179J175754l38411j145036r42640
35156a52571j267219j849559o79254J831444K519791M59027j293898n46473Q12779
35147a65933M95667m37363o9739P87989L84367o26809n06110M02494N32461j0686
35137G86338O3885O83615O31078k57423j018270j193918j013336n44683O0067
35128a802647K38292n937J80271Q69593Q48267k04544p31823J69849J048862N38701
$$ plain form
35118 1148884 814187 662770 1044279 1054820 438194 100037 305750 272816 -16273 358579
35108 358579 1061823 369417 -1842870 -3155420 -1942403 246773 1076027 496265 -122505
35099 -122505 -431169 -935845 -1476421 -1521637 -1271079 -1169559 -1017095 -617602 -473367 -793078
35089 -793078 -723724 319771 1441064 1512418 811853 298427 82463 -215273 -360315 -2054
35079 -2054 349460 29596 -600188 -713347 -246732 344022 917021 1315687 995021 50089
35069 50089 -212511 962581 2173896 1545613 -470887 -1626089 -1022768 -53143 -1530
35060 -1530 -333203 -35877 610501 624951 -6095 -309160 150221 579084 127832 -752591
35050 -752591 -777916 355910 1367188 1071968 51009 -223469 453989 849751 212337
$$ packed form
35118A148884l34697j51417L81509J0541o16626l38157K05713l2934k89089L74852
35108C58579P03244o92406k212287j312550J213017K189176Q29254n79762o18770
35099a22505l08664n04676n40576m5216K50558J01520J52464L99493J44235l19711
35089g93078O9354J043495J121293P1354p00565n13426k15964k97736j45042L58261
35079b054L51514l19864o29784j13159M66615N90754N72999L98666l20666r44932
35069E0089k62600J175092J211315o28283k016500j155202O03321R69625N1613
35060a530l31673K97326O46378J4450o31046l03065M59381M28863m51252q80423
35050g52591k5325J133826J011278k95220j020959k74478O77458L95762o37414
$$ plain form
35041 212337 -823815 -1441642 -1539932 -1047621 393631 2357403 3368312 2646337 1265772
35032 1265772 664616 797430 771157 553765 774258 1253586 1092718 215462 -358429 -47739
35022 -47739 432919 215221 -414512 -490734 175612 712710 433489 -233343 -479376 -358103
35012 -358103 -554727 -1078684 -1178366 -742070 -635314 -1090706 -1003294 192081 1156520 570422
35002 570422 -619985 -631143 311340 610114 198617 429657 1258248 1145317 85877
34993 85877 75544 1731851 2981285 2368004 1362713 1770483 2850396 2893651 2035727
34984 2035727 1485579 1204647 385087 -631230 -810477 -208842 344968 795063 1562433
34975 1562433 2260523 2233523 1898259 2036849 2174839 1241784 -415840 -1293891 -982110
$$ packed form
35041B12337j036152o17827r8290M92311J441252J963772J010909p21975j380565
35032A265772o01156J32814k6273k17392K20493M79328j60868q77256n73891L10690
35022d7739M80658k17698o29733p6222O66346N37098k79221o66832k46033J21273
35012c58103j96624n23957r9682M36296J06756m55392Q7412J195375R64439n86098
35002E70422j190407j1158R42483K98774m11497K31040Q28591j12931j059440
34993H5877j0333J656307J249434o13281j005291M07770J079913M3255q57924
34984B035727n50148k80932q19560j016317j79247O01635N53810M50095P67370
34975A562433O98090k7000l35264J38590J37990r33055j657624q78051L11781
$$ plain form
34966 -982110 -615086 -849219 -834719 196861 1410541 1308808 -270112 -1852774 -2068883
34957 -2068883 -1235759 -818237 -1398972 -1887240 -1239085 -231787 -408683 -1649067 -2240681
34948 -2240681 -1390989 -130712 596754 1168558 1998566 2522561 2311780 1909187 1705428
34939 1705428 1207848 271678 -199803 285658 853447 689557 217321 -45673 -471915
34930 -471915 -1156982 -1161489 -89333 902093 860692 463280 503209 490451 117461 421474
34920 421474 1773494 2395354 965397 -818006 -658841 642993 572679 -987445 -1878812
34911 -1878812 -1359016 -755910 -535687 384866 1989272 2478595 1091760 -533436 -764353
34902 -764353 2890 606367 873235 1167767 1378365 1248635 935927 683701 558767 697630
$$ packed form
34966i82110L67024k34133J4500J031580J213680j01733j578920j582662k16109
34957b068883Q33124M17522n80735m88268O48155J007298j76896j240384n91614
34948b240681Q49692J260277P27466N71804Q30008N23995k10781m02593k03759
34939A705428m97580r36170m71481M85461N67789j63890m72236k62994m26242
34930d71915o85067m507J072156R91426m1401l97412L9929j2758l72990L04013
34920D21474J352020O21860j429957j783403J59165J301834p0314j560124q91367
34911a878812N19796O03106K20223R20553J604406M89323j386835j625196k30917
34902g64353P67243O03477K66868K94532K10598j29730l12708k52226j24934J38863
$$ plain form
34892 697630 1115566 1294068 742976 -195185 -928171 -1575146 -2283465 -2186041 -549673 1448649
34882 1448649 1857664 737435 -4887 401383 726150 190373 -236466 228500 737767
34873 737767 377676 -286794 -427922 -501920 -1198076 -1664971 -308881 2777981 5356408
34864 5356408 5316235 2881268 292375 -501748 377185 1313780 1281462 799797 767145 1186300
34854 1186300 1600517 2037011 2669140 3092783 2847033 2210875 1613530 789904 -466109
34845 -466109 -1280158 -701342 638599 1199348 660145 71607 46482 186483 272334 560735
34835 560735 731735 1847 -1314501 -1716168 -607494 667466 643722 -302672 -661293
34826 -661293 102238 975154 793540 -353405 -1251038 -950096 135665 742533 298235
$$ packed form
34892F97630M17936J78502n51092r38161p32986o46975p08319R7424J636368J998322
34882A448649M09015j120229p42322M06270L24767n35777m26839M64966N09267
34873G37767l60091o64470j41128p3998o96156m66895J356090L086862K578427
34864E356408m0173k434967k588893p94123Q78933R36595l2318m81665l2652M19155
34854A186300M14217M36494O32129M23643k45750o36158n97345q23626j256013
34845d66109q14049N78816J339941N60749n39203n88538k5125J40001Q5851K88401
34835E60735J71000p29888j316348m01667J108674J274960k3744r46394l58621
34826f61293P63531Q72916j81614j146945q97633L00942J085761O06868m44298
$$ plain form
34817 298235 -554524 -1071373 -1298103 -1470895 -1352129 -847052 -571832 -975944 -1451296 -1140693
34807 -1140693 -165522 697884 1070444 1006655 555036 -39384 -347409 -586419 -1547038 -2973659
34797 -2973659 -3175592 -1327427 977162 1781488 1313065 997771 978241 422973 -444476
34788 -444476 -560784 109255 648236 832249 1111198 1289973 845072 261433 440594 1002136
34778 1002136 738742 -411549 -1308456 -1314939 -708206 242323 1202591 1256712 -581 -1297719
34768 -1297719 -1155892 -37536 516493 247904 -21714 -197916 -562749 -366289 1010073
34759 1010073 2134031 1241467 -600060 -747459 834288 1568173 585121 -14547 1084640
34750 1084640 2296027 1960942 849262 443850 715424 962517 1207104 1504900 1295176
$$ packed form
34817B98235q52759n16849k26730j72792J18766N05077K75220m04112m75352L10603
34807a140693R75171Q63406L72560o3789m51619n94420l08025k39010r60619j426621
34797b973659k01933J848165K304589Q04326m68423l15294j9530n55268q67449
34788d44476j16308O70039N38981J84013K78949J78775m44901n83639J79161N61542
34778A002136k63394j150291q96907o483O06733R50529R60268N4121j257293j297138
34768a297719J41827J118356N54029k68589k69618j76202l64833J96460J376362
34759A010073J123958q92564j841527j47399J581747P33885r83052n99668J099187
34750A084640J211387l35085j111680m05412K71574K47093K44587K97796k09724
$$ plain form
34741 1295176 540093 222232 748745 1098987 459198 -468555 -667536 -260584 80492
34732 80492 288950 672073 1141946 1247137 615058 -740624 -2150611 -2602203 -1913473
34723 -1913473 -1115726 -980432 -955353 -477620 -253716 -892824 -1411198 -798243 17693 -282789
34713 -282789 -977298 -662004 -29678 -679461 -1910004 -1568632 259878 1293671 744904
34704 744904 239135 899884 2033782 2889813 3393689 3099127 1708071 515656 967036
34695 967036 2018419 1464175 -394085 -1135290 -79099 1072261 1382804 1644844 2164714
34686 2164714 2304193 2242939 2663797 2947875 2221871 1549212 2249386 2939167 1500765
34677 1500765 -942208 -1597456 -581948 -38701 255649 1988485 3930833 3327303 1097594
$$ packed form
34741A295176p55083l17861N26513L50242o39789r27753j98981M06952L41076
34732H0492K08458L83123M69873J05191o32079j355682j409987m51592O88730
34723a913473P97747J35294K5079M77733K23904o39108n18374O12955Q15936l00482
34713b82789o94509L15294O32326o49783j230543L41372J828510J033793n48767
34704G44904n05769O60749J133898Q56031N03876k94562j391056j192415M51380
34695I67036J051383n54244j858260p41205J056191J151360L10543K62040N19870
34686B164714J39479o1254M20858K84078p26004o72659P00174O89781j438402
34677A500765k442973o55248J015508N43247K94350J732836J942348o03530k229709
$$ plain form
34668 1097594 624242 1798364 1566102 44122 343067 2307786 2449880 497530 -68983
34659 -68983 1403999 1804715 570671 585515 1971024 1543926 -623510 -850084 1063491
34650 1063491 1436177 170799 1027878 3680944 3774747 1767320 2645157 5825738 5427859
34641 5427859 1946166 2429145 7121223 8357765 5357501 6293812 12155676 14024625
34633 14024625 11090913 13910392 23509074 27426346 25256967 34409012 57673674 74067167
34625 74067167 84138112 131677017 239545549 345391135 354301288 254927429 135335993
34618 135335993 74662128 64466472 54848101 32786001 19541485 20450425 19078441
34611 19078441 10423281 6087520 9121981 9587202 4686796 2410776 4828519 5321987
$$ packed form
34668A097594m73352J174122k32262j521980K98945J964719J42094j952350n66513
34659f8983J472982M00716j234044J4844J385509m27098k167436k26574J913575
34650A063491L72686j265378Q57079K653066R3803k007427Q77837L180581l97879
34641E427859l481693M82979M692078J236542l000264R36311N861864J868949
34633A4024625k933712K819479R598682L917272k169379R152045K3264662J6393493
34625G4067167J0070945M7538905J07868532J05845586Q910153r9373859j19591436
34618A35335993o0673865j0195656r618371k2062100j3244516R08940j371984
34611A9078441q655160m335761L034461M65221m900406k276020K417743M93468
$$ plain form
34603 5321987 2848309 3441190 6971225 6497678 1638475 -266879 2636535 4210401
34595 4210401 2201172 1467915 3722664 4385089 1749917 14509 1033871 1459445 56722
34586 56722 -13312 1873109 2068818 -181831 -881414 1413061 3042258 2040157 1212085
34577 1212085 2299394 2952290 1759046 887626 1486510 1406480 -361853 -1535298 -789274
34568 -789274 43772 -249197 -276021 660717 1116739 676068 849723 1730095 1493645 163669
34558 163669 4864 1258754 1452856 -44714 -782947 351760 1428088 1368730 1616139
34549 1616139 2588734 2398378 672930 -49238 1545979 3402430 3686950 3286461 3201207
34540 3201207 2662914 1419127 816534 1090331 561074 -1062148 -1645409 -354561 663550
$$ packed form
34603E321987k473678N92881L530035m73547m859203j905354K903414J573866
34595D210401k009229p33257K254749O62425k635172j735408J019362M25574j402723
34586E6722p0034J886421J95709k250649o99583K294475J629197j002101q28072
34577A212085J087309O52896j193244q71420N98884q0030j768333j173445P46024
34568g89274Q33046k92969k6824R36738M56022m40671J73655Q80372k36450j329976
34558A63669j58805J253890J94102j497570p38233J134707J076328n9358K47409
34549A616139R72595j90356j725448p22168J595217J856451K84520m00489q5254
34540C201207n38293j243787o02593K73797n29257j623222n83261J290848J018111
$$ plain form
34531 663550 -101465 -1207707 -1165782 -724860 -602191 172325 1873086 2789403 2083322
34522 2083322 1307047 1426667 1087057 -428015 -1379775 -709290 -182641 -1175168 -1982028
34513 -1982028 -820816 900028 995302 117572 193354 926519 625347 -693179 -1540797
34504 -1540797 -1412143 -900067 -221586 528516 569063 -392311 -1070756 -280453 1199474
34495 1199474 1880190 1713444 1593866 1701969 1692255 1589855 1319868 381994 -951222 -1340717
34485 -1340717 -338094 736245 909595 934437 1394894 1336546 309546 -184028 815700
34476 815700 1680262 875912 -115765 744234 2186899 1410794 -1141065 -2149819 -472022
34467 -472022 1357646 1185795 -25221 -482748 -184268 50763 302494 847509 1056004
$$ packed form
34531F63550p65015j106242M1925M40922J22669P74516J700761R16317p06081
34522B083322p76275J19620l39610j515072r51760O70485N26649r92527q06860
34513a982028J161212J720844R5274q77730P5782P33165l01172j318526q47618
34504a540797J28654N12076O78481P50102M0547r61374o78445P90303J479927
34495A199474O80716j66746j19578J08103r714j02400k69987r37874j333216l89495
34485a340717J002623J074339J73350K4842M60457n8348j027000m93574R99728
34476H15700Q64562q04350r91677Q59999J442665p76105k551859j008754J677797
34467d72022J829668j71851j211016m57527K98480K35031K51731N45015K08495
$$ plain form
34458 1056004 397378 -343342 -97970 867482 1472608 1455155 1351778 1155099 263289 -1078061
34448 -1078061 -1502982 -395880 816908 298829 -1665512 -2961104 -2445698 -1160168 -389146
34439 -389146 44490 653894 819184 -105720 -1193709 -1151533 -472618 -550337 -1081183 -415622
34429 -415622 1568199 3072982 3143874 2739622 2534528 1792914 371099 -125344 1498589
34420 1498589 4197522 6234664 7222164 7458968 6636429 4656003 2664575 1799103 1620253
34411 1620253 999638 -144891 -1098771 -1607003 -1803694 -1570442 -990256 -771008 -1230091
34402 -1230091 -1533676 -913614 66639 466114 471892 851181 1508770 1739270 1486201 1279196
34392 1279196 1223355 991135 582065 303771 218065 221100 393297 784243 1203853 1566114
$$ packed form
34458A056004o58626p40720K45372R65452O05126j7453j03377j96679q91810j341350
34448a078061m24921J107102J212788n18079j964341j295592N15406J285530P71022
34439c89146M33636O09404J65290r24904j087989M2176O78915p7719n30846O65561
34429d15622J983821J504783P0892m04252k05094p41614j421815m96443J623933
34420A498589K698933K037142R87500K36804q22539j980426j991428q65472j78850
34411A620253o20615j144529r53880n08232j96691K33252N80186K19248m59083
34402a230091l03585O20062R80253L99475N778L79289O57589K30500k53069k07005
34392A279196n5841k32220m09070k78294q5706L035J72197L90946M19610L62261
$$ plain form
34382 1566114 1933052 1982658 1190270 -141612 -895692 -560386 225453 790098 1008019
34373 1008019 588067 -723927 -1821071 -900208 1719551 3244626 2002372 -367523
34365 -367523 -1610601 -1842369 -2127759 -2003032 -762190 264447 -585173 -2216201 -2081073
34356 -2081073 -81276 1450402 1463448 1282056 1830754 2266316 1927374 1457576 1229126
34347 1229126 524279 -877553 -1913024 -1885174 -1510959 -1519045 -1475401 -840871 -73958 208499
34337 208499 280256 672638 1158022 1101108 386224 -511725 -1047443 -945553 -378876 117213
34327 117213 280877 531244 1242360 1920454 1835969 1184012 767248 801487 954287 1238314
34317 1238314 1782835 2016122 1310125 245342 -46480 381737 589502 558624 1048597
$$ packed form
34382A566114L66938M9606p92388j331882p54080L35306P85839N64645K17921
34373A008019m19952j311994j097144R20863K619759J525075j242254k369895
34365c67523j243078k31768k85390J24727J240842J026637q49620j631028J35128
34356b081073J999797J531678J3046j81392N48698M35562l38942m69798k28450
34347A229126p04847j401832j035471K7850L74215q086M3644O34530P66913K82457
34337B08499P1757L92382M85384n6914p14884q97949n35718J01890N66677M96089
34327A17213J63664K50367P11116O78094q4485o51957m16764L4239J52800K84027
34317A238314N44521K33287p05997j064783k91822M28217K07765l0878M89973
$$ plain form
34308 1048597 1703039 1231072 -208622 -816233 -43393 293159 -1094451 -2727814 -2518665
34299 -2518665 -805051 431988 459913 242848 540549 1095397 1505000 1633837 1231949
34290 1231949 203844 -761188 -742884 165129 889483 726251 91968 -128631 429970
34281 429970 1304691 1649399 1088331 215464 -72311 195459 66571 -882350 -1791274 -1661795
34271 -1661795 -634218 409837 931351 823798 15694 -1250728 -2174060 -2210016 -1831726
34262 -1831726 -1758502 -1750306 -1003913 420102 1431097 1247049 253653 -566996 -566025 221456
34252 221456 1140437 1290756 334317 -943002 -1238137 -28461 1924190 3317148 3350486
34243 3350486 2205093 835898 224418 545269 1115461 1300239 1198420 1204461 1319499
$$ packed form
34308A048597O54442m71967j439694o07611P72840L36552j387610j633363K09149
34299b518665J713614J237039K7925k17065K97701N54848M09603J28837m01888
34290A231949j028105r65032J8304R08013P24354j63232o34283k20599N58601
34281D29970Q74721L44708n61068q72867k87775K67770j28888r48921r08924J29479
34271a661795J027577J044055N21514j07553q08104j266422r23332l5956L78290
34262a831726P3224Q196P46393J424015J010995j84048r93396q20649R71P87481
34252B21456R18981J50319r56439j277319k95135J209676J952651J392958L3338
34243C350486j145393j369195o11480L20851N70192J84778j01819O041J15038
$$ plain form
34234 1319499 1370219 1533110 1981860 2254723 1751551 813728 499315 1126971 1802913 1713910
34224 1713910 1191248 981641 1031212 714061 -1481 -385776 -11846 634181 874464 734714
34214 734714 732571 1021748 1201359 935457 332208 -388472 -1181447 -1885646 -2055512 -1545341
34204 -1545341 -1000001 -1152801 -1697871 -1562377 -496947 301785 -322452 -1829195 -2491166
34195 -2491166 -1447145 357810 1393257 1240786 791130 981134 1697774 2045092 1504398
34186 1504398 503611 -262976 -704796 -1115402 -1363520 -1020411 -313380 -107297 -579653
34177 -579653 -743019 47273 851697 414435 -823856 -1257596 -547092 -88815 -678364
34168 -678364 -1104882 -21882 1838998 2652109 2136361 1740493 2253695 2700460 2082081
$$ packed form
34234A319499N0720J62891M48750K72863n03172r37823l14413O27656O75942q9003
34224A713910n22662k09607M9571l17151p15542l84295L73930O46027K40283j39750
34214G34714k143K89177J79611k65902o03249p20680p92975p04199j69866N10171
34204a545341N45340j52800n45070J35494J065430P98732o24237j506743o61971
34195b491166J044021J804955J035447j52471m49656J90004P16640L47318n40694
34186A504398j000787p66587m41820m10606k48118L43109P07031K06083m72356
34177e79653j63366P90292Q04424m37262j238291m33740P10504M58277n89549
34168f78364m26518J083000J860880Q13111n15748l95868N13202M46765o18379
$$ plain form
34159 2082081 974679 520027 694867 669872 398099 648034 1523461 2078916 1699435
34150 1699435 955674 622227 571400 224909 -447122 -1035824 -1432759 -1800663 -2017914 -1757502
34140 -1757502 -1025889 -159150 567615 910870 544083 -431994 -1132813 -770949 270700
34131 270700 1000047 1263765 1700848 2345680 2432980 1780521 1176951 1002814 695424 184699
34121 184699 528458 2104556 3367066 2778991 1096294 200740 351823 345549 -40061
34112 -40061 185088 940958 718860 -770113 -1489123 131746 2690953 3562397 2239019
34103 2239019 474702 -343727 -477562 -620591 -745606 -510301 -2611 315103 83264
34094 83264 -627112 -1285811 -1364914 -992479 -779294 -814704 -483485 318804 623839 -177463
$$ packed form
34159B082081j107402m54652J74840k4995k71773K49935Q75427N55455l79481
34150A699435p43761l33447n0827l46491o72031n88702l96935l67904k17251K60412
34140a757502P31613Q66739P26765L43255l66787r76077p00819L61864J041649
34131B70700P29347K63718M37083O44832Q7300o52459o03570j74137l07390n10725
34121A84699L43759J576098J262510n88075j682697q95554J51083o274l85610
34112d0061K25149P55870k22098j488973p19010J620869K559207Q71444j323378
34103B239019j764317q18429j33835j43029j25015K35305N07690L17714k31839
34094H3264p10376o58699p9103L72435K13185l5410L31219Q02289L05035q01302
$$ plain form
34084 -177463 -1111224 -922614 -20387 204642 -335892 -364599 488743 954145 200506 -750044
34074 -750044 -598690 273707 546046 61780 41771 1277439 2998660 3800194 3253459
34065 3253459 2293316 2072222 2655837 3119773 2900959 2476304 2367963 2200588 1543226
34056 1543226 1027977 1401383 1893718 1123321 -443507 -779113 563456 1546223 814773
34047 814773 -122059 612987 2187845 2482339 1529356 1268175 2258735 2855651 1852308
34038 1852308 77037 -1134041 -1527334 -1409998 -855555 -163107 -97862 -900932 -1708431
34029 -1708431 -1526262 -307525 1230731 2307743 2417534 1652917 931426 1232902 2367698
34020 2367698 3125735 2805492 1882783 1009111 206273 -595132 -1019424 -757157 -61883
$$ packed form
34084a77463r33761J88610R02227K25029n40534k8707Q53342M65402p53639r50550
34074g50044J51354Q72397K72339m84266k0009J235668J721221Q01534n46735
34065C253459r60143k21094N83615M63936k18814m24655j08341j67375o57362
34056A543226n15249L73406M92335p70397j566828l35606J342569R82767p31450
34047H14773r36832P35046J574858K94494r52983k61181R90560N96916j003343
34038A852308j775271j211078l93293J17336N54443O92448O5245q03070q07499
34029a708431J82169J218737J538256J077012J09791p64617p21491L01476J134796
34020B367698P58037l20243r22709q73672q02838q01405m24292K62267O95274
$$ plain form
34011 -61883 643552 1180816 1414178 1184114 637215 90801 -482860 -1197822 -1572037 -1034973
34001 -1034973 -112666 33668 -602279 -832174 -306924 -72253 -486601 -245962 1404719
33992 1404719 2993308 2853117 1635757 1083369 1221194 698642 -633647 -1520864 -1530977
33983 -1530977 -1527906 -1772556 -1452883 -560295 -405986 -1434908 -2113556 -1123476 590134
33974 590134 1245825 763586 470023 846737 1047302 541754 -83459 -216094 -71009 -18482
33964 -18482 171883 867328 1824915 2429240 2419625 1978611 1323059 632725 231148 344800
33954 344800 659077 553961 -82583 -642625 -585558 -111172 185641 30467 -435031 -972309
33944 -972309 -1311456 -1167896 -605040 -153016 -137901 -162089 209328 539367 66442 -960556
$$ packed form
34011f1883P05435N37264K33362k30064n46899n46414n73661p14962l74215N37064
34001a034973R22307J46334o35947k29895N25250K34671m14348K40639J650681
33992A404719J588589j40191j217360n52388J37825n22552j332289q87217j0113
33983a530977L071k44650L19673Q92588J54309j028922o78648R90080J713610
33974E90134O55691m82239k93563L76714K00565n05548o25213j32635J45085N2527
33964a8482J90365O95445R57587O04325r615m41014o55552o90334m01577J13652
33954C44800L14277j05116o36544n60042N7067M74386K96813j55174m65498n37278
33944i72309l39147J43560N62856M52024J5115k4188L71417L30039m72925j026998
$$ plain form
33934 -960556 -1395646 -790422 -26437 -28419 -597233 -979667 -978628 -951391 -1125961 -1414906
33924 -1414906 -1632474 -1544469 -964929 -64702 668049 916809 708028 139457 -571988 -854732
33914 -854732 -332946 342277 70792 -1119636 -2005624 -1925862 -1541224 -1428246 -1117682 -275314
33904 -275314 291671 -162867 -986603 -1077612 -501032 -135274 -300281 -715197 -1238940 -1694512
33894 -1694512 -1566297 -841125 -475128 -988374 -1359681 -526765 793948 1187313 693738
33885 693738 280108 -141451 -1233031 -2228117 -1633753 56049 596647 -624691 -1561938
33876 -1561938 -634083 1038097 1544171 694367 -526731 -1595874 -2279028 -1980389 -577064
33867 -577064 909752 1574627 1803846 2249526 2543438 2176003 1824996 2437480 3489213
$$ packed form
33934i60556m35090O05224P63985j982n68814l82434J039K7237j74570k88945
33924a414906k17568Q8005N79540R00227P32751K48760k08781n68571p11445k82744
33914h54732N21786O75223k71485j190428q85988P9762L84638J12978L10564Q42368
33904b75314N66985m54538q23736r1009N76580L65758j65007m14916n23743m55572
33894a694512J28215P25172L65997n13246l71307Q32916J320713L93365m93575
33885F93738m13630m21559j091580r95086N94364J689802N40598j221338r37247
33876a561938R27855J672180N06074q49804j221098j069143o83154K98639J403325
33867e77064J486816O64875K29219M45680K93912l67435l51007O12484J051733
$$ plain form
33858 3489213 3525070 2253587 915613 557632 912755 1105104 695603 -133966 -900795
33849 -900795 -1187863 -967783 -519666 68281 932579 1792180 1895088 1046822 80410 -276076
33839 -276076 -394977 -900334 -1422881 -1151159 -232309 427175 604849 961640 1735951 2228451
33829 2228451 1902467 1211870 887879 944079 849398 357520 -242178 -544163 -419102 -61160
33819 -61160 205675 231198 205334 409673 764165 801477 252125 -447454 -502311 253485
33809 253485 924716 461625 -997277 -2114042 -1890608 -798798 -9251 67274 -138730
33800 -138730 -395179 -932888 -1683552 -2084065 -1865903 -1396011 -1021509 -692276 -444644 -578793
33790 -578793 -1005653 -1034563 -264014 775758 1272733 1039661 464190 -14818 -75246 378166
$$ packed form
33858C489213L5857j271483j337974l57981L55123J92349m09501q29569p66829
33849i00795k87068K20080M48117N87947Q64298Q59601J02908q48266r66412l56486
33839b76076j18901n05357n22547K71722R18850O59484J77674L56791P74311M92500
33829B228451l25984o90597l23991N6200r4681m91878n99698l01985J25061L57942
33819f1160K66835K5523k5864K04339L54492L7312n49352o99579n4857P55796
33809B53485O71231m63091j458902j116765K23434J091810P89547P6525k06004
33800a38730k56449n37709p50664m00513K18162M69892L74502L29233K47632j34149
33790e78793m26860k8910P70549J039772M96975k33072n75471m79008o0428M53412
$$ plain form
33780 378166 917817 842914 88960 -517273 -256377 635554 1445605 1860716 1968044 1791528
33770 1791528 1291154 570647 -238855 -1042245 -1529072 -1275231 -397055 271687 -18424
33761 -18424 -1205269 -2623092 -3579091 -3665070 -2991493 -2204130 -1766891 -1277526 -194705
33752 -194705 885094 757314 -483964 -1352420 -1166167 -949773 -1459730 -1783938 -1057886
33743 -1057886 -284343 -894536 -2356173 -2866878 -1971695 -932976 -694347 -896243 -906835
33734 -906835 -620982 -181085 131298 -149895 -898234 -937811 440557 1875094 1375647
33725 1375647 -730835 -2005499 -1295076 -147396 -164927 -681672 -311295 546294 417803
33716 417803 -701018 -1239753 -483248 363390 27281 -986859 -1218023 -330557 580871
$$ packed form
33780C78166N39651p4903p53954o06233K60896Q91931Q10051M15111J07328j76516
33770A791528n00374p20507q09502q03390m86827K53841Q78176O68742k90111
33761a8424j186845j417823r55999q5979O73577P87363M37239M89365J082821
33752a94705J079799j27780j241278q68456J86253K16394n09957l24208P26052
33743a057886P73543o10193j461637n10705Q95183J038719K38629k01896j0592
33734i06835K85853M39897L12383k81193p48339l9577J378368J434537m99447
33725A375647k106482j274664P10423J147680j7531n16745L70377Q57589j28491
33716D17803j118821n38735P56505Q46638l36109j014140k31164Q87466R11428
$$ plain form
33707 580871 683727 466490 694400 1050645 668628 -312847 -775365 -317792 85317 -423889
33697 -423889 -1303972 -1496241 -909313 -248234 125656 351723 451100 335279 188216 168546
33687 168546 -10260 -587604 -1159766 -1187078 -737426 -140738 594131 1333062 1403203 515702
33677 515702 -463224 -631831 -344283 -301795 -79429 990990 2068931 1733284 406502
33668 406502 -77131 606689 764572 -514009 -2024493 -2628706 -2858424 -3276678 -2996746
33659 -2996746 -1305496 577213 989458 182104 -345141 -177823 -121354 -428916 -433411 83117
33649 83117 430622 107196 -572265 -1103809 -1330735 -1256688 -935579 -633877 -640224 -903613
33639 -903613 -1184088 -1375933 -1334556 -741736 333455 1101429 956895 460390 672995 1666163
$$ packed form
33707E80871J02856k17237K27910L56245l82017r81475m62518M57573M03109n09206
33697d23889q80083j92269N86928O61079L73890K26067R9377j15821j47063j9670
33687A68546j78806n77344n72162k7312M49652N96688P34869P38931P0141q87501
33677E15702r78926j68607K87548M2488K22366J070419J077941l35647j326782
33668D06502m83633O83820J57883j278581j510484o04213k29718m18254K79932
33659b996746J691250J882709M12245q07354n27245J67318N6469l07562m495N16528
33649H3117L47505l23426o79461n31544k26926P4047L21109L01702o347k63389
33639i03613k80475j91845M1377N92820J075191P67974j44534m96505K12605R93168
$$ plain form
33629 1666163 2490677 2594950 2411502 2355409 2100787 1337502 588343 555624 952900 729029
33619 729029 -507469 -1905954 -2458860 -2168696 -1714970 -1367270 -888588 -314252 30249
33610 30249 364629 1330966 2644993 2922687 1662621 437988 896108 2296506 2590693
33601 2590693 1553944 996953 1756455 2445684 1942290 1346454 2152260 3727426 4176549
33592 4176549 3057091 1778356 1543328 2118108 2627697 2572626 1917092 906927 -293
33583 -293 -458607 -561033 -604332 -693727 -854083 -1245983 -1893396 -2433915 -2475082 -1963443 -986373
33572 -986373 370929 1680685 2209040 1743709 943796 455537 191504 -69046 -16667
33563 -16667 563511 1054586 725457 -164898 -757959 -787478 -600861 -272427 415106 1197515
$$ packed form
33629A666163Q24514J04273j83448n6093k54622p63285p49159l2719L97276k23871
33619G29029j236498j398485n52906K90164M53726L47700M78682N74336L44501
33610C0249L34380R66337J314027K77694j260066j224633M58120J400398K94187
33601B590693j036749n56991P59502O89229n03394n95836Q05806J575166M49123
33592D176549j119458j278735k35028N74780N09589n5071o55534j010165r07220
33583b93m58314j02426m3299q9395j60356l91900o47413n40519m1167N11639R77070
33572i86373J357302J309756N28355m65331p99913m88259k64033k60550N2379
33563a6667N80178M91075l29129q90355n93061k9519J86617L28434O87533P82409
$$ [...]
##END NTUPLES=NMR SPECTRUM
##END=
