##TITLE=31Pdec_B3d2410
 CDCl3 
  24 sc
 25.10.2023
##JCAMPDX= 6.0         $$ Bruker NMR JCAMP-DX V2.0
##DATA TYPE= NMR SPECTRUM
##DATA CLASS= NTUPLES
##ORIGIN= UXNMR, Bruker Analytische Messtechnik GmbH
##OWNER= root
$$ XWIN-NMR		Version 3.5
$$ Wed Oct 25 13:48:39 2023 Russian Standard Time (UT+4h)  she@DPX200
##.OBSERVE FREQUENCY= 81.013821
##.OBSERVE NUCLEUS= ^31P
##.ACQUISITION MODE= SIMULTANEOUS
##.ACQUISITION SCHEME= undefined
##.AVERAGES= 24
##.DIGITISER RES= 16
##SPECTROMETER/DATA SYSTEM= spect
##.PULSE SEQUENCE= zgpg30
##.SOLVENT NAME= CDCl3
##.SHIFT REFERENCE= (INTERNAL, CDCl3, 0, 248.564)
##AUDIT TRAIL= $$ (NUMBER, WHEN, WHO, WHERE, WHAT)
$$ ##TITLE= Audit trail, XWIN-NMR		Version 3.5
$$ ##JCAMPDX= 5.01
$$ ##ORIGIN= Bruker BioSpin GmbH
$$ ##OWNER= she
$$ F:/spectra/data/she/nmr/P31/1/pdata/1/auditp.txt
$$ ##AUDIT TRAIL=  $$ (NUMBER, WHEN, WHO, WHERE, WHAT)
(   1,<2023-10-25 13:47:40.73 +0400>,<she>,<DPX200>,
      <created by zg, POWCHK disabled, PULCHK disabled
       configuration hash MD5:
       00 E9 B6 7A A2 85 ED C7 34 08 36 98 17 FE 4E 26
       data hash MD5: 32K
       1B 21 14 D8 AD 34 BD E1 F5 D5 EB 8C 1E CE 7A A6>)
(   2,<2023-10-25 13:47:42.96 +0400>,<she>,<DPX200>,
      <Start of raw data processing
       efp BC_mod = 2 LB = 5 FT_mod = 6 PKNL = 1 PHC0 = -10801.35 PHC1 = 384.2862 SI = 64K 
       data hash MD5: 64K
       67 1F 8B 0B 9E 1E 7F 35 68 54 F8 0D 9B 5F 1B E3>)
(   3,<2023-10-25 13:48:03.54 +0400>,<she>,<DPX200>,
      <pk PHC0 = 74.16798 PHC1 = -124.4 
       data hash MD5: 64K
       9D 36 CD AF 9C 07 4E 7D 3A 8E 2C 33 B8 AD D8 53>)
$$ ##END=
$$ 
$$ hash MD5
$$ 26 2E A9 E2 93 A5 06 F8 DF E0 24 B4 9A 17 1B C6
##$RELAX= 
##$RELAX= 
##$RELAX= 
##$RELAX= 
##$RELAX= 
##$RELAX= 
##$RELAX= 
##$RELAX= 
##$RELAX= 
$$ Bruker specific parameters
$$ --------------------------
##$DU= <F:/spectra>
##$EXPNO= 1
##$NAME= <P31>
##$PROCNO= 1
##$TYPE= <nmr>
##$USER= <she>
##$AMP= (0..31)
100 100 100 100 100 100 100 100 100 100 100 100 100 100 100 100 100 100 
100 100 100 100 100 100 100 100 100 100 100 100 100 100 
##$AQSEQ= 0
##$AQ_mod= 1
##$AUNM= <au_zg>
##$AUTOPOS= <>
##$BF1= 81.014009
##$BF2= 200.13
##$BF3= 200.13
##$BF4= 200.13
##$BF5= 200.13
##$BF6= 200.13
##$BF7= 200.13
##$BF8= 200.13
##$BYTORDA= 1
##$CFDGTYP= 0
##$CFRGTYP= 5
##$CHEMSTR= <none>
##$CNST= (0..31)
1 1 145 1 1 1 1 1 1 1 1 1 1 1 1 1 1 1 1 1 1 1 1 1 1 1 1 1 1 1 1 1 
##$CPDPRG= <waltz16>
##$CPDPRG1= <>
##$CPDPRG2= <waltz16>
##$CPDPRG3= <>
##$CPDPRG4= <mlev>
##$CPDPRG5= <mlev>
##$CPDPRG6= <mlev>
##$CPDPRG7= <mlev>
##$CPDPRG8= <mlev>
##$CPDPRGB= <>
##$CPDPRGT= <>
##$D= (0..31)
0 1 0 0 0 0 0 0 0 0 0 0.03 2e-05 3e-06 0 0 0 0 0 0 0 0 0 0 0 0 0 0 0 0 
0 0 
##$DATE= 1698227259
##$DBL= (0..7)
120 120 120 11 120 120 24 19 
##$DBP= (0..7)
150 150 150 150 150 150 150 150 
##$DBP07= 0
##$DBPNAM0= <>
##$DBPNAM1= <>
##$DBPNAM2= <>
##$DBPNAM3= <>
##$DBPNAM4= <>
##$DBPNAM5= <>
##$DBPNAM6= <>
##$DBPNAM7= <>
##$DBPOAL= (0..7)
0.5 0.5 0.5 0.5 0.5 0.5 0.5 0.5 
##$DBPOFFS= (0..7)
$$ [...]
##$SUBNAM2= <"">
##$SUBNAM3= <"">
##$SUBNAM4= <"">
##$SUBNAM5= <"">
##$SUBNAM6= <"">
##$SUBNAM7= <"">
##$SUBNAM8= <"">
##$SUBNAM9= <"">
##$SW= 501.771253377433
##$SWIBOX= (0..15)
0 1 3 0 0 0 0 0 0 0 0 0 0 0 0 0 
##$SW_h= 40650.406504065
##$TD= 32768
##$TD0= 1
##$TE= 0
##$TE2= 300
##$TE3= 300
##$TEG= 300
##$TL= (0..7)
0 120 53 12 22 120 120 120 
##$TP= (0..7)
150 150 150 150 150 150 150 150 
##$TP07= 0
##$TPNAME0= <>
##$TPNAME1= <>
##$TPNAME2= <>
##$TPNAME3= <>
##$TPNAME4= <>
##$TPNAME5= <>
##$TPNAME6= <>
##$TPNAME7= <>
##$TPOAL= (0..7)
0.5 0.5 0.5 0.5 0.5 0.5 0.5 0.5 
##$TPOFFS= (0..7)
0 0 0 0 0 0 0 0 
##$TUNHIN= 0
##$TUNHOUT= 0
##$TUNXOUT= 0
##$USERA1= <user>
##$USERA2= <user>
##$USERA3= <user>
##$USERA4= <user>
##$USERA5= <user>
##$V9= 5
##$VALIST= <valist>
##$VCLIST= <CCCCCCCCCCCCCCC>
##$VD= 0
##$VDLIST= <DDDDDDDDDDDDDDD>
##$VPLIST= <PPPPPPPPPPPPPPP>
##$VTLIST= <TTTTTTTTTTTTTTT>
##$WBST= 1024
##$WBSW= 4
##$XGAIN= (0..3)
0 0 0 0 
##$XL= 0
##$YL= 0
##$YMAX_a= 4509
##$YMIN_a= -4511
##$ZGOPTNS= <>
##$ZL1= 120
##$ZL2= 120
##$ZL3= 120
##$ZL4= 120
##$ABSF1= 0
##$ABSF2= 0
##$ABSG= 0
##$ABSL= 0
##$ALPHA= 0
##$AQORDER= 0
##$ASSFAC= 0
##$ASSFACI= 0
##$ASSFACX= 0
##$ASSWID= 0
##$AUNMP= <proc_1d>
##$AZFE= 0.1
##$AZFW= 0.5
##$BCFW= 0
##$BC_mod= 2
##$BYTORDP= 0
##$COROFFS= 0
##$CY= -3
##$DATMOD= 1
##$DC= 0
##$DFILT= <>
##$DTYPP= 0
##$F1P= 0
##$F2P= 0
##$FCOR= 1
##$FTSIZE= 65536
##$FT_mod= 6
##$GAMMA= 0
##$GB= 0
##$INTBC= 1
##$INTSCL= 6.047779e-11
##$ISEN= 30
##$LB= 5
##$LEV0= 0
##$LPBIN= 0
##$MAXI= 10000
##$MC2= 0
##$MEAN= 0
##$ME_mod= 0
##$MI= 50
##$NCOEF= 0
##$NC_proc= -6
##$NLEV= 6
##$NOISF1= 182.463
##$NOISF2= 159.3651
##$NSP= 0
##$NTH_PI= 0
##$NZP= 0
##$OFFSET= 248.5645
##$PC= 4
##$PHC0= -10727.18
##$PHC1= 259.8862
##$PH_mod= 1
##$PKNL= yes
##$PPARMOD= 0
##$PSCAL= 0
##$PSIGN= 0
##$REVERSE= no
##$SF= 81.0140089999694
##$SI= 65536
##$SIGF1= 159.3651
##$SIGF2= -187.1042
##$SINO= 113.3802
##$SIOLD= 16384
##$SREGLST= <1H.CDCl3>
##$SSB= 0
##$STSI= 65536
##$STSR= 0
##$SW_p= 40650.406504065
##$SYMM= 0
##$S_DEV= 0
##$TDeff= 32768
##$TDoff= 0
##$TI= <>
##$TILT= no
##$TM1= 0
##$TM2= 0
##$TOPLEV= 0
##$USERP1= <user>
##$USERP2= <user>
##$USERP3= <user>
##$USERP4= <user>
##$USERP5= <user>
##$WDW= 1
##$XDIM= 65536
##$YMAX_p= 349559604
##$YMIN_p= -4748222
$$ End of Bruker specific parameters
$$ ---------------------------------
##NTUPLES= NMR SPECTRUM
##VAR_NAME=  FREQUENCY,     SPECTRUM/REAL,   SPECTRUM/IMAG
##SYMBOL=    X,             R,               I
##VAR_TYPE=  INDEPENDENT,   DEPENDENT,       DEPENDENT
##VAR_FORM=  AFFN,          ASDF,            ASDF
##VAR_DIM=   65536,         65536,           65536
##UNITS=     HZ,            ARBITRARY UNITS, ARBITRARY UNITS
##FACTOR=    0.620285442955139, 1,           1
##FIRST=     20137.2065510682, 0,            0
##LAST=      -20513.1999529968, 0,           0
##MIN=       -20513.1999529968, -4748222,    0
##MAX=       20137.2065510682, 349559604,    0
$$ Real data points
##PAGE= N=1
##DATA TABLE= (X++(R..R)), XYDATA
$$ [...]
39765A215326N3892j9471p8113q7035m5801R755L6496J8717k4453o1947p4905
39754I42461o1364l1135k810N297p060j8967j4158n855k2918p1122j19694j30713
39742D61962r6136m3902j1574j3659l0973l3840j8373j2760m0200q3995j03608
39731b7058q1799m0049p020J1693K7877N0117P6882R8305R6537N5741j6784q6270
39719A58172j18245j07960p6191m2117r475K4879N9770Q8538J03543J01718Q8574
39708B71206P4338O2820M7774K4423J25j3043j4257j6312l1665n9802q8033j02148
39696A55426r6188p2863l5397J6080P4668J18988J28686J09168Q7206P7278O6579
39685F29631M1783J4349L699P804J0675J1209K0874L3976K5525j3501n9126q4764
$$ y = [1215326, 1269218, 1249747, 1171634, 1084599, 1038798, 1048553, 1085049, 1103766, 1079313, 1017366, 942461, 881097, 849962, 847152, 852449, 845389, 826422, 812264, 806409, 783491, 712369, 592675, 461962, 365826, 321924, 310350, 296691, 265718, 231878, 213505, 200745, 160545, 76550, -27058, -108857, -148906, -155926, -144233, -116356, -66239, 10643, 108948, 205485, 261226, 244442, 158172, 39927, -68033, -144224, -186341, -195816, -170937, -111167, -22629, 80914, 182632, 271206, 345544, 408364, 456138, 480561, 480686, 467643, 453386, 437074, 405409, 345607, 257574, 155426, 59238, -13625, -49022, -32942, 41726, 160714, 289400, 398568, 485774, 563052, 629631, 671414, 685763, 689462, 697266, 707941, 719150, 740024, 774000, 799525, 786024, 726898, 642134]
39673F42134r3059j02957j16163j14174q6124m5191j4293l523n619j0355j9377
39662C1299m3178q1369j11507j07791p1298l1179j2758j5343k6244m2452o5766
39651e77586q5448q1782m6410J0189O8582J09187J17671R6258O8392N7944O2512
39640b00491O0478M5374L6422M8562O8068O9806M6941J0507k9581o4528p3482
39629A8076l4616M1812J06950J14055O2074q432n7070p2520o5392m8661l2180
39618B4096k6789m1096p2430j06779j28674j27246r4625k9398N1910J14767J30863
39607c05401J04712O9621N4905O0794O5218M9071J3447k1990l5470k3683q361
39596B2863j5913m6523o9778n6780j1910L3564N5787N9594O8309R9301J48684
$$ y = [642134, 549075, 446118, 329955, 215781, 129657, 84466, 70173, 66650, 61031, 50676, 31299, -11879, -93248, -204755, -312546, -383844, -415023, -427781, -443124, -469368, -511820, -577586, -663034, -744816, -791226, -781037, -712455, -603268, -485597, -389339, -320947, -263003, -200491, -140013, -94639, -58217, -9655, 58413, 128219, 175160, 185667, 156086, 91558, 18076, -16540, 25272, 132222, 246277, 308351, 299919, 242849, 170329, 104937, 56276, 24096, -2693, -43789, -116219, -222998, -351672, -478918, -573543, -602941, -551031, -436264, -305401, -200689, -131068, -76163, -15369, 49849, 98920, 112367, 90377, 54907, 31224, 22863, 6950, -39573, -109351, -166131, -178041, -144477, -88690, -29096, 39213, 138514, 287198]
39585B87198J93701K09096J85301J32430O7702M009m7854p6352q0392p9615r9867
39574F95357j44507j88079k01936j80448j40193j00946p2471n4945m5772m5004
39564d78944n4365p0187q0662p6601o4751o2563p6037q8366p5399k9502L5371
39553a122006R8893J49215J82779J95043J78215J31896P2151K1272j3454m2157
39543a48153o9366p9854n7977j1756L7382Q2509J30422J75577J96442J82374J45362
39532E82962R8881M4259j3142n4884p2268q2175j02554j24557j27195j09042q6249
39521d5964o8543n8170o3878q9131j08131q2352j0025O1592Q4577N7027J4190
39510c08808j1424j0640Q211L1023M8137O1297P7740R4995R9150Q1561M8464R439
$$ y = [287198, 480899, 689995, 875296, 1007726, 1075428, 1079437, 1031583, 955231, 874839, 795224, 695357, 550850, 362771, 160835, -19613, -159806, -260752, -333223, -388168, -433940, -478944, -533309, -603496, -684158, -760759, -825510, -888073, -964110, -1052476, -1127875, -1157377, -1122006, -1023113, -873898, -691119, -496076, -317861, -185965, -113814, -92542, -105996, -148153, -217519, -297373, -355350, -367106, -329724, -247215, -116793, 58784, 255226, 437600, 582962, 681843, 726102, 712960, 658076, 585808, 503633, 401079, 276522, 149327, 40285, -45964, -114507, -172677, -236555, -325686, -433817, -516169, -526194, -464602, -380025, -322998, -308808, -320232, -330872, -322661, -291638, -243501, -182204, -104464, -9469, 89681, 171242, 219706, 229145]
39498B29145l4139q2184j24549j43867j27097p4305m509M6623M8989O679m2945
39487c02159o3495m4997M605P3843J41867J75304J52826Q9944K5208j5506l0178
39476B07262k3320M475M7935R1345J16516J12125P8307L0577l728m022K7218P1890
39464G56580J14656J44459J45530J05982L7994k5253n8098n8453l5767N36L5313
39453A163479M8145L4034J4532J4266L0675L8856K3669m980k8950m2032m8090
39442A243604m7514l5398j3290N112O448n547j3114p324j329j3950m4377p2142
39430A001179q0284o8519m3902j1082K3417M8316N7850N8510N7587M9743K3269
39419A116084k2155o9858r7023q8479m5835R601M6169M3129N617m2505p8206r1070
$$ y = [229145, 195006, 112822, -11727, -155594, -282691, -356996, -361505, -314882, -265893, -259214, -302159, -365654, -410651, -406046, -332203, -190336, -15032, 137794, 227738, 252946, 237440, 207262, 183942, 188417, 236352, 327697, 444213, 556338, 634645, 665222, 661494, 657472, 684690, 756580, 871236, 1015695, 1161225, 1267207, 1305201, 1279948, 1221850, 1163397, 1127630, 1128166, 1163479, 1211624, 1245658, 1260190, 1274456, 1305131, 1343987, 1367656, 1362676, 1333726, 1291694, 1243604, 1196090, 1160692, 1147402, 1152514, 1158962, 1153415, 1140301, 1132977, 1131648, 1117698, 1073321, 1001179, 920895, 852376, 808474, 797392, 820809, 869125, 926975, 985485, 1043072, 1092815, 1116084, 1093929, 1024071, 927048, 838569, 792734, 802335, 848504, 891633, 897250, 854745, 776539, 685469]
39407F85469q4658p4853q1745j11650j46693j60752j46739j20972j00426q4538
39397d27557o2032k7276J5177N5896Q4412R2475Q0960O2625N1717M8796L9238
39386A4431R834l3796o9120p7672o2263m0209k2079n458Q706O281k1158n3822
39374c46325n7444k3687J5880K3987k030l1013l1693K798N7890J13523J57492
39363a20622J91235K22683K47313K38843J70210M7938q2421j71545k03430j95046
39353C45158j68659j35387j01554p4514n4233k8897J0016N2158P8969Q9057J01275
39342A13389J29411J64544J88143J92267J78348J46485J00056N4873K6805J0022
39332A304343j7862o6875j24246j74632k14650k41112k40373k00323j22722j7105
$$ y = [685469, 600811, 525958, 444213, 332563, 185870, 25118, -121621, -242593, -343019, -427557, -489589, -516865, -501688, -445792, -361380, -268905, -187945, -125320, -73603, -24807, 14431, 24265, -9531, -78651, -156323, -218586, -258795, -280874, -286332, -277626, -271345, -292503, -346325, -403769, -427456, -411576, -387589, -389619, -420632, -452325, -449527, -391637, -278114, -120622, 70613, 293296, 540609, 779452, 949662, 997600, 915179, 743634, 540204, 345158, 176499, 41112, -60442, -134956, -189189, -218086, -208070, -155912, -76943, 12114, 113389, 242800, 407344, 595487, 787754, 966102, 1112587, 1212643, 1267516, 1294321, 1304343, 1286481, 1219606, 1095360, 920728, 706078, 464966, 224593, 24270, -98452, -115557]
39322a15557J01670J98349K19969J40555m96j25815j86576j87942j56683j10538
39312b23064o3400l2903k3663j4906J9063P8831J36519J57303J22237M1231m9031
39301A48217j08775j25184j15073r6877p1189l2362J6025O6773J16488J55463
39291d6494J63619J33875R1140O9701P5390Q6163Q6155Q0690P7846P4135O3716
39280I55936M7479K7970Q023j565J1624L8918M7718J5304m0804p8402p3916m0854
39268I17431p950R140J1842N417p664k2734l2102l6329n0612q7944j34722j56338
39256D07435j35865r7842q1594r5994j13027j02513o0064k767M7298P3637P4532
39245h6764O7019P0233Q1139P8815N6151L2186K6049L4313M5373O2049R3066J29012
$$ y = [-115557, -13887, 184462, 404431, 544986, 544490, 418675, 232099, 44157, -112526, -223064, -286464, -319367, -343030, -357936, -338873, -260042, -123523, 33780, 156017, 197248, 148217, 39442, -85742, -200815, -297692, -368881, -401243, -385218, -318445, -201957, -46494, 117125, 251000, 342140, 411841, 487231, 573394, 659549, 740239, 818085, 892220, 955936, 1003415, 1031385, 1039408, 1037843, 1049467, 1088385, 1136103, 1151407, 1110603, 1032201, 958285, 917431, 909481, 918621, 930463, 935880, 928216, 905482, 873380, 837051, 786439, 698495, 563773, 407435, 271570, 173728, 92134, -3860, -116887, -219400, -279464, -282231, -234933, -161296, -86764, -19745, 50488, 131627, 210442, 266593, 298779, 324828, 359141, 404514, 466563, 559629, 688641]
39233F88641J42605J12889M2771m1186r9788j04213o3544k3196k0856m7663o5816
39222E20644n7582l8589k7574k7580m1194p9370j38945j85905j80044j14823k3531
39211c94493N1942R2053J02987R7387P5690K9407l5423q6704r2560n8752k4171
39200b42637j4669j7920j2481k857p023k2302k9284k7287l9262p1826r1298n9227
39188f38073J4681P3433P2003K7517L096M2200J23299J81059J68221R2385k151
39177A57670p4349j05014r3175n2030l754L8044Q0973J36021J89449K11687J98440
39166F83962J80931J80873J72397J11580k270j16720j79459j84133j58963j27020
39156E61178r0130m3441Q508N2707P9217Q8743Q7994P7542M7844q705q4332j59685
$$ y = [688641, 831246, 944135, 986906, 945720, 845932, 741719, 678175, 654979, 634123, 586460, 520644, 463062, 424473, 396899, 369319, 328125, 248755, 109810, -76095, -256139, -370962, -394493, -342551, -250498, -147511, -50124, 25566, 54973, 19550, -67154, -159714, -218466, -242637, -257306, -275226, -287707, -290564, -297587, -319889, -349173, -376460, -415722, -487548, -578846, -638073, -623392, -549959, -477956, -450439, -447343, -405143, -281844, -100785, 67436, 159821, 157670, 83321, -21693, -114868, -166898, -170652, -132608, -51635, 84386, 273835, 485522, 683962, 864893, 1045766, 1218163, 1329743, 1327473, 1210753, 1031294, 847161, 688198, 561178, 471048, 427607, 436115, 488822, 568039, 656782, 744776, 822318, 870162, 861457, 777125, 617440]
39144F17440k17857k47485k37199j82716j03446l7680r572o379L931L8151Q8572
39133b94240J41767J94332K48020K95389L13546K74807J71465L3924q4259j48555
39123A146196j67885j73033j79922j84105j81865j78319j74692j63694j41767
39114c99086j13726q0979l7718J3469N1888N5268K3644j8548m2482l5737q593
39103e92600J7029K8557L4676N2771Q4705J10271J04615N7714j8730r3287j28163
39092c42442j08222n9741k4173r628J1726N0811P2824M3754j2917l6821k688N5882
39080c61635R3549R5256O5189M635p7433j48390j72038j44657r6798n7660k6631
39069h26613J7854Q6832J61456K05365J97623J52464J03785P3264O0021N6568
$$ y = [617440, 399583, 152098, -85101, -267817, -371263, -408943, -418515, -424894, -420963, -382812, -294240, -152473, 41859, 289879, 585268, 898814, 1173621, 1345086, 1379010, 1294751, 1146196, 978311, 805278, 625356, 441251, 259386, 81067, -93625, -257319, -399086, -512812, -593791, -631509, -618040, -566152, -510884, -487240, -505788, -548270, -584007, -592600, -575571, -547014, -512338, -459567, -374862, -264591, -159976, -102262, -120992, -214279, -342442, -450664, -510405, -534578, -544206, -532480, -481669, -408845, -365091, -378008, -414829, -417517, -361635, -268086, -172830, -107641, -103006, -180439, -328829, -500867, -645524, -742322, -799982, -826613, -808759, -721927, -560471, -355106, -157483, -5019, 98766, 172030, 232051, 288619]
39059B88619N9222N9298M1510N364k1403q008M1321Q7637R8105P7189N4692N1622
39047H35168O2441O4251L6974k2249r7743j65920k08093k14665j82642j18225
39037a0703m4285N075R878j4769l1683j9245R457K7474K5152J2591q89j4507k3881
39024g0335j8421J179J6640J6407J6791M2264Q8205J20226J12066O9102J1782
39013D05906m6509r5717j19167j05346o5733k7979j1383j6120l2124m8022n3490
39002b15684m4845l1228k7586l8880n5793o5500o0556l9099o290K2677L1315J9795
38990e11674Q474J8410N1225Q8762J05564Q0740J0530q0460j47918j60811j26056
38979f63214p4772k9618M740K6629L2885L2442M5473P7441J06612J10851R7334
$$ y = [288619, 347841, 407139, 448649, 454013, 432610, 424602, 465923, 553560, 651665, 728854, 783546, 835168, 897609, 961860, 998834, 976585, 878842, 712922, 504829, 290164, 107522, -10703, -54988, -49913, -40035, -54804, -86487, -105732, -96275, -68801, -43649, -31058, -31947, -46454, -70335, -88756, -87577, -70937, -54530, -37739, 4525, 92730, 212956, 325022, 394124, 405906, 359397, 263680, 144513, 39167, -26566, -54545, -65928, -82048, -114172, -162194, -215684, -260529, -291757, -319343, -358223, -414016, -479516, -540072, -579171, -585461, -562784, -531469, -511674, -503200, -484790, -433565, -344803, -239239, -158499, -147969, -228429, -376347, -537158, -663214, -737986, -767604, -762864, -736235, -703350, -670908, -625435, -547994, -441382, -330531, -233197]
38968b33197Q9397R0074P9686N2477L5023N4541R9180J24114R4686J4636q4113
38957D16504j67286k13213k15181j79412j19896n0397K0204Q5265J35637J60647
38947a27128J55973J30967J04870Q9971P6871M2147k4160j01277j52206j53767
38937D2261j09812m1502K5472O6895O8473L7375k88k1099k2724j8789k0699k9635
38925b4072m1503n0584m7970k4709J8679O8559J06945J22479J12357P8999L1010
38914C50190j3881l5500k7360m279J1730J3911J4449K4190L4647K6501n604m3451
38902C45543o2717n6704m0522l3780m1622n2753n4786m9668n0966o4191p3037
38891b35203n1081R981Q5312J32051J21202N8795j9590p4918r0707p8777o1068
$$ y = [-233197, -143800, -53726, 25960, 78437, 113460, 168001, 267181, 391295, 485981, 500617, 416504, 249218, 36005, -179176, -358588, -478484, -528881, -508677, -423412, -287775, -127128, 28845, 159812, 264682, 354653, 431524, 473671, 449511, 348234, 196028, 42261, -67551, -109053, -83581, -16686, 51787, 89162, 88874, 67775, 45051, 26262, 5563, -24072, -65575, -116159, -164129, -188838, -170159, -101600, 5345, 127824, 240181, 319180, 350190, 336309, 300809, 273449, 269170, 280900, 294811, 309260, 333450, 368097, 394598, 388994, 345543, 282826, 226122, 185600, 151820, 110198, 57445, 2659, -47009, -97975, -162166, -235203, -286284, -276303, -190991, -58940, 62262, 121057, 101467, 26549, -64158, -142935, -204003]
38880b04003m5818k2146K1309P3589J01252P7250J3190m2587m7809p613L3675
38869d9711M1149J8498j2534m3261p4171r2893p8624k8527L7208R7820J43562
38858d1484J63821J45061R2278L8355J6932L0466N2090N2072J7669m0656r2525
38847D34079j08352r0885p8668j03123j46517j57568j08373k3601M6660P1698
38837b64650N7558L1960J7722J6797J7870J7621K5919M5587N9712N2179L2016
38826A10291K1529K6872L8493N5368Q5360J20335J34575J15442P6356L2382j5985
38815H01018o3902q9194p7459m5794k2471j3382p399n784k3773o3637j04423j22102
38803A61698j09423p6207l9714j2935O670L3347O9187R1932Q1215N1619M1455
$$ y = [-204003, -249821, -271967, -250658, -177069, -75817, 1433, 14623, -27964, -75773, -83386, -49711, -8562, 9936, -2598, -45859, -120030, -212923, -291547, -320074, -282866, -185046, -41484, 122337, 267398, 359676, 398031, 414963, 445429, 497519, 549591, 567260, 526604, 434079, 325727, 234842, 156174, 53051, -93466, -251034, -359407, -383008, -336348, -264650, -207092, -175132, -157410, -140613, -122743, -105122, -79203, -33616, 26096, 78275, 110291, 131820, 158692, 197185, 252553, 337913, 458248, 592823, 708265, 784621, 817003, 801018, 737116, 647922, 570463, 524669, 502198, 488816, 481417, 475633, 451860, 388223, 283800, 161698, 52275, -23932, -63646, -76581, -69911, -36564, 32623, 124555, 205770, 257389, 298844]
38792B98844O8670J13168J42352J37441R4580K1516n7733j10514j19467r2458
38782D96399m7635j991K4250J4279k1346m4371k9453N652K5870K4123K1760L0029
38770D97566L3314J4276k0355m6147m4954j8944J2653K8566K2639P733l10p06
38758D85331o147k7538o5377j09478j37653j21210m8420N4372J36530J63615J39493
38747D63518R0353L9276L28j5301j297L4555O9238P7711N1871P934k9923n6461
38735G31802q7671j28785j51701j23443n4051O091K2455J0541M042Q377N238p709
38723B35186n798L0917R0137J38157J51021J30971R7439O6969M1985J7404n323
38712I89065j5765o318J8982M8576O9945P0467M1085j3786p5002j23282j52340
$$ y = [298844, 367514, 480682, 623034, 760475, 855055, 876571, 818838, 708324, 588857, 496399, 448764, 446773, 471023, 485302, 463956, 419585, 390132, 395784, 421654, 445777, 467537, 497566, 530880, 545156, 524801, 478654, 433700, 414756, 427409, 455975, 478614, 486347, 486037, 485331, 479184, 451646, 386269, 276791, 139138, 17928, -30492, 23880, 160410, 324025, 463518, 553871, 593147, 593475, 578174, 576877, 611432, 680670, 758381, 810252, 818186, 788263, 731802, 644131, 515346, 363645, 240202, 186151, 192242, 214697, 225238, 229280, 237657, 242895, 235186, 229388, 260305, 350442, 488599, 639620, 770591, 868030, 934999, 976984, 994388, 989065, 973300, 966982, 985964, 1034540, 1104485, 1174952, 1216037, 1202251, 1127249, 1003967, 851627]
38701H51627j66029j70524j73062j77619j73339j37133o1719K2652O7074M6392
38691g1680k1658r4389j34119j27435q7602l8436R210N9819J08481J29281J05195
38680a63333N9024L1787L3168L5499J6496j6475m8584p7195r6964q8768m3357
38669c58702J8179O6125R4484J15757J33514J38577J26163R9349O0220J5208j4682
38658D94192j0088J7500L1214J0064k9213n7624o6461o4174n3439k8523O047K8132
38646B77627J6653k4543o4651o9648l0674K9666P9561J05038J12262J06133P6166
38635F13590R820q3598j69092k08298j85525j14996k8387M2324P4873O0438O769
38624A7918o1060j09719j16046q1480k9889R524K0798P919j5115m1682p7709j25002
$$ y = [851627, 685598, 515074, 342012, 164393, -8946, -146079, -207798, -185146, -118072, -71680, -93338, -187727, -321846, -449281, -536883, -575319, -566109, -506290, -397809, -268528, -163333, -104309, -72522, -39354, -3855, 12641, -3834, -52418, -129613, -226577, -315345, -358702, -340523, -274398, -179914, -64157, 69357, 207934, 334097, 433446, 493666, 508874, 494192, 484104, 501604, 532818, 542882, 513669, 456045, 389584, 325410, 271971, 243448, 249495, 277627, 294280, 269737, 205086, 135438, 104764, 134430, 213991, 319029, 431291, 537424, 613590, 623410, 539812, 370720, 162422, -23103, -138099, -166486, -124162, -49289, 11149, 17918, -43142, -152861, -268907, -350387, -380276, -370752, -349954, -342035, -357150, -398832, -476541, -601543]
38612f01543j62556j56119r2507K593Q8601J47303J88868K25267K49180K41818
38602A30905J95464J25817O5235M2128N9787R2137J03285P3776R381o9851j43377
38591F84687j96855k24555k27826k08277j64599j00953l4238J6639M8339P1400
38581c36238R1540J02687R8552P8946M1808j7204q9528j49279j74034j63332j30478
38570f46560q6723m2837j3807n305j489J7498M8952P3378Q2861Q5230Q0834N7693
38558c50275J7346j3727j1453J9245N5414Q0963Q9346P5223M0447K29l2733o3196
38546i3171r5937j11522q2863j5935M8842Q1359Q8576R0182Q9117Q0255P0973
38535A49876P3645Q6037R5609R7737R4895Q2494N1666N854l7906o4785p0278n6058
$$ y = [-601543, -764099, -920218, -1012725, -1010132, -921531, -774228, -585360, -360093, -110913, 130905, 326369, 452186, 517421, 559549, 619336, 711473, 814758, 888534, 897915, 828064, 684687, 487832, 263277, 35451, -172826, -337425, -438378, -472616, -455977, -407638, -336238, -244698, -142011, -43459, 35487, 77295, 60091, -29437, -178716, -352750, -516082, -646560, -733283, -776120, -789927, -795232, -796721, -779223, -730271, -656893, -574032, -488802, -407968, -350275, -332929, -346656, -358109, -338864, -283450, -202487, -113141, -37918, 2529, 2758, -29975, -93171, -189108, -300630, -383493, -399428, -350586, -269227, -180651, -90469, -1352, 78903, 149876, 223521, 309558, 405167, 502904, 597799, 680293, 731959, 737813, 699907, 635122, 564844, 508786]
38523E08786l0136q942m524p689L703L7041P5865R8725R4407N8526n877p5891
38511G43994j13555r8760n0382l964K4117L9329M4957L3498L607k7569l5829j0994
38499E48449L3314O7246O4756K3741l1087o7316o7543l5864R608M5354N0906J9618
38487F61182l7042r8475j46090j65174j45937r2838k8531K2237N2667P1317Q1968
38476A75284P4995L9477k1909q9610j35218j38319j04150o1391l4022j9370l478
38465c17711R311N45k8751m9276l7530n104J5929O891k5883o0796o9853k8001
38453e90229O7433J83971K70132K88056K31463J22482K005q4651j12190r2693
38443B85779o0581l7361j9071L60P680j4820n7718q2036n4867J6979R3508J39049
$$ y = [508786, 478650, 469708, 465184, 457495, 461198, 498239, 574104, 672829, 767236, 825762, 819885, 743994, 630439, 531679, 481297, 477333, 501450, 540779, 585736, 619234, 622841, 595272, 559443, 548449, 581763, 649009, 713765, 737506, 706419, 639103, 571560, 535696, 545304, 590658, 641564, 661182, 624140, 525665, 379575, 214401, 68464, -24374, -52905, -30668, 21999, 93316, 175284, 250279, 289756, 267847, 178237, 43019, -95300, -199450, -260841, -294863, -314233, -317711, -308400, -307855, -336606, -385882, -423412, -428516, -412587, -405696, -431579, -492375, -562228, -590229, -522796, -338825, -68693, 219363, 450826, 573308, 575313, 490662, 378472, 285779, 225198, 187837, 168766, 169126, 176806, 161986, 104268, 22232, -32635, -15656, 77852, 216901]
38431B16901J48367J37119J15910Q2233L5504j1034m0323n0043n4820o8954q9691
38420D21169r9472q5742n9290m9721p6585j24658j55672j48706j21709j06247
38410f06633j08328j06365q4512n1784k3349K225L4384O7504Q2103O8767L7154
38399f88834j858m8777j00759j36134j31608r3941n7983m7193m8589l5361l036
38388a394073L0479N3879P4295R9815J25957J44820J54397J50324J19771N7034
38378c83302j8468p1100p6397l4307L9960J26572K01783K40240K27255J70643
38368D22879R9170M7471L6474O1258R6603J17304J13524Q7547M4732l903l7421
38357A085638l9951k3050j9557m7526q8964j11001r9237o2543j6081K5852M6534
$$ y = [216901, 365268, 502387, 618297, 700530, 736034, 725000, 684677, 634634, 579814, 510860, 421169, 321697, 235955, 176665, 126944, 50359, -74299, -229971, -378677, -500386, -606633, -714961, -821326, -905838, -957622, -980971, -978746, -944362, -876858, -794755, -725988, -688834, -690692, -739469, -840228, -976362, -1107970, -1201911, -1259894, -1307087, -1355676, -1391037, -1394073, -1363594, -1309715, -1235420, -1135605, -1009648, -864828, -710431, -560107, -440336, -383302, -401770, -472870, -549267, -583574, -543614, -417042, -215259, 24981, 252236, 422879, 522049, 569520, 605994, 667252, 763855, 881159, 994683, 1082230, 1126962, 1123059, 1085638, 1045687, 1022637, 1003080, 955554, 866590, 755589, 656352, 593809, 577728, 603580, 650114]
38346F50114L5441M026k0064k0267m988P313N815j3310n1648j02861j51534j87996
38334A50041k16386k36862k29301j73545q4386p470K5764K6048K4725L8752O5449
38323f17171R7177J25500J37685J25310R6718P0646N7571N4997N7682O1119N5877
38312C23111L1529j0064n5130r4847j31675j63841j74032j43904p6704Q56N7024
38301d37677P3475N4223K4646J5567L5934O0605N4549J1841l6522n6930m8673
38290b48962l9262m8711o7563p2341n4751k7557m333J5200L5215M9921N1516M6770
38278c64858N0230O0103N7605L7909K5989M6543Q7667J12579J04107P9098N7036
38267C54008L3551n673n8727j08015j38894j45870j26337q2500k9648R600K3744
$$ y = [650114, 685555, 689581, 669517, 649250, 644262, 651575, 657390, 644080, 592432, 489571, 338037, 150041, -66345, -303207, -532508, -706053, -790439, -797909, -772145, -746097, -721372, -682620, -617171, -519994, -394494, -256809, -131499, -34781, 35865, 93436, 148433, 206115, 267234, 323111, 354640, 344576, 289446, 194599, 62924, -100917, -274949, -418853, -495557, -494701, -437677, -364202, -309979, -285333, -269766, -233832, -173227, -118678, -106837, -143359, -200289, -248962, -288224, -336935, -404498, -476839, -531590, -559147, -563480, -548280, -513065, -463144, -411628, -364858, -314628, -254525, -196920, -159011, -133022, -86479, 1188, 113767, 217874, 296972, 354008, 387559, 381886, 323159, 215144, 76250, -69620, -195957, -278457, -308105, -298505, -274761]
38256b74761J9457R513R03l855k618L750J1256K1817M7345R6125J56390K01189
38244B86511K10566J83965J32714P1089J8161l880J2868M7663O5158M7234N592
38233A077641l7119o9772r2766j04603r7738o6071j1598N3401J05281J14840O5660
38222I37156k8147j25763j83970j80201j20684l6637L0664N6573N2847N2728O9553
38211E24119P8188M6280k3292r3260j31389j35633j21368j00515p9922o5568n4733
38200a57093l1420J5431P0410J01388R3492O2632L1042P68l8141p9885r8598p6243
38188a06217k6282J7478L3105K7584K4957M3597Q3756J28906J54651J42002R0973
38177F14510K3354l1732n7494n5058l3774l247K4141L2151J1152l0778p2509r6149
$$ y = [-274761, -255304, -245791, -244888, -248743, -251361, -247611, -236355, -214538, -167193, -71068, 85322, 286511, 497077, 681042, 813756, 884845, 903006, 899126, 911994, 959657, 1024815, 1072049, 1077641, 1040522, 970750, 877984, 773381, 675643, 609572, 597974, 651375, 756656, 871496, 937156, 909009, 783246, 599276, 419075, 298391, 261754, 292418, 348991, 401838, 454566, 524119, 602307, 648587, 625295, 532035, 400646, 265013, 143645, 43130, -36792, -102360, -157093, -188513, -173082, -102672, -1284, 92208, 154840, 185882, 186650, 148509, 68624, -29974, -106217, -132499, -115021, -81916, -54332, -29375, 14222, 97978, 226884, 381535, 523537, 614510, 637864, 606132, 548638, 493580, 459806, 456559, 480700, 512851, 524003, 493225, 420716, 324567]
38165C24567r6889q0373n7542m2196m5126o4379q4095q8390p6895o4154o4566
38154d40038q0546j04006j23531j27590j07144o4798k2850j2496m5730r9827j37137
38143a365693j39686j17534q5523m5353L969N0191P4601P1071N0596L1257L0109
38132a441995N7095J04993J49768J72467J77069J75717J64333J32059R1063P2424
38122a45007Q7414J14740J33404J44319J47310J23117O2784k748l1181j9327k72
38111F14553L261m707k0589n2573r5579j21246j09236p2429l7068j1070J3659
38100A06976L7623M8238L4841o79m5227p9634q7546o7768l5897q453J2033L2621
38088e2872N4686O7636N6439J5833l8047p1833o0825j3345L9126P6963J05767
$$ y = [324567, 227678, 147305, 89763, 47567, 2441, -61938, -146033, -234423, -311318, -375472, -440038, -520584, -624590, -748121, -875711, -982855, -1047653, -1070503, -1082999, -1128729, -1228556, -1365693, -1505379, -1622913, -1708436, -1753789, -1749820, -1699629, -1625028, -1553957, -1503361, -1472104, -1441995, -1384900, -1279907, -1130139, -957672, -780603, -604886, -440553, -308494, -217431, -145007, -57593, 57147, 190551, 334870, 482180, 605297, 668081, 665333, 634152, 614825, 614553, 617814, 613107, 592518, 539945, 444366, 323120, 213884, 141455, 104387, 93317, 106976, 144599, 192837, 227678, 226999, 181772, 102138, 14592, -53176, -89073, -97526, -85493, -52872, 1814, 69450, 125889, 141722, 103675, 31842, -28983, -42328, -3202, 73761, 179528]
38077A79528J32901J48299J39311J10890P6657L9120o725n7043j01042j34272
38067E27624j56032j58692j36086j00689p5287o5587n6260l7232j8426j1860j2816
38056c01343r098j48L789j855p234N750M9556J15734J69621J70304J07134J4546
38044C16756n7109q4448q0217o5601m7156k5711j6645m5802j20016k08166k60056
38033f94171k46262j76724q2054J4322J00553J63144J85541J64282J17724P2462
38023c81183M4745L7911N0452P7550J05890J15351R0688L1526m7554j23523j72504
38012a70651j78072j39209p1505K467O6321J13556J40260J41195J19403R5377
38002A19142R3837J15822J33116J19720Q2791N0833L5837K4148P551M021L2894
$$ y = [179528, 312429, 460728, 600039, 710929, 787586, 826706, 819981, 762938, 661896, 527624, 371592, 212900, 76814, -23875, -99162, -164749, -221009, -258241, -276667, -288527, -301343, -310441, -310589, -306800, -308655, -315889, -310139, -260583, -144849, 24772, 195076, 302210, 316756, 259647, 175199, 94982, 29381, -17775, -43486, -60131, -105933, -225949, -434115, -694171, -940433, -1117157, -1199211, -1184889, -1084336, -921192, -735651, -571369, -453645, -381183, -336438, -298527, -248075, -170525, -64635, 50716, 141404, 172930, 125376, 1853, -170651, -348723, -487932, -559437, -556970, -490649, -377093, -236833, -95638, 23765, 119142, 212979, 328801, 461917, 581637, 664428, 715261, 751098, 775246, 782797, 786818, 819712]
37991H19712P9836J04966Q5885L9289k456k5125l9134o2043j00831j45403j74395
37980E80301j72491j46462j18736j01289q3752n3580j8612K195M073k093j0254
37969a20700k3984l9749m4788l9665m5555p5170j09043j17451r8072p5053o5363
37958h54593o3227n5413l3560R710P7053J51233J99309K02389J71054J23994O4137
37947g914j1761q8894j35299j27583o9638J1142Q0812J17662J22907J12752R8344
37936A02530P9346N8216M7841N5927P2062Q1578Q3281Q0452O3798K2327l2434
37925G14924p2010q1093o5379l1005K0594P1305Q4927M5202j9684o8924r4503
37914E04354j15400j36062j37973j15109r1222q6717q5903n8433o616L0808K6166
$$ y = [819712, 899548, 1004514, 1090399, 1129688, 1127232, 1102107, 1062973, 1000930, 900099, 754696, 580301, 407810, 261348, 142612, 41323, -42429, -96009, -114621, -112426, -108353, -110446, -120700, -144684, -184433, -229221, -268886, -314441, -389611, -498654, -616105, -714177, -789230, -854593, -917820, -973233, -1006793, -997083, -920030, -768797, -569488, -367099, -196045, -72051, -7914, -19675, -108569, -243868, -371451, -441089, -429947, -349135, -231473, -108566, 4186, 102530, 181876, 240092, 287933, 343860, 415922, 497500, 580781, 661233, 725031, 747358, 714924, 642914, 561821, 496442, 465437, 486031, 557336, 642263, 687465, 667781, 598857, 504354, 388954, 252892, 114919, -190, -91412, -178129, -264032, -322465, -329081, -298273, -272107]
37903b72107l137j8337n415J6428K6640K7013L1012M3516N9681P5622R0410J00885
37891A72211J02237R2127O9264L2297j2234m4784m6723k1038Q843K2925K1216
37880C96341J6287J7683K5878L2988K4860r769o4998j16810j42388j38095j16096
37869g4119r0471p2555p1203q4283r2292p5047l8560j3526j9528l9084l5822P512
37857f98978P7448J48698K00625K17659J92021J34495P1345K1336j6337m4284
37847C04028m9475j9417L0543O4961O5194M4342K3837J0795L130P08J678M79l97
37834D80406J1223L5878N2480M5048K7946K4334K7131O504m3110q8419r8646q1899
37822C98876o7900p0104q0495r0742r9644j02623r0786o3872l3304q244J3734
$$ y = [-272107, -275244, -293581, -298996, -282568, -255928, -228915, -197903, -154387, -94706, -19084, 71326, 172211, 274448, 366575, 435839, 468136, 455902, 411118, 364395, 343357, 352200, 375125, 396341, 412628, 430311, 456189, 489177, 514037, 504268, 439270, 322460, 180072, 41977, -74119, -164590, -237145, -308348, -392631, -484923, -559970, -598530, -612056, -631584, -670668, -706490, -698978, -621530, -472832, -272207, -54548, 137473, 271968, 343313, 364649, 348312, 304028, 254553, 235136, 265679, 330640, 395834, 440176, 464013, 474808, 477938, 478646, 480324, 480803, 480406, 491629, 527507, 579987, 625035, 652981, 677315, 704446, 710950, 667840, 579421, 480775, 398876, 330976, 260872, 180377, 89635, -10009, -112632, -203418, -267290, -300594, -308838, -295104]
37811b95104L8220O2840Q0183Q7499Q6244P2983L9787j0493n4718o5837m1229
37800C75p002J0772J2379J5121K3879K2601m431n1715r4797j07189p5765r978
37788b65750N9083R6536Q9391N5072K2714P480L106m861k1130l5005l4029k4933
37776e2326l4021p6043j25249j32506p6463J3393R0529J36028J60374J73936J74685
37765B52337J62890J49863J44924J42809J29876R7474M6175j5625p0632r5230
37755I44861p3525j2756N8922J13882J44333J58971J62433J44788R7322L5819
37745A775050k908M243L8247N1609J2459o7166j45587j89041j94956j84635j78325
37734I18990j76752j64457j31080q8093n9335n1973m3269o005N3615R5537R0644
$$ y = [-295104, -256884, -194044, -113861, -26362, 59882, 132865, 172652, 162159, 107441, 41604, 375, -6627, 4145, 16524, 31645, 55524, 78125, 73694, 21979, -72818, -180007, -255772, -265750, -206667, -110131, -20740, 34332, 57046, 64526, 67632, 62771, 41641, 6636, -27393, -52326, -86347, -162390, -287639, -420145, -496608, -483215, -392686, -256658, -96284, 77652, 252337, 415227, 565090, 710014, 852823, 982699, 1080173, 1126348, 1110723, 1040091, 944861, 871336, 858580, 917502, 1031384, 1175717, 1334688, 1497121, 1641909, 1739231, 1775050, 1772142, 1776385, 1814632, 1866241, 1878700, 1811534, 1665947, 1476906, 1281950, 1097315, 918990, 742238, 577781, 446701, 358608, 299273, 247300, 204031, 198026, 251641, 347178, 437822]
37723D37822N8180M7335Q3069J39461J67051J37690O1545k8445j01533j45916
37713H56259j69819j85279j88340j60312r2233k047P7659J23626J30351J05666
37703D95531O8878M5085M5564N4666M7981K2285m692k1896l5812n1611o2330o6156
37691E37493p8026j07622j34992j27370q1262l3383k3871n6062r6871j10620q6960
37680c99546m0834M544L1175L0505M954l1821o1827p4474o9974n1882k4706k989
37668f86875j0620n5029j04166j06088l9396O3343J46941J81204J74120J48453
37658b88113J16614P7269K9040j6034l4951j4767K8293N9226O0357N1833O7074
37647A35841J09064J40921J25175O7339J2376k684J5541L3979L7994M3916O5577
$$ y = [437822, 496002, 543337, 626406, 765867, 932918, 1070608, 1132153, 1103708, 1002175, 856259, 686440, 501161, 312821, 152509, 60276, 58229, 135888, 259514, 389865, 495531, 564409, 609494, 655058, 709724, 757705, 779990, 775298, 753402, 717590, 665979, 603649, 537493, 459467, 351845, 216853, 89483, 8221, -25162, -49033, -105095, -201966, -312586, -399546, -440380, -435836, -404661, -374156, -369202, -401023, -462850, -537324, -607298, -659180, -683886, -686875, -697495, -752524, -856690, -962778, -1002174, -938831, -791890, -610686, -436566, -288113, -171499, -94230, -65190, -81224, -116175, -130942, -102649, -43423, 16934, 68767, 135841, 244905, 385826, 511001, 578340, 590716, 588032, 603573, 637552, 675546, 719462, 785039]
37636G85039Q6397P8523L9928l635k9489l5372k8692j6633r932j9450m1065n6270
37624G49349n5298m8425m6190l9753j2898L2537P4322R1082Q0002N6787M2959
37613I24474M8417O1104N7487K6901j8736o0756r0630j07481j10030j00671r0719
37602E39360r1044r9519j03668r2286o0550j0969M3449Q2861R5321Q4545N9810
37591D47310K7349k425j3300m093j471l1171p7370r0420m1697M1908J04534J13179
37579D72333P9276M0312K8443M9645Q3048J01150R5307P9848O8839N4072J2926
37568A165199o3221j54447k26509k54620k33640j74949j02436m6889k8884l8494
37558a58890l8700P94P2715J39306J67106J49750J02241M4508q619n0916q2492
$$ y = [785039, 871436, 949959, 989887, 986252, 956763, 921391, 892699, 876066, 866134, 846684, 805619, 749349, 694051, 645626, 599436, 559683, 546785, 579322, 653644, 744726, 824728, 881515, 924474, 972891, 1033995, 1091482, 1118383, 1099647, 1038891, 948261, 840780, 730750, 630079, 539360, 448316, 348797, 245129, 152843, 92293, 81324, 124773, 207634, 302955, 387500, 447310, 474659, 472234, 458934, 454841, 453370, 422199, 344829, 254409, 212712, 254620, 359154, 472333, 551609, 591921, 620364, 670009, 753057, 854207, 949514, 1029362, 1098201, 1152273, 1165199, 1101978, 947531, 721022, 466402, 232762, 57813, -44623, -91512, -120396, -158890, -197590, -196796, -124081, 15225, 182331, 332081, 434322, 478830, 470211, 419295, 336803]
37547C36803j01218r9979p9289n5757m3323k9285J1292P4089J19550J18725Q7163
37536C38771N8327L8329O464m7995j10290j59742j87157j89945j63537j05152
37526e21927k3275N7657J03827R4933N0044K2004N0907J23103J84425J90341J34835
37515D66874L9572o5005j45801j74228j42485p1290L223N0464N7972L3275k752
37504D9819k9262l6591k5945k835K4478M4416M8646M0160K9483K2096J3801j115
37492A77151k1378m0378n4943o9925r0299j07253r8817n2467J7109Q2683J31333
37481a27184J61245J58088J02929J1928n8999o8190k8775K1782P1421J27317J77784
37470E49346J95636J76885J46384J22347R9730P1384M1284J1030k4341n8791p3544
$$ y = [336803, 235585, 135606, 56317, 560, -42763, -72048, -60756, 13333, 132883, 251608, 338771, 397098, 435427, 441891, 393896, 283606, 123864, -63293, -253238, -416775, -521927, -545202, -487545, -383718, -288785, -238741, -216737, -165830, -42727, 141698, 332039, 466874, 506446, 441441, 295640, 121412, -21073, -92363, -89140, -38676, 19296, 52571, 49819, 20557, -16034, -41979, -44814, -20336, 24080, 72726, 112886, 142369, 164465, 178266, 177151, 155773, 115395, 60452, -9473, -99772, -207025, -305842, -358309, -341200, -258517, -127184, 34061, 192149, 295078, 307006, 248007, 179817, 151042, 172824, 244245, 371562, 549346, 744982, 921867, 1068251, 1190598, 1290328, 1361712, 1402996, 1414026, 1389685, 1330894, 1257350]
37459A257350o3311m8256m9475o5617q2808r4804j02085r9578p6227k5332M6313
37448E96170J15205J50552J38746R9175O5588N3014N3432N6978N7263L9121j0802
37437A414442p2919r9337o5531j029M4568N0060K4549j8823o8535j06062j16619
37426I84764j06865r4159q0244n2966j4384J0681J479l3366o3755o5772l8459
37415D46954N88L0266L8587K6240K014k4291m7177o7081q6170j01275j04829r6084
37403A7742q5225p8979o8016l9494K547M2858P7221J10867J34510J24311P5470
37392C13812J8002j4832k1799k4525l3978m1156l5172j7340k24j214l0746p6477
37380C4351j05344r4112n5560k4405k0347l5601n5367p5977r8768j16027j10449
$$ y = [1257350, 1194039, 1145783, 1096308, 1030691, 947883, 853079, 750994, 651416, 575189, 549857, 596170, 711375, 861927, 1000673, 1099848, 1165436, 1218450, 1271882, 1328860, 1386123, 1425244, 1414442, 1341523, 1242186, 1176655, 1175626, 1220194, 1270254, 1294803, 1275980, 1207445, 1101383, 984764, 877899, 783740, 703496, 650530, 636146, 646827, 648306, 614940, 551185, 485413, 446954, 447542, 477808, 516395, 542635, 544649, 520358, 473181, 406100, 319930, 218655, 113826, 17742, -67483, -146462, -214478, -253972, -251425, -208567, -131346, -20479, 114031, 238342, 313812, 331814, 316982, 295183, 270658, 236680, 195524, 160352, 143012, 142788, 141574, 110828, 34351, -70993, -165105, -220665, -245070, -265417, -301018, -356385, -432362, -531130, -647157, -757606]
37369g57606o7940Q762R6243J61867J84599J67238J28916Q8763N7476L7616K4373
37358A30307O988k4225o9065j15415j45506j45593j13323n7392J0205P8877J34769
37347c09373J58833J39590Q6031J9522m3778r2113j06498p1092o8O3849Q7094
37336f8003O9734K9220j9210n4026m2744K6852J17943J71369J62207J13928N9647
37325E66917J1671k5591l5143N79P1801J39146J62746J30410N8830k5451j01393
37314I54522j54822j77373j73187j61705j62254j74363j81587j74766j60101j40929
37304g06565j04312l5587N9928J56843K26753K51636K28557J69239R2156J2207
37294C50855n7274r5153q1656k5209L3412N7393M8122L4089L4435M5361N4759
$$ y = [-757606, -825546, -816784, -720541, -558674, -374075, -206837, -77921, 10842, 68318, 105934, 130307, 137295, 113070, 44005, -71410, -216916, -362509, -475832, -533224, -523019, -444142, -309373, -150540, -10950, 75081, 94603, 50825, -41288, -147786, -218878, -218946, -155097, -68003, 1731, 30951, 11741, -42285, -85029, -58177, 59766, 231135, 393342, 507270, 566917, 578588, 552997, 517854, 518433, 590234, 729380, 892126, 1022536, 1081366, 1055915, 954522, 799700, 622327, 449140, 287435, 125181, -49182, -230769, -405535, -565636, -706565, -810877, -846464, -786536, -629693, -402940, -151304, 77253, 246492, 338648, 350855, 293581, 198428, 116772, 91563, 124975, 182368, 230490, 264579, 299014, 344375, 399134]
37283C99134N4787M1678J5829j6747n0778q7760j27255j53689j41368p6579K6265
37272a16483J28610J88691J87486J40551Q0557K6413k3876p1079j00880r9218
37262C40772o8626k1220L1845P5601R2179Q0325O0196M3955J6600l5126q9806
37251E26695j12969j03047q9041q6245q1330o1782l3450l523K9558O0016O8788
37240A13670M5285K008l8837o0019m8415K63O6947J17127J34824J34857J32233
37229E99943J17111P6066K4650k152J0782M3132O2049N0840J6422k2538n2673
37218I23632p3504q7471q6131n7439r693K4947K1739p934k8318j6736J5841L6628
37206F55561J8690l6428r6562j23354j04118n7322q529K7764M2322K7637p077
$$ y = [399134, 453921, 495599, 511428, 494681, 443903, 356143, 228888, 75199, -66169, -142748, -116483, 12127, 200818, 388304, 528855, 609412, 635825, 611949, 540870, 439990, 340772, 272146, 250926, 282771, 358372, 450551, 530876, 591072, 635027, 651627, 616501, 526695, 413726, 310679, 221638, 135393, 54063, -7719, -41169, -44692, -15134, 44882, 113670, 158955, 160963, 122126, 62107, 13692, 13955, 80902, 198029, 332853, 467710, 599943, 717054, 793120, 817770, 815618, 826400, 869532, 931581, 982421, 998843, 976305, 923632, 850128, 762657, 676526, 619087, 609394, 634341, 656080, 648146, 619828, 603092, 618933, 655561, 674251, 637823, 541261, 417907, 313789, 256467, 247938, 275702, 318024, 345661, 338584]
37195C38584l3611l6180l4222n3255q1795q3883n3071k4250k2221k5136J970N6015
37183e1055J01434J15796J04655P4823K0495n4867j23153j53902j43601j11823
37173b21198p5410l7826J363L9755P4817J02970J14822J01063O7046L4484K3098
37162B24984L2519M3951L7225O861l4024o5127p8525q5716r8440j03932p1582
37151a91806Q563J01145J48184J16246K0997q6368j51105j43895p6440M903M9033
37140b00543L4952j6247o1620p1149m9516k8676l8104p8600j21604j30411q2656
37129h44174J7457J36846K26222K50490K14202J51039Q6982K3765l9807q6443
37119A36579r2730n5210O171O5010J00687J02582P6548M6113L6550N5635R2962
$$ y = [338584, 304973, 268793, 234571, 181316, 99521, 15638, -37433, -61683, -83904, -109040, -107070, -51055, 50379, 166175, 270830, 345653, 366148, 311281, 188128, 34226, -109375, -221198, -296608, -334434, -333071, -293316, -218499, -115529, -707, 100356, 167402, 201886, 224984, 257503, 301454, 338679, 345540, 311516, 246389, 167864, 82148, -16292, -120224, -191806, -183243, -82098, 66086, 182332, 203329, 116961, -34144, -178039, -254479, -249576, -200543, -165591, -181838, -243458, -314607, -364123, -392799, -430903, -509503, -631107, -761518, -844174, -826717, -689871, -463649, -213159, 1043, 152082, 239064, 262829, 223022, 136579, 43849, -11361, -5190, 59820, 160507, 263089, 339637, 385750, 422300, 477935, 570897]
37108E70897J32174J56485J49522J05227L8326k4352o5304q4573q9282q3586o9513
37097G36021m9676k5835J239K7848M5323M4542K5073J055p186N017J5692k975
37085H16138n4061j17688j80284k41414k87217k83440k14385j12356k6263K9735
37075f71235P6829J30584J82817K20612K40433K40908K18966J76636J20399N6060
37065I93009m341l9019l9576l2288n2430r7303j28149j21479r4037p0157m8926
37054B65304j6529K8438P6585J19748J48636J52135J31500J03175P6329M0843
37044A126164j0338o1904r5795j17874j45305j75053j85704j67981j33789r3090
37034f0669l9376L5363J22807K01664K51118K57708K18788J47410O9468Q270k9732
$$ y = [570897, 703071, 859556, 1009078, 1114305, 1152631, 1128279, 1062975, 978402, 889120, 805534, 736021, 686345, 660510, 661749, 689597, 734920, 779462, 804535, 805590, 798404, 803421, 819113, 816138, 762077, 644389, 464105, 222691, -64526, -347966, -562351, -674707, -700970, -671235, -594406, -463822, -281005, -60393, 180040, 420948, 639914, 816550, 936949, 993009, 988668, 949649, 910073, 877785, 825355, 728052, 599903, 478424, 384387, 314230, 265304, 248775, 277213, 353798, 473546, 622182, 774317, 905817, 1008992, 1085321, 1126164, 1115826, 1053922, 958127, 840253, 694948, 519895, 334191, 166210, 32421, -60669, -100045, -64682, 58125, 259789, 510907, 768615, 987403, 1134813, 1204281, 1212551, 1182819]
37023A182819n2919p0056p9764p3732m9263j8098j217j2508m6707q3588j03416
37012E91551r8236p1533l2698N675K9818L2474K1432J4140J7135J4228j5940p0836
37000D37210j21792j42445j29485r2380l7265K7483Q0877J03177R9540R5030J02023
36989D21973J02837P0714L390o8012j03147q8118n0497l4781n7155q8365q8073
36978B0766n1791j4613j1033m0310o9946o4128j0407O9929J34518J50959J20731
36967B34675P2302L4073J7539J9687L1027M2918N5415P5669J01425J12466R1518
36956H88714N0735K2881K4890M1932M7987K9953r013n4903q6286q4906n1301l927
36944H16756L9735P2807Q8779P6162L3256j9928n6206o6691o4810o5209o4773
$$ y = [1182819, 1129900, 1059844, 980080, 906348, 857085, 838987, 837770, 825262, 778555, 694967, 591551, 493315, 421782, 389084, 394759, 424577, 457051, 478483, 492623, 509758, 523986, 508046, 437210, 315418, 172973, 43488, -48892, -86157, -58674, 22203, 125380, 224920, 319950, 421973, 524810, 595524, 598914, 530902, 427755, 339637, 289140, 254359, 197204, 108839, 20766, -31025, -45638, -56671, -96981, -166927, -231055, -241462, -171533, -37015, 113944, 234675, 306977, 341050, 358589, 378276, 409303, 452221, 507636, 583305, 684730, 797196, 888714, 939449, 962330, 987220, 1029152, 1077139, 1107092, 1098079, 1043176, 956890, 871984, 820683, 816756, 856491, 929298, 1018077, 1094239, 1127495, 1107567, 1051361, 984670, 919860, 854651, 789878]
36933G89878m8974j5996J1567O208l3625p9698j02613r5795o9384l3634L904L7574
36921C69412P1979J20873J84290K35464K44395K06698J36908M6400n2425j31797
36911A432197j65790j59972j40701j16987p8476l1488o499j7736l8156k9685J5663
36900F62370P4492J16799J22708R0492M2145J1102J1371K3083J5586j9919o4303
36889A085926q9804q2035n0424k0719j2159k1065l0516l0564k0173K700L6551
36878G67718O5029O7708M3680J1619j1996k1479j4729L434J4292L438j4746j3007
36866I00961Q732K4360K4744L1261N6961Q0507P3448L4114j7670o0920p7106n3642
36854A025750J86N3998Q4487R0279P3441K9097l1240o6059l7264M8116J42522
$$ y = [789878, 740904, 724908, 736475, 742683, 709058, 629360, 526747, 430952, 361568, 327934, 331838, 369412, 441391, 562264, 746554, 982018, 1226413, 1433111, 1570019, 1616419, 1563994, 1432197, 1266407, 1106435, 965734, 848747, 770271, 738783, 732284, 714548, 676392, 646707, 662370, 736862, 853661, 976369, 1066861, 1109006, 1120108, 1131479, 1154562, 1170148, 1150229, 1085926, 996122, 914087, 863663, 842944, 830785, 809720, 779204, 748640, 728467, 731167, 767718, 832747, 900455, 944135, 955754, 943758, 922279, 907550, 910984, 925276, 928714, 913968, 900961, 909693, 934053, 958797, 990058, 1047019, 1127526, 1200974, 1235088, 1217418, 1156498, 1079392, 1025750, 1025936, 1079934, 1164421, 1254700, 1328141, 1357238, 1325998, 1259939, 1222675, 1270791, 1413313]
36843A413313J97301J89638J24627K9069n8853j06105r6599l1946O9959J77503
36833A907907K57690K89173K60155J65749K5634j03895j62041j32115m4168O1600
36823B525689J48908J74820J10198j6993j32120j83719j80660j55893j27275j05117
36813B057838j00096j00630p2217l711O9295J07154J07166Q2700L2055m2006j05085
36802B032463j17943q0756k7079J5781M2094N8079P6016J04411J28448J17795
36792B349309P0369K8395L1330P1406J14322J42462J55752J52226J35869J28667
36782C380107J49235J90987K40031K97546L64339M23103M59769M85229N14851
36773F505197N48206N92258O77096Q13533R54925J037723J044080R87296Q51776
$$ y = [1413313, 1610614, 1800252, 1924879, 1953948, 1895095, 1788990, 1692391, 1660445, 1730404, 1907907, 2165597, 2454770, 2714925, 2880674, 2906308, 2802413, 2640372, 2508257, 2464089, 2525689, 2674597, 2849417, 2959615, 2942622, 2810502, 2626783, 2446123, 2290230, 2162955, 2057838, 1957742, 1857112, 1784895, 1781184, 1850479, 1957633, 2064799, 2147499, 2179554, 2137548, 2032463, 1914520, 1833764, 1806685, 1822466, 1864560, 1922639, 1998655, 2103066, 2231514, 2349309, 2419678, 2448073, 2479403, 2550809, 2665131, 2807593, 2963345, 3115571, 3251440, 3380107, 3529342, 3720329, 3960360, 4257906, 4622245, 5045348, 5505117, 5990346, 6505197, 7053403, 7645661, 8322757, 9136290, 10091215, 11128938, 12173018, 13160314, 14012090]
36764A4012090N97285K28251j76547n12785p10346p52199o67240n11431l33540
36755A1173538j50267L8901K24149L92206N51147P24346R23376J146250J390743
36746A6414389J632547J780858J689585J255279N25971k90051r47605j325754
36738B0735219j478231j527411j530083j467052j330959j161159r88673q07764
36730A0443887o24076m77182l84114l08047k20806j54021j44754j66499j63016
36721G801372j25590r1013q2783r7203j31410j84078k37589k70753k79200k62989
36711F038764k16432j52334j07503r7650r6293q2318p0072o3644k8800M7051J11136
36700E281905J12359P5213N6334O3517P1066P9620J01628J17252J04000Q4428
$$ y = [14012090, 14609375, 14837626, 14661079, 14148294, 13437948, 12685749, 12018509, 11507078, 11173538, 11023271, 11062172, 11286321, 11678527, 12229674, 12954020, 13877396, 15023646, 16414389, 18046936, 19827794, 21517379, 22772658, 23298629, 23008578, 22060973, 20735219, 19256988, 17729577, 16199494, 14732442, 13401483, 12240324, 11251651, 10443887, 9819811, 9342629, 8958515, 8650468, 8429662, 8275641, 8130887, 7964388, 7801372, 7675782, 7584769, 7501986, 7404783, 7273373, 7089295, 6851706, 6580953, 6301753, 6038764, 5822332, 5669998, 5562495, 5464845, 5368552, 5286234, 5216162, 5152518, 5123718, 5170769, 5281905, 5394264, 5469477, 5525811, 5589328, 5660394, 5740014, 5841642, 5958894, 6062894, 6147322]
36690F147322Q8895R8580Q1917N8279O5989R5189J13741J33081J85606K60182
36680G328781L19661L58128L84699L81502L37904K95138K96819L28249L60697
36671A0391578M11053M95036N73555O17457O71300P76018Q88172R61023J040838
36662A6826030J187809J368897J531908J712612J955653K211112K439501K734972
36654C1968494L200115L788088M428027N204556O223473P404754Q631705J0010302
36646H0859514J1743643J3858685J6320561J9269304K2803696K6676051L0531229
36639B22062683L4015773L5791365L2718963K1673378L297442j6725216l1370354
36632C01464034l7428287l6723358l2948571k8459480k3974402j9799408j6262039
$$ y = [6147322, 6236217, 6334797, 6416714, 6474993, 6540982, 6636171, 6749912, 6882993, 7068599, 7328781, 7648442, 8006570, 8391269, 8772771, 9110675, 9405813, 9702632, 10030881, 10391578, 10802631, 11297667, 11871222, 12488679, 13159979, 13935997, 14824169, 15785192, 16826030, 18013839, 19382736, 20914644, 22627256, 24582909, 26794021, 29233522, 31968494, 35168609, 38956697, 43384724, 48589280, 54812753, 62217507, 70849212, 80859514, 92603157, 106461842, 122782403, 142051707, 164855403, 191531454, 222062683, 256078456, 291869821, 324588784, 346262162, 349559604, 332834388, 301464034, 264035747, 227312389, 194363818, 165904338, 141929936, 122130528, 105868489]
36625A05868489j3398171j1024064r102626p683306o620220n685188m866329m285052
36617D3203533l902284l544758l153318k794819k482586k170617j881179j673454
36609B1600518j518724j343801j159940j024765r19181p82914o34823n45408n22732
36600A3148230n25767n52451o13782o56173o11030m98091l92721l17436k46436
36591H734343j83798j48710j08025j0663J23499K22009K54343K47484K29795K21481
36581I581758K56918L52219M68262N60371O40911P41076Q44559R20646R92609
36572A5359329J107683J264327J434523J635809J913072K260736K620364K938963
36564C0534806L170802L234466L026794K480544J583563L84142r63448k197111
$$ y = [105868489, 92470318, 81446254, 72343628, 64660322, 58040102, 52354914, 47488585, 43203533, 39301249, 35756491, 32603173, 29808354, 27325768, 25155151, 23273972, 21600518, 20081794, 18737993, 17578053, 16553288, 15634107, 14851193, 14216370, 13670962, 13148230, 12622463, 12070012, 11456230, 10800057, 10189027, 9690936, 9298215, 8980779, 8734343, 8550545, 8401835, 8293810, 8283147, 8406646, 8628655, 8882998, 9130482, 9360277, 9581758, 9838676, 10190895, 10659157, 11219528, 11860439, 12601515, 13446074, 14366720, 15359329, 16467012, 17731339, 19165862, 20801671, 22714743, 24975479, 27595843, 30534806, 33705608, 36940074, 39966868, 42447412, 44030975, 44415117, 43451669, 41254558]
36556D1254558l079135l542583l670458l560256l272096k881377k488010k152356
36548A6608287j875692j650640j479870j342322j195849j027306q61854p20030
36540F454724o03942n22333m83856m63179m16473l35443k50180j79669j17749
36531C081900o5870l8029l0163k2342j4077k2765m6731o4304o8727o9346o0831
36520B578715k8785J4362L6929L4659L6913O5600J17629J80682K28656K09900
36510C475260R0319q4740k15961k50392k22539j90739j74519j66876j65013j62994
36500A931806j42852r7929m8305j8656j6385l8306p6863j10996j13698q1645m1429
36489A144742j8739j7223l0847n5450q0126q7167p2042n0257l6811k9807j8452
$$ y = [41254558, 38175423, 34632840, 30962382, 27402126, 24130030, 21248653, 18760643, 16608287, 14732595, 13081955, 11602085, 10259763, 9063914, 8036608, 7174754, 6454724, 5850782, 5328449, 4844593, 4381414, 3964941, 3629498, 3379318, 3199649, 3081900, 3016030, 2978001, 2947838, 2925496, 2911419, 2888654, 2841923, 2777619, 2708892, 2639546, 2578715, 2549930, 2564292, 2601221, 2635880, 2672793, 2738393, 2856022, 3036704, 3265360, 3475260, 3565579, 3480839, 3264878, 3014486, 2791947, 2601208, 2426689, 2259813, 2094800, 1931806, 1788954, 1691025, 1642720, 1624064, 1607679, 1569373, 1492510, 1381514, 1267816, 1186171, 1144742, 1126003, 1108780, 1077933, 1022483, 942357, 855190, 783148, 732891, 696080, 666273, 647821]
36478F47821K781K8795M3369K8497j3209n1772o0856m9040m4114n5218o9857p8809
36466C28388q0261o6720l3632L043K2036K5485K9879L6954M1143N6997J04006
36455D67318J65602J98112J83365J39561P7818j2782j24013k08254k22793j74274
36445D89660j02395l6710J6263N8226Q6510R1204O2635J0097l2823l9113k0418
36434E83136q838j2998j6935j6609k5691m5240o0709p2653r6174j23319j22742
36423a8772q9010n5583m0695j5916M5929J21815J67852J75066J65006J46817J11225
36412G13734N9028O530l5384o5809p9952p0786m4676j9145m089K796L274n186
36400D60335j8078j9345M845M8216Q2009P5123K3593m0547p7422p6330n7642m1852
$$ y = [647821, 650602, 679397, 722766, 751263, 738054, 686282, 625426, 576386, 532272, 477054, 407197, 328388, 248127, 181407, 147775, 150818, 172854, 198339, 228218, 265172, 306315, 363312, 467318, 632920, 831032, 1014397, 1153958, 1231776, 1218994, 1094981, 886727, 663934, 489660, 387265, 350555, 366818, 425044, 511554, 602758, 665393, 675490, 642667, 603554, 583136, 574298, 561300, 544365, 527756, 502065, 456825, 396116, 323463, 227289, 103970, -18772, -107782, -163365, -204060, -219976, -174047, -52232, 115620, 290686, 455692, 602509, 713734, 772762, 779292, 743908, 678099, 598147, 527361, 482685, 463540, 459451, 462247, 465521, 460335, 442257, 422912, 427757, 475973, 557982, 633105, 656698, 616151, 538729, 462399, 404757, 362905]
36388C62905l0760j8607l655J8131N5580J07530J54343J73113J56471J13842O2459
36377A151352J9606o762k4126m4604o7670q3600r2008j01128j08125r9407p5810
36366D67718n7487n3478m4909j3542K7152M7086L8007K0693J6804K6005L0027
36355E04076J0414l7027r7897j46981j62491j35337p2223J558M7692M0770m729
36344e2175m4014m5817k0443q88n059k2564l2249k5877j5743j9750l7594m7082
36332c69255l1087j669J4842J2058P404J3799K4902K9942K5525Q380k6342p1403
36320c62904j05150j10130q4353l2623L7369J05465J43935J43534J22606J01405
36310d0846Q0823N7289M4381O1726J07083J54000J78503J81754J87362K19925
$$ y = [362905, 332145, 313538, 309883, 328014, 383594, 491124, 645467, 818580, 975051, 1088893, 1151352, 1170958, 1164196, 1140070, 1095466, 1027796, 944196, 852188, 751060, 642935, 543528, 467718, 410231, 356753, 311844, 298302, 325454, 372540, 410547, 431240, 448044, 474049, 504076, 514490, 477463, 379566, 232585, 70094, -65243, -137466, -135908, -88216, -47446, -52175, -96189, -142006, -162449, -163337, -168396, -190960, -223209, -249086, -264829, -284579, -322173, -369255, -400342, -402011, -387169, -375111, -367707, -353908, -329006, -299064, -273539, -265159, -291501, -362904, -468054, -578184, -662537, -695160, -657791, -552326, -408391, -264857, -142251, -40846, 39977, 97266, 141647, 203373, 310456, 464456, 642959, 824713, 1012075, 1232000]
36300A232000K83028L55094M09528M39439M57848M73353M71455M21094K98018
36291D840857J08295j03520k76908l79384m26046m47384m48258m15147l53290
36282B099215k90331k43793k08413j76646j48235j17939p9954m9702n4408r2835
36272F36959j28997j35387j17484q5866l4767L3007Q7850J06390J04743J14666
36262E81114J40093J57975J49216J10035M7901j2556l3901n73N9642J09453J46902
36251A455301J94716K55972L07822L36974L57916L92703M45349M91341M80096
36242D718190L61561J36311j22864l21013m14970m27012l97624l50415k98735
36233B883429k54769k20233j86518j54352j41971j67431k29626l04761l51267
$$ y = [1232000, 1515028, 1870122, 2279650, 2719089, 3176937, 3650290, 4121745, 4542839, 4840857, 4949152, 4845632, 4568724, 4189340, 3763294, 3315910, 2867652, 2452505, 2099215, 1808884, 1565091, 1356678, 1180032, 1031797, 913858, 833904, 784202, 729794, 636959, 507962, 372575, 255091, 169225, 134458, 167465, 255315, 361705, 466448, 581114, 721207, 879182, 1028398, 1138433, 1186334, 1173778, 1139877, 1139304, 1198946, 1308399, 1455301, 1650017, 1905989, 2213811, 2550785, 2908701, 3301404, 3746753, 4238094, 4718190, 5079751, 5216062, 5093198, 4772185, 4357215, 3930203, 3532579, 3182164, 2883429, 2628660, 2408427, 2221909, 2067557, 1925586, 1758155, 1528529, 1223768, 872501]
36224H72501l26257k20550q2121J3838K7940j7437p2101j00786r2257n1669m28
36213d9327K9746K1604q751k6543j2897J7071K8706O86n1828q6902p3163j6522
36201b28120N3394J15750J66227J98276J96574J56391R7063M6169J4585q179l8599
36190G69531q2555j29301j58483j56715j30259r9591q0640p2066n8628k5206K8203
36179a95710Q1805J11792J15216J11129J10050R4322M4846j9977n3790l3586J5871
36168C81968N4125O5578N9760M6030K3612p021l4410m0867j6196L0620P3912R1859
36156G28970Q6281P6377P2465O4526L9417M07l5652n3673m8176k3800M462J7485
36144I29089P661j3272k8377l4884m1884n0258m5720j7479K3049N2041O0842O2775
$$ y = [872501, 546244, 325694, 243573, 257411, 285351, 267914, 195813, 95027, 2770, -48899, -49327, -19581, 2023, -6728, -33271, -46168, -29097, -391, 295, -51533, -138435, -211598, -228120, -174726, -58976, 107251, 305527, 502101, 658492, 755555, 801724, 816309, 808130, 769531, 686976, 557675, 399192, 242477, 112218, 12627, -68013, -140079, -198707, -223913, -195710, -113905, -2113, 113103, 224232, 334282, 428604, 473450, 453473, 399683, 366097, 381968, 436093, 501671, 561431, 607461, 631073, 624052, 589642, 548775, 532579, 563199, 637111, 728970, 815251, 891628, 964093, 1028619, 1068036, 1068443, 1032791, 979118, 930942, 907142, 911604, 929089, 936750, 923478, 895101, 860217, 818333, 768075, 722355, 704876, 727925, 779966, 840808, 903583]
36132I03583O7198N8481J6809m3537p8169o4215l1127k4119m8834p2691p4212
36121F09167o5663o4214o5339n6182l6825j3706J3472M1484N1606K8815j0972
36110D31643l3166k6256j4215k1650m1580m7719k8460L193K8395L9638L9557L1384
36098C60764J4219j3625m5719o2136m1246J4789P1011Q8130O1151K0154q331k8564
36086D30597n9607j05717j54197j93688k19560k24287j97780j40616o7393N847
36076i26401P0732J23392J61016J82248J82237J48333P4085j8727q5934r8698
36066a87717o8335k7159N956L1501M9344M8248J8677l0166o9730p1221l1066K1599
36054c10069M9759M3485K4089J4750K0365L9283P5425J24452J62284J66941J45014
$$ y = [903583, 970781, 1029262, 1046071, 1002534, 924365, 860150, 829023, 804904, 756070, 683379, 609167, 543504, 479290, 413951, 357769, 320944, 307238, 320710, 362194, 413800, 442615, 431643, 398477, 372221, 358006, 336356, 294776, 247057, 218597, 221790, 250185, 289823, 329380, 360764, 374983, 361358, 315639, 253503, 212257, 227046, 298057, 386187, 447338, 467492, 459161, 430597, 370990, 265273, 111076, -82612, -302172, -526459, -724239, -864855, -932248, -926401, -855669, -732277, -571261, -389013, -206776, -58443, 15642, -3085, -89019, -187717, -256052, -283211, -277255, -245754, -196410, -148162, -129485, -159651, -229381, -300602, -331668, -310069, -260310, -216825, -192736, -177986, -157621, -118338, -42913, 81539, 243823, 410764, 555778]
36043E55778J18996R5044O3985L0383J5432K6562M7520O8206J01941J56451K06513
36032A486811K20565K06109K00000K09054J85735Q1143q9126k50643l39755l52994
36022A556899l27171k90450k47357k00929j66483j56478j63972j70031j61331
36013c27303j33544q3924j1587P4263J53488K05662K20470J99081J48828P8066
36003E23500l376p8382j22148j17308p3022k2018O938J0265J792p299j3926j6269
35991H8747j2419l411J0411L2889O2722Q3376P4286L4495j3734m7647o3006o8614
35979A78095p1707p4971p9978q3010p0040k7745L5753Q8709J03042Q2388N5787
35968A36323M3563L8717K5519N707m038O362L4588P7799J33862J88127K14078
$$ y = [555778, 674774, 769818, 833803, 864186, 879618, 906180, 953700, 1021906, 1123847, 1280298, 1486811, 1707376, 1913485, 2113485, 2322539, 2508274, 2589417, 2500291, 2249648, 1909893, 1556899, 1229728, 939278, 691921, 490992, 324509, 168031, 4059, -165972, -327303, -460847, -544771, -556358, -482095, -328607, -122945, 97525, 296606, 445434, 523500, 520124, 441742, 319594, 202286, 129264, 107246, 114184, 124449, 126241, 118942, 105016, 88747, 76328, 72917, 83328, 116217, 178939, 262315, 336601, 371096, 357362, 309715, 246709, 178095, 106388, 31417, -48561, -131571, -201611, -229356, -193603, -104894, -1852, 80536, 136323, 179886, 218603, 244122, 249829, 245791, 252153, 286741, 364540, 498402, 686529, 900607]
35957I00607J95283J38905O4337j1056p2245j07803j20103j23056j20938j00598
35947F43333n4176K693M6904O9428O6585K4581o2709j64444k25470k14237j45466
35936a2978n5812K6296Q5122J12751J12846J00513Q7673P0508L5730k1665q6825
35925D54159j30348j31348j00911p4682p1822o9839l6887J5904L7359k239p0062
35914a80716j01443o1435L0633J25029J78969J79084J41623R3282M8846Q133k8009
35903D33996m9114m7271k9927j2565j204J1806L3941N6944N8259K3462l0930o5650
35891C81747n8014k6412m771k78N963J9731J9113j2303n5918p5416n3899m593
35879A34950M4420O5025L9236k8245j06808j58008j59349j12468l8701K8051N6868
$$ y = [900607, 1095890, 1234795, 1299132, 1288076, 1215831, 1108028, 987925, 864869, 743931, 643333, 589157, 591850, 638754, 708182, 774767, 799348, 736639, 572195, 346725, 132488, -12978, -68790, -42494, 42628, 155379, 268225, 368738, 456411, 526919, 562649, 540984, 454159, 323811, 192463, 91552, 16870, -54952, -124791, -161678, -145774, -108415, -110654, -180716, -282159, -343594, -312961, -187932, -8963, 170121, 311744, 405026, 453872, 462005, 433996, 384882, 337611, 307684, 295119, 293915, 305721, 339662, 396606, 454865, 478327, 447397, 381747, 323733, 297321, 292550, 292272, 298235, 317966, 337079, 324776, 268858, 193442, 139543, 134950, 179370, 244395, 283631, 255386, 148578, -9430, -168779, -281247, -319948, -291897, -235029]
35868b35029M2857J2221l894L530K5766N5991Q9219J09268R6745N4846J2650n101
35856B59069l134n423k8054o7845j09619j36214j36886j16098r2979q3124p9996
35845f00303o2811k6167O686Q210j9781m6085m3312j2275K7925O2390Q4542Q6432
35833e34549O0820J6338j9467k0648J4210O1674R4250R9720Q2734N2939J6706
35822g5273j8374l7188k5801R637L9763L5619n087n7591r1535q9172m9799J1888
35810c52913P0352J00719R2497N4272P151k7066l8623l6719m0450n8877q4367
35799c14024j07752j29903j50330j54734j28208p6512k1670K0097M4428M9614
35789i68994L9037L0537M3153P0809Q6619P8965O6379O7913P3740N7165O502o3871
$$ y = [-235029, -192172, -179951, -183845, -180315, -154549, -98558, -9339, 99929, 196674, 251520, 264170, 259069, 255935, 250512, 222458, 154613, 44994, -91220, -228106, -344204, -437183, -520307, -600303, -663114, -689281, -682595, -674385, -694166, -740251, -783563, -795838, -767913, -705523, -620981, -534549, -473729, -457391, -476858, -497506, -483296, -421622, -327372, -227652, -144918, -91979, -75273, -93647, -130835, -156636, -146999, -107236, -71617, -76704, -134295, -225830, -315002, -364801, -352913, -282561, -181842, -89345, -35073, -27922, -54988, -93611, -130330, -170780, -229657, -314024, -421776, -551679, -702009, -856743, -984951, -1061463, -1083133, -1063036, -1018608, -968994, -929957, -899420, -856267, -785458, -698839, -619874, -553495, -485582, -411842, -354677, -348175, -412046]
35777d12046j24706j46206j13353m1115L1201P2730Q6441R5226J08324J11228
35767c32276Q6597L6966j3344l5768k0948J0800K6824J4208j0925l0269m9828
35756c17963q7978j41696j79718j74106j29624p4510k6633K1122P8516J30090
35746i02500J43171J06199M6617J296k1227l5674m5324l3680O159N2160P3361
35735f09442O0260L0024J0498K1789O1591J03614J22497J25215J43732J88991
35725B58769K28089K20286J62799Q5088Q197o9393j47667k06977k22723j90797
35715A25671j33716q3898o0820o1522p1449q0003p9290n3781J0135R7612J64050
35704b27011J73167J28168N6970k0262r4514j51162j72227j56250j21189q4981
$$ y = [-412046, -536752, -682958, -796311, -837426, -806225, -733495, -647054, -551828, -443504, -332276, -245679, -208713, -222057, -257825, -278773, -267973, -241149, -226941, -237866, -268135, -317963, -405941, -547637, -727355, -901461, -1031085, -1105595, -1132228, -1111106, -1032590, -902500, -759329, -653130, -606513, -605217, -626444, -662118, -707442, -741122, -734963, -682803, -609442, -549182, -519158, -508660, -486871, -425280, -321666, -199169, -73954, 69778, 258769, 486858, 707144, 869943, 955031, 963228, 893835, 746168, 539191, 316468, 125671, -8045, -91943, -152763, -214285, -285734, -365737, -445027, -498808, -488673, -391061, -227011, -53844, 74324, 131294, 111032, 16518, -134644, -306871, -463121, -584310, -669291]
35694f69291n2446k0875J0675L8091N2176M4197J7445j0611k3602j8690N11L2268
35682f00152O7571Q3038N8636j315p5643j47391k05101k33779k24825j91255j54613
35671a624829j18879p4413k3047K2887O5098J18075J79716K27879K53246K69829
35661g04438K80554K59048J88493J00180M5848L8916M6929L9005J7151k006j4365
35650B95315k6185l8809m9126n9811p7815j02308j20898j19946r5458n2870q83
35639d48794M9355Q1569Q1653N5169L1794L9980P4338R7024P7890K9738j435J8642
35627A86923P6991J18875Q9550j9985j60304k58034k70243k10169j24007m9154
35617f19557K836L2196L5811J2405k5289n5196o4628n7179l9026q585L1374O0744
$$ y = [-669291, -721737, -742612, -731937, -693846, -641670, -597473, -580028, -590639, -614241, -632931, -632420, -600152, -532581, -449543, -390907, -392222, -467865, -615256, -820357, -1054136, -1278961, -1470216, -1624829, -1743708, -1818121, -1841168, -1818281, -1753183, -1635108, -1455392, -1227513, -974267, -704438, -423884, -164836, 23657, 123837, 169685, 208601, 255530, 294535, 311686, 309680, 295315, 269130, 230321, 181195, 121384, 43569, -58739, -179637, -299583, -395041, -447911, -448794, -399439, -317870, -236217, -181048, -149254, -109274, -34936, 62088, 139978, 169716, 168281, 186923, 263914, 382789, 472339, 452354, 292050, 34016, -236227, -446396, -570403, -619557, -616721, -584525, -548714, -536309, -561598, -616794, -681422, -738601, -777627, -786212, -754838, -694094]
35605f94094N9197L6158K4097L3723L4282m700o4313r0889n7485P910N6555O3639
35593e95920L5183j0610n5250q1681p7388l8381K9704J10111J76381K05934J96745
35582a05172J64174J19798O2632n610o7757j01703r7843o1878r211L7024N3601
35571a1945L7061J3740J8732O3116J27322J84719K23227K42656K38997J98853
35561A336478J12005r725j28064k00019k10907j85169j60337j51008j42358j16890
35551A44006p9039m8422l4579k8568k1267j9029l0089m0697k1518L6993J09368
35540c2841J64006J93775K04676J88774J33509N3932j1668m4166n8632o8965o2940
35529F59460k9702J0008K7469K8425M4858Q7611J31802J50488J39288J02291L7450
$$ y = [-694094, -634897, -598739, -574642, -540919, -506637, -511337, -575650, -666539, -724024, -716114, -659559, -595920, -560737, -571347, -626597, -708278, -785666, -824047, -794343, -684232, -507851, -301917, -105172, 59002, 178800, 241432, 235822, 168065, 66362, -31481, -93359, -102570, -65546, -11945, 25116, 38856, 57588, 120704, 248026, 432745, 655972, 898628, 1137625, 1336478, 1448483, 1438758, 1310694, 1110675, 899768, 714599, 554262, 403254, 260896, 144006, 64967, 16545, -18034, -46602, -67869, -86898, -116987, -157684, -179202, -142209, -32841, 131165, 324940, 529616, 718390, 851899, 905831, 894163, 849997, 791365, 722400, 659460, 629758, 639766, 667235, 695660, 740518, 828129, 959931, 1110419, 1249707, 1351998, 1389448]
35518A389448m9242j30815j78464j88069j75946j54000j20987p4473j8610L9359
35508C38201Q8637J09791Q4059J7163n3090q4268o5684k2328J5882M0837O0813
35497E30013P8473Q4280P0069M0741J1032l960M431L1351N3345L9795j8765r4514
35485H26291j43427j44698j14482q2058o2340n5157n9327p3201q3107o6413j5167
35474g3086M8777R0498R2696O4574K3440k2677p1928j17609j48182j55940j40749
35463d10186j06967o0248o049N0388J00226J28407J23899R5923O8532N0670K3902
35452E8497k5039p0140o8092j3551N0717Q3975Q6023P7660O7114N3549M4664M6214
35440C91591M3639J7450k6834o4284q2889q9686q5858n9076o905N0431Q8358R5230
$$ y = [1389448, 1340206, 1209391, 1030927, 842858, 666912, 512912, 391925, 317452, 298842, 338201, 426838, 536629, 620688, 637851, 584761, 500493, 434809, 412481, 428363, 469200, 530013, 608486, 692766, 762835, 803576, 814608, 810648, 815079, 846430, 899775, 939570, 920805, 826291, 682864, 538166, 423684, 341626, 279286, 224129, 164802, 91601, 8494, -57919, -73086, -24309, 66189, 158885, 223459, 246899, 224222, 152294, 34685, -113497, -269437, -410186, -517153, -577401, -583450, -533062, -432836, -304429, -180530, -84607, -16075, 34595, 58497, 33458, -36682, -104774, -118325, -67608, 16367, 102390, 180050, 247164, 300713, 345377, 391591, 435230, 452680, 425846, 361562, 278673, 188987, 103129, 44053, 37148, 87579, 175937, 271167]
35428B71167O8259J2168m8605p6850o0914l5676m6856r8162j47966j55412j16776
35417d35623n8074o196K7940M6134N0428L7171P222k0344j8537J4595M4471L6854
35405b73959J735j5194J5136P4863J21964J29073R5611L5592l4691j00499j47537
35394i7906j60286j27537n7681J5650N7115O2139N6530O2793P8722R0066Q6904
35383F6509O0502K581p6257j39012j51401j14943n9589j0569K3700L9073L2787
35372c26619J5244Q062K4153N8194R6734J26390J32998J08373O2682J7485j8470
35361C05226n4748r5800j25567j24129q9217l2542L4674J01459J51191J70197
35351B40744J59910J31079Q9625L8396j0538l8456l7471j7345P301K9773M8950
$$ y = [271167, 339426, 351594, 302989, 226139, 165225, 129549, 82693, -15469, -163435, -318847, -435623, -493697, -499893, -471953, -425819, -375391, -338220, -330998, -351342, -369879, -355284, -310813, -273959, -272224, -287418, -272282, -197419, -75455, 53618, 149229, 184821, 150130, 49631, -97906, -258192, -385729, -443410, -427760, -370645, -308506, -251976, -189183, -110461, -20395, 66509, 127011, 129592, 53335, -85677, -237078, -352021, -411610, -422179, -398479, -359406, -326619, -311375, -303313, -279160, -220966, -124232, 2158, 135156, 243529, 306211, 323696, 305226, 250478, 154678, 29111, -95018, -184235, -216777, -182103, -80644, 70547, 240744, 400654, 531733, 621358, 659754, 649216, 610760, 573289, 555944, 563245, 593018, 641968]
35340F41968O0549N6312L1745o127l8563m5011j7660L1710P9487J05438J02969
35329A002817P9067M5512O956m3064j09904j80151k22006k09023j43075n2820
35319A74309K7677P8384R7822R4963P7995N0299J5325k0847n6138r4309j30728
35308C14752j43656j16678o7864l5686l0538k0883K1187P9416J14888J13622R3808
35297C22368P5736O4375N5738M1871J3866k2257l7270o844N2474R5192R6974P5013
35285H27236N6066M4595L1252J6202J0577K2431M9876Q2992J07292J09774Q4820
35274A443113L3385l6994j04140j34657j15642p9864p6449j12307j43101j28278
35264E45066p3989j2665L6944P2837R1679Q9499P0761L9063j2709q4958j51111
$$ y = [641968, 702517, 758829, 790574, 784447, 745884, 700873, 683213, 714923, 794410, 899848, 1002817, 1081884, 1127396, 1134352, 1091288, 981384, 801233, 579227, 370204, 227129, 174309, 201986, 280370, 378192, 473155, 551150, 601449, 616774, 595927, 539789, 445480, 314752, 171096, 54418, -13446, -49132, -79670, -100553, -79366, 50, 114938, 228560, 322368, 398104, 462479, 518217, 560088, 573954, 551697, 514427, 507583, 560057, 655249, 752223, 827236, 883302, 927897, 959149, 975351, 985928, 1008359, 1058235, 1141227, 1248519, 1358293, 1443113, 1476498, 1439504, 1335364, 1200707, 1085065, 1005201, 928752, 816445, 673344, 545066, 471077, 458412, 495356, 568193, 659872, 749371, 820132, 859195, 846486, 761528, 610417]
35253F10417j75029j48535r6622m5446Q92N0472J03096J43873J51102J11933L9005
35242G45158k9536n7342m1213j0826K334r023k9735l9874k8647J913M1404P8641
35230F23254J04115J06412P4470J0894o0933j12360j33855j39394j45930j52087
35220A74586j39028r2702k5638K6509L6124J0658j8161l0129l0219k7214j7946
35209a33160k651J055k1852n8231p9323p5599o3560o0056o5250p0244o5804m1366
35197g36041R342P5677J33099J62956J61311J29113O8860k836n4111o3181m0855
35186a56666j8635j5825k3727j9629R165N3688R0432R9670Q0604N1271L3172L2559
35174B16079L2869P181n4422j27668j71775j68265j33336q7385k8299M9186J20681
$$ y = [610417, 435388, 286853, 190231, 144785, 145677, 196149, 299245, 443118, 594220, 706153, 745158, 715622, 658280, 617067, 606241, 608575, 599552, 569817, 529943, 501296, 503209, 544613, 623254, 727369, 833781, 908251, 919145, 858212, 745852, 611997, 472603, 326673, 174586, 35558, -57144, -82782, -56273, -20149, -9491, -27652, -57781, -88000, -115214, -133160, -135811, -134756, -156608, -214839, -294162, -369761, -433321, -493377, -558627, -628871, -694675, -736041, -726699, -651022, -517923, -354967, -193656, -64543, 4317, 1481, -52630, -115811, -156666, -175301, -191126, -214853, -234482, -225317, -171629, -81197, 18473, 99077, 150348, 183520, 216079, 248948, 256129, 201707, 74039, -97736, -266001, -399337, -486722, -515021, -465835, -345154]
35163c45154J45649J14219N6531J48n7120j18615j56451j33385m9633N3228J32647
35152c57936J71854J69318J25867N4152j3659m5426l7315j5358q636k5348n3382
35141c5869p6084q2956p0377m1020m863K5343M4152N5873O3887O2516M5583J8414
35129D599p922l2286o2107r4924j12938j02059o8286k8791O138L4938N4966O0396
35117c48276M8107J9603j9185n3617o1875l3584J2552M1387L6658J6726J1137
35106c30367K8792N5094P3410P8921P3311N7849L7330K3912K8724N0071P4250
35095B51297Q6256P5168L3629l5176j06016j40736j23750q5221p3880j02575j31620
35084c52624j13048m3779L3126P4223P1788M5915J4347j9636n2970o9690n2664
$$ y = [-345154, -199505, -85286, -28755, -28607, -85727, -204342, -360793, -494178, -543811, -490583, -357936, -186082, -16764, 109103, 163255, 149596, 104170, 66855, 51497, 42861, 17513, -35869, -111953, -194909, -265286, -306306, -311169, -285826, -241674, -185801, -121914, -59398, -13815, 4599, -3323, -35609, -97716, -192640, -305578, -407637, -475923, -504714, -498576, -463638, -408672, -348276, -300169, -280566, -299751, -353368, -415243, -448827, -436275, -394888, -358230, -341504, -330367, -301575, -246481, -173071, -94150, -20839, 37010, 74340, 98252, 126976, 177047, 251297, 337553, 412721, 446350, 411174, 305158, 164422, 40672, -44549, -118429, -221004, -352624, -465672, -509451, -476325, -402102, -330314, -284399, -270052, -289688, -342658, -412348, -465012]
35073d65012p745L3912M4649K7147O028k150J31P313K1387M1167N5197N6753N6896
35060a24327P0235R3343J09628J11173J02356Q4451N2507R895k8311n1859o4527
35049C64564p3417q2071r9104j36230j83474j99597j48526m3745N9536J16712
35039d25352J25057J05454P3897L9385J3167L761P767J5950K4762L3962L8395
35028E6205L2408K0006J0941P989O995Q497J9111L9849O2272P8960Q9181R0961
35016E23375P7680N0111K3917J3662J1329q602n9569j24417j69351j71908j32851
35005C3376o7054P782P2373J06005R7296N7345J5434m339j303Q117J0345M032
34993C39409n843j5171k2648l1158m6879o9993q6602p9420m9618j8811l253O291
$$ y = [-465012, -472757, -438845, -394196, -367049, -361021, -363171, -363040, -355727, -334340, -293173, -237976, -181223, -124327, -54092, 39251, 148879, 260052, 362408, 446859, 499366, 509261, 480950, 429091, 364564, 291147, 209076, 109972, -26258, -209732, -409329, -557855, -601600, -542064, -425352, -300295, -194841, -120944, -81559, -68392, -64631, -56864, -40914, -16152, 17810, 56205, 88613, 108619, 119560, 127549, 134544, 143041, 162152, 202001, 264273, 343233, 432414, 523375, 601055, 651166, 675083, 688745, 700074, 691472, 631903, 507486, 338135, 166227, 33376, -33678, -25896, 46477, 152482, 249778, 307123, 322557, 318218, 316915, 325032, 335377, 339409, 333566, 318395, 295747, 264589, 217710, 147717, 61115, -18305, -67923, -86734, -89987, -83696]
34981h3696L0328P0564J02869R9140N0192l0168j14120j71378j81928j46853q7462
34970d62512k9876J1900L8324N1350M2702k82p5315j55698k05980k07764j67966
34959a161117j05135l5454K7978P2400Q9499Q0125N2718K0737J685R936M4097
34948i02531Q5460J13278J18333J00930O5239K1977j1857k6174k7072k5805k3912
34937e12134j7770j1771j4282k2046k0298M0L2971O4189P8835O5155K3176k7660
34925c61595o0168o3653n0375l6606k5446j0407J2925M2615P0491Q3924P5867
34914c22428N6380M4968M6762M6113L0774J2455J2140L1296N0847N7295N6892
34903A23494O0339O3436N1439K0062j5102l3262l0759k4965l3654n3011o1152
$$ y = [-83696, -53368, 17196, 120065, 219205, 269397, 239229, 125109, -46269, -228197, -375050, -462512, -492388, -480488, -442164, -390814, -348112, -348394, -423709, -579407, -785387, -993151, -1161117, -1266252, -1301706, -1273728, -1201328, -1111829, -1031704, -978986, -958249, -956564, -946628, -902531, -817071, -703793, -585460, -484530, -419291, -397314, -409171, -435345, -462417, -488222, -512134, -529904, -541675, -555957, -578003, -598301, -598261, -565290, -501101, -422266, -357111, -333935, -361595, -421763, -485416, -535791, -572397, -597843, -608250, -595325, -552710, -482219, -398295, -322428, -266048, -221080, -174318, -128205, -97431, -84976, -72836, -41540, 9307, 66602, 123494, 183833, 247269, 298708, 318770, 303668, 270406, 239647, 214682, 181028, 128017, 66865]
34892F6865m3869j1403J3291J7910O842j2896m2371q2239j17921j22668q1567
34881d10026j0676N4111Q9255J00116J03851J03692Q7647M7628j0671p5982j38132
34870e9187j83406j93879j61006r8778l8948j1857k7793o9040r8617q5184k6255
34859a053950N4149J29582J86040K14131K02578J51824Q5646L3632K373k4298
34849a8293n6485q3445r2441q8997q6578q3019o1148j2532N1212J12817J62780
34838b56129J92258J85931J37594O8376J2979j4747k9684m7132o3051o9841p3602
34827D2952p8793o8200k1095N1379J10517J32897J30618J23903J12956Q8824N6887
34816F82845L2256J7727Q54k7545o0682q0461o9865k6298K9045N9974M4980j230
$$ y = [66865, 22996, 11593, 24884, 42794, 49636, 36740, -5631, -87870, -205791, -328459, -410026, -420702, -366591, -277336, -177220, -73369, 30323, 117970, 165598, 154927, 78945, -59187, -242593, -436472, -597478, -696256, -735204, -747061, -774854, -843894, -942511, -1027695, -1053950, -999801, -870219, -684179, -470048, -267470, -115646, -30000, 3632, 6005, -18293, -74778, -158223, -250664, -339661, -426239, -509258, -570406, -582938, -531726, -418909, -256129, -63871, 122060, 259654, 328030, 341009, 326262, 296578, 249446, 186395, 116554, 42952, -35841, -104041, -125136, -73757, 36760, 169657, 300275, 424178, 537134, 625958, 682845, 715101, 732828, 733682, 706137, 645455, 564994, 495129, 468831, 497876, 557850, 602830, 601600]
34804F01600m3006n9321n6548m8707l8248k1195j116J1363R875k725j7500k1478
34792C12994o41M8038J05004J38748J36078J16154J05905J06431R5502O0482J2515
34781A237210l4687q1428j26841j53899j47570j17679q4747n0983p331L5799N2625
34770E20469M1584L4940N6535Q9385R9300P5311L2850r318m0764o0044p8281j10736
34758F51231j50045j60250j16033l8101K9719O8853Q8695R0774O3269J5018j6439
34747E26691o134K9818O1775Q3414J01348J03112O4007j2036p9668r2216m8287
34736G31824Q120L0822J0783k4672m4370l9903k2237k607J3820J9323K868l5633
34724F48138p8289j04938j12814j13874j14973j08917q6699n1424j4211K1421
$$ y = [601600, 558594, 499273, 442725, 394018, 355770, 334575, 333459, 344822, 354697, 351972, 334472, 312994, 312353, 360391, 465395, 604143, 740221, 856375, 962280, 1068711, 1164213, 1224695, 1237210, 1202523, 1121095, 994254, 840355, 692785, 575106, 490359, 439376, 432045, 467844, 520469, 562053, 596993, 653528, 742913, 842213, 917524, 950374, 941056, 900292, 840248, 761967, 651231, 501186, 340936, 224903, 186802, 216521, 285374, 374069, 464843, 528112, 543130, 526691, 520557, 550375, 612150, 695564, 796912, 900024, 964031, 951995, 872327, 780111, 731824, 739944, 770766, 781549, 756877, 712507, 672604, 650367, 647760, 661580, 680903, 683771, 648138, 569849, 464911, 352097, 238223, 123250, 14333, -72366, -123790, -138001, -116580]
34714a16580O4702J24097J91081K40720K48296K04551J19085J6741o8920j09610
34704I14163j00656o5084l3336j8355j3441j1618j9468m9239j00552j52342j73844
34693A76228j47669q6174k3466J3093K3303K5349L1635L8782L7576K4668M770
34682A18095j1771j3677J343J9393J9199r000n6222j05017j40331j50860j30859
34671d59707q7450m0361o992J0448J9166K1234J1414j1693l8999n7565o0473m8758
34659g49736k7226j812K1251L9309N8041Q6449J20761J36245J06041L3842l8224
34648b15059o2304k5479M4032J05673J35058J29207R7461N4185J5205o641o311
34637B65027J1516L4805N0720N2878M2819K5302N481j0004j7061k3076m2881p6766
$$ y = [-116580, -51878, 72219, 263300, 504020, 752316, 956867, 1075952, 1092693, 1023773, 914163, 813507, 748423, 715087, 696732, 683291, 671673, 652205, 602966, 502414, 350072, 176228, 28559, -57615, -81081, -67988, -44685, -19336, 12299, 51081, 88657, 113325, 118095, 106324, 92647, 93990, 113383, 132582, 123582, 67360, -37657, -177988, -328848, -459707, -547157, -587518, -594510, -584062, -564896, -543662, -532248, -543941, -582940, -640505, -700978, -749736, -776962, -778774, -757523, -718214, -660173, -573724, -452963, -316718, -210677, -176835, -215059, -277363, -302842, -258810, -153137, -18079, 111128, 208589, 262774, 277979, 271338, 265027, 276543, 311348, 362068, 414946, 457765, 483067, 488548, 478544, 461483, 438407, 395526, 318760]
34625C18760r9491q4908m0605m921o379l5922o2142o3604m1445j0890J0419J2079
34613a09049p14r123L538L8264Q3205J23272J42085J23226O3237j5486p5397r3463
34601B73595p6115m2120K230O1826J27985J66714J42235N3250n9180j42324j69121
34590C38975j47459j00291m2314K5796J05310J84143K36032K39582J99272J42735
34580A181781R4977O0545L2740J0417l281j2596k8365n6617r4935j36230j67103
34569H81333j67487j26665o1449o183J9588K4792K6635K8548K3723R755r397l0160
34557F13033m9538o1143n7417l5855j636L3468N5076N5161L9833K4163J7739J9311
34545F52195K5308L6918N6878Q3660J07948J09693O5032k8768j34544j97941j96255
$$ y = [318760, 219269, 134361, 93756, 88835, 82456, 46534, -15608, -79212, -120657, -131547, -121128, -109049, -109763, -118886, -115348, -77084, 6121, 129393, 271478, 394704, 457941, 442455, 367058, 273595, 197480, 155360, 157590, 219416, 347401, 514115, 656350, 709600, 650420, 508096, 338975, 191516, 91225, 48911, 74707, 180017, 364160, 600192, 839774, 1039046, 1181781, 1276758, 1337303, 1370043, 1380460, 1377179, 1364583, 1336218, 1279601, 1184666, 1048436, 881333, 713846, 587181, 525732, 519549, 539137, 563929, 590564, 619112, 642835, 652590, 643193, 613033, 563495, 502352, 444935, 409080, 407444, 440912, 495988, 551149, 590982, 615145, 632884, 652195, 677503, 714421, 771299, 854959, 962907, 1072600, 1137632, 1108864, 974320, 776379, 580124]
34534E80124j53913j06324o5064k7205P24Q004n89j0344j8477l3594n4094o3169
34522E6079m9583k3588q471k0488n4757q4757q0421l6313K0341N7049O6990O5071
34510i2848O2662O1370O4822P5080P6748M6366j4155o9762q7446o7242l1863j300
34498B2432J1092o420n1749r6356j03891o5981j0754K5129K6281L338k0806k7383
34486b95068j3568O673J6934J5485J5183K6579M5688N8878N4409K8039j6052o4932
34474a21752j01741j17706j19566j20592j23028j13133p6089j3577N5676J10132
34464g41376J36141J27807Q6560K6260k7936n4929n1533k6680J3034O1659J00560
34453c50433J04113O8416K4436J0270L3226O7299Q3502P2514M1761N236k0498
$$ y = [580124, 426211, 319887, 254823, 227618, 228342, 236346, 235757, 225413, 206936, 173342, 119248, 56079, 6496, -17092, -25563, -46051, -100808, -185565, -265986, -302299, -281958, -224909, -157919, -92848, -30186, 31184, 96006, 171086, 247834, 294200, 280045, 210283, 122837, 55595, 23732, 22432, 33524, 27104, -24645, -121001, -224892, -290873, -301627, -276498, -250217, -246879, -267685, -295068, -308636, -301963, -285029, -269544, -254361, -227782, -182094, -123216, -68807, -40768, -56820, -121752, -223493, -341199, -460765, -581357, -704385, -817518, -893607, -907184, -851508, -741376, -605235, -477428, -390868, -364608, -392544, -447473, -499006, -525686, -512652, -450993, -350433, -246320, -177904, -153468, -143198, -109972, -42673, 40829, 113343, 155104, 160340, 139842]
34442A39842k2830m205J7399K2420L46n0914j22872j89182k15210j88448j33279
34431g46933q4862n4426l0641n657J8561M5361Q2545J22292J41859J33550J18296
34420b60055J19414J37262J60453J85237K06056K00337J46752N6021l5606j02912
34410H12959j45870j70670j77776j72343j67675j70503j75227j76751j75383j65551
34400h84790j35317q3111k1337L9819R4781J25877J10361N8215J8938K8257O5127
34389e83180Q4896P9579P7097R2228J11480J22959J26186J07666M2600o1197j47206
34378E3108j61890j10920m7743j6734k1386l6936l6000o169M1981Q3082R9755
34367a59852R4064P2993L4684j9272o8328q7977p8036o0804n0885m0515j6389
$$ y = [139842, 117012, 112807, 130206, 152626, 152972, 102058, -20814, -209996, -425206, -613654, -746933, -831795, -886221, -916862, -922519, -903958, -858597, -776052, -653760, -511901, -378351, -260055, -140641, -3379, 157074, 342311, 548367, 748704, 895456, 951477, 915871, 812959, 667089, 496419, 318643, 146300, -21375, -191878, -367105, -543856, -719239, -884790, -1020107, -1103218, -1124555, -1084736, -989955, -864078, -753717, -695502, -676564, -648307, -583180, -498284, -418705, -341608, -249380, -137900, -14941, 111245, 218911, 261511, 200314, 53108, -108782, -219702, -267445, -284179, -305565, -342501, -378501, -384670, -342689, -259607, -159852, -65788, 7205, 41889, 22617, -45711, -133688, -211724, -272528, -323413, -363928, -380317]
34356c80317K2471O7389J07866J30223J20020P7437K5932m849o398K486l601l2717
34344A25942p0533r4339r1097o4781k8493R546N0680R5668J32781J41761J12780
34333C19915N8827M994l3908o0731q1996r5138r5272q7772q3127p9778o2323k0345
34321c16654L7950R3645J31043J39946J14237N8470q368o5408j05113j29184j33386
34310a82822j08573n8393m594L1801M8456N6244O2817O8537P2752P3714O3892
34299A23831L6749J508j9336j6167j0318l4116r1599j48628j66958j41487r8256
34288e64777o2742m0384k5165j3964p448n528q615j8186k9974l0970j0951K3985
34276g94719N5671P1936P5683P5842P4928O8593N4583L8456K9735L2741M1335
$$ y = [-380317, -357846, -290457, -182591, -52368, 67652, 145089, 171021, 166172, 159774, 162260, 158659, 125942, 55409, -38930, -130027, -194808, -223301, -213755, -163075, -67407, 65374, 207135, 319915, 378742, 383736, 349828, 289097, 207101, 111963, 16691, -71081, -154208, -233986, -296309, -316654, -278704, -185059, -54016, 85930, 200167, 258637, 250269, 184861, 79748, -49436, -182822, -291395, -349788, -354382, -322581, -274125, -217881, -155064, -86527, -13775, 59939, 123831, 160580, 162088, 142752, 126585, 116267, 82151, -9448, -158076, -325034, -466521, -564777, -627519, -667903, -693068, -707032, -714480, -720008, -728623, -746809, -776783, -807753, -818704, -794719, -739048, -667112, -591429, -515587, -440659, -372066, -317483, -279027, -249292, -216551, -175216]
34265a75216M3651L3242J5165o88j3206l5721q3923j52897k06241j97306j11682
34254h84822J1754J10618J52136J51744J41415J32190J12339O9391L357p2873
34244g2751j33745j48804j07488l7637J3435K1036M16j6655j3375L304J3736K581
34232d75947k5861m6656l7450m890K1420K3069R950J296M389J8639M4770P5674
34220c91597Q8010O0034k423o6280r5973p5643j8128L8199N3107K2437j0537N103
34208c93691P9082J80596K79403L69319M55228N36461O05651O52102O70144O77554
34198D111849P11275P71657P74224O03097K36833k06402n72136p93555q91643
34189D745199q91549p95253o29190m59725l36432k50264j68459q7283k8721k558
$$ y = [-175216, -131565, -98323, -83158, -83846, -97052, -132773, -216696, -369593, -575834, -773140, -884822, -873068, -762450, -610314, -458570, -317155, -184965, -72626, -3235, 122, -72751, -206496, -355300, -462788, -500425, -486990, -465954, -465538, -482193, -495568, -492264, -478528, -475947, -501808, -548464, -585914, -590804, -569384, -546315, -536365, -535069, -530680, -512041, -467271, -391597, -303587, -243553, -245976, -312256, -408229, -483872, -502000, -463801, -410694, -388257, -398794, -393691, -314609, -134013, 145390, 514709, 969937, 1506398, 2112049, 2764151, 3434295, 4111849, 4823124, 5594781, 6369005, 6972102, 7208935, 7002533, 6430397, 5636842, 4745199, 3853650, 3058397, 2429207, 1969482, 1633050, 1382786, 1214327, 1127044, 1098323, 1095765]
34179A095765L922N397O364O425L502p555l0042n9643q8267j09198j15038j00233
34167F11399p4010o1039p5349r7461r0430l8863L6490J00618J30765J23790R1609
34156F57519N4894L1870K4564J7658m682m0841p2405q3400p8650q0816j05962
34145C19749j43729j67247j61537j32855q8813k3351O8154J67783K42110K67820
34135C48084K42882J79934J01321L5075j912j9930m3926q2008j15460j20907r2388
34124D30765m1030J5365N9343Q1028Q2741P0519M3625L671l0757l9416l2855m5203
34112E97796q2951j03726o7175Q132O2728O3772L1604K483j0822j6920k4382l2675
34100D27864l4335k0753O005K6083J8090j4390m3106m4468j7670K6926Q0107J27384
$$ y = [1095765, 1099687, 1105084, 1111448, 1117873, 1121375, 1113820, 1083778, 1024135, 935868, 826670, 711632, 611399, 537389, 476350, 401001, 303540, 213110, 174247, 210737, 311355, 442120, 565910, 657519, 712413, 744283, 768847, 786505, 781823, 740982, 668577, 585177, 506527, 425711, 319749, 176020, 8773, -152764, -285619, -374432, -397783, -329629, -161846, 80264, 348084, 590966, 770900, 872221, 907296, 905384, 885454, 841528, 759520, 644060, 523153, 430765, 389735, 405100, 464443, 545471, 628212, 698731, 742356, 746027, 715270, 675854, 642999, 597796, 514845, 411119, 343944, 352076, 414804, 478576, 510180, 512663, 501841, 484921, 460539, 427864, 393529, 372776, 378781, 404864, 422954, 408564, 365458, 320990, 303320, 330246, 410353, 537737]
34088E37737J48405J39082J24180J30414J50735J50554J08844L9778k7268p6129
34078A426332j08449j31879j52141j70437j80454j70759j37404r4236o4515n9080
34068A56978o5092n9639l4283k742J7691K8758M9185Q8984J31676J46490J15639
34057E73645M7053l4120r9241j25407j04280m8964J2486N6791P8811Q5114P9894
34046E21782O2705L6899J2011m862j5295k3449k5847j1377K7040Q1343J29506
34035G90456J49356J34478R8840O4810M4086K9441N973k9505o1930p2495n9941
34024A093569m5747n5131r1172j29741j43589j30897j14825j13540j17906j05136
34014D5885o8469k1822K3770P3388J30213J74938J76419J21523K7013p4511j51221
$$ y = [537737, 686142, 825224, 949404, 1079818, 1230553, 1381107, 1489951, 1529729, 1502461, 1426332, 1317883, 1186004, 1033863, 863426, 682972, 512213, 374809, 280573, 216058, 156978, 91886, 32247, -2036, -4778, 12913, 41671, 90856, 179840, 311516, 458006, 573645, 620698, 586578, 487337, 361930, 257650, 208686, 221172, 277963, 356774, 441888, 521782, 584487, 621386, 633397, 628535, 613240, 589791, 563944, 552567, 579607, 660950, 790456, 939812, 1074290, 1173130, 1237940, 1282026, 1311467, 1317440, 1287935, 1226005, 1153510, 1093569, 1047822, 992691, 901519, 771778, 628189, 497292, 382467, 268927, 151021, 45885, -22584, -44406, -20636, 52752, 182965, 357903, 534322, 655845, 682858, 608347, 457126]
34003D57126j79673j53565r2401l0945R619L5843O2343Q6131R1403P6350O1458
33992D23689O6082Q4608R3104P7154M6711K2217J0418j723k9578p2117j13373
33981F07192j38690j43521j28512r6381n8097l2972l1955m2838m1116j6552J7780
33970a05662M3870N8634P1227Q5525R1117P2106K3530l9588q9427j04884q6203
33959B0245m9511p992L6854Q4946J26472J47770J45776J30353J12409R4103P0190
33948I11615L4068j7206p7221j26855j42812j16243o2741j1499J3751L053m1137
33937C66773j02423j49528j51955j07494n0793k6072m9148r7242j32565j31835
33927f32282r7188m8005o178J4656J1558j0059l6199m4320j6366L9462Q8363J03743
$$ y = [457126, 277453, 123888, 31487, 542, 10161, 46004, 108347, 194478, 285881, 362231, 423689, 489771, 574379, 667483, 744637, 791348, 813565, 823983, 822260, 792682, 720565, 607192, 468502, 324981, 196469, 100088, 41991, 9019, -22936, -65774, -106890, -123442, -105662, -61792, -3158, 68069, 153594, 244711, 316817, 340347, 300759, 211332, 106448, 20245, -29266, -37258, -404, 84542, 211014, 358784, 504560, 634913, 747322, 841425, 911615, 945683, 928477, 851256, 724401, 581589, 465346, 402605, 391106, 404857, 407910, 366773, 264350, 114822, -37133, -144627, -195420, -221492, -270640, -367882, -500447, -632282, -729470, -777475, -783653, -768997, -757439, -767498, -803697, -848017, -864383, -824921, -736558, -632815]
33915f32815R8653J08556J44814J82605J96793J88946J69305J32584P0206o427
33905F53220p5825j31967j79068k05909j89907j30165n5273Q620N9329J00836
33895a46109J24401J23018J10966J10533J25377J41096J46109J36364J04014M1667
33885A017436l6780r4592j02125o3192p031L8896O1877N8112K8716j4280m6935
33874H40102m8474j9341J8482L8826K7159j5937p5822j24476j31195q5467q856
33863D15001O2963J08263J23701J08661O2542Q66m1762l7169J1089P2253J13130
33852I99538J16421Q4330L2623k2170p4511j26245j70801j89170j66585j08333
33842C75097l6937J9828L8959J5056k8571n2293l4233J2594O0509R3681J09347
$$ y = [-632815, -534162, -425606, -280792, -98187, 98606, 287552, 456857, 589441, 659647, 653220, 577395, 445428, 266360, 60451, -129456, -259621, -314894, -306274, -246945, -146109, -21708, 101310, 212276, 322809, 448186, 589282, 735391, 871755, 975769, 1017436, 980656, 886064, 783939, 720747, 713716, 752612, 814489, 872601, 901317, 887037, 840102, 791628, 772287, 790769, 829595, 856754, 840817, 764995, 640519, 509324, 423857, 415001, 477964, 586227, 709928, 818589, 881131, 881997, 840235, 803066, 814155, 886408, 999538, 1115959, 1200289, 1232912, 1210742, 1136231, 1009986, 839185, 650015, 483430, 375097, 338160, 357988, 396947, 412003, 383432, 331139, 296906, 309500, 370009, 463690, 573037]
33831E73037J08451R8147R1713R1378Q1723N5515L4487M2805O6119O0589M030
33820A307994q0151j50779j83226j75672j41115r9361o2864k6308J8206N7625
33810D64349O8389N1756L6325L7323L4691N631l7484n9021m1472j663K8389K7687
33798F14900J274k0692m679N5980J34009J91777K03914J59411O2905n4566j43491
33787A200742j73508j57037j24783q9318m8258j1656j804k4378n7034p1980o0714
33776C80272l5630j6308j4730k5750l1456k0278P69J8072K8707L5458L1063L502
33764C53691m1970p9978q9288p1398m2411j6575l802j4742n6392j19869j77007
33753c59741j94810j58206q1063N312P4131J13923J24790J14505R8166Q9825Q9053
$$ y = [573037, 681488, 779635, 871348, 962726, 1044449, 1099964, 1134451, 1177256, 1243375, 1303964, 1307994, 1227843, 1077064, 893838, 718166, 577051, 477690, 414826, 388518, 406724, 464349, 532738, 584494, 620819, 658142, 692833, 698464, 660980, 601959, 560487, 558824, 587213, 614900, 616174, 595482, 590803, 646783, 780792, 972569, 1176483, 1335894, 1398799, 1344233, 1200742, 1027234, 870197, 745414, 656096, 607838, 596182, 594378, 570000, 512966, 440986, 380272, 344642, 328334, 313604, 287854, 256398, 236120, 236889, 254961, 283668, 319126, 350189, 353691, 311721, 231743, 142455, 71057, 28646, 12071, 8269, -6473, -62865, -182734, -359741, -554551, -712757, -793820, -788508, -714377, -600454, -475664, -361159, -262993, -173168, -84115]
33742h4115Q3426O7676N0930M1335L5563K9898K8265K9096J7711j3054m3998m7956
33730A94777k1850J4030M3111O2982P2140O3512L3642j1609n9365q9840q2304
33719B19226l6655J4962L4870J8939k991k916K1664N4177P2079N7463J3384l2178
33707D32024n6644p2629j04521j39644j35316q1305k2948n541k1877l4810k8729
33696b71940j3594M577K7256M3439L1727j5775q5841j56138k00113j88040j07088
33685i31530J5289J24755J84545J99753J97986J97098J94100J75875J35995Q5228
33675E79094M5872L1182L2175K9978J7972M573k494n347j0433k2133m1428o3622
33663E95389p8521q0380p6031p5074p4488o3989m6328l8829m9759o3604n7129
$$ y = [-84115, -689, 66987, 117917, 159252, 194815, 224713, 252978, 282074, 299785, 286731, 242733, 194777, 172927, 186957, 230068, 293050, 365190, 428702, 462344, 450735, 391370, 301530, 219226, 182571, 197533, 232403, 251342, 248351, 245435, 267099, 321276, 393355, 450818, 464202, 432024, 375380, 302751, 198230, 58586, -76730, -158035, -180983, -186524, -208401, -243211, -271940, -285534, -280957, -253701, -210262, -178535, -194310, -280151, -436289, -636402, -824442, -931530, -916241, -791486, -606941, -407188, -209202, -12104, 181996, 357871, 493866, 579094, 624966, 656148, 688323, 718301, 736273, 740846, 738352, 733005, 722572, 700439, 659011, 595389, 516868, 436488, 360457, 285383, 210895, 146906, 100578, 61749, 11990, -51614, -108743]
33652a08743k3456K5501P3097J06275J15951J01224P4483N3764M5960M1696K8608
33641E34360M467k5940o0001r4783j18280j15441q8004o0019n5545p5052j00814
33630b55052j20596j35466j45998j42973j15677o1567J4658J02664J82884K30770
33620d46353K34078K03454J60736J19141P8646L7499K917j0339P170M4774P1816
33609E03539O1206J5993l3535o0265n9112l4614J4247Q4079J51019J81364J59659
33598I83580R7803J8238o1319j26642j63737j65534j38278r5943m9210k367M0051
33587C36642O6610O1443J5896o0259j40004j94686k12443k03429j85800j64084
33577f80114j23566n2508L0810Q5125Q7793N9663L7854L3287L1280K6320L1693
$$ y = [-108743, -132199, -106698, -33601, 72674, 188625, 289849, 364332, 418096, 464056, 505752, 534360, 538827, 512887, 452886, 358103, 239823, 124382, 36378, -23641, -79186, -154238, -255052, -375648, -511114, -657112, -800085, -915762, -977329, -962671, -860007, -677123, -446353, -212275, -8821, 151915, 271056, 349702, 387201, 390118, 379779, 386949, 431723, 503539, 564745, 580738, 547203, 486938, 427826, 393212, 407459, 491538, 642557, 823921, 983580, 1081383, 1099621, 1038302, 911660, 747923, 582389, 444111, 348168, 298958, 296591, 336642, 403252, 464695, 480591, 420332, 280328, 85642, -126801, -330230, -516030, -680114, -803680, -856188, -825378, -740253, -652460, -592797, -554943, -521656, -490376, -464056, -432363]
33566d32363N1202O4217N0280J3683k6560n7550p3347o9286m9254k9321k2344
33555e80643k6783l8823o3230j00658j36955j59160j70049j70538j40634o1032
33545a648505N1430J51536K08338K23668K13149J90697J71644J67776J71981J64902
33535F6616J43240J25146J19936J08817O8533M136n4738q6422r6845j07426j28775
33524A62218j48461j45817j17836q3048n5963k8935R162M6714O0610M9150L3020
33513b19186K3981J5179O538J4470M3316O8239O6246N0778N3899Q0299R9488Q4312
33501C87559M0834l593k8239k8115o368K8620N8303N8104J7847m1144p7915o7100
33489C38793k0218K9567N6278N0342J1829m8420j03596j24573j05512o8123l8304
$$ y = [-432363, -381161, -316944, -266664, -252981, -279541, -337091, -410438, -479724, -528978, -558299, -580643, -607426, -646249, -709479, -810137, -947092, -1106252, -1276301, -1446839, -1587473, -1648505, -1597075, -1445539, -1237201, -1013533, -800384, -609687, -438043, -270267, -98286, 66616, 209856, 335002, 454938, 563755, 632288, 636424, 581686, 495264, 398419, 290993, 162218, 13757, -132060, -249896, -332944, -388907, -417842, -408680, -361966, -301356, -252206, -219186, -195205, -180026, -173488, -159018, -115702, -47463, 18783, 69561, 123460, 203759, 303247, 387559, 428393, 424800, 396561, 368446, 362078, 390698, 449001, 507105, 524952, 483808, 405893, 338793, 318575, 348142, 404420, 454762, 466591, 418171, 314575, 190002, 84490, 16367, -21937]
$$ [...]
##END NTUPLES=NMR SPECTRUM
##END=
