##TITLE=31Pdec_B3d2301
 CDCl3, 24 sc
 24.1.2025
##JCAMPDX= 6.0         $$ Bruker NMR JCAMP-DX V2.0
##DATA TYPE= NMR SPECTRUM
##DATA CLASS= NTUPLES
##ORIGIN= UXNMR, Bruker Analytische Messtechnik GmbH
##OWNER= root
$$ XWIN-NMR		Version 3.5
$$ Fri Jan 24 14:07:45 2025 Russian Standard Time (UT+4h)  she@DPX200
##.OBSERVE FREQUENCY= 81.013821
##.OBSERVE NUCLEUS= ^31P
##.ACQUISITION MODE= SIMULTANEOUS
##.ACQUISITION SCHEME= undefined
##.AVERAGES= 24
##.DIGITISER RES= 17
##SPECTROMETER/DATA SYSTEM= spect
##.PULSE SEQUENCE= zgpg30
##.SOLVENT NAME= CDCl3
##.SHIFT REFERENCE= (INTERNAL, CDCl3, 0, 198.062)
##AUDIT TRAIL= $$ (NUMBER, WHEN, WHO, WHERE, WHAT)
$$ ##TITLE= Audit trail, XWIN-NMR		Version 3.5
$$ ##JCAMPDX= 5.01
$$ ##ORIGIN= Bruker BioSpin GmbH
$$ ##OWNER= she
$$ F:/spectra/data/she/nmr/P31/2/pdata/1/auditp.txt
$$ ##AUDIT TRAIL=  $$ (NUMBER, WHEN, WHO, WHERE, WHAT)
(   1,<2025-01-24 14:06:45.54 +0400>,<she>,<DPX200>,
      <created by zg, POWCHK disabled, PULCHK disabled
       configuration hash MD5:
       00 E9 B6 7A A2 85 ED C7 34 08 36 98 17 FE 4E 26
       data hash MD5: 32K
       ED 84 FD 57 22 AF 47 B3 26 70 A2 DD DB 9E 11 D3>)
(   2,<2025-01-24 14:06:47.87 +0400>,<she>,<DPX200>,
      <Start of raw data processing
       efp BC_mod = 2 LB = 1.5 FT_mod = 6 PKNL = 1 PHC0 = 2216.989 PHC1 = -120.9129 SI = 64K 
       data hash MD5: 64K
       5D 44 91 EB 30 8B 7D 01 6D 6A D2 62 79 07 3C D3>)
(   3,<2025-01-24 14:07:09.78 +0400>,<she>,<DPX200>,
      <pk PHC0 = -118.4919 PHC1 = 286.2001 
       data hash MD5: 64K
       83 05 37 6A D5 16 75 F3 F8 2D 92 A8 6B 6A 6F CE>)
(   4,<2025-01-24 14:07:12.71 +0400>,<she>,<DPX200>,
      <abs ABSG = 5 
       data hash MD5: 64K
       F5 96 A8 01 A7 F0 AE CA 04 40 28 9A DF CC AC D0>)
$$ ##END=
$$ 
$$ hash MD5
$$ D5 51 BD 64 26 B7 0C 9C 24 67 5A E2 5A 4C 0C 3D
##$RELAX= 
##$RELAX= 
##$RELAX= 
##$RELAX= 
##$RELAX= 
##$RELAX= 
##$RELAX= 
##$RELAX= 
$$ Bruker specific parameters
$$ --------------------------
##$DU= <F:/spectra>
##$EXPNO= 2
##$NAME= <P31>
##$PROCNO= 1
##$TYPE= <nmr>
##$USER= <she>
##$AMP= (0..31)
100 100 100 100 100 100 100 100 100 100 100 100 100 100 100 100 100 100 
100 100 100 100 100 100 100 100 100 100 100 100 100 100 
##$AQSEQ= 0
##$AQ_mod= 1
##$AUNM= <au_zg>
##$AUTOPOS= <>
##$BF1= 81.014009
##$BF2= 200.13
##$BF3= 200.13
##$BF4= 200.13
##$BF5= 200.13
##$BF6= 200.13
##$BF7= 200.13
##$BF8= 200.13
##$BYTORDA= 1
##$CFDGTYP= 0
##$CFRGTYP= 5
##$CHEMSTR= <none>
##$CNST= (0..31)
1 1 145 1 1 1 1 1 1 1 1 1 1 1 1 1 1 1 1 1 1 1 1 1 1 1 1 1 1 1 1 1 
##$CPDPRG= <waltz16>
##$CPDPRG1= <>
##$CPDPRG2= <waltz16>
##$CPDPRG3= <>
##$CPDPRG4= <mlev>
##$CPDPRG5= <mlev>
##$CPDPRG6= <mlev>
##$CPDPRG7= <mlev>
##$CPDPRG8= <mlev>
##$CPDPRGB= <>
##$CPDPRGT= <>
##$D= (0..31)
0 1 0 0 0 0 0 0 0 0.06 0 0.03 2e-05 3e-06 0 0 0.0002 0 0 0 0 0 0 0 0 0 
0 0 0 0 0 0 
##$DATE= 1737713205
##$DBL= (0..7)
120 120 120 11 120 120 24 19 
##$DBP= (0..7)
150 150 150 150 150 150 150 150 
##$DBP07= 0
##$DBPNAM0= <>
##$DBPNAM1= <>
$$ [...]
##$SUBNAM3= <"">
##$SUBNAM4= <"">
##$SUBNAM5= <"">
##$SUBNAM6= <"">
##$SUBNAM7= <"">
##$SUBNAM8= <"">
##$SUBNAM9= <"">
##$SW= 400.765351723535
##$SWIBOX= (0..15)
0 1 3 0 0 0 0 0 0 0 0 0 0 0 0 0 
##$SW_h= 32467.5324675325
##$TD= 32768
##$TD0= 1
##$TE= 0
##$TE2= 300
##$TE3= 300
##$TEG= 300
##$TL= (0..7)
0 120 53 12 22 120 120 120 
##$TP= (0..7)
150 150 150 150 150 150 150 150 
##$TP07= 0
##$TPNAME0= <>
##$TPNAME1= <>
##$TPNAME2= <>
##$TPNAME3= <>
##$TPNAME4= <>
##$TPNAME5= <>
##$TPNAME6= <>
##$TPNAME7= <>
##$TPOAL= (0..7)
0.5 0.5 0.5 0.5 0.5 0.5 0.5 0.5 
##$TPOFFS= (0..7)
0 0 0 0 0 0 0 0 
##$TUNHIN= 0
##$TUNHOUT= 0
##$TUNXOUT= 0
##$USERA1= <user>
##$USERA2= <user>
##$USERA3= <user>
##$USERA4= <user>
##$USERA5= <user>
##$V9= 5
##$VALIST= <valist>
##$VCLIST= <CCCCCCCCCCCCCCC>
##$VD= 0
##$VDLIST= <DDDDDDDDDDDDDDD>
##$VPLIST= <PPPPPPPPPPPPPPP>
##$VTLIST= <TTTTTTTTTTTTTTT>
##$WBST= 1024
##$WBSW= 4
##$XGAIN= (0..3)
0 0 0 0 
##$XL= 0
##$YL= 0
##$YMAX_a= 12933
##$YMIN_a= -20610
##$ZGOPTNS= <>
##$ZL1= 120
##$ZL2= 120
##$ZL3= 120
##$ZL4= 120
##$ABSF1= 198.0616
##$ABSF2= -202.7028
##$ABSG= 5
##$ABSL= 3
##$ALPHA= 0
##$AQORDER= 0
##$ASSFAC= 0
##$ASSFACI= 0
##$ASSFACX= 0
##$ASSWID= 0
##$AUNMP= <proc_1d>
##$AZFE= 0.1
##$AZFW= 0.5
##$BCFW= 0
##$BC_mod= 2
##$BYTORDP= 0
##$COROFFS= 0
##$CY= -3
##$DATMOD= 1
##$DC= 0
##$DFILT= <>
##$DTYPP= 0
##$F1P= 0
##$F2P= 0
##$FCOR= 1
##$FTSIZE= 65536
##$FT_mod= 6
##$GAMMA= 0
##$GB= 0
##$INTBC= 1
##$INTSCL= 9.790993e-09
##$ISEN= 30
##$LB= 1.5
##$LEV0= 0
##$LPBIN= 0
##$MAXI= 10000
##$MC2= 0
##$MEAN= 0
##$ME_mod= 0
##$MI= 50
##$NCOEF= 0
##$NC_proc= -6
##$NLEV= 6
##$NOISF1= 182.463
##$NOISF2= 159.3651
##$NSP= 0
##$NTH_PI= 0
##$NZP= 0
##$OFFSET= 198.0616
##$PC= 4
##$PHC0= 2098.497
##$PHC1= 165.2872
##$PH_mod= 1
##$PKNL= yes
##$PPARMOD= 0
##$PSCAL= 0
##$PSIGN= 0
##$REVERSE= no
##$SF= 81.0140089999434
##$SI= 65536
##$SIGF1= 159.3651
##$SIGF2= -187.1042
##$SINO= 113.3802
##$SIOLD= 16384
##$SREGLST= <1H.CDCl3>
##$SSB= 0
##$STSI= 65536
##$STSR= 0
##$SW_p= 32467.5324675325
##$SYMM= 0
##$S_DEV= 0
##$TDeff= 32768
##$TDoff= 0
##$TI= <>
##$TILT= no
##$TM1= 0
##$TM2= 0
##$TOPLEV= 0
##$USERP1= <user>
##$USERP2= <user>
##$USERP3= <user>
##$USERP4= <user>
##$USERP5= <user>
##$WDW= 1
##$XDIM= 65536
##$YMAX_p= 525903674
##$YMIN_p= -13416121
$$ End of Bruker specific parameters
$$ ---------------------------------
##NTUPLES= NMR SPECTRUM
##VAR_NAME=  FREQUENCY,     SPECTRUM/REAL,   SPECTRUM/IMAG
##SYMBOL=    X,             R,               I
##VAR_TYPE=  INDEPENDENT,   DEPENDENT,       DEPENDENT
##VAR_FORM=  AFFN,          ASDF,            ASDF
##VAR_DIM=   65536,         65536,           65536
##UNITS=     HZ,            ARBITRARY UNITS, ARBITRARY UNITS
##FACTOR=    0.49542278885378, 1,            1
##FIRST=     16045.7642231865, 0,            0
##LAST=      -16421.768244346, 0,            0
##MIN=       -16421.768244346, -13416121,    0
##MAX=       16045.7642231865, 525903674,    0
$$ Real data points
##PAGE= N=1
##DATA TABLE= (X++(R..R)), XYDATA
$$ [...]
43236 213041 -282317 -608335 -758523 -876959 -1001929 -919576 -406572 405155 1087307 1353880
43226 1353880 1270888 1038175 783372 596179 532685 522654 462706 418935 527728 720047
43216 720047 816871 866086 1034297 1173064 935144 399384 91842 204856 285542 -24817
43206 -24817 -411429 -406390 -70639 259471 533489 820758 897899 539594 29663 -118209
43196 -118209 176559 593390 911984 1024014 674950 -206612 -1030484 -1027765 -241671 513960
43186 513960 722810 640276 633998 643507 491124 227668 -54548 -336186 -446356 -185481
43176 -185481 179063 85906 -418013 -544496 89076 758823 620962 -73966 -409551 -114338
43166 -114338 286495 460484 626341 868881 832095 381201 14557 214610 736554 948850
43156 948850 687828 390176 432151 670819 723131 486514 222866 178972 260787 160798
43146 160798 -224096 -607446 -608311 -178482 343633 588321 493691 289353 208037 262775 312837
43135 312837 298313 305331 360360 303798 29968 -244584 -186211 220283 706621 1170734 1729186
43124 1729186 2247452 2262413 1635663 898187 569468 453202 77693 -419014 -443017 99150
43114 99150 622822 729841 668199 717527 656899 218834 -314422 -415078 -17359 453740
43104 453740 651649 593859 447482 308111 194743 94129 20353 90510 399904 735926
43094 735926 660549 86216 -458926 -427001 71480 503576 646241 666516 582405 169686
43084 169686 -507305 -947874 -827735 -423792 -190833 -193338 -220142 -235384 -397733 -722862
43074 -722862 -978086 -893307 -354486 512846 1326521 1656832 1427040 991210 667306 372675
43064 372675 -60294 -416525 -313687 192915 606212 612126 351339 3584 -497855 -1128506
43054 -1128506 -1492190 -1220674 -492461 155783 458356 596092 797979 1054599 1266712
43045 1266712 1439111 1623028 1810958 1965237 2035969 1908386 1480105 865109 367251 125168
43035 125168 -88437 -542369 -1106316 -1352504 -1105570 -684821 -510552 -623870 -724707 -577594
43025 -577594 -222834 161689 443182 575170 597968 628424 731304 771579 526096 2871
43015 2871 -477026 -611718 -440615 -246229 -228183 -376639 -576574 -709407 -715224 -665599 -694083
43004 -694083 -742258 -512663 124384 797571 997843 735800 512474 595911 680254 422274
42994 422274 -4280 -168038 2294 154322 -20773 -499109 -1043032 -1383996 -1319389 -853758
42984 -853758 -280358 35538 -1226 -179293 -272746 -261262 -264328 -354884 -454516 -386031 -82442
42973 -82442 240845 262523 -21359 -232574 -116375 85497 1834 -307568 -491370 -504571
42963 -504571 -667375 -1101408 -1490036 -1525546 -1278511 -967180 -647256 -324251 -113550 -39547
42953 -39547 128033 559774 1008586 1041092 584632 11018 -321223 -409123 -462192 -584870
42943 -584870 -680866 -595972 -292227 113833 477408 766008 1025449 1232800 1287338 1149414
42933 1149414 866194 455570 -71053 -545532 -720467 -603987 -498289 -565856 -587482 -352105
42923 -352105 -50572 22855 -11633 219596 723771 1068580 967285 587314 188887 -194923
42913 -194923 -550309 -681426 -493772 -258950 -277642 -388688 -131970 609013 1403691 1767522
42903 1767522 1631982 1240518 800340 414452 214816 316567 625094 856031 812900 556825
42893 556825 266027 29727 -155064 -284136 -365377 -497345 -798423 -1224652 -1529219 -1450181
42883 -1450181 -944723 -267630 176368 150992 -160611 -299615 -33025 363837 465701 258382
42873 258382 133794 349151 726712 929150 805471 392219 -196109 -755965 -1077978 -1176153
42863 -1176153 -1243284 -1253538 -863349 63956 1057631 1486972 1308362 1062687 1168758 1500564
42853 1500564 1671212 1478597 1013623 523235 233543 182578 202912 157177 134130 280868
42843 280868 531850 703445 793207 953750 1197369 1366541 1399156 1385395 1340920 1165462
42833 1165462 877708 662996 611772 606691 536403 430734 314436 112273 -217159 -596059
42823 -596059 -910416 -1029018 -769407 -90122 670697 1038794 960810 837004 910221 947572
42813 947572 695977 328982 174761 241609 299422 249049 122182 -135885 -561674 -914133
42803 -914133 -819225 -209607 559039 1041353 1040890 683676 306486 221615 440079 645018
42793 645018 537267 166094 -148798 -141172 212475 700907 1005415 967581 796461 824694
42783 824694 1010372 972663 638353 462890 724600 976191 651359 -39416 -355014 -55040
42773 -55040 348649 371604 84932 -218045 -419732 -485454 -360807 -148084 -74990 -130822
42763 -130822 -29052 321275 610057 561270 291428 62545 -45848 -49733 52059 102322
42753 102322 -182214 -739916 -1037007 -746253 -281550 -253816 -604261 -749047 -479709 -205632
42743 -205632 -250022 -375789 -210414 187988 431514 282578 -154094 -588103 -747920 -545455
42733 -545455 -177853 5258 -161625 -507493 -751905 -774626 -588892 -193665 367967 845720
42723 845720 866789 277237 -648139 -1400554 -1664327 -1555623 -1429590 -1449225 -1398510 -989084
42713 -989084 -304998 203767 212029 -140276 -501179 -759752 -1043783 -1328780 -1330628 -892915
42703 -892915 -271740 137661 212276 46364 -360961 -1037623 -1681682 -1757594 -1123954 -286598
42693 -286598 208597 413835 721745 1151122 1291417 943310 429713 162664 210988 441887
42683 441887 795729 1186036 1347466 1081562 565217 164542 -14069 -164526 -400707 -577156
42673 -577156 -539783 -354744 -182431 -53382 113493 330715 470151 356685 -87169 -734237
42663 -734237 -1261744 -1353123 -983972 -483232 -232876 -313200 -512284 -660852 -815405 -1039289
42653 -1039289 -1144343 -847733 -170728 513778 890021 981886 936797 730322 288456 -233650
42643 -233650 -564282 -675936 -788980 -1000693 -1141375 -1050571 -788160 -505866 -305339 -289074
42633 -289074 -536578 -927032 -1182757 -1195933 -1120749 -1064919 -964767 -900113 -1172126 -1761623
42623 -1761623 -2032645 -1456630 -477799 -113767 -659023 -1294634 -1171427 -442552 103042
42614 103042 124629 19162 220851 615046 767583 502861 73151 -168469 -110091 112844
42604 112844 322289 409360 316945 85828 -54870 168035 709767 1127343 1025146 486242
42594 486242 -92402 -463680 -613235 -520302 -177934 176035 221824 32260 37673 377883
42584 377883 632984 418158 -71531 -403865 -514441 -587581 -547161 -153939 435111 687785
42574 687785 382599 -112186 -388767 -474257 -558545 -589197 -445603 -275206 -289947 -342898
42564 -342898 -60009 630117 1400594 1956731 2254946 2259858 1839189 1073389 385205 102947
42554 102947 60959 -119521 -471742 -666703 -497372 -119488 208006 410934 581978 834493
42544 834493 1203707 1550196 1563875 1054525 277906 -221012 -178241 115773 171129 -215886
42534 -215886 -857256 -1344024 -1259402 -488480 506709 940318 476540 -367275 -787152 -531994
42524 -531994 23153 463324 661709 595361 227848 -295664 -600348 -434060 18674 309639
42514 309639 208123 -47227 -17194 390950 723501 491921 -155393 -576238 -530700 -533404
42504 -533404 -1028633 -1604403 -1526718 -815052 -185252 -3535 67482 318378 528906 471494
42494 471494 309755 179618 -136642 -741813 -1247807 -1286678 -1053347 -913024 -788239 -417974
42484 -417974 38097 197453 101551 131235 353337 464084 359129 255653 213728 26461
42474 26461 -320959 -548067 -576761 -692095 -1009958 -1197223 -996287 -690527 -725253 -1102561
42464 -1102561 -1469092 -1634864 -1683607 -1647928 -1374047 -749177 103478 897981 1384655 1487899
42454 1487899 1294634 904839 337680 -333432 -839949 -923205 -677096 -459949 -431866 -422927
42444 -422927 -320391 -299405 -521120 -853188 -1078879 -1176750 -1205506 -1116559 -896483 -713043
42434 -713043 -687645 -682838 -556527 -478281 -723242 -1250028 -1726760 -1883816 -1625873 -949809
42424 -949809 -53157 592866 634375 273334 10806 -6102 -54236 -295595 -562820 -710023
42414 -710023 -766984 -661460 -233244 296142 323452 -344356 -1065524 -1133910 -704543 -498685
42404 -498685 -767429 -1068207 -1041077 -871330 -818483 -730096 -341359 202621 480646 369985
42394 369985 184916 208054 316505 201639 -164234 -448720 -349964 54392 413001 481752
42384 481752 307659 82001 -51964 -31501 140161 363805 498675 518218 514603 488631
42374 488631 288826 -106704 -399450 -284119 116442 361149 221640 -108033 -321929 -279978
42364 -279978 46374 612943 1157673 1275170 847716 232347 -184355 -460552 -890015 -1455039
42354 -1455039 -1807192 -1771714 -1548550 -1321315 -945366 -222973 673770 1293183 1404116 1240716
42344 1240716 1190788 1324707 1329601 932712 318865 9457 297154 920412 1385211 1481812
42334 1481812 1323704 997708 462279 -191943 -669103 -786273 -663932 -479364 -246387
42325 -246387 -4582 14148 -299185 -597835 -419925 154019 521719 312317 -179338 -454037
42315 -454037 -445457 -474446 -734825 -1084709 -1300682 -1319809 -1206163 -1030713 -829710 -587367
42305 -587367 -229350 295812 907620 1416271 1659308 1581360 1217746 681627 147500 -256762
42295 -256762 -559523 -862876 -1137901 -1210666 -1008190 -724155 -641141 -819844 -1035677 -1007119
42285 -1007119 -648104 -141231 183306 100944 -283334 -600829 -602229 -428289 -372613 -431461
42275 -431461 -308364 102777 492446 535633 301256 50741 -185464 -532354 -887414 -981134
42265 -981134 -821576 -713380 -758188 -708135 -464624 -323157 -444833 -459316 -18997 526936
42255 526936 551486 122793 -33332 394087 833212 667109 74757 -309970 -255977 -74866
42245 -74866 -100314 -378386 -766033 -1038198 -970505 -575444 -200367 -169492 -395696 -544064
42235 -544064 -462573 -210139 200029 742999 1134380 1023315 481373 -22939 -203621 -210826
42225 -210826 -247367 -286139 -320966 -565359 -1152659 -1857430 -2334210 -2448076 -2189803 -1510862
42215 -1510862 -518042 361929 745092 734529 727258 860859 940024 851909 730565 687308
42205 687308 660740 586274 472789 273475 -67050 -395490 -469558 -381173 -534262 -1013472
42195 -1013472 -1284683 -837392 68395 651480 531666 71527 -198265 -162228 -31708 35750
42185 35750 23401 -71559 -231392 -345773 -324608 -265401 -354602 -585942 -711740 -526812 -100555
42174 -100555 329298 587726 593388 274237 -337765 -916289 -975712 -377028 387982 609777
42164 609777 77223 -742538 -1252092 -1309995 -1213104 -1240304 -1364787 -1377376 -1151678 -743982
42154 -743982 -299554 85957 411228 680942 791032 566757 -25696 -726954 -1114474 -929147
42144 -929147 -295186 350602 549574 131915 -654732 -1316418 -1485192 -1174182 -677978 -256293
42134 -256293 43240 288862 502337 649789 742243 865242 1087020 1360552 1532143 1454083
42124 1454083 1117373 710662 537291 792430 1342704 1751292 1634501 1049134 454439
42115 454439 224626 270234 232932 -26140 -298149 -373441 -336319 -445344 -831789 -1364020
42105 -1364020 -1711525 -1542598 -833899 -29777 317081 170714 64720 385646 852293
42096 852293 952238 657196 337112 118762 -209077 -664522 -926430 -856670 -754640 -861363
42086 -861363 -944598 -668389 -141424 202555 136715 -175903 -403301 -263437 300047 934818
42076 934818 1044947 400030 -558101 -1253004 -1619009 -1894363 -1996757 -1608426 -838802 -276176
42066 -276176 -246637 -440677 -449690 -297020 -211829 -207270 -167097 -105135 -53492 106643 402792
42055 402792 514495 93418 -705022 -1293530 -1274524 -791450 -262457 43209 137684 188594
42045 188594 327045 512249 580448 470031 335030 352423 487812 559438 471563 269119
42035 269119 20407 -226370 -408276 -485377 -489701 -467152 -441741 -501928 -776813 -1182428 -1337614
42024 -1337614 -952680 -220799 392756 679392 774975 799832 722657 596886 619241 840995
42014 840995 1046335 1019222 742612 275704 -323190 -847193 -974617 -644255 -216827 -73402
42004 -73402 -189578 -268709 -146413 124979 457635 768333 909998 768966 411540 8753
41994 8753 -316624 -459305 -296933 112640 424906 359367 84422 -30032 -2546 -239885
41984 -239885 -886097 -1516289 -1658190 -1346942 -931430 -559734 -172653 125698 79207 -291794
41974 -291794 -598102 -572066 -408142 -397040 -406774 -55331 631691 1095935 940513 487113
41964 487113 369997 715029 1036908 917835 448169 -87298 -617362 -1146782 -1458757 -1285530
41954 -1285530 -704011 -100882 225512 218641 -99875 -641078 -1081055 -1011319 -407695 272797
41944 272797 616780 691268 801265 1006626 1118676 1067517 1008881 1064872 1157230 1134036 925680
41933 925680 561032 164366 -43085 116895 569062 1002838 1153989 1009532 731567 494082
41923 494082 432114 613060 946362 1200633 1223382 1096959 979911 856127 587657 204229
41913 204229 -24792 121994 557953 989399 1213841 1263649 1315756 1511543 1803768 1936395
41903 1936395 1664229 1061613 510866 285430 265415 219311 227086 542518 1074752 1345233
41893 1345233 1064377 468903 -62886 -450572 -743188 -788844 -440985 42041 203064 -12488
41883 -12488 -210324 -143703 -9667 -39331 -129011 -88695 6181 -22573 -115052 -72815 96836
41872 96836 204161 208785 266801 400121 329723 -244352 -1288007 -2421895 -3194034 -3330005
41862 -3330005 -2820973 -1891813 -897763 -172574 111815 -20315 -451404 -1084188 -1791712
41853 -1791712 -2285777 -2237794 -1680538 -1130023 -1044001 -1229958 -1106381 -546959 -70417 -54027
41843 -54027 -160591 149851 838734 1399551 1556820 1446688 1196848 746119 110795 -499894
41833 -499894 -890000 -962116 -637436 2544 525874 478982 -39406 -484392 -602606 -668806
41823 -668806 -882520 -994502 -793243 -551463 -616951 -859091 -926584 -840160 -900689 -1127168
41813 -1127168 -1208376 -997984 -702484 -539570 -479557 -354901 -19939 566566 1202959 1466223
41803 1466223 1149724 625542 461499 707012 901256 787153 605219 573195 496098 144904
41793 144904 -296211 -479351 -402988 -377790 -585316 -919942 -1211948 -1393965 -1462844 -1438522
41783 -1438522 -1367422 -1277062 -1146834 -964623 -742493 -455856 -101159 152071 69486 -286584
41773 -286584 -526393 -432281 -267858 -346303 -488184 -247105 419281 1061747 1327437 1313103
41763 1313103 1271788 1261307 1204652 1073753 884129 672354 558523 641369 748566 516015
41753 516015 -142042 -841216 -1169622 -1133135 -967900 -717814 -303987 99966 131319 -270176
41743 -270176 -714846 -815891 -590932 -318725 -195162 -265129 -511506 -803260 -851496 -445030
41733 -445030 257737 830157 1010913 938675 939335 1180903 1560822 1825442 1749575 1296350
41723 1296350 685228 247153 132823 192435 194157 102993 57641 120673 186953 163323 124433
41712 124433 216473 462778 729380 850747 741292 424327 24359 -287059 -427618 -512627
41702 -512627 -746995 -1141694 -1396263 -1185351 -578082 -45839 38550 -182169 -270369 -68370
41692 -68370 156903 169703 121706 295510 676107 1008777 1175281 1247041 1212599 963991
41682 963991 611017 503829 779392 1123290 1194427 1100791 1193904 1510845 1724622 1639848
41672 1639848 1455134 1449540 1625415 1789754 1829665 1743076 1488047 994892 348611 -182345
41662 -182345 -390245 -352131 -336345 -510888 -822410 -1135436 -1340964 -1285273 -801572 -8295
41652 -8295 583188 578491 278831 376433 990250 1412326 1057137 296619 -46548 209627
41642 209627 505504 423476 147122 -22415 -111323 -214008 -173868 161944 594933 786429
41632 786429 707435 645671 837616 1273906 1788315 2154171 2150188 1724515 1103062 606134
41622 606134 344425 173970 -73715 -410007 -726326 -925285 -988325 -944645 -801707 -550165
41612 -550165 -267341 -133147 -226685 -368987 -342028 -229152 -304019 -563400 -663377 -450572
41602 -450572 -278614 -557202 -1171627 -1616023 -1596312 -1247124 -813925 -382411 51662 439865
41592 439865 682468 703909 532186 333417 270537 267700 70442 -352405 -675396 -687296
41582 -687296 -684829 -1074453 -1705037 -1983877 -1662905 -1149984 -946585 -1080297 -1235819 -1200181
41572 -1200181 -996613 -736216 -502228 -302008 -49814 320216 695098 864334 793433 675184
41562 675184 668011 720155 680410 438907 -39161 -624248 -963594 -772355 -256981 10819
41552 10819 -244672 -718180 -1015528 -1116344 -1124549 -874887 -173828 720166 1247942 1157348
41542 1157348 657157 2415 -723605 -1359757 -1553787 -1118610 -334985 282978 449212
41533 449212 237419 -131821 -477430 -661405 -563852 -165825 329888 533236 152128 -678407
41523 -678407 -1413680 -1547718 -1047797 -315932 208625 338619 141127 -173877 -376391 -369056
41513 -369056 -238496 -75417 198192 669237 1150340 1293047 1033366 696780 549587 468531
41503 468531 243263 7132 62439 347714 418054 37154 -490957 -751448 -761489 -827192
41493 -827192 -979156 -885136 -390438 132179 173551 -303851 -852705 -1077573 -976258 -736606
41483 -736606 -418752 16797 479967 728766 589612 113663 -482937 -946516 -1053874 -697462
41473 -697462 -33499 500482 490966 -29918 -549304 -582063 -190685 117625 -1859 -383605
41463 -383605 -651959 -691076 -677835 -759264 -869182 -838164 -570488 -143298 189775 178227
41453 178227 -129357 -374076 -318799 -158426 -179416 -252270 -14765 476970 703138 409336
41443 409336 651 -28779 237550 340602 107035 -221508 -413465 -480631 -496275 -446682
41433 -446682 -326530 -217577 -211442 -329761 -515152 -639704 -574540 -327385 -50356 148152
41423 148152 292658 364521 190308 -337720 -1034095 -1572635 -1800357 -1793324 -1713399 -1723296 -1890763
41412 -1890763 -2031587 -1828440 -1291706 -888603 -944181 -1112819 -803235 -686 727905 980318
41402 980318 853774 551695 124099 -287391 -373093 -47137 376657 592153 638890 681763
41392 681763 717764 678970 581883 390401 -30210 -622856 -1036020 -1041781 -852950 -785018 -796189
41381 -796189 -638099 -312497 -81823 -102722 -291639 -473145 -438832 17578 826080 1472291
41371 1472291 1443046 870336 426930 491036 685696 408941 -373959 -1071258 -1116754 -517413
41361 -517413 229754 635846 594615 339673 136300 72485 106208 189029 276739 302586 244979
41350 244979 191483 239404 335355 305852 93716 -82733 110120 745201 1449240 1711526
41340 1711526 1435967 1062576 1014364 1152408 1009039 493458 56604 98602 497838 852795
41330 852795 941580 786839 505409 301529 410711 812056 1135398 1070659 744661 497105
41320 497105 440157 471325 555225 690484 713513 475781 175680 183459 518404 795665 738737
41309 738737 485844 341629 468584 861126 1359375 1617207 1320971 567739 -159069 -465824
41299 -465824 -316491 174099 885807 1513010 1601664 1067366 463062 405504 831561 1108064
41289 1108064 829325 231626 -189862 -216991 13331 251232 306606 95677 -323010 -758235
41279 -758235 -1007528 -977267 -660726 -56838 774992 1562883 1875892 1501356 755432 246152
41269 246152 257761 501193 555915 396431 310823 422203 540868 477835 278641 102089
41259 102089 53120 190333 517978 885115 1052161 961861 807789 727266 574867 163935
41249 163935 -379025 -720751 -763769 -763883 -924382 -1046263 -761919 -61134 616769 871579
41239 871579 749144 526308 250231 -242783 -895667 -1347911 -1394599 -1249607 -1171549 -1075984
41229 -1075984 -765168 -333525 -33849 123729 316012 542074 644627 631331 625303 531904
41219 531904 137737 -446744 -850342 -1013750 -1277333 -1767784 -2134468 -2115179 -1941198 -1864877
41209 -1864877 -1663057 -1027188 -171722 417887 689264 999534 1437820 1644684 1400154
41200 1400154 1003528 878474 1056303 1251516 1286205 1233969 1205387 1166212 1003848 686153
41190 686153 291474 -89316 -396862 -532147 -370304 27518 317644 207868 -131309 -232371
41180 -232371 50847 343058 263766 -104247 -415117 -505045 -439638 -290973 -83262 142921
41170 142921 370619 605665 733527 559617 137774 -147989 -33158 268602 360205 146146
41160 146146 -175385 -404952 -390769 -4244 623398 1013257 831360 355782 127110 241163
41150 241163 331022 163577 -109899 -251043 -132747 317912 1008614 1523338 1448502 906432
41140 906432 450763 401893 577296 658137 477679 -36468 -800322 -1408814 -1441616 -1027734
41130 -1027734 -732847 -809179 -958797 -915793 -779787 -613633 -240059 267545 391126 -112145
41120 -112145 -693099 -709147 -354803 -353798 -880012 -1351519 -1316481 -1036237 -1001402 -1217107
41110 -1217107 -1243181 -808847 -153128 276027 334740 267053 280171 239285 -26931 -277809
41100 -277809 -69506 592022 1172128 1266161 982319 553019 -13659 -646515 -968067 -707408
41090 -707408 -91809 510514 1070462 1645287 1926789 1563147 815769 378347 519852 829849
41080 829849 859838 623221 370058 226739 210462 329348 512926 627097 651021 668855
41070 668855 639415 386008 -97565 -517542 -573793 -276495 91319 237371 77270 -195323
41060 -195323 -249377 58416 498742 698519 503455 11673 -631046 -1266280 -1649005 -1622436
41050 -1622436 -1378597 -1292973 -1438729 -1473063 -1088367 -414389 115845 198020 -95196 -420611
41040 -420611 -497538 -368410 -279386 -290999 -184772 142470 431166 432182 312117 375416 554431
41029 554431 551183 370725 287999 320816 173805 -251219 -693621 -950948 -1071025 -1053017
41019 -1053017 -770104 -326519 -100811 -253145 -523261 -667196 -741770 -803819 -720281 -481738
41009 -481738 -315269 -255819 -16610 437206 635915 319072 -13468 224892 789065 920787
40999 920787 398242 -292910 -731463 -934421 -964812 -729000 -311649 -79647 -254685 -659949
40989 -659949 -997758 -1113378 -931155 -460462 13643 59893 -386908 -860619 -877943 -445744
40979 -445744 65934 354256 327061 6851 -473841 -854562 -930006 -769280 -638110 -679258
40969 -679258 -746996 -608576 -280589 -75900 -242025 -614280 -786458 -623907 -390394 -301156
40959 -301156 -234291 -78968 -72939 -427875 -806773 -643741 30062 533279 422520 50910
40949 50910 46053 527657 1074459 1258348 980672 413021 -186029 -644797 -980113 -1270973
40939 -1270973 -1414788 -1174455 -536056 161171 560078 600783 424697 166863 -31813 -19991
40929 -19991 166705 274174 197045 216367 625547 1239240 1561465 1408620 1098529 996101
40919 996101 1108017 1204995 1158421 1035497 959435 973144 1004472 930185 715818 503793 507724
40908 507724 799123 1234164 1595421 1775115 1824867 1852985 1868610 1737429 1353790 864812
40898 864812 615096 801169 1277391 1788392 2267252 2738332 3024259 2824865 2158461 1509253
40888 1509253 1356047 1624571 1760315 1351495 572054 -44166 -204011 -130978 -220898 -527631
40878 -527631 -733924 -627502 -413206 -414364 -599493 -643878 -446630 -322567 -556980 -969119
40868 -969119 -1124215 -876671 -484431 -235600 -213304 -444081 -973704 -1634525 -1996696 -1829092
40858 -1829092 -1455067 -1334035 -1387603 -1135789 -509859 -64059 -185404 -517035 -510989 -221931
40848 -221931 -101695 -231729 -304144 -292768 -555207 -1149686 -1578433 -1469169 -1098178 -921271
40838 -921271 -914777 -744429 -354789 -12311 107036 44253 -125151 -289409 -203440 281660
40828 281660 923228 1311590 1367099 1332120 1302000 1106329 706663 372863 312080 368991
40818 368991 261499 -55186 -392518 -555135 -462480 -185810 42525 -8329 -310074 -599254
40808 -599254 -698221 -647676 -493782 -201907 99142 62760 -451518 -1091579 -1402724 -1354543
40798 -1354543 -1214399 -1044956 -687502 -205196 49494 -79194 -302262 -287917 -69676 143791
40788 143791 359688 725429 1153567 1316584 1067882 662156 453552 504555 610719 627991
40778 627991 624865 709483 840454 885234 789369 583126 256346 -229490 -762669 -1056011
40768 -1056011 -927683 -531591 -160092 139005 560732 1140714 1568718 1530643 1093175 596420
40758 596420 266098 96517 34360 66697 131166 122710 19703 -130480 -331570 -562552
40748 -562552 -607856 -239992 355094 629797 329591 -157366 -338548 -266970 -325783 -533988
40738 -533988 -484310 40687 764931 1286223 1421322 1123239 418200 -413328 -909576 -910898
40728 -910898 -753008 -794391 -983555 -1094509 -1129965 -1206166 -1248101 -1129496 -972904 -978945 -1063359
40717 -1063359 -999791 -832617 -773856 -743030 -442654 64380 304359 92126 -113584 173549
40707 173549 786770 1156394 1054794 774814 654821 720953 815952 875779 1007980 1359684
40697 1359684 1900643 2326420 2294200 1822143 1313112 1079276 1006086 833753 578649 422414
40687 422414 320167 52124 -353094 -573056 -442616 -168172 33779 259672 691159 1233123
40677 1233123 1605819 1691910 1583010 1358287 1036988 715554 524036 430624 300484 179831
40667 179831 281435 597868 787786 634044 389416 394771 526288 385588 -32524 -290246
40657 -290246 -193349 -90916 -265088 -409697 -100467 463453 657537 309603 -61185 41389
40647 41389 496928 838704 843191 662284 548871 624271 802769 821225 451998 -207143
40637 -207143 -762177 -935264 -831329 -698203 -569329 -313571 49782 290740 249480 51649
40627 51649 -29277 98467 208506 20873 -382227 -547017 -206046 268216 236414 -386227
40617 -386227 -975016 -940649 -338006 403442 1034869 1503957 1669309 1384872 808422 318236
40607 318236 115151 116620 203298 341230 491940 645390 931960 1443738 1921559 1898336
40597 1898336 1259862 442011 -56107 -170837 -156931 -164927 -148276 -89133 -75190 -128613 -132356
40586 -132356 -6571 144736 159826 36142 -93885 -189890 -352460 -575076 -614410 -301816
40576 -301816 111337 183851 -146116 -510128 -679915 -840474 -1116824 -1195369 -783204 -205332
40566 -205332 -81191 -466436 -749632 -457901 197670 679469 702839 315989 -313516 -975533
40556 -975533 -1438347 -1573025 -1401336 -990715 -444635 -10317 32821 -305455 -694562 -860812
40546 -860812 -821462 -683036 -454332 -194522 -99858 -230653 -339061 -206292 -18676 -158668
40536 -158668 -683791 -1227370 -1397883 -1128154 -671155 -382503 -445805 -675035 -647521 -161964
40526 -161964 502747 900242 877960 578958 134948 -378281 -741225 -649924 -53246 752698
40516 752698 1416501 1764569 1746583 1385512 874234 514904 402566 295871 -42079 -465699
40506 -465699 -584365 -257445 200114 347980 66506 -369531 -591636 -442974 -25971 433804
40496 433804 705121 614026 144011 -478503 -903721 -956432 -776357 -610396 -533606 -450490
40486 -450490 -293208 -100152 48505 41963 -261210 -861878 -1452996 -1630557 -1339669 -935319
40476 -935319 -721546 -628331 -471343 -302201 -257253 -236396 -70900 72171 -144747 -619503
40466 -619503 -792766 -431291 -42904 -192946 -711004 -981590 -807186 -510085 -301862 -94472
40456 -94472 56119 -105630 -486990 -582469 -235220 19613 -258790 -719451 -780223 -541640
40446 -541640 -577411 -1010967 -1374927 -1325928 -990745 -621768 -376941 -427398 -804728 -1121929
40436 -1121929 -921920 -340682 59417 143582 319996 695580 763808 224491 -461925 -732200
40426 -732200 -650944 -555649 -409346 -20245 416415 539782 407021 392785 640993 1012416
40416 1012416 1423430 1830296 2002227 1715835 1111173 532625 119493 -156827 -237090 -122645
40406 -122645 -105136 -432891 -869590 -985059 -764497 -524338 -362888 -149968 56447 85137
40396 85137 74642 314679 706081 895774 918037 1130960 1487700 1478058 919309 230900
40386 230900 -246928 -651208 -1108504 -1403079 -1404155 -1326637 -1289466 -1099551 -753095 -626045
40376 -626045 -819730 -854362 -451932 -103468 -301894 -658321 -449523 254864 712291 599939
40366 599939 310720 190332 115294 -70794 -229700 -207059 -53879 164971 465414 748735
40356 748735 801034 568058 176564 -333575 -983171 -1524766 -1521072 -918247 -242637 -17117
40346 -17117 -186836 -307317 -121438 253560 585862 751481 717441 473649 56784 -390946
40336 -390946 -648027 -581095 -328077 -226947 -455050 -792605 -865426 -584644 -215345 -37412
40326 -37412 -85538 -221802 -305127 -235289 48752 517280 1018784 1339527 1314854 935054
40316 935054 376684 -121056 -454752 -687886 -872957 -948942 -873897 -752206 -741395 -905236
40306 -905236 -1205816 -1523872 -1635186 -1341953 -752012 -271354 -160748 -227871 -123502 180476
40296 180476 397778 319471 10202 -324134 -494643 -401746 -96267 253159 519369 664068
40286 664068 614907 310011 -53129 -98909 210026 423811 229290 -66406 -14475 292369
40276 292369 458945 487215 683807 960656 836939 234041 -269318 -191582 255195 558487
40266 558487 548074 371664 93891 -346071 -847414 -1055558 -636079 349161 1335888 1659982
40256 1659982 1200096 491820 56206 -156301 -397880 -519966 -240045 186283 194007 -218052
40246 -218052 -485330 -403016 -355293 -450678 -201815 531777 993770 537812 -339688 -674333
40236 -674333 -393094 -258787 -622647 -970833 -767351 -142252 434665 721743 738436 539330
40226 539330 178028 -235965 -565060 -696818 -612683 -470752 -492158 -644327 -608430 -234338
40216 -234338 169323 225788 -37635 -390023 -848717 -1540681 -2247177 -2515194 -2202413 -1566382
40206 -1566382 -868552 -259317 20166 -197702 -592526 -577980 -90330 251849 -32521 -678299
40196 -678299 -1126179 -1256196 -1355904 -1570382 -1712901 -1561624 -1135089 -699299 -583277 -881864
40186 -881864 -1284655 -1373840 -1164854 -1113239 -1443236 -1736946 -1451885 -661993 17172 143709
40176 143709 -189886 -638485 -938780 -957124 -700269 -375329 -235287 -284107 -312236 -269005
40166 -269005 -349035 -584238 -633519 -261826 159133 19377 -683939 -1276013 -1308621 -1154084
40156 -1154084 -1403583 -1956166 -2139555 -1642257 -873910 -338414 -72160 106317 169795 51623
40146 51623 11854 417701 1181861 1752035 1736994 1319440 956132 836249 757599 459183
40136 459183 -29928 -385342 -315155 127322 607586 875404 956421 960112 876085 681100
40126 681100 485489 380800 250049 -52462 -394092 -467014 -192608 180171 390713 388028
40116 388028 218294 -91577 -446913 -650010 -590027 -403538 -353201 -557516 -863933 -986403
40106 -986403 -808470 -572277 -669087 -1166480 -1666700 -1765662 -1514767 -1223412 -939523 -453214
40096 -453214 202617 625125 554065 233580 72957 161150 338611 569379 927225 1257754
40086 1257754 1199694 701582 298649 597527 1505652 2231496 2168218 1574439 1166488 1193206
40076 1193206 1251964 986766 552902 241712 23998 -249165 -476591 -488113 -410767 -498306
40066 -498306 -708861 -783421 -653850 -452892 -212988 100231 335147 308952 165838 197125
40056 197125 340427 271971 -15087 -181718 -129573 -130603 -267547 -243571 65904 341120
40046 341120 325658 160933 -28489 -397422 -890828 -977728 -357917 429324 640723 333293
40036 333293 205397 598600 1193391 1624569 1858332 1893124 1550307 756604 -221564 -961142
40026 -961142 -1177266 -871745 -381931 -217279 -588548 -1105962 -1168888 -643840 46858 463663
40016 463663 539585 461726 417356 483981 579800 515972 249058 20028 50875 182273 57718
40005 57718 -371805 -771055 -830499 -533962 -53660 390726 605846 593862 601325 759022
39995 759022 767051 266921 -531659 -990668 -831021 -374755 67798 589747 1252147 1681909
39985 1681909 1486792 848380 336072 218046 245348 88233 -258901 -553183 -632530 -579236
39975 -579236 -556774 -517771 -198736 464613 1032609 949040 244545 -436546 -598512 -399400
39965 -399400 -259263 -269390 -241313 -105372 65455 308933 732914 1247979 1597907 1659940
39955 1659940 1505762 1181387 668617 99465 -240157 -246915 -170928 -305464 -617358 -837597
39945 -837597 -852828 -838332 -997049 -1315050 -1637500 -1870931 -1999956 -1970406 -1700253 -1215381
39935 -1215381 -662170 -165877 214402 380568 217433 -188698 -510319 -508409 -293915 -108837
39925 -108837 34445 283583 596544 728029 584435 359848 253388 246010 239400 235460 259065
39914 259065 241254 117834 -36712 -97882 -71342 -74116 -130899 -69848 311255 961642 1525058
39903 1525058 1678740 1527118 1515297 1891601 2411769 2680799 2619295 2432578 2280553 2183540
39893 2183540 2113110 1949676 1494260 782410 231870 154074 248108 -47680 -799465 -1571389
39883 -1571389 -2059568 -2235826 -1945777 -1025721 73372 470084 -28354 -572316 -408243
39874 -408243 174279 485928 489226 577089 698586 463966 -29366 -201663 129013 456644
39864 456644 309285 -184519 -574285 -556594 -59743 779603 1568897 1862291 1564657 978618
39854 978618 434349 81375 10106 257083 624047 783493 675307 571257 664079 826451
39844 826451 872655 824273 772707 661421 381286 7520 -184937 33248 563744 953083
39834 953083 803633 305504 141606 650646 1309080 1373972 850760 386690 320378 367545
39824 367545 260297 127860 78465 -67813 -349592 -416522 -59279 371266 452483 314553
39814 314553 384558 726020 1046540 1228421 1439666 1748211 1974605 1960898 1734294 1384972
39804 1384972 984039 618239 321724 -9060 -456790 -868189 -986706 -801842 -597074
39795 -597074 -617751 -803533 -872850 -613324 -103526 334748 480731 505025 742447 1152516
39785 1152516 1291821 967906 599049 633968 894371 907905 700345 728076 1046912 1109378
39775 1109378 576768 -123349 -366153 -149863 15330 -125509 -290461 -148287 212335
39766 212335 430967 339540 119142 13513 17731 -57803 -265125 -409874 -323117 -119989
39756 -119989 -66356 -246804 -472650 -483523 -172751 312858 632585 534904 171166 -45033
39746 -45033 -20515 -177977 -820499 -1561949 -1794430 -1540633 -1333034 -1332422 -1172870 -739144
39736 -739144 -423956 -356348 -36241 793988 1468393 1227225 361893 -174909 -102798 -16482
39726 -16482 -288555 -525256 -305293 177837 523124 666098 665303 378855 -220801 -728934
39716 -728934 -763600 -540308 -558126 -850168 -994569 -815487 -615216 -654559 -825789 -991297
39706 -991297 -1272093 -1743326 -2106836 -1977740 -1376016 -669403 -101904 356173 707844 775290
39696 775290 473742 48684 -141739 -10175 228626 356253 339235 245751 137462 79744
39686 79744 115033 155298 29177 -268996 -504151 -509227 -448938 -577923 -812913 -799943 -417821
39675 -417821 39945 266808 296943 323900 356641 229966 -159654 -756347 -1354833 -1613674
39665 -1613674 -1279681 -593583 -251902 -670807 -1442585 -1852916 -1801190 -1783182 -2018073 -2124400
39655 -2124400 -1806444 -1364426 -1204431 -1206302 -970107 -455234 29166 326134 516880 574086
39645 574086 351065 -39999 -226993 -96457 516 -243800 -629245 -736424 -507867 -250604
39635 -250604 -120229 94843 588895 1162208 1416620 1249473 971529 913577 1060019 1147365
39625 1147365 1005827 665696 197578 -358796 -885746 -1187012 -1180317 -969736 -666900 -287492
39615 -287492 100281 321806 350294 432145 723551 940924 679294 29350 -454167 -449849
39605 -449849 -227316 -178479 -255651 -86992 503651 1293537 1893778 2030954 1671354 1023043
39595 1023043 396834 -31083 -299362 -479702 -534727 -451912 -387633 -493832 -640075 -479692
39585 -479692 168739 1079436 1754797 1772962 1109507 243102 -147854 200943 824072 997633
39575 997633 541942 -34252 -224265 -99827 -31779 -69796 66643 433289 661101 451696
39565 451696 14668 -218029 -161662 -99014 -201702 -332291 -365898 -412197 -555505 -608952
39555 -608952 -377288 -32940 43461 -239998 -597323 -776748 -814941 -818839 -731565 -460378
39545 -460378 -86269 202086 299323 210957 -18601 -315036 -599050 -875303 -1182931 -1379593
39535 -1379593 -1144570 -376181 521750 962614 760598 234571 -218927 -458170 -522686 -474210
39525 -474210 -406029 -433676 -539890 -529142 -263510 109616 276244 89390 -286494 -551993
39515 -551993 -535595 -292228 -6579 173923 241116 300752 453046 670543 763523 489595
39505 489595 -224062 -1128025 -1777520 -1883299 -1534773 -1065231 -752912 -673862 -724256 -673491
39495 -673491 -300865 332703 796398 701587 229771 10959 372449 930256 1093967 777599
39485 777599 371076 165862 137229 242190 553394 986730 1207705 1017198 634984 402900
39475 402900 370201 384310 439255 652224 954907 1088931 930559 603495 256664 -50489
39465 -50489 -226671 -172713 -2940 11171 -155423 -175072 155558 545719 561057 207644
39455 207644 -88437 -20119 310009 611509 713565 636710 512197 459250 463197 401541 244668
39444 244668 130469 158255 263612 428591 803405 1370466 1679565 1292399 430615 -195417
39434 -195417 -229944 -2985 34725 -143060 -283162 -230112 18730 390631 695103 706434
39424 706434 447769 214901 186198 204794 93133 -17124 140958 597294 1095717 1314957
39414 1314957 1066298 436116 -183776 -389685 -183399 67781 113527 17500 -139891 -381900
39404 -381900 -543661 -280991 388023 923083 924413 600591 281685 -113337 -698366 -1108438
39394 -1108438 -941319 -461860 -280104 -486928 -683460 -741839 -918474 -1256538 -1502113 -1645177
39384 -1645177 -1925100 -2203815 -1958254 -1098014 -239339 72665 -71843 -362719 -705495
39375 -705495 -953289 -747266 -49943 574162 642058 386695 312057 446688 485446 394930
39365 394930 393864 517971 658435 881619 1262029 1516624 1272015 653562 179778 73370
39355 73370 69298 -82966 -314866 -480433 -531557 -375288 86793 651525 866519 559042
39345 559042 64791 -222941 -297031 -362119 -443150 -402129 -214916 -8459 120748 148078
39335 148078 15832 -340190 -829627 -1194198 -1230329 -997290 -766185 -762097 -967956 -1179406
39325 -1179406 -1221710 -1076055 -816445 -508764 -206651 27617 165292 238319 279832 276887
39315 276887 216129 122762 18674 -94141 -172992 -144401 -37989 -30832 -274598 -719886 -1155337
39304 -1155337 -1361460 -1211741 -745785 -203997 137337 251110 356820 549418 602829 311944
39294 311944 -110895 -225221 76858 404101 303479 -256230 -875819 -1134703 -988287 -771226
39284 -771226 -793063 -985089 -1061273 -962305 -893357 -903196 -751486 -345062 8418 26391 -143006
39273 -143006 -233117 -314051 -568241 -833434 -812982 -601521 -535480 -609268 -535822 -344921 -373073
39262 -373073 -616937 -671093 -436588 -298263 -378141 -237856 307474 684529 412314 -44008
39252 -44008 54302 548293 647472 173929 -282627 -439887 -695493 -1210711 -1433285 -991360
39242 -991360 -422776 -414968 -761246 -727004 -184139 286313 304402 58216 -239264 -633682
39232 -633682 -1042191 -1150555 -917320 -691882 -593860 -284016 324225 662962 327121 -148185
39222 -148185 21047 686323 1005586 730414 466365 592002 715407 484199 230947 357290
39212 357290 605699 466664 -45808 -511441 -721874 -730092 -524740 -118814 218729 270143
39202 270143 267733 558622 999073 1117083 780851 279705 -172515 -578831 -874345 -942110
39192 -942110 -868133 -768066 -463611 185979 756874 687675 201756 102661 564510 880016
39182 880016 636930 351066 499692 667305 295057 -290592 -361057 55703 267125 -9212
39172 -9212 -379425 -523369 -540616 -499075 -249353 156649 367652 257169 149616 323901
39162 323901 619193 724560 581642 319642 35127 -183269 -211011 -36393 187664 328640
39152 328640 341817 116866 -462090 -1175117 -1482068 -1117316 -451192 -5035 187792 411090
39142 411090 620289 422795 -260344 -945781 -1205893 -1202892 -1300842 -1386209 -1004391 -125763
39132 -125763 663817 873590 659887 455364 361871 242503 180694 390398 727410 754323
39122 754323 385828 67259 134822 350784 327118 124153 106920 380751 687475 778139
39112 778139 619133 276917 -161757 -564070 -826393 -968070 -1045411 -1065148 -1109208 -1387363
39102 -1387363 -1945573 -2441570 -2465047 -2005517 -1361341 -688735 39491 681172 923193 722187
39092 722187 419885 270580 124571 -230608 -636535 -721352 -397128 10994 134497 -50276
39082 -50276 -215721 -33654 450384 813066 695480 223206 -132287 -101953 122907 212869
39072 212869 119447 73564 260736 597563 804989 668849 253078 -155803 -352612 -405643
39062 -405643 -478935 -574346 -608955 -645586 -791099 -892299 -632967 -3891 607263 921425
39052 921425 1083550 1275556 1288940 816594 22555 -566871 -749049 -870477 -1243390 -1634022
39042 -1634022 -1580222 -1053891 -503698 -249291 -117985 196808 644342 919261 941210 940595
39032 940595 1052978 1119158 1007636 866693 837494 738825 352837 -111279 -234302 -69875
39022 -69875 -189381 -863641 -1546850 -1514063 -845816 -394072 -732260 -1450132 -1670490 -1079096
39012 -1079096 -179444 430289 716543 991118 1300101 1392405 1222883 1058609 971007 640828
39002 640828 -49719 -581736 -381122 372195 976048 1130244 1134431 1200824 1141545 889723
38992 889723 803260 1133383 1562768 1617855 1280656 867659 518719 154722 -194382 -368395
38982 -368395 -356726 -345591 -486921 -779065 -1121876 -1346313 -1282133 -959004 -649091 -552135
38972 -552135 -544530 -404660 -156333 13956 56798 41617 -54981 -273039 -445803 -340973
38962 -340973 -22524 194143 179817 143151 290976 556015 743491 772346 695755 633889
38952 633889 743388 1091496 1484299 1571378 1222141 687842 304455 138715 19558 -175727
38942 -175727 -390217 -508234 -508200 -480805 -533592 -683010 -829869 -846956 -693714 -444457 -219130
38931 -219130 -89316 -28298 42179 122559 83499 -178811 -564081 -858610 -972777 -924729
38921 -924729 -634590 -31255 574804 602609 -54853 -687480 -531811 292657 979705 1051078
38911 1051078 773919 612170 693580 897464 1099164 1179361 1055084 816960 626992 456318
38901 456318 194533 8991 197531 595762 580940 -101797 -907350 -1179873 -934585 -620392
38891 -620392 -434729 -307597 -310502 -551650 -759696 -495278 168211 606721 417005 -95114
38881 -95114 -327474 -34887 530872 916073 814869 314319 -151713 -258757 -188475 -351510
38871 -351510 -766578 -1045560 -1002069 -870151 -813088 -650598 -296225 -42843 -70398 -30242
38861 -30242 442216 1071191 1298930 1127600 1048612 1183117 1082377 505581 -131492 -336885
38851 -336885 -172750 -27807 -76956 -249691 -468279 -626353 -561127 -338936 -341601 -735551
38841 -735551 -1062563 -758589 60836 763523 1052946 1160543 1188619 841906 36818 -713334
38831 -713334 -895749 -657355 -480337 -447486 -278132 40399 164465 -5779 -80925 259004
38821 259004 776971 1019661 941321 876821 981538 1034984 863796 669185 739814 1013491
38811 1013491 1164115 1042771 772187 415772 -139213 -846531 -1321497 -1233267 -719914 -182982
38801 -182982 202342 520420 769517 791449 527229 82550 -432281 -872899 -965563 -618987
38791 -618987 -287260 -536669 -1172943 -1334885 -677969 72838 122727 -331030 -553827 -398855
38781 -398855 -323626 -492345 -569778 -414152 -330646 -478875 -555732 -297783 107854 348182
38771 348182 388111 326659 143946 -159286 -386005 -345277 -104283 115158 179296 104126
38761 104126 26332 159210 578418 999096 995021 514381 -44037 -321299 -314664 -172998
38751 -172998 -3954 34221 -186527 -456749 -384194 -31232 16027 -539314 -1248467 -1588825
38741 -1588825 -1653541 -1758064 -1797192 -1554680 -1305919 -1445470 -1726615 -1577546 -1075457 -865010
38731 -865010 -1074912 -1069223 -471917 254245 570437 602597 721519 893847 923016 940770
38721 940770 1153739 1379448 1323756 1113552 1067998 1081899 739657 15297 -597329 -718159
38711 -718159 -490771 -289794 -324538 -609458 -1044636 -1405154 -1458925 -1209985 -894073 -693123
38701 -693123 -593093 -524085 -466617 -412821 -396894 -542336 -863551 -1059001 -815261 -355192
38691 -355192 -308128 -854683 -1347537 -1096612 -290793 251294 140486 -188839 -186228 97580
38681 97580 209276 -34945 -363190 -467773 -353782 -202853 -71432 118426 359731 523072
38671 523072 580225 692903 943541 1103605 883861 375861 3552 -3090 155591 230119
38661 230119 267187 365185 326543 -94698 -688332 -913728 -597706 -189695 -164848 -416372
38651 -416372 -461459 -105587 342499 488126 287114 22924 -35857 107690 226689 140638
38641 140638 -73374 -161873 19101 352345 599685 618580 412003 58643 -321182 -578301
38631 -578301 -606623 -419421 -137251 87868 157125 107932 113684 300173 542228 572465 345809
38620 345809 143320 204705 403818 446311 259248 -20852 -335572 -697298 -930497 -762244
38610 -762244 -281807 -13068 -305934 -845635 -1023185 -688689 -269044 -169547 -343188 -527453
38600 -527453 -644465 -759456 -789777 -533807 -18575 398282 406076 107572 -140664 -197511
38590 -197511 -273110 -581279 -1032593 -1367861 -1459152 -1335156 -1011270 -505478 -16277 135164
38580 135164 -148157 -572069 -750123 -604903 -371715 -257799 -221579 -88887 216548 588475
38570 588475 805608 651021 60329 -743911 -1303806 -1264109 -743096 -284932 -319985 -688584
38560 -688584 -821220 -404533 275356 721591 799199 745228 701723 508713 46307 -427783
38550 -427783 -498776 -118825 270619 215321 -240603 -616743 -545005 -149754 159565 168355
38540 168355 -2910 -191753 -414706 -696550 -858093 -700525 -358201 -232963 -504238 -874780
38530 -874780 -923018 -596515 -217567 -65733 -114195 -178093 -167716 -122233 -102009 -162825 -381479
38519 -381479 -763390 -1111111 -1130110 -758079 -296048 -94641 -169206 -255774 -194664 -69754
38509 -69754 42513 242130 607352 987254 1152536 1067503 867864 631539 324813 -44300
38499 -44300 -362651 -537111 -609771 -722723 -986328 -1354603 -1612813 -1549626 -1177824 -724327
38489 -724327 -387277 -201048 -145914 -209962 -259374 -44984 488523 1033002 1238387 1107444
38479 1107444 902722 762616 603725 335578 -18522 -380901 -655060 -751413 -690601 -593570
38469 -593570 -472762 -185187 288771 733922 1040719 1409395 1992071 2624075 3202863 3982960
38459 3982960 5089236 6157984 7093038 8771557 11994377 15760288 17657371 16369269
38451 16369269 13021332 9661451 7201212 5384682 3964495 2982419 2279023 1605292
38443 1605292 1108005 1043490 1134353 856580 293707 58922 346849 673989 663253 512575
38433 512575 486077 444185 181973 -119417 -94587 357485 1046218 1719052 2111592 1950186
38423 1950186 1180144 157505 -592658 -858784 -886688 -1004752 -1189781 -1113018 -617425 -2076
38413 -2076 292702 181584 -64436 -223634 -267234 -146382 206167 599058 680903 463032
38403 463032 383067 654192 928824 875912 711469 789444 995234 987484 802488 754552 886770
38392 886770 956501 873660 777923 770564 888822 1195906 1563279 1565861 996984 304675 83573
38381 83573 302097 477078 420689 306861 180551 -20311 -87584 202491 556838 523135
38371 523135 288557 413090 818411 858814 469513 369190 890204 1470334 1669354 1845656
38361 1845656 2304772 2561033 2147436 1548065 1528195 1942350 2006529 1520631 1050604 962634
38351 962634 972067 750244 441610 382237 628159 930493 1025282 883003 731405 784394
38341 784394 940507 931599 789986 855914 1208103 1450507 1276112 892248 627935 471238
38331 471238 305534 253687 409761 540805 475477 520717 1038968 1819571 2325497 2408190
38321 2408190 2350843 2356173 2430288 2647279 3092616 3653567 4284109 5314093 6955226 8563194
38311 8563194 8990334 7814523 5795058 4002841 2891637 2323570 2058927 1942755 1862866
38302 1862866 1786293 1768515 1850899 2035982 2338518 2707479 2942106 2872594 2579096 2245773
38292 2245773 1881309 1408801 934581 651421 545756 482989 498280 673095 798927 571365
38282 571365 132690 2428 357464 755887 754085 488191 412959 677530 1016155 1194799
38272 1194799 1387439 2039617 3323291 4742530 5460904 5148956 4318844 3634951 3154706
38263 3154706 2586392 2027804 1882148 2099288 2110398 1664845 1213678 1213448 1473431 1501250
38253 1501250 1177084 764849 473637 296600 147027 -52231 -298373 -423565 -271897
38244 -271897 -29545 -69973 -337914 -281565 332432 941542 957075 683177 883363 1593237
38234 1593237 2039947 1807797 1412915 1406253 1460103 889806 -197656 -879391 -549016 400245
38224 400245 1159767 1397602 1338531 1236709 1108839 914112 717792 636050 763440 1140522
38214 1140522 1650246 1984561 1901261 1518399 1177343 1014383 884052 739467 816093 1276205
38204 1276205 1865589 2134348 1912697 1417420 971221 761240 799928 968471 1125798 1278176
38194 1278176 1588635 2116302 2619938 2765072 2502224 2117611 1923930 2015021 2311983 2704166
38184 2704166 3079682 3312840 3336171 3241865 3264049 3613322 4292161 5053391 5578933 5796952
38174 5796952 6056843 6853561 8237763 9652047 10650338 11650947 13429222 15809415 17634944
38165 17634944 18439128 19302864 21322618 24135838 27125091 31164787 37466862 45572330
38157 45572330 55019999 68352580 88299882 110518609 123300586 118297464 99620008
38150 99620008 79062268 64117769 54282986 47170876 42789868 41418731 42023372 44273607
38142 44273607 48836662 55230710 63354366 77137246 100392795 126528803 138889615
38135 138889615 127027480 99049336 72550437 56315359 46543218 38048381 31119009
38128 31119009 26979654 23781435 19955010 16890972 15683663 14723862 12721593 11033792
38120 11033792 10893489 11046251 10147522 9056508 8793691 8467489 7192554 6046473 6158705
38111 6158705 6620149 6168324 5374715 5383511 5914003 6186615 6494527 7281275 7914993 7825085
38101 7825085 7608868 7687854 7221576 5711643 4299641 4057039 4317002 4077834 3679961
38092 3679961 3676485 3465430 2569554 1912294 2263198 2728630 2332265 1752904 1900025 2135964
38082 2135964 1617649 1081627 1517454 2310431 2477922 2509851 3172444 3743808 3332704 2717184
38072 2717184 2921398 3206129 2527836 1762673 2265653 3333281 3393174 2719763 2643982 2985402
38062 2985402 2647325 1955806 2033587 2568739 2522852 2330787 3076005 4219320 4497603 4327548
38052 4327548 4930991 5864864 5889302 5475646 5888287 6613592 6389708 5938902 6825767 8412653
38042 8412653 8938484 8851855 9943201 11876993 12826086 12875480 13467953 14202692 13715246
38033 13715246 12998584 14110797 16319852 17442889 18140053 20632718 24200885 26755054
38025 26755054 29785532 36259002 44608577 51074720 57191965 67862071 82710917 97689932
38017 97689932 114845420 140532009 174134278 211975842 264209144 348283187 453098819
38010 453098819 525903674 516581827 431298599 325496836 246119430 197334093 161424023
38003 161424023 130691846 108285649 93115086 79495947 66694864 58050111 52998741
37996 52998741 47672219 41564551 37284011 34960650 32198621 28734025 26639331 26319079
37988 26319079 25954331 24712307 23607718 23347908 23646857 24568932 26765902 30336696 34488658
37979 34488658 38458296 42955280 51127566 66345636 86207922 99997125 96955879 78249359
37971 78249359 56611062 42632576 35640383 29893879 24241776 21148027 20201974 18436996
37963 18436996 15546770 13860390 13761553 13262554 11826014 10940780 10942782 10512621 9425978
37954 9425978 8898159 9041663 8618818 7500011 6937959 7199119 7165689 6489306 6061080
37945 6061080 6178880 6204113 6138842 6633494 7359266 7284699 6674797 6922009 8212552 9188175
37935 9188175 9162018 8931243 9127848 9430473 9716431 10446527 11618063 12747629 14021796
37926 14021796 16001046 18133390 19180408 19282540 19972406 21895348 24138642 26129133
37918 26129133 28554953 31954280 35915498 40118733 44621406 48571648 50184696 48753458
37910 48753458 45430551 41429512 36772347 31458305 26481888 22752661 20033664 17741181
37902 17741181 15849528 14313397 12583971 10479622 8703019 7793775 7340609 6835438
37894 6835438 6491929 6593777 6823998 6871972 6957630 7149537 6916198 5995705 5019664 4633760
37884 4633760 4612726 4423649 4057204 3736975 3383735 2912529 2546779 2397856 2267312 2196831
37874 2196831 2548943 3203007 3453659 3132244 2990757 3455574 3887408 3746779 3636147
37865 3636147 4367717 5748314 7179296 8764623 10767759 12467842 12711544 11448702
37857 11448702 9773221 8517100 7640780 6958064 6583602 6473011 6193875 5458443 4506857
37848 4506857 3766993 3384492 3199543 3010448 2781506 2642362 2665121 2698497 2602211 2564959
37838 2564959 2846881 3236551 3227904 2799782 2494289 2567429 2617825 2304344 1882127 1700800
37828 1700800 1677098 1624526 1637492 1783957 1865761 1830757 1948661 2231413 2221287 1772787
37818 1772787 1462763 1687296 1913911 1495884 753258 478158 696150 721297 282608 -151833
37808 -151833 -145300 236131 724358 1089515 1082678 627470 91982 -35552 270274 671392
37798 671392 1058003 1609145 2289371 2711620 2574571 1958171 1183387 611813 506769 825273
37788 825273 1208765 1387082 1449892 1509283 1355141 802705 160989 -92935 11747 35949
37778 35949 -152184 -192927 201924 863615 1398717 1531106 1223510 763426 723896 1487165
37768 1487165 2700609 3474985 3271857 2438883 1764545 1632868 1737839 1576855 1090419
37759 1090419 715445 830384 1329345 1861872 2283779 2600581 2650311 2276547 1763030 1620309
37749 1620309 1905752 2231390 2473587 2869628 3274757 3047085 2055276 1156532 1127795 1616391
37739 1616391 1741474 1344599 1014898 1137025 1519367 1824894 1882312 1700473 1555622 1846240
37729 1846240 2493530 2802791 2360613 1705168 1556208 1739665 1557504 948679 497969
37720 497969 409349 263838 -164012 -562189 -671869 -604529 -436314 -56031 425186 642950
37710 642950 550647 555469 879360 1188861 1074648 578609 70612 -135552 66749 560633
37700 560633 1064606 1403610 1687774 2006148 2106011 1742971 1200659 991425 1125842 1196304
37690 1196304 1141367 1335634 1857457 2274429 2341122 2351856 2525908 2530997 1986663 1107204
37680 1107204 478412 368861 514089 474559 77019 -400211 -476086 -53620 343177 196542
37670 196542 -272207 -416886 -129638 59010 -107223 -206465 110233 496797 423430 -56995
37660 -56995 -454625 -531009 -481589 -535094 -643923 -562972 -121584 556555 1114292 1340075
37650 1340075 1409203 1580442 1795884 1861430 1865836 2015265 2157148 1954442 1497062 1207710
37640 1207710 1118126 828637 307130 119707 628308 1502347 2289472 2925648 3363040 3262145
37630 3262145 2523333 1687474 1318238 1322002 1323603 1364658 1709385 2226138 2518253 2527276 2503789
37619 2503789 2466733 2174392 1628471 1182764 1079525 1191708 1298832 1375929 1526492 1787835
37609 1787835 2084150 2336226 2612877 3109592 3829438 4360013 4281929 3821800 3691075 4119595
37599 4119595 4482556 4182457 3504453 3171707 3339166 3525538 3413113 3242813 3407540
37590 3407540 4008624 4862234 5695089 6293323 6613395 6743469 6693058 6349281 5712083 4953682
37580 4953682 4147795 3263763 2608046 2839044 4152758 5821423 7063493 8083055 9574939
37571 9574939 11320215 12073542 11078930 9077661 7415294 6560977 5955219 5060527 4029828
37562 4029828 3305379 2969300 2731227 2396131 2093509 2026810 2179593 2375114 2503524 2540761
37552 2540761 2434574 2172125 1912687 1821856 1783713 1529312 1067327 707426 607111 599385
37542 599385 552291 567625 693760 785443 817235 975630 1228201 1188037 693741 146806
37532 146806 -74040 -154637 -370323 -434614 102338 1021880 1606979 1570374 1276971 1074913
37522 1074913 932050 770486 666252 613122 495422 380471 466061 692987 815644 904191
37512 904191 1303534 1967295 2339927 2164788 1955590 2279260 2910049 3167184 2915291 2729487
37502 2729487 3046326 3589519 3848602 3854064 4163765 5147709 6600403 8159973 9801099
37493 9801099 11573101 12988667 13172376 11808591 9612959 7616744 6229220 5238470
37485 5238470 4429543 3792690 3274408 2748958 2232172 1827282 1501375 1187817 1017059
37476 1017059 1119580 1281464 1172170 882650 845892 1217253 1744055 2292937 3036898 3941313
37466 3941313 4497425 4282237 3507800 2707043 2071874 1417674 682359 110392 -109535
37457 -109535 -139354 -266595 -479292 -444960 28053 639511 883057 652233 342653 306455
37447 306455 460676 566216 617930 712767 756017 617197 443435 504779 809194 1143419
37437 1143419 1396649 1561513 1535768 1272940 1064151 1299292 1933788 2506061 2707264 2660406
37427 2660406 2632526 2739280 2937956 3069632 2930784 2531407 2205704 2206129 2296098 2061838
37417 2061838 1526777 1096898 973194 1005837 1091086 1315721 1689142 2061125 2302308 2306558
37407 2306558 1945153 1341526 985701 1147500 1401711 1263246 1045722 1391976 2112494
37398 2112494 2325414 1775145 1177906 1105306 1322159 1466909 1622096 1884484 2047384 2056441
37388 2056441 2202307 2599195 3051067 3600793 4536469 5725828 6738578 7719383 9160591
37379 9160591 10785563 12111405 14413569 20068042 28574428 34975036 34437716 27696613
37371 27696613 19980381 15050324 12405381 10154574 8061695 6808056 6181748 5481974
37363 5481974 4742011 4367289 4180714 3758948 3231286 2959508 2832278 2565271 2327420
37354 2327420 2401260 2518042 2172159 1402456 698056 277702 -16408 -211260 -103912 303095
37344 303095 659129 652548 318142 -77497 -299529 -281358 -95432 201756 665842 1294792
37334 1294792 1820294 1903969 1551519 1073584 618323 67425 -534387 -830336 -626964 -203776
37324 -203776 77631 206228 336505 435118 399486 346428 495211 851968 1210298 1371362
37314 1371362 1215643 706209 18762 -440096 -350079 213391 887901 1364171 1525877 1368633
37304 1368633 954669 461904 189625 418509 1142370 1906609 2105975 1616460 978353
37295 978353 748167 859014 905560 835213 919601 1187481 1397347 1501076 1585894 1403326
37285 1403326 617960 -406689 -801162 -398059 -39626 -341238 -843165 -851088 -451342 -89239
37275 -89239 273909 853513 1340292 1298116 973268 934001 1104766 937475 434576 222901
37265 222901 615075 1330871 2178756 3236584 4203731 4357605 3510841 2410631 1812887
37256 1812887 1663151 1556672 1497070 1694989 1971048 1914948 1501564 1115303 1020009 1133329
37246 1133329 1278506 1367218 1335932 1140416 865123 705565 797839 1094070 1378615 1421264
37236 1421264 1216340 1052846 1188123 1461092 1450093 1045115 602387 447477 506301 568743
37226 568743 621844 701602 693259 586384 706561 1301504 1997523 2080546 1355795 381040
37216 381040 -255398 -572448 -921906 -1329536 -1431804 -1036654 -477672 -281963 -597891 -1088554
37206 -1088554 -1357811 -1328900 -1156134 -933065 -672572 -497389 -590724 -892303 -1066773 -925674
37196 -925674 -720670 -824888 -1226270 -1557360 -1583817 -1420831 -1229586 -946020 -466642 56454
37186 56454 325717 265451 80706 -79190 -314109 -700274 -987860 -828037 -291343 105618
37176 105618 12659 -318447 -395272 -114016 239803 520673 888593 1374041 1627969 1357380
37166 1357380 811877 531937 655444 742589 364003 -316901 -692061 -398749 249190 585128
37156 585128 331742 -80332 -36164 488777 882314 668978 94026 -253594 -233416 -273271
37146 -273271 -713415 -1321096 -1588750 -1338556 -862888 -543574 -493396 -577965 -659577 -717833
37136 -717833 -740072 -600695 -180313 377094 676585 482490 39260 -199700 -144675 -154004
37126 -154004 -480871 -855012 -793725 -202350 535990 1006499 1092091 876987 468801 28165
37116 28165 -199249 -76775 221872 344131 127523 -230092 -393976 -228876 129507 486382
37106 486382 767565 958435 976290 749451 412732 260081 423968 721471 909965 964175
37096 964175 964484 856785 553784 190866 5257 -20016 -99754 -220508 -119238 209576
37086 209576 358795 79231 -327610 -470943 -409392 -368757 -231736 186637 564866 395832
37076 395832 -154442 -344770 68896 470990 344053 22625 105956 576934 971079 1085302
37066 1085302 1033509 856075 590690 563616 1070709 1808217 2097442 1694451 974234 327492
37056 327492 -170806 -452282 -315394 206098 706648 856225 715343 471722 179982 -74138
37046 -74138 -84434 170597 412421 477277 566324 840285 1077347 1065707 1041038 1281245 1463804
37035 1463804 983759 -79911 -835045 -599328 308981 1018320 1070459 707916 405566
37026 405566 405266 654104 958780 1139584 1139136 1037967 957705 969448 1098927 1346979 1652272
37015 1652272 1896994 2042548 2252925 2787165 3685294 4564337 4830219 4220142 3146334
37006 3146334 2378110 2307442 2614231 2721016 2438505 2013282 1672589 1388100 1076527 765007
36996 765007 482787 216434 71020 238280 642863 851308 588348 180947 173721 579124
36986 579124 860488 686809 344558 247719 353872 342213 173537 132286 352916 618448
36976 618448 717899 777538 1067231 1566507 1884076 1653037 964390 348730 268218 631611
36966 631611 908875 758858 400957 257871 393904 528957 502944 422993 356548 213290
36956 213290 35908 87683 438187 711609 527381 45481 -200803 59612 596750 1007852
36946 1007852 1066193 809591 508422 491114 776404 947932 653747 159444 78630 575522
36936 575522 1202887 1559695 1680016 1641195 1270246 568977 47066 169053 670517 876153
36926 876153 592685 235094 95017 -27658 -336111 -611878 -548159 -222112 74437 309200
36916 309200 688726 1200758 1479406 1245142 728895 518904 997749 1971501 2829155 3034822
36906 3034822 2498788 1557625 669630 123926 -54399 -26134 13897 -25042 -89300 -71546
36896 -71546 59903 232728 360654 435406 522554 676767 865298 982502 958768 854127
36886 854127 816474 939824 1181295 1402606 1460557 1300581 1048997 976229 1215615 1501448
36876 1501448 1377516 762015 119098 -89598 56021 177256 211676 410838 744392 742219
36866 742219 131580 -685244 -1083855 -958711 -703532 -572296 -423517 -118607 174944 242526
36856 242526 149139 93737 72222 -89541 -413208 -684852 -718921 -547831 -300056 -28843
36846 -28843 250206 463473 563647 678891 1032309 1644695 2178988 2172238 1465998 402789
36836 402789 -431813 -685448 -461120 -88400 234624 498094 684525 734452 739220 927929
36826 927929 1299708 1462065 1095682 470423 174490 331115 433048 78060 -456109 -616630
36816 -616630 -321342 14893 77132 -59645 -219685 -385869 -581719 -734613 -777057 -706551
36806 -706551 -444879 155967 994859 1587907 1521928 982402 558724 499117 435862 -18635
36796 -18635 -662002 -963670 -796789 -545456 -456460 -273835 250317 784294 761074 200513
36786 200513 -239374 -120434 229865 237583 -124067 -345725 -44900 656103 1351054 1700735
36776 1700735 1584020 1140484 717553 610028 795452 1027247 1167658 1269229 1340546 1258564
36766 1258564 999625 765562 735241 817371 802501 669895 574028 573613 563243 495588 486495
36755 486495 597029 658156 494038 251056 265580 559993 724278 474040 110078 121266
36745 121266 453665 576017 290637 24598 110360 199207 -214263 -955448 -1342716 -1106813
36735 -1106813 -673054 -494541 -531759 -534127 -476694 -479332 -514826 -434180 -186367 126759 340524
36724 340524 317742 74020 -147102 -91405 153078 201771 -148888 -678067 -1066809 -1256327
36714 -1256327 -1339394 -1297840 -1055085 -668280 -283929 15020 182806 144348 -91639 -350287
36704 -350287 -470145 -478162 -456402 -349793 -69934 303476 593527 728119 729480 597669
36694 597669 365920 173004 91782 -32134 -365712 -776519 -958988 -844232 -657309 -555996
36684 -555996 -434815 -156507 190970 363438 204704 -210700 -603682 -664322 -301364 257477
36674 257477 661403 712354 430526 -28559 -420842 -518458 -352385 -267219 -544761 -1035251
36664 -1035251 -1348021 -1334019 -1158848 -961245 -712855 -426197 -242972 -248648 -381179 -546670
36654 -546670 -647369 -516981 -64675 509909 888700 1027726 1113115 1140660 905811 486169
36644 486169 321193 599086 913719 811590 401545 112918 71342 48366 -118461 -370133
36634 -370133 -587663 -644306 -420709 -36496 85980 -278588 -717992 -629822 -52482 365610
36624 365610 243906 -108789 -250540 -167295 -79923 -53119 -68436 -196470 -372919 -223896
36614 -223896 493053 1355473 1573713 897714 -46827 -445531 -127340 417945 702812 729629
36604 729629 828225 1156239 1467429 1385024 847163 206863 -124158 -61014 168454 342303
36594 342303 435348 508949 538055 412864 59312 -487049 -1085361 -1530510 -1643392 -1389784
36584 -1389784 -895229 -301112 346190 982455 1362359 1196448 519417 -242314 -720258
36575 -720258 -1004032 -1387317 -1793659 -1768659 -1130714 -336086 36223 -22868 -67094 87783
36565 87783 108374 -321159 -995229 -1401880 -1280843 -793675 -258990 81421 99698 -177536
36555 -177536 -516896 -640790 -532365 -452998 -553740 -595366 -242546 404018 801099 585584
36545 585584 35148 -257702 -66303 321982 583375 705892 791589 798383 702197 722360
36535 722360 1066500 1499457 1492118 890523 192342 10363 422091 987288 1263032 1137081
36525 1137081 770688 420780 283858 337070 327445 47024 -395277 -702326 -753388 -673003
36515 -673003 -554644 -336572 -11642 256792 359688 412947 547790 673355 628600 451062
36505 451062 288250 145994 -21041 -42183 310966 854380 1017459 512492 -266034 -709479
36495 -709479 -665350 -428159 -248710 -138311 -62307 -25081 45467 266616 619252 954021
36485 954021 1167338 1228890 1104729 847890 684638 762816 886409 797239 648219 796984
36475 796984 1129848 1084694 502059 -34063 4465 373655 511655 338935 150750 12307
36465 12307 -197238 -323244 -105955 234143 151578 -408979 -855536 -748570 -327872 -76872
36455 -76872 -151901 -437440 -818353 -1170602 -1350946 -1380526 -1398954 -1330513 -923477 -262819
36445 -262819 138396 -9749 -384192 -568492 -600879 -690396 -753246 -640861 -521436 -572230
36435 -572230 -545925 -150326 339792 407488 106401 -38533 109161 170221 40495 144448
36425 144448 663557 1097785 961032 467385 131405 44621 -23960 -80339 69155 364739
36415 364739 486537 313067 111229 244641 832077 1617883 2063790 1753851 912290 329446
36405 329446 506218 1038893 1161864 744692 359031 433518 783913 1028974 1061066 965922
36395 965922 821673 758870 931480 1230054 1275926 914250 483273 354438 423162 359814
36385 359814 196504 275272 639707 858441 574055 -36324 -501044 -574885 -375331 -141481
36375 -141481 -27640 -70993 -215213 -360701 -450351 -484153 -440572 -285625 -106990 -91056
36365 -91056 -237436 -230787 192926 817115 1122518 903300 470966 194613 92150 -198
36355 -198 -105481 -168104 -242049 -350583 -297752 71600 500846 553100 215448 -75451 -74049
36344 -74049 -23377 -155480 -261226 -47102 354838 590440 621041 678050 777522 692675 430958
36333 430958 345502 631452 1009121 1087466 829710 491756 280184 244601 355754 497654
36323 497654 479153 225086 -107274 -329307 -450664 -574574 -668958 -618485 -430518 -196171
36313 -196171 106289 554366 1027358 1230837 1051329 728687 585548 688427 837156 797430
36303 797430 507034 157733 99626 524994 1188897 1580227 1440720 980351 530939 205251
36293 205251 27636 129951 513436 785844 531071 -82021 -444135 -316310 -100189 -141131
36283 -141131 -172787 210261 828343 1109650 872170 468995 185540 -48772 -255170 -165044
36273 -165044 348522 908698 1025680 677554 224999 -97990 -290289 -286216 48219 552801
36263 552801 749850 382546 -229273 -583023 -613518 -690062 -1046282 -1463525 -1593566 -1396953
36253 -1396953 -1094340 -795514 -413122 35921 286241 151112 -146018 -189180 131624 571054
36243 571054 977930 1517065 2313512 3095368 3404879 3077102 2363129 1668524 1296523 1323418
36233 1323418 1539495 1587273 1336424 1065615 1113720 1427102 1631793 1479321 1036887 545373
36223 545373 330346 722321 1687095 2547108 2490351 1499511 450313 124293 418588 710330
36213 710330 684604 518279 477624 656885 990274 1249916 1129189 574815 -44526 -318075
36203 -318075 -250742 -141804 -149940 -249123 -490618 -958202 -1486138 -1753990 -1699727 -1553748
36193 -1553748 -1430775 -1196013 -815533 -525776 -497724 -591960 -637419 -734546 -1043933 -1411869
36183 -1411869 -1460214 -1029649 -365495 149045 352066 398986 555792 895054 1207791 1267806
36173 1267806 1133384 1047935 1061410 952079 576824 92347 -283049 -540881 -767374 -925091
36163 -925091 -943221 -905641 -934630 -955036 -792135 -492710 -349400 -559280 -991917 -1337303
36153 -1337303 -1380521 -1103408 -633328 -179151 31688 -137439 -607444 -1066904 -1177713 -901541
36143 -901541 -577159 -543878 -727951 -789181 -651775 -595123 -729775 -726341 -321105 181238
36133 181238 269520 -71607 -409167 -519049 -560516 -584392 -335422 277769 893685 1141552
36123 1141552 1109358 1095257 1092111 830872 258996 -286035 -390126 77556 853372 1407422
36113 1407422 1306674 654255 110333 275496 1052233 1751741 1799795 1202707 378749 -274768
36103 -274768 -638199 -855205 -1101421 -1302743 -1165170 -619686 -105477 -129311 -572211 -762433
36093 -762433 -329641 313652 520164 189129 -246980 -450103 -494822 -593010 -752033 -778177
36083 -778177 -505258 15427 506838 693745 601549 539120 693844 879376 849089 709522
36073 709522 742075 889931 784623 343244 -20483 35633 304610 384310 270036 252400
36063 252400 368061 348083 101417 -131406 -197369 -260532 -441161 -524077 -286099 94558
36053 94558 256319 164496 101335 196893 275776 194104 39893 -87867 -242131 -439416 -537222
36042 -537222 -476907 -468083 -726698 -1154090 -1464760 -1516078 -1323953 -900795 -344712 21802
36032 21802 -63109 -399494 -541909 -433425 -459733 -792648 -1086021 -1021754 -772140 -618419
36022 -618419 -447567 -20478 521338 864820 1040358 1223663 1177956 528175 -397673 -697830
36012 -697830 -103714 571920 589470 335300 654601 1525897 2101379 1927813 1436068 1134743
36002 1134743 911184 390526 -413079 -1103482 -1343359 -1075681 -464037 224331 780891
35993 780891 1177536 1413973 1275728 518954 -630737 -1466189 -1479065 -856151 -142207 371288
35983 371288 723061 968176 1078866 1067319 970634 768909 498839 362059 523529 877537
35973 877537 1208089 1495801 1837622 2123142 2052316 1498284 668748 -86730 -470651 -323609
35963 -323609 223713 721057 822929 761921 1071551 1759435 2129018 1645351 670003 11995
35953 11995 -60350 -2437 -271962 -787815 -1155033 -1126587 -708166 -28929 687079 1124905
35943 1124905 1074593 668416 308295 280827 484311 597820 486313 331817 341857 466369
35933 466369 524155 504958 544121 623311 535911 224366 -59644 -69803 117184 247178 218338
35922 218338 108146 -1935 -46573 68138 328610 532080 562545 642506 1020713 1478196
35912 1478196 1515114 1070885 672248 701613 860670 623786 -30215 -652537 -934147 -961433
35902 -961433 -925590 -867243 -733752 -495104 -177881 108371 240354 290744 526051 999438
35892 999438 1311986 1086423 562793 333468 517416 643321 429198 194832 261677 374046
35882 374046 100607 -475539 -889171 -948324 -849697 -729971 -508583 -181662 89077 251465
35872 251465 442509 721671 967168 1093348 1133983 1061919 789181 430515 300614 510498
35862 510498 785416 823162 631433 375629 116799 -114894 -192554 -71022 58273 26508
35852 26508 -22205 153105 483579 672955 624893 479861 218672 -423539 -1484751 -2473223
35842 -2473223 -2794720 -2386038 -1702886 -1121110 -602541 -32701 358695 193491 -484888
35833 -484888 -1136866 -1345554 -1274242 -1293749 -1356565 -1090414 -446393 143927 337285 253400
35823 253400 143435 30484 -98502 -65293 213770 444657 304911 -82583 -360971 -482014
35813 -482014 -667278 -926796 -1018732 -859988 -589766 -234131 276216 723912 715790 325916
35803 325916 171869 587586 1111145 1139528 782151 644470 943923 1278069 1240266 899691
35793 899691 607658 584037 772581 933569 828474 440066 23068 -180464 -254032 -484545
35783 -484545 -935663 -1322430 -1362836 -1101200 -795308 -605863 -522969 -521623 -613697 -716053
35773 -716053 -629103 -290148 24907 -53188 -519630 -972990 -1136104 -1159053 -1222137 -1102487
35763 -1102487 -500268 349143 841455 778093 520996 310606 -44040 -568352 -748172 -200189
35753 -200189 639420 993700 689076 153931 -308032 -681102 -802568 -428858 178530 343684
35743 343684 -117744 -590979 -548079 -278494 -349184 -717581 -874684 -648986 -356779 -230398
35733 -230398 -177633 -143383 -270058 -552667 -692117 -511216 -255665 -227318 -299381 -89127
35723 -89127 456663 936079 999126 768465 652246 872023 1286440 1596093 1605204 1315062
35713 1315062 863068 394488 -22848 -339481 -414356 -109059 437566 794640 685077 348319
35703 348319 228693 356686 336242 -11047 -318866 -179165 282205 600984 597299 518410
35693 518410 616248 850700 1038175 1084956 1008701 870863 751990 708975 720426 717395 645300
35682 645300 450323 90350 -332086 -533263 -312206 171400 528984 546522 339708 143035
35672 143035 93100 208706 430649 650398 796391 891471 954516 913073 729834 529561
35662 529561 435291 352981 116874 -207445 -389744 -377421 -342254 -401694 -536608 -775695
35652 -775695 -1174593 -1571948 -1669806 -1461640 -1304494 -1428298 -1627811 -1607697 -1403589 -1264367
35642 -1264367 -1296914 -1412726 -1466753 -1278177 -687598 197240 946706 1212875 1102030 977469
35632 977469 997417 1027501 913800 649931 335085 130683 197081 523271 881157 1074667
35622 1074667 1140279 1170381 1082876 778576 420339 293631 415716 527769 495416 484161
35612 484161 647738 819444 667103 114241 -496054 -705902 -416559 -12930 52984 -233783
35602 -233783 -483408 -410062 -121625 117482 182502 70468 -163677 -317447 -136759 314794
35592 314794 619215 540434 339823 308664 284851 1241 -350532 -387211 -206866 -266171
35582 -266171 -633532 -892733 -824828 -667265 -597935 -488169 -350820 -511178 -1030887 -1411034
35572 -1411034 -1246076 -818115 -638846 -701497 -642881 -428673 -365086 -506073 -544796 -357004
35562 -357004 -240657 -460984 -850455 -1040901 -908167 -632403 -443628 -446543 -625588 -897415
35552 -897415 -1152519 -1301274 -1313198 -1228812 -1118201 -981826 -715506 -276023 124342 157247
35542 157247 -216130 -641799 -783977 -673364 -501821 -263281 154264 652655 1008872 1235367
35532 1235367 1534999 1854298 1802848 1180693 355942 -97069 -14236 291174 494814 587686
35522 587686 730149 961448 1169511 1294177 1439829 1723862 2054459 2159886 1881205 1363013
35512 1363013 884200 559497 300735 25792 -216389 -324849 -249318 -16198 257697 400341
35502 400341 351188 275681 371010 563159 576384 338154 110200 117892 245545 260961 177719
35491 177719 174451 255402 242632 85933 -61662 -128175 -275266 -653074 -1129003 -1378699
35481 -1378699 -1201544 -700933 -212562 -69779 -336550 -719810 -823187 -525638 -40850
35472 -40850 382307 668008 807347 765435 618535 586591 731482 767754 410043 -185155
35462 -185155 -584328 -639863 -617084 -754956 -982509 -1136983 -1185188 -1094193 -728283 -75601
35452 -75601 582415 920320 884621 622858 235944 -225332 -639446 -891691 -993713 -947309
35442 -947309 -598555 116425 820418 888769 108981 -1020963 -1768103 -1850052 -1573845 -1373641
35432 -1373641 -1323272 -1142928 -652659 -104344 71468 -186302 -482318 -477763 -251293 -19953
35422 -19953 219466 498677 554582 95684 -671491 -1152877 -1034537 -555354 -110626 119018
35412 119018 134792 44184 74318 353751 629610 528915 148266 -16781 161666 211488
35402 211488 -171251 -584922 -536510 -216466 -167663 -415019 -457909 -60091 429495 584731
35392 584731 369018 53523 -31299 334655 1005814 1358066 796644 -495604 -1610968
35383 -1610968 -1865593 -1450580 -998326 -778360 -585936 -261163 11582 -35273 -392020 -784501
35373 -784501 -977792 -964432 -847417 -653065 -378045 -153492 -142584 -231123 -68648 433994
35363 433994 889329 954394 848861 1009931 1377515 1453803 1056971 575326 376122 366044
35353 366044 307187 196399 92993 -98130 -365279 -382748 72642 681467 938413 830516
35343 830516 751558 788012 560328 -101256 -748032 -865436 -562783 -378752 -548201 -817544
35333 -817544 -955322 -1072344 -1301888 -1454640 -1242524 -698441 -117974 353139 822345 1344892
35323 1344892 1762818 1906566 1740831 1250427 445017 -389765 -735883 -402370 162580
35314 162580 421206 442499 683498 1183241 1436797 1132126 579837 225678 89689 -54384
35304 -54384 -212571 -189841 70988 428257 726079 845940 701170 398314 280860 554252
35294 554252 954650 1074110 957967 1031486 1385824 1513016 976569 84517 -427863 -285532
35284 -285532 78625 178754 54151 24576 132560 164760 146274 421431 1114837 1824889
35274 1824889 2088011 1912478 1562100 1029826 160818 -793018 -1272461 -1178020 -1046613 -1214971
35264 -1214971 -1259318 -672050 246759 705537 485437 166648 285828 728548 1055855 1032965
35254 1032965 672414 94789 -432805 -571547 -253127 212435 520035 664133 702347 492980
35244 492980 -44995 -593105 -707665 -387803 -66190 -22288 -68681 133334 667350 1314033
35234 1314033 1704247 1504162 717632 -114155 -304691 211079 740276 658844 127791 -277517
35224 -277517 -383759 -436126 -456015 -148975 461744 845001 685528 389169 485962 821482
35214 821482 802660 309198 -122446 -53837 328591 579671 578659 548305 676486 908140
35204 908140 1045712 962069 754427 680305 844352 1002677 861591 528944 398184 554313
35194 554313 619812 336464 -15750 -47774 128141 74753 -281840 -511550 -278619 216115
35184 216115 529221 506305 332519 163574 -55928 -356144 -518068 -293149 187893 473179
35174 473179 369869 234905 438660 717754 459421 -391052 -1156461 -1311358 -1127684 -1156978
35164 -1156978 -1414969 -1486929 -1229728 -907099 -691539 -478575 -252849 -233098 -472146 -609881
35154 -609881 -279899 375594 816161 697121 217461 -124527 -35874 334714 618617 620340
35144 620340 446211 287395 196098 108097 -34263 -255334 -543892 -808261 -938661 -978923
35134 -978923 -1103311 -1342488 -1491697 -1399951 -1176129 -971412 -746251 -425649 -94527 157250
35124 157250 384194 575422 557948 391582 553695 1297444 2072582 2127418 1537687 1031138
35114 1031138 858865 549386 -110526 -589964 -439959 8227 220217 260772 516068 954095
35104 954095 1181224 1042270 719294 373483 82119 14529 295890 755442 1099216 1245811
35094 1245811 1248934 1052996 627581 192543 -7045 -5550 103348 466981 1134660 1615960
35084 1615960 1332903 484776 -64239 178512 880594 1535996 2061915 2565743 2973365
35075 2973365 3155704 3100247 2756075 2040278 1183201 680470 643020 576394 129390 -320897
35065 -320897 -267908 64160 18807 -502664 -949229 -1011652 -1019012 -1281500 -1540659 -1385202
35055 -1385202 -884828 -474042 -393280 -539285 -742975 -901621 -878034 -544700 2265 437093
35045 437093 498283 231299 -73029 -122119 176655 664578 1066501 1235452 1259460 1280051
35035 1280051 1258457 1030699 568284 46853 -352312 -558175 -495196 -51388 695257 1359155
35025 1359155 1562043 1331183 1023619 881900 835442 738921 610052 555278 604231 713406
35015 713406 838569 927412 927861 877678 905198 1060255 1202365 1127053 769583 259142 -169081
35004 -169081 -310373 -142934 123811 247169 205408 134720 43726 -177052 -420136 -336855
34994 -336855 169624 675043 710884 338075 -10294 -109728 -95362 -161371 -400541 -832314
34984 -832314 -1280358 -1334462 -806892 -158383 -46224 -443417 -644936 -210033 561733 1213098
34974 1213098 1680895 2016166 2034930 1643633 1165036 921256 755171 373821 -82939 -281509
34964 -281509 -304045 -491803 -781701 -765682 -438692 -331633 -739881 -1301330 -1574628 -1608276
34954 -1608276 -1615163 -1438526 -784179 171964 833732 872063 582194 475387 689490 904798
34944 904798 772410 336885 -5779 35696 325845 528277 550531 554645 567017 380674
34934 380674 -57156 -442444 -490567 -302303 -142655 -45236 108975 275323 313567 288113
34924 288113 384009 542201 490461 181117 -93709 -121897 -48879 -91427 -181424 -74262 313137
34913 313137 818625 1194978 1251678 958601 532600 314618 432888 678308 816639 884108
34903 884108 1015059 1129569 1054608 890383 950457 1278870 1491783 1246178 687099 261674
34893 261674 206488 390057 583107 685678 688397 597263 482088 479921 624051 705804 433918
34882 433918 -214686 -870338 -1093722 -840498 -527300 -570733 -909267 -1089013 -829115 -379806
34872 -379806 -240220 -603447 -1198418 -1643026 -1801177 -1747608 -1527369 -1110666 -572018 -167344
34862 -167344 -134155 -441585 -804804 -951628 -829025 -543880 -186853 193026 475576 493476
34852 493476 269507 122895 351009 799401 940517 479867 -264571 -730367 -730115 -505426
34842 -505426 -269789 -3942 278840 409301 371853 449767 803117 1132549 1106216 965680
34832 965680 1271165 2047902 2620932 2424187 1601475 639108 -203255 -809449 -926207 -431997
34822 -431997 282166 658643 650869 646745 749725 624475 172213 -131588 113641 584953
34812 584953 626742 119632 -413132 -505102 -209291 165229 467774 713022 864869 798403
34802 798403 443081 -116380 -661727 -951611 -885237 -599276 -342278 -212165 -83808 154343
34792 154343 388807 437022 368579 470011 806678 1000831 657793 -53119 -495792 -298925
34782 -298925 228647 529781 447519 261612 241001 414903 721368 1120147 1525576 1805790
34772 1805790 1873545 1658651 1059500 123494 -785351 -1270988 -1364899 -1435980 -1627542 -1692531
34762 -1692531 -1443403 -1011377 -530499 52006 619355 725779 180488 -469135 -485452 144139
34752 144139 747267 861220 678880 587965 672312 801976 897797 916112 786694 559127
34742 559127 480865 751452 1230043 1482234 1134160 214406 -791649 -1280214 -1051075 -494737
34732 -494737 -169735 -225451 -348281 -222799 110307 344319 221492 -230224 -668906 -700125
34722 -700125 -295486 119171 139131 -158687 -430612 -615801 -946091 -1427472 -1683515 -1452292
34712 -1452292 -958250 -597479 -449439 -315337 -125456 -72480 -309737 -655940 -717557 -331611
34702 -331611 189655 378798 156293 -135516 -262971 -371875 -580436 -642498 -336045 83163
34692 83163 218926 116256 58638 -16769 -340391 -666941 -473487 168885 591026 531268
34682 531268 480235 794747 1143658 1184787 1140033 1218913 1057007 324178 -571959 -1028426
34672 -1028426 -1128572 -1331072 -1585287 -1470065 -1027421 -730771 -679969 -507397 -109706 159029
34662 159029 117820 23084 88837 249038 500989 968168 1476446 1581633 1231695 934810
34652 934810 1015447 1131171 840576 300064 37010 241683 586440 628855 200591 -491753
34642 -491753 -1031710 -1169959 -1063360 -979968 -851323 -455368 2067 -16693 -585597 -1120359
34632 -1120359 -1211775 -1155812 -1310725 -1416773 -1075754 -550741 -455315 -793693 -925533 -503202
34622 -503202 101754 442532 605123 921905 1386195 1648100 1473287 995745 545818 337076
34612 337076 308551 235545 15305 -181450 -120988 154134 326006 187861 -77964 -111308
34602 -111308 171250 448311 375691 21670 -209414 -93615 141209 169022 36203 73212
34592 73212 417700 861036 1140979 1144796 836711 281771 -201901 -231682 151523 449332
34582 449332 326704 11079 -126132 -118862 -241520 -481389 -522963 -211739 239677 511020
34572 511020 454585 149965 -146488 -152028 157804 431197 263192 -366481 -1083183 -1503717
34562 -1503717 -1539596 -1390606 -1344996 -1508858 -1643616 -1390907 -764015 -252595 -271841 -655208
34552 -655208 -890582 -729729 -351500 -42114 50733 -60005 -192103 -94797 219038 355794
34542 355794 18052 -513937 -690373 -406052 -65182 30552 -16821 -45857 -98741 -204156
34532 -204156 -198472 64957 516740 963526 1180006 899399 39220 -947591 -1285305 -683684
34522 -683684 279620 810064 761469 640313 902030 1491716 2014756 2148521 1894103 1561209
34512 1561209 1491354 1697637 1805277 1427445 574146 -351481 -906582 -932671 -625816 -348073
34502 -348073 -302733 -357481 -250995 35989 241291 168370 -75927 -245315 -225391 -80707
34492 -80707 50520 49241 -93552 -237489 -238416 -131217 -45550 16684 121223 154771 -76707
34481 -76707 -464273 -627077 -446177 -259720 -348582 -525608 -480263 -266479 -141547 -121636
34471 -121636 -37950 90442 80838 -69832 -168874 -135384 -54040 71126 351245 762758 1085402
34460 1085402 1154427 1022546 837440 684951 565414 421092 202453 -11390 -28444 218587
34450 218587 544797 732417 752567 658232 456124 260070 320628 616049 653968 69291
34440 69291 -763310 -1163196 -1053457 -925024 -979219 -918267 -637143 -478363 -602451 -707100
34430 -707100 -651322 -772600 -1204651 -1434272 -1029437 -338758 78786 286970 597342 745423
34420 745423 239210 -658109 -1128729 -977821 -810254 -914849 -777987 -25736 846155 1147475
34410 1147475 892287 551805 302308 -5427 -414557 -848485 -1320298 -1771477 -1908498
34401 -1908498 -1584958 -1162532 -1105302 -1371587 -1579816 -1600979 -1560012 -1399878 -949284 -390405
34391 -390405 -168867 -373068 -611036 -573285 -338967 -63710 227729 424218 306869 -74302
34381 -74302 -344512 -317767 -262482 -461272 -792473 -956918 -862039 -575893 -148254 308826
34371 308826 591727 667291 752427 947549 1028814 803919 429430 173288 127472 348762
34361 348762 928962 1634392 1853778 1315272 534516 98955 -153920 -664489 -1161577 -927507
34351 -927507 10121 751718 747404 446245 458432 692244 703652 405944 917 -426784
34341 -426784 -832099 -1019321 -921272 -823485 -934717 -963994 -539246 120648 402915 128475
34331 128475 -219841 -160461 192389 314831 -99110 -775900 -1089201 -680777 120705 611183
34321 611183 467562 9988 -329274 -501240 -647106 -731855 -665546 -552344 -482677 -253285
34311 -253285 348930 1096700 1500197 1372934 943515 523421 365695 671224 1295273 1559209
34301 1559209 893823 -280565 -823652 -176536 1034210 1847029 1964935 1670074 1214392
34292 1214392 728527 448889 555134 858020 998995 919556 850629 886046 865305 702372
34282 702372 575960 707526 1099429 1544493 1792520 1710025 1397889 1147230 1150478 1259117
34272 1259117 1168112 841921 576097 571293 630864 437137 6207 -347234 -467307 -534829
34262 -534829 -704168 -796275 -580888 -231792 -180534 -488233 -672811 -320837 366764 861143
34252 861143 957068 866242 774323 624535 342456 -7076 -354931 -707378 -1033461 -1263665
34242 -1263665 -1444030 -1685219 -1898958 -1803743 -1290068 -585064 41739 526109 844007 842176
34232 842176 458651 -40742 -287082 -206417 -20337 70485 19071 -182422 -529806 -903082
34222 -903082 -1101672 -1036867 -803966 -545680 -309868 -46742 293655 642384 777038 489875
34212 489875 -150380 -783905 -1078439 -994236 -690286 -306984 39574 176751 -16081 -445985
34202 -445985 -892556 -1226067 -1415219 -1368706 -952376 -209417 547045 923687 724906 100960
34192 100960 -514040 -687342 -339203 198855 546906 641013 651309 645902 526781 269926
34182 269926 17750 -130684 -270946 -538919 -880421 -1049557 -821968 -215095 458198 787404
34172 787404 605316 129668 -301140 -591455 -878520 -1207867 -1414506 -1390465 -1299795 -1369002
34162 -1369002 -1523711 -1400238 -779126 73846 608805 558581 216369 59052 171845 235301
34152 235301 76848 -47350 116960 365948 331561 103959 165714 664659 1120157 1029221
34142 1029221 494653 21289 -126940 -118103 -218406 -524074 -977590 -1401307 -1498543 -1052542
34132 -1052542 -214651 564954 986901 1153587 1287782 1370077 1240001 942647 703744 549049
34122 549049 236251 -287306 -606538 -301144 433194 960686 1008269 951849 1183658 1530431
34112 1530431 1568593 1281214 1045735 1067745 1185090 1231364 1246963 1248209 1112898 862060
34102 862060 774761 977128 1125917 810502 164452 -257522 -214927 -62464 -178674 -415155
34092 -415155 -378102 -80594 38185 -246895 -606792 -600912 -226294 178313 403126 484993
34082 484993 467022 350430 261728 344968 446048 244628 -193020 -370670 -95927 114040
34072 114040 -265283 -935147 -1125151 -645176 -80341 68483 -52899 -78915 20495 57967
34062 57967 4468 -15048 73964 285899 612267 904846 871492 363661 -411013 -1055405
34052 -1055405 -1271508 -973715 -319526 298026 500747 286918 -13833 -194215 -355255
34043 -355255 -596105 -825817 -997716 -1199775 -1347778 -1154103 -644472 -326957 -501904 -744550
34033 -744550 -495971 118668 534905 563223 420940 147127 -382314 -924725 -1018690 -726327
34023 -726327 -593581 -723798 -536328 269541 1116417 1345305 1125019 1041500 1121232 854079
34013 854079 51365 -858682 -1415738 -1594903 -1597322 -1476705 -1131311 -546387 50302 293300
34003 293300 23574 -454122 -630938 -392327 -154437 -284916 -636402 -852832 -883069 -902188
33993 -902188 -934258 -907237 -947563 -1241680 -1652724 -1823182 -1662830 -1441573 -1396645 -1510233
33983 -1510233 -1643791 -1609552 -1161402 -261537 648357 1005433 791774 486775 329482 70962
33973 70962 -415442 -760116 -625136 -232860 -16303 -14437 17422 87327 -61064 -526528
33963 -526528 -1096875 -1489039 -1546419 -1275408 -866936 -585416 -476718 -315226 24015 356830
33953 356830 535499 709846 947085 910057 376701 -155553 28293 831866 1424907 1384229
33943 1384229 1132138 1073595 939576 368055 -360257 -654904 -384733 119576 593313 935493
33933 935493 961428 522390 -177737 -763548 -1160321 -1560335 -1966685 -2135480 -1993226 -1768138
33923 -1768138 -1625954 -1465682 -1181544 -879727 -703591 -620971 -499914 -277872 3231 225079
33913 225079 243493 16668 -356622 -845021 -1593023 -2571524 -3255731 -3066537 -2161844 -1378051
33903 -1378051 -1260350 -1530807 -1673962 -1614431 -1512202 -1283486 -791961 -296369 -216123 -508333
33893 -508333 -694115 -510413 -173364 37640 105181 94371 -32544 -268981 -468159 -550219
33883 -550219 -623889 -762223 -819925 -628907 -260044 53452 174621 126435 -35764 -295579
33873 -295579 -636688 -1002418 -1289389 -1373525 -1192726 -817281 -392816 -29903 188767 158428
33863 158428 -138332 -490078 -603647 -424661 -152301 80368 326966 567699 583103 255578
33853 255578 -197074 -488212 -610569 -711365 -767451 -652175 -440791 -351704 -382429 -281721
33843 -281721 51365 382538 468260 374937 330860 392279 406679 242410 -60447 -337128
33833 -337128 -436021 -364853 -348659 -653862 -1257222 -1743586 -1654312 -964393 -161423 179232
33823 179232 -97597 -623557 -894416 -751551 -451039 -272437 -191324 -43284 124288 110306
33813 110306 -52062 -61274 182838 338455 75522 -406073 -587839 -283096 195635 499708
33803 499708 594219 582881 447008 132408 -247601 -478716 -482857 -386585 -368544 -486861 -627990
33792 -627990 -607799 -378720 -145572 -189724 -549392 -960146 -1142820 -1061112 -876161 -773537
33782 -773537 -880255 -1201562 -1539944 -1598567 -1276135 -762581 -267158 190401 597499 761019
33772 761019 540153 134093 -137325 -257713 -419253 -557804 -362998 168586 554358 400767
33762 400767 -104438 -492305 -586511 -531916 -434312 -282993 -162826 -250092 -565414 -926542
33752 -926542 -1172490 -1285753 -1298114 -1234715 -1154139 -1088865 -943870 -620147 -250073 -115794
33742 -115794 -269321 -419017 -313416 -89310 -67858 -281680 -402912 -178726 207109 330214
33732 330214 50669 -290587 -283440 14913 110549 -324439 -1023338 -1411641 -1235664 -772933
33722 -772933 -459089 -438815 -492948 -323761 96282 433870 321737 -177337 -564654 -473226
33712 -473226 -82055 220530 404778 706148 1065147 1100373 732082 428945 600199 1034619
33702 1034619 1227227 1066554 898888 1017018 1361409 1685716 1779943 1533626 986382 362216
33692 362216 -80099 -276169 -373612 -530228 -749144 -885539 -779554 -433415 -63958 123692
33682 123692 207033 406902 658643 602958 133159 -348684 -453385 -306215 -226984 -179143
33672 -179143 49575 319943 302226 81808 68613 279522 257093 -168796 -578854 -663219
33662 -663219 -715823 -1072416 -1480935 -1488951 -1160979 -923502 -886234 -813388 -675197 -718274 -945280
33651 -945280 -979265 -606224 -120269 68976 -44440 -114959 116407 567676 918569 907162
33641 907162 611437 447403 753925 1357464 1708987 1511701 1057824 845289 988468 1150959
33631 1150959 1015806 685609 554879 819263 1211703 1328744 1161306 1072784 1191250 1145193
33621 1145193 676484 237090 489787 1297719 1769500 1430939 811664 573660 548959 140483
33611 140483 -635467 -1115407 -927816 -418426 -64699 61797 86796 323 -211101 -400227
33601 -400227 -502778 -715006 -1142622 -1467933 -1310447 -816391 -524426 -639265 -780573 -555821
33591 -555821 -96248 159293 27112 -272773 -429355 -325980 -55135 211670 361271 405793
33581 405793 399380 296549 5587 -389263 -630843 -617219 -549248 -590596 -575191 -317431 -57346
33570 -57346 -216860 -739602 -1083169 -967203 -738813 -792234 -980493 -917433 -600891 -351939
33560 -351939 -273994 -159048 97854 325451 344796 148279 -201849 -601067 -820236 -662808
33550 -662808 -242031 142374 413393 711666 961373 818472 195655 -506106 -893746 -997506
33540 -997506 -967467 -709900 -183163 235780 150674 -235670 -374232 -176905 -83070 -294058
33530 -294058 -449777 -233925 152835 388588 515210 686640 741434 455729 50562 3540
33520 3540 404337 900512 1282710 1694864 2158398 2312087 1875318 1055256 205435 -647520
33510 -647520 -1571996 -2242204 -2172301 -1424387 -633416 -237672 -89563 40649 35865 -197561
33500 -197561 -335856 -65223 348476 411286 178914 151377 424626 517522 164724 -261141
33490 -261141 -374154 -345700 -488579 -661283 -550088 -293395 -321616 -675060 -949714 -925582
33480 -925582 -827043 -865497 -876948 -590009 -35786 470564 652417 513212 344760 472854
33470 472854 860574 1028492 580644 -233618 -752359 -705715 -484563 -520417 -717402 -713126
33460 -713126 -463776 -270146 -310035 -426048 -422226 -379122 -546126 -972409 -1362260 -1358303 -921771
33449 -921771 -337365 130823 420518 493448 256912 -150507 -266498 145798 610641 440810
33439 440810 -291347 -743634 -385609 331236 622975 355327 51154 120463 436219 648308
33429 648308 658375 688428 944002 1271619 1244021 671712 -84199 -502637 -516123 -481060
33419 -481060 -622289 -843469 -1030942 -1117469 -843966 11121 1027682 1323877 625655 -319202
33409 -319202 -707339 -576492 -367322 -123649 306740 680289 621066 246065 -56916 -272388
33399 -272388 -601556 -868238 -720843 -299584 -54623 16625 280070 656024 625844 119873
33389 119873 -301092 -297530 -127069 -8831 201040 464598 393620 -25664 -191044 195826
33379 195826 548591 238659 -471350 -870733 -772448 -503827 -269923 -79859 -47016 -224034
33369 -224034 -322202 -73858 290919 367050 195017 120741 213959 287730 349657 554581 793086
33358 793086 772791 463778 91388 -222955 -449271 -420621 -43763 367664 396022 67124
33348 67124 -291448 -567665 -774814 -653792 5592 741680 816808 275825 -79948 102478
33338 102478 264914 -61017 -480085 -391087 119519 529162 632445 571189 409060 130556
33328 130556 -136851 -291665 -496655 -929953 -1458885 -1843896 -2076196 -2215578 -2094809 -1543364
33318 -1543364 -784882 -277755 -214563 -420175 -646192 -737480 -640396 -494506 -577170 -902463
33308 -902463 -1047474 -694467 -187378 -155467 -657340 -1107798 -1063894 -693700 -388067 -265141
33298 -265141 -206417 -96334 154968 617405 1185985 1552818 1486307 1071107 600419 317545
33288 317545 300861 471394 634202 614036 434091 299718 359850 550020 702166 736715
33278 736715 710163 727482 826815 910171 807564 471324 69001 -204269 -358826 -533852
33268 -533852 -727339 -770288 -586395 -316220 -128457 -43051 -5689 -6000 -22397 55461 330559
33257 330559 749320 1107726 1181966 849088 183780 -492755 -763300 -469763 70994 311556
33247 311556 -15376 -667200 -1176774 -1294173 -1100502 -766553 -346790 138822 530595 582923
33237 582923 227228 -276342 -496591 -172632 537769 1122762 1124584 589606 58765 -1066
33227 -1066 304574 507959 406921 246331 280594 435496 499960 405279 172037 -194470
33217 -194470 -576212 -711848 -509104 -230893 -162369 -244845 -252014 -155147 -54623 74304
33207 74304 239005 179262 -331197 -977889 -1120799 -569542 217006 755994 981027 976906
33197 976906 725345 346610 209390 469740 759614 657874 279359 88360 284755 680817
33187 680817 1054067 1300030 1324596 1115165 885983 853355 891844 720335 413493 365651
33177 365651 672492 911124 712591 252775 -63618 -170384 -299712 -520859 -634275 -498787
33167 -498787 -203778 110727 392883 587710 593926 404581 168362 29606 -7796 -15614
33157 -15614 -51260 -183518 -478457 -870638 -1161814 -1250356 -1250039 -1263939 -1180817 -891374 -592314
33146 -592314 -587606 -793311 -751274 -257157 279283 306563 -189125 -695028 -790807 -555934
33136 -555934 -364926 -440197 -667330 -779427 -652763 -379746 -51646 401232 998719 1448112
33126 1448112 1399938 993294 789836 1010307 1197004 903678 369781 100578 58349 -190619
33116 -190619 -664285 -899795 -723950 -511728 -526156 -522469 -240870 179112 566823 1058054
33106 1058054 1683672 1998658 1594009 742565 83682 -161366 -219538 -178323 100313 503056
33096 503056 631512 373805 90756 65390 132612 64712 -13251 99102 218242 -19005
33086 -19005 -531473 -716276 -136540 885045 1548095 1440627 979684 896835 1374311 1872688
33076 1872688 1822952 1260925 641724 234570 -41075 -286845 -442693 -455721 -383966 -267280
33066 -267280 -87816 92893 162240 188660 403871 829749 1121549 957029 437323 -83065
33056 -83065 -444763 -738430 -973379 -959066 -604840 -170697 -74245 -475009 -1114970 -1551621
33046 -1551621 -1509222 -1033278 -381629 188105 549302 699398 686238 563631 407892 333539
33036 333539 419150 584322 619047 438128 255055 342991 626644 724286 477304 209531
33026 209531 273315 526710 536350 192960 -196813 -420363 -622812 -954553 -1240225 -1197592
33016 -1197592 -816617 -326561 114631 522809 922625 1217714 1235903 867688 208630 -417685
33006 -417685 -686468 -586316 -414681 -403912 -477029 -467613 -438929 -603993 -987204 -1349675
32996 -1349675 -1470612 -1372581 -1223901 -1106291 -943690 -639287 -243224 45057 64974 -134941
32986 -134941 -361364 -476682 -437951 -166952 423255 1179807 1664129 1555605 1046946 658220
32976 658220 659693 838296 871241 778230 881234 1353903 1911917 2015653 1414457 482629
32966 482629 -62544 147429 748530 1025762 656261 -30315 -532200 -748279 -932547 -1177167
32956 -1177167 -1200723 -765269 -127157 161558 -119883 -640409 -958981 -976092 -848319 -674138
32946 -674138 -467868 -302030 -241905 -216718 -166384 -228200 -534531 -909296 -1064502 -1046589
32936 -1046589 -1133221 -1287635 -1132660 -568233 9188 285057 398306 480451 291932 -248237
32926 -248237 -570731 -106418 772234 1114003 669323 174953 246879 606515 702358 583916
32916 583916 704007 1163693 1631274 1875846 1952266 1880388 1528459 915005 346143 94783
32906 94783 107777 173834 254545 463837 763347 891398 685273 329271 121401 68552
32896 68552 -77879 -388777 -618288 -607612 -577598 -788707 -1078756 -1031130 -536508 96302
32886 96302 583997 954913 1341775 1714152 1904458 1763012 1269519 632816 241006 303979
32876 303979 566037 600570 356177 132396 52909 -53278 -201467 -131143 179991 306434
32866 306434 -17066 -413781 -346250 166560 661976 856599 803441 613808 413282 442918
32856 442918 793728 1100988 892553 224952 -384184 -641141 -721694 -823254 -876540 -807749
32846 -807749 -736216 -755629 -779194 -719839 -594593 -393900 -126402 -39963 -434331 -1124188
32836 -1124188 -1473568 -1194316 -762652 -743783 -1011794 -1023247 -644297 -263424 -166386 -219658
32826 -219658 -201826 -95664 43922 238945 479288 649343 668743 579303 438120 257640
32816 257640 91804 30485 49673 18340 -64277 9551 361320 755459 792800 364276 -212083
32805 -212083 -527798 -471681 -258679 -158613 -263817 -485069 -694900 -851394 -1004221 -1176691
32795 -1176691 -1237003 -963621 -339051 278826 465475 230860 -11345 -61089 -222607 -732418
$$ [...]
##END NTUPLES=NMR SPECTRUM
##END=
