##TITLE=31Pdec_B3d2101
 CDCl3, 24 sc
 21.1.2025
##JCAMPDX= 6.0         $$ Bruker NMR JCAMP-DX V2.0
##DATA TYPE= NMR SPECTRUM
##DATA CLASS= NTUPLES
##ORIGIN= UXNMR, Bruker Analytische Messtechnik GmbH
##OWNER= root
$$ XWIN-NMR		Version 3.5
$$ Tue Jan 21 17:59:43 2025 Russian Standard Time (UT+4h)  she@DPX200
##.OBSERVE FREQUENCY= 81.013821
##.OBSERVE NUCLEUS= ^31P
##.ACQUISITION MODE= SIMULTANEOUS
##.ACQUISITION SCHEME= undefined
##.AVERAGES= 24
##.DIGITISER RES= 17
##SPECTROMETER/DATA SYSTEM= spect
##.PULSE SEQUENCE= zgpg30
##.SOLVENT NAME= CDCl3
##.SHIFT REFERENCE= (INTERNAL, CDCl3, 0, 198.062)
##AUDIT TRAIL= $$ (NUMBER, WHEN, WHO, WHERE, WHAT)
$$ ##TITLE= Audit trail, XWIN-NMR		Version 3.5
$$ ##JCAMPDX= 5.01
$$ ##ORIGIN= Bruker BioSpin GmbH
$$ ##OWNER= she
$$ F:/spectra/data/she/nmr/P31/2/pdata/1/auditp.txt
$$ ##AUDIT TRAIL=  $$ (NUMBER, WHEN, WHO, WHERE, WHAT)
(   1,<2025-01-21 17:58:39.40 +0400>,<she>,<DPX200>,
      <created by zg, POWCHK disabled, PULCHK disabled
       configuration hash MD5:
       00 E9 B6 7A A2 85 ED C7 34 08 36 98 17 FE 4E 26
       data hash MD5: 32K
       99 09 59 8F 6F AD 9C 0A 59 5A 3C 8F 5D C6 29 68>)
(   2,<2025-01-21 17:58:42.39 +0400>,<she>,<DPX200>,
      <Start of raw data processing
       efp BC_mod = 2 LB = 1.5 FT_mod = 6 PKNL = 1 PHC0 = 1654.453 PHC1 = 326.8863 SI = 64K 
       data hash MD5: 64K
       D2 79 77 0B A8 DC E5 B6 0A 1F AF F4 AA 8D E6 86>)
(   3,<2025-01-21 17:59:00.53 +0400>,<she>,<DPX200>,
      <pk PHC0 = 32.19928 PHC1 = -56.4 
       data hash MD5: 64K
       E2 E7 15 48 AF 37 64 5D A4 68 BB 5B 8C 62 55 C9>)
$$ ##END=
$$ 
$$ hash MD5
$$ CA 82 8C 0E 5E B4 00 92 46 6F C3 AD 0B 5B B1 A4
##$RELAX= 
##$RELAX= 
##$RELAX= 
##$RELAX= 
##$RELAX= 
##$RELAX= 
##$RELAX= 
##$RELAX= 
$$ Bruker specific parameters
$$ --------------------------
##$DU= <F:/spectra>
##$EXPNO= 2
##$NAME= <P31>
##$PROCNO= 1
##$TYPE= <nmr>
##$USER= <she>
##$AMP= (0..31)
100 100 100 100 100 100 100 100 100 100 100 100 100 100 100 100 100 100 
100 100 100 100 100 100 100 100 100 100 100 100 100 100 
##$AQSEQ= 0
##$AQ_mod= 1
##$AUNM= <au_zg>
##$AUTOPOS= <>
##$BF1= 81.014009
##$BF2= 200.13
##$BF3= 200.13
##$BF4= 200.13
##$BF5= 200.13
##$BF6= 200.13
##$BF7= 200.13
##$BF8= 200.13
##$BYTORDA= 1
##$CFDGTYP= 0
##$CFRGTYP= 5
##$CHEMSTR= <none>
##$CNST= (0..31)
1 1 145 1 1 1 1 1 1 1 1 1 1 1 1 1 1 1 1 1 1 1 1 1 1 1 1 1 1 1 1 1 
##$CPDPRG= <waltz16>
##$CPDPRG1= <>
##$CPDPRG2= <waltz16>
##$CPDPRG3= <>
##$CPDPRG4= <mlev>
##$CPDPRG5= <mlev>
##$CPDPRG6= <mlev>
##$CPDPRG7= <mlev>
##$CPDPRG8= <mlev>
##$CPDPRGB= <>
##$CPDPRGT= <>
##$D= (0..31)
0 1 0 0 0 0 0 0 0 0.06 0 0.03 2e-05 3e-06 0 0 0.0002 0 0 0 0 0 0 0 0 0 
0 0 0 0 0 0 
##$DATE= 1737467918
##$DBL= (0..7)
120 120 120 11 120 120 24 19 
##$DBP= (0..7)
150 150 150 150 150 150 150 150 
##$DBP07= 0
##$DBPNAM0= <>
##$DBPNAM1= <>
##$DBPNAM2= <>
##$DBPNAM3= <>
##$DBPNAM4= <>
##$DBPNAM5= <>
##$DBPNAM6= <>
##$DBPNAM7= <>
##$DBPOAL= (0..7)
0.5 0.5 0.5 0.5 0.5 0.5 0.5 0.5 
##$DBPOFFS= (0..7)
$$ [...]
##$SUBNAM2= <"">
##$SUBNAM3= <"">
##$SUBNAM4= <"">
##$SUBNAM5= <"">
##$SUBNAM6= <"">
##$SUBNAM7= <"">
##$SUBNAM8= <"">
##$SUBNAM9= <"">
##$SW= 400.765351723535
##$SWIBOX= (0..15)
0 1 3 0 0 0 0 0 0 0 0 0 0 0 0 0 
##$SW_h= 32467.5324675325
##$TD= 32768
##$TD0= 1
##$TE= 0
##$TE2= 300
##$TE3= 300
##$TEG= 300
##$TL= (0..7)
0 120 53 12 22 120 120 120 
##$TP= (0..7)
150 150 150 150 150 150 150 150 
##$TP07= 0
##$TPNAME0= <>
##$TPNAME1= <>
##$TPNAME2= <>
##$TPNAME3= <>
##$TPNAME4= <>
##$TPNAME5= <>
##$TPNAME6= <>
##$TPNAME7= <>
##$TPOAL= (0..7)
0.5 0.5 0.5 0.5 0.5 0.5 0.5 0.5 
##$TPOFFS= (0..7)
0 0 0 0 0 0 0 0 
##$TUNHIN= 0
##$TUNHOUT= 0
##$TUNXOUT= 0
##$USERA1= <user>
##$USERA2= <user>
##$USERA3= <user>
##$USERA4= <user>
##$USERA5= <user>
##$V9= 5
##$VALIST= <valist>
##$VCLIST= <CCCCCCCCCCCCCCC>
##$VD= 0
##$VDLIST= <DDDDDDDDDDDDDDD>
##$VPLIST= <PPPPPPPPPPPPPPP>
##$VTLIST= <TTTTTTTTTTTTTTT>
##$WBST= 1024
##$WBSW= 4
##$XGAIN= (0..3)
0 0 0 0 
##$XL= 0
##$YL= 0
##$YMAX_a= 12020
##$YMIN_a= -2804
##$ZGOPTNS= <>
##$ZL1= 120
##$ZL2= 120
##$ZL3= 120
##$ZL4= 120
##$ABSF1= 0
##$ABSF2= 0
##$ABSG= 0
##$ABSL= 0
##$ALPHA= 0
##$AQORDER= 0
##$ASSFAC= 0
##$ASSFACI= 0
##$ASSFACX= 0
##$ASSWID= 0
##$AUNMP= <proc_1d>
##$AZFE= 0.1
##$AZFW= 0.5
##$BCFW= 0
##$BC_mod= 2
##$BYTORDP= 0
##$COROFFS= 0
##$CY= -3
##$DATMOD= 1
##$DC= 0
##$DFILT= <>
##$DTYPP= 0
##$F1P= 0
##$F2P= 0
##$FCOR= 1
##$FTSIZE= 65536
##$FT_mod= 6
##$GAMMA= 0
##$GB= 0
##$INTBC= 1
##$INTSCL= 9.790993e-09
##$ISEN= 30
##$LB= 1.5
##$LEV0= 0
##$LPBIN= 0
##$MAXI= 10000
##$MC2= 0
##$MEAN= 0
##$ME_mod= 0
##$MI= 50
##$NCOEF= 0
##$NC_proc= -8
##$NLEV= 6
##$NOISF1= 182.463
##$NOISF2= 159.3651
##$NSP= 0
##$NTH_PI= 0
##$NZP= 0
##$OFFSET= 198.0616
##$PC= 4
##$PHC0= 1686.652
##$PHC1= 270.4863
##$PH_mod= 1
##$PKNL= yes
##$PPARMOD= 0
##$PSCAL= 0
##$PSIGN= 0
##$REVERSE= no
##$SF= 81.0140089999434
##$SI= 65536
##$SIGF1= 159.3651
##$SIGF2= -187.1042
##$SINO= 113.3802
##$SIOLD= 16384
##$SREGLST= <1H.CDCl3>
##$SSB= 0
##$STSI= 65536
##$STSR= 0
##$SW_p= 32467.5324675325
##$SYMM= 0
##$S_DEV= 0
##$TDeff= 32768
##$TDoff= 0
##$TI= <>
##$TILT= no
##$TM1= 0
##$TM2= 0
##$TOPLEV= 0
##$USERP1= <user>
##$USERP2= <user>
##$USERP3= <user>
##$USERP4= <user>
##$USERP5= <user>
##$WDW= 1
##$XDIM= 65536
##$YMAX_p= 293005859
##$YMIN_p= -16400831
$$ End of Bruker specific parameters
$$ ---------------------------------
##NTUPLES= NMR SPECTRUM
##VAR_NAME=  FREQUENCY,     SPECTRUM/REAL,   SPECTRUM/IMAG
##SYMBOL=    X,             R,               I
##VAR_TYPE=  INDEPENDENT,   DEPENDENT,       DEPENDENT
##VAR_FORM=  AFFN,          ASDF,            ASDF
##VAR_DIM=   65536,         65536,           65536
##UNITS=     HZ,            ARBITRARY UNITS, ARBITRARY UNITS
##FACTOR=    0.49542278885378, 1,            1
##FIRST=     16045.7642231865, 0,            0
##LAST=      -16421.768244346, 0,            0
##MIN=       -16421.768244346, -16400831,    0
##MAX=       16045.7642231865, 293005859,    0
$$ Real data points
##PAGE= N=1
##DATA TABLE= (X++(R..R)), XYDATA
$$ [...]
40712G3672p19044j32951n42846j097492j89440J248034R89059n34442p84721
40703a690171M18500M39927j445208k299074j35351K665913K883362J148874M04714
40694B391486J189851J428425K60682q15471p88464n98377j011014j055902K12448
40685A213664J760894J749050j1849j905643k515090j861554p67282J27967M84377
40676a725466J12142o98398r89029K2369J803878K818293K264679R36971o1887
40667D483552o87690j212686r63755O48114K190895J298651j852884m027177k875815
40658b998795J50774K042888J916031R16561k34461j535396k242109j285394Q52248
40649b417653K382875K446502J722799R01451K4336o50296o37373k40759k57196
$$ y = [73672, -645372, -778323, -1321169, -2418661, -2608101, -1360067, -371008, -905450, -1690171, -1271671, -831744, -2276952, -4576026, -4711377, -2045464, 837898, 1986772, 2391486, 3581337, 5009762, 5270444, 4454973, 3666509, 3068132, 2057118, 1001216, 1213664, 2974558, 4723608, 4711759, 2806116, 291026, -1570528, -2337810, -2209843, -1725466, -1613324, -2311722, -3300751, -3278382, -1474504, 1343789, 3608468, 4545439, 4483552, 3795862, 2583176, 1619421, 2267535, 4458430, 5757081, 3904197, -122980, -2998795, -2848021, -805133, 1110898, 2027459, 1792998, 257602, -1984507, -3269901, -2417653, -34778, 2411724, 4134523, 5035974, 5060310, 4410014, 3772641, 3531882, 3274686]
40640C274686o01400n10920j2854K52243M55872J131914J545992N98561p40657
40631E393437m19715J007341N96520k169564l856904k085169Q04415J474649N10631
40622A255641O06911J687761J337152p39697k081442j317180J67235P48010M19560
40613B083951k68992j109970j623223j240047m12622o6606L4123P54216J614420
40604b34750J334414L08444K90905J324506J369264k88056j625946j105436j76731
40595A196614q81182k534798k758149r78772Q79631J012782k29401j050560k85861
40586e629696J403525K347253J890253J118380J085872J155065K54987j027550
40578B598089j369938j148098j741319k649819j917902K90185J331461J11089
$$ y = [3274686, 2673286, 2162366, 2149512, 2401755, 2857627, 3989541, 5535533, 6134094, 5393437, 4973722, 5981063, 6577583, 4408019, 551115, -1534054, -729639, 745010, 1255641, 1862552, 3550313, 4887465, 4147768, 2066326, 749146, 916381, 1664391, 2083951, 1814959, 704989, -918234, -2158281, -2570903, -2637509, -2603386, -1849170, -234750, 1099664, 1408108, 1699013, 3023519, 4392783, 4104727, 2478781, 1373345, 1196614, 315432, -2219366, -4977515, -5956287, -5076656, -4063874, -4293275, -5343835, -5629696, -4226171, -1878918, 11335, 1129715, 2215587, 3370652, 3625639, 2598089, 1228151, 80053, -1661266, -4311085, -6228987, -5938802, -4607341, -4496252]
40570d496252j300266j254576q77730j139638m68821K189382M340254L086124
40562G8477k36089j693395j40177J936509K421166J667661P31498m9299n28023
40553D188328o72074j033172j828188k027586r32359J65434j56031q19109J57551
40544b957206K134688K590797J039412n01199q20890n58946K8464J370915K378790
40535D704825J059477j901385l152377j339005J008987J403810M40811m15047
40527A810096j200766j850246r99820J365857K500766O27354j972724k164722
40519a884205l84323Q78667J252063J950807K388112Q88095j690423k476352r07330
40510A5111N21498L10014j05766O41731J490590R98669j84804m71397K85778R47361
$$ y = [-4496252, -5796518, -7051094, -7928824, -9068462, -9537283, -7347901, -3007647, 78477, -157612, -1851007, -1991184, -54675, 2366491, 4034152, 4765650, 4716351, 4188328, 3516254, 2483082, 654894, -1372692, -2305051, -2139617, -2295648, -3114757, -2957206, -822518, 1768279, 2807691, 2306492, 1485602, 926656, 955120, 2326035, 4704825, 5764302, 3862917, 710540, -628465, 380522, 1784332, 2225143, 1810096, 609330, -1240916, -2240736, -874879, 1625887, 2253241, 280517, -1884205, -2268528, -1389861, -137798, 1813009, 4201121, 5089216, 3398793, 922441, 15111, 536609, 846623, 740857, 1382588, 2873178, 3871847, 3687043, 3215646, 3501424, 4448785]
40500D448785Q41234K47541l94970r17885j234588j170132m92328P39006J685358
40491C752021J229330l89079j233432j14352J361187P89316j449352k569596j331577
40482D4466M73752R60782N53566N12710P80548N68005j29837q17740j381773j674623
40472a10144j112155L16061J436367J248637J80232q01262j415810j528796m98000
40463b284870J606630L012994K104288j30788j047153L22760K198531K389957
40455H172349N97828j735667k922444k252665n16045O41292M79770J9483M05692
40446B889593J000427L74157j177315j773864p31089M66680M54365l29248r67940
40437B05766j497745j893998j097491J284811L253030K329027j020318l588062
$$ y = [4448785, 5290019, 5537560, 5142590, 4224705, 2990117, 1819985, 1327657, 2066663, 3752021, 4981351, 4592272, 3358840, 3244488, 4605675, 5394991, 3945639, 1376043, 44466, 518218, 1479000, 2032566, 2545276, 3325824, 3893829, 3763992, 2946252, 1564479, -110144, -1222299, -906238, 530129, 1778766, 1958998, 1157736, -258074, -1786870, -2284870, -678240, 2334754, 4439042, 4308254, 3261101, 3583861, 5782392, 8172349, 8770177, 7034510, 4112066, 1859401, 1343356, 1984648, 2464418, 2483901, 2889593, 3890020, 4264177, 3086862, 1312998, 581909, 1048589, 1502954, 1173706, 205766, -1291979, -3185977, -4283468, -2998657, 254373, 2583400, 1563082, -2024980]
40429b024980l240440j089769N14802Q26983P59342J037265J326107R82818K8275
40420h79597p23004m12336Q57074J880005J615413M88975j63422P6115K41256
40411B980479m33986j331749j413735o99823m7687J49504K92753P20471J106291
40402A322518P82087n44270k257393k979441j756953O47138K270350K174267J442362
40393A100665J371492J553393Q14315o59626j589082j648116j618828j481332
40385b157119j39948K352788L950120L108406R46366l57907m56014p05999j688821
40376D851872k399755j973490r21573k16787r952K09884O61440R61079O48803
40367A811521j75723p70552m47767N47478J147443P02460k19306o27910l47589
$$ y = [-2024980, -5265420, -6355189, -5840387, -5013404, -4254062, -3216797, -1890690, -907872, -879597, -1602601, -2014937, -1157863, 722142, 2337555, 2826530, 2663108, 2739223, 2980479, 2546493, 1214744, -198991, -898814, -946501, -796997, -504244, 216227, 1322518, 2104605, 1560335, -697058, -3676499, -5433452, -4786314, -2515964, -341697, 1100665, 2472157, 4025550, 4839865, 4180239, 2591157, 943041, -675787, -2157119, -2297067, 55721, 4005841, 7114247, 8060613, 7702706, 7246692, 6540693, 4851872, 2452117, 478627, -442946, -659733, -669685, -459801, 201639, 1162718, 1811521, 1635798, 865246, 417479, 964957, 2112400, 2814860, 2595554, 1967644, 1620055]
40358A620055K5174N6401k50537q52080j603878j918663j258689k2348P71182
40349c433383P93151O87510Q64852Q25174J51084n14478k35165P97368J387094
40340A323207Q98592M4853j74911J41970K8729q43735j531704j052102J96973
40331i68128R01647N49149j13250m08269n83059r10898q79384r1433P50234P85098
40321i68293L97090N21761R52968P26326K8248Q5295Q81092P34320r98093k385154
40311b4440j494046O24271J243942k83441j849809j639894k20679Q18709R08933
40302a916454M57404j35765m92945o9129J040375J610672O75759q47651j046090
40293g23824M40184J861157J681397L94512o26606j071813j358815j075566N92695
$$ y = [1620055, 1645229, 1701630, 1451093, 599013, -1004865, -2923528, -4182217, -4204565, -3433383, -2640232, -1952722, -1087870, -262696, -111612, -626090, -861255, -63887, 1323207, 2221799, 2266652, 2091741, 2233711, 2262440, 1418705, -112999, -1165101, -968128, -66481, 482668, 369418, -38851, -621910, -1532808, -2412192, -2503625, -1753391, -968293, -571203, -49442, 903526, 1629852, 1658100, 1743395, 2624487, 3358807, 2360714, -24440, -1518486, -894215, 349727, 66286, -1783523, -3423417, -3644096, -2825387, -1916454, -1459050, -1594815, -2087760, -2156889, -1116514, 494158, 1169917, 322266, -723824, -283640, 1577517, 3258914, 3653426, 3026820, 1955007, 596192, -479374, 113321]
40284A13321K820298L210885Q00152k174993k754756q56003R54376R98801K58478
40275C370559K84222Q14356N30859o69176j489009j151418l32704O7837J24687
40266A550213L02898M32265J11555k75773K8518P55790O86474n00443j445808
40257A645689r15346M09927R44700M10155j93167m65433r72455j670329j516786
40248b323045j57343J359112K195754K719625L071909K230533j76358k361811
40240F558376k376348q11582J97379L1198k24856k10707p22638j598887j362704
40231e20769L00982J534973Q22621q54022j472875n81042O09649J019290O53656
40222A512463J96575K88034Q78635J069448J50591j177245j536863q90781n77176
$$ y = [113321, 2933619, 6144504, 6944656, 4769663, 2014907, 1158904, 2113280, 3112081, 3370559, 3654781, 4469137, 4999996, 4330820, 2841811, 1690393, 1357689, 1425526, 1550213, 1853111, 2285376, 2396931, 2121158, 2149676, 2905466, 3591940, 3091497, 1645689, 730343, 1140270, 2084970, 2495125, 2301958, 1836525, 864070, -806259, -2323045, -2480388, -1121276, 1074478, 3794103, 6866012, 9096545, 8920187, 6558376, 4182028, 3370446, 3567825, 3599023, 3374167, 3163460, 2440822, 841935, -520769, -219787, 1315186, 2137807, 1283785, -189090, -770132, -160483, 858807, 1512463, 1709038, 1997072, 2875707, 3945155, 4095746, 2918501, 1381638, 490857, -86319]
40213h6319j053733j101655K8917J156372R19464k13532q57034o23557J0712P73538
40203a046827J339140R84980j92236o91783L07625J267745M34616j229204j397782
40194b23726j30175K12689j112182j939045o69076J171851J312194J05755k45282
40185a516997R50904K011734J341126n08064j637457j008718O33410J838396J965211
40176D069545J345714K94210j180173k455992k205889k17493J490381Q59174j190197
40167H09280j640065M35475K313554J271304j557841k588527n26288K002287J931339
40158B450518m55290k251370j798707m14237k514l27109J46354J482091K078503
40149I08239J241370J95279n2228k11053j064204j801098j376068l61290O5002
$$ y = [-86319, -1140052, -2241707, -2212790, -1056418, -136954, -350486, -1207520, -1831077, -1820365, -1046827, 292313, 1277293, 1085057, 393274, 700899, 1968644, 2403260, 1174056, -223726, -353901, -141212, -1253394, -3192439, -3861515, -2689664, -1377470, -1271715, -1516997, -566093, 1445641, 2786767, 2278703, 641246, -367472, 265938, 2104334, 4069545, 5415259, 5709469, 4529296, 2073304, -132585, -350078, 1140303, 1999477, 809280, -830785, -395310, 1918244, 3189548, 1631707, -956820, -1483108, 519179, 2450518, 1995228, -256142, -2054849, -2469086, -2471600, -2798709, -2652355, -1170264, 908239, 2149609, 2344888, 2292660, 2081607, 1017403, -783695, -2159763, -2521053, -2456051]
40140b456051j4899L9362j08352p88516q35201O70038J946271N02695k661769
40131c706422l730597j332658J596086K028813M16891j048511j403845p38678
40123g918921R00881K795526L301770J819934k27623j430573j884401j718425
40115d361832j81608K306336L221046J082990k007657k987329j600205L43566
40107d184693J888314K860695K427731M38156r62427O3782J728260R66322j565506
40098C660634k286176l65731J073076J01905j232425p50304L67848Q7393q59712
40089b03492l99684J256524J864950M94266j295687j591291k22672J320805J418960
40080B642679j18864j739062j746632k66558J048763J195462O86466K17682k59631
$$ y = [-2456051, -2470950, -2431588, -2539940, -3328456, -4163657, -3493619, -1547348, -1044653, -3706422, -7437019, -8769677, -7173591, -5144778, -4727887, -5776398, -7180243, -7918921, -7018040, -4222514, -920744, 899190, 671567, -759006, -2643407, -4361832, -4543440, -2237104, 983942, 2066932, 59275, -2928054, -4528259, -4184693, -2296379, 564316, 2992047, 3430203, 2467776, 2531558, 4259818, 5226140, 3660634, 1374458, 1008727, 2081803, 2183708, 951283, 200979, 568827, 656220, -203492, -603176, 653348, 2518298, 3012564, 1716877, 125586, -97086, 1223719, 2642679, 2523815, 784753, -961879, -1228437, -179674, 1015788, 1702254, 1919936, 1660305]
40071A660305q40567j284468j690099k327277k523770j182571J178830K527098
40063d482519K069054J222001J063208P06977n67096j437680n40297J065362J316839
40054D15849P4473j103448j298174p20050L51624J479961J643881N33554m38137
40045I39533n8859O12180M7895p38567M58002K962191L320198R1731l868148n007883
40035a241727l090191m10872J397166K277759K476515J926155P40839n90194j541250
40026A944200j800941j416413p97408k58503L33979R94075J059333O7745j097897
40017i71830j076468O3481J007108J245460J499428J907525J419473l56489k130367
40008B607321k614775k062224j293375l66494P82112J416563R00943j79209p96823
$$ y = [1660305, 819738, -464730, -2154829, -4482106, -7005876, -8188447, -7009617, -4482519, -2413465, -1191464, -128256, 578721, 11625, -1426055, -1966352, -900990, 415849, 490322, -613126, -1911300, -2631350, -2279726, -799765, 844116, 1377670, 939533, 880674, 1492854, 1540749, 802182, 1260184, 4222375, 7542573, 7634304, 3766156, -1241727, -4331918, -4742790, -3345624, -1067865, 1408650, 3334805, 4075644, 3485450, 1944200, 143259, -1273154, -2070562, -2329065, -1995086, -1001011, 58322, 126067, -971830, -2048298, -1984817, -977709, 267751, 1767179, 3674704, 5094177, 4737688, 2607321, -7454, -2069678, -3363053, -3729547, -2947435, -1530872, -629929, -809138, -1605961]
39999a605961p60336l87704K88009J033670R94277p0539q63307j66352J224967
39990c13276J615938R74157P13499J088949O89161j001302k226163j231999J129045
39981A438009K328485J293763m82206j009497j19545P23825M58483m37990r20966
39972C272361p99887n83369l07091N13872J652766J851583K96328k145778l681842
39963F8943l260437j271099R01924J836034J231676L06162L09040O94302r5j425955
39953f09505j511914N5957P63617p39570j889048j8462K926643K922182J20716
39944B020616j356555R5374J381870J22784j634250j286407k2219l56435j647759
39935b682981j380991M36565J409319O96873j32691j20753j41366p64559j149649
$$ y = [-1605961, -2366297, -2754001, -2465992, -1432322, -438045, -508584, -1371891, -1538243, -313276, 1302662, 2276819, 2990318, 4079267, 4768428, 3767126, 1540963, 308964, 1438009, 3766494, 5060257, 4578051, 3568554, 3449009, 4172834, 4631317, 4193327, 3272361, 2472474, 1889105, 1582014, 2095886, 3748652, 5600235, 5896563, 3750785, 68943, -3191494, -4462593, -3560669, -1724635, -492959, -186797, 122243, 816545, 816450, -609505, -2121419, -2065462, -1301845, -2041415, -3930463, -3948925, -1022282, 1899900, 2020616, 664061, 759435, 2141305, 2264089, 629839, -656568, -678787, -1035222, -2682981, -4063972, -3627407, -2218088, -1521215, -1653906, -1774659, -1916025, -2680584, -3830233]
39926c830233o83069M2109M50910P31833R51695P98020N07316O72047R12640K93711
39916H46979o63599k13581J696096K582902O89655k395703l783884k832037j181212
39907e254384r6023O14221J356684J904697J922105J414334N55377l39617p55428
39898A321966m08908L86430J113485J466841J133746j25092j655862k003745o84789
39889E44072Q13258P87824m99699j464314j435424r46404k03845J154292K727524
39880A477284L264583K307354Q07466k24983o66572o51271j58528L84015K12790
39871F752138n69647r51132o16325m36999q19976q98599k10423J79594n59601
39862A869030j353120q40492K85986L67728l81160j25295J552994K803623K151670
$$ y = [-3830233, -4513302, -4471193, -4020283, -3288450, -2336755, -1538735, -1031419, -359372, 553268, 846979, 183380, -30201, 1665895, 4248797, 4938452, 2542749, -1241135, -4073172, -5254384, -5350407, -4736186, -3379502, -1474805, 447300, 1861634, 2417011, 2077394, 1321966, 913058, 1299488, 2412973, 3879814, 5013560, 4888468, 3232606, 1228861, 544072, 1357330, 2145154, 1645455, 181141, -1254283, -2200687, -2404532, -1250240, 1477284, 4741867, 7049221, 7856687, 7631704, 6965132, 6313861, 6155333, 6539348, 6752138, 6182491, 5231359, 4615034, 4178035, 3358059, 2459460, 2249037, 2428631, 1869030, 515910, -324582, -38596, 329132, -52028, -177323, 1375671, 4179294, 6330964]
39853F330964L98593p83644q69059l56196K63471N69938R6461r91589j679702
39844B979237j276596l20077K55217L08147K50837J72896p6160l37137m02539
39835A553825n59314j185279j962676k127502j464210n28284J46376O15023J147964
39826d364077J563317J235304o4432j447493j562150l02781P58521M39430j56930
39817c901291Q17725K785219L002270M93527k177675k239531k06011J517882K130786
39808B222901K449239K308972M78525k696985m728802l844233j055827J243685
39800c622525J691398N50344r99948j622563p39866Q04275J574906J170355L63720
39791h29904j96396m01732J1616J173464K028014J183150p72607j443394J34894
$$ y = [6330964, 6729557, 5945913, 5076854, 4720658, 4984129, 5554067, 5650528, 4658939, 2979237, 1702641, 1382564, 1637781, 1945928, 2196765, 2369661, 2293501, 1956364, 1553825, 994511, -190768, -2153444, -4280946, -5745156, -6273440, -6127064, -5512041, -4364077, -2800760, -1565456, -1629888, -3077381, -4639531, -4942312, -4183791, -3744361, -3901291, -3083566, -298347, 2703923, 3197450, 1019775, -1219756, -1425767, 92115, 2222901, 4672140, 6981112, 7459637, 4762652, 33850, -3810383, -4866210, -3622525, -1931127, -1380783, -2380731, -4003294, -4743160, -3938885, -2363979, -1193624, -829904, -1026300, -1428032, -1416416, -242952, 1785062, 2968212, 2195605, 752211, 887105]
39782H87105J977087J886512K98657q76093j021891q70908o33725J87951J343803
39773C178498J661941N67536j098209j989916j579550o09361l79961j257249j937976
39764c444247r92952Q87225J515611M14430k90824Q73483K292009J657470n55695
39755B356510j962057j712944j014928o88485k58998N67376J282538J541890J356542
39746A467444M69675r96513j573476O1499K653598L327159J253804j381177k406110
39737B875903j879835q51288J78355P49089J88546j029416j181349K58799J437070
39728G45874P33315o66658m75325J216489K004728N92874j459636j844250k90560
39719E56851J419686J705675P45170k41906o71399r61419j384632j471530r58972
$$ y = [887105, 2864192, 4750704, 5049361, 4173268, 3151377, 2280469, 1646744, 1834695, 3178498, 4840439, 5407975, 4309766, 2319850, 740300, 130939, -249022, -1506271, -3444247, -4437199, -3549974, -2034363, -1619933, -1910757, -1037274, 1254735, 2912205, 2356510, 394453, -1318491, -2333419, -3021904, -3280902, -2713526, -1430988, 110902, 1467444, 1937119, 940606, -632870, -571371, 2082227, 5409386, 6663190, 5282013, 2875903, 996068, 144780, 323135, 1072224, 1260770, 231354, -949995, -691196, 745874, 1479189, 812531, 337206, 1553695, 3558423, 4151297, 2691661, 847411, 556851, 1976537, 3682212, 4427382, 4185476, 3514077, 2552658, 1168026, -303504, -1262476]
39710a262476m58375m51404m38914j4180J20064n45180r54130j01497Q52210K79623
39700b974259p03649N00478L450620M438866J671176k109990l555545k742885
39692b025188j571010m94727Q67022J677538R87696j90471k27664M38591M9045
39683d89168j579954k819536k567929j213762M20790J701908K132334J890018
39675b525299J877846K190415J505871o70437k358898j546817O91504J624554
39667G88739P42779l4707L18280P35986L35922j70176J22524R55125J389551P27976
39657E911999r76288k527545k356676p11558K9379j259066k184118k77017K595122
39648a755768K457909o78853k564752r18503J632071J980329P41952K25066P36475
$$ y = [-1262476, -1720851, -2172255, -2611169, -2625349, -2505285, -3050465, -4004595, -4106092, -3253882, -2974259, -3677908, -3177430, 273190, 4712056, 6383232, 4273242, 717697, -2025188, -3596198, -4090925, -3223903, -1546365, -558669, -749140, -976804, -538213, -489168, -2069122, -4888658, -7456587, -8670349, -8249559, -6547651, -4415317, -2525299, -647453, 1542962, 3048833, 2378396, 19498, -1527319, -835815, 788739, 1531518, 1496811, 1815091, 2551077, 2886999, 2716823, 2839347, 3794472, 5184023, 5911999, 4935711, 2408166, 51490, -660068, -630689, -1889755, -4073873, -4350890, -1755768, 702141, 23288, -2541464, -3459967, -1827896, 152433, 894385, 1119451, 1855926]
39639A855926J061713Q94909P57511O07391J35570m10491q61132j639688k677498
39630b75789k865201j555296L43093J562038J797351J285753K98604l66817J92876
39621D16612J385520J410044j31396j479616j346280n49731j06566L69544J111590
39612A079721J021939l02909j162887k72034Q74602K24638j551441k179054j131370
39603c398795L08756J439049K338107K372255Q63053j067714j522182n73493M4533
39594H03569j26209J85409J302752J666566L42546j264016j255848K51286J397588
39585C303643Q40200q04296j618780n01036J278705J280314r01856k702242j909560
39576a734908J82782O77044o30182j089027O58103K639562K481061O14991p03256
$$ y = [1855926, 2917639, 3812548, 4570059, 5177450, 5313020, 4902529, 4041397, 2401709, -275789, -3140990, -4696286, -4353193, -2791155, -993804, 291949, 590553, 223736, 416612, 1802132, 3212176, 3080780, 1601164, 254884, -294847, -401413, -31869, 1079721, 2101660, 1798751, 635864, 363830, 1238432, 1463070, -88371, -2267425, -3398795, -3090039, -1650990, 687117, 3059372, 3922425, 2854711, 1332529, 759036, 803569, 677360, 862769, 2165521, 3832087, 4174633, 2910617, 1654769, 1906055, 3303643, 4143843, 3339547, 1720767, 1219731, 2498436, 3778750, 2876894, 174652, -1734908, -1552126, -875082, -1505264, -2594291, -1936188, 703374, 3184435, 3799426, 3096170]
39567C096170n39219q2609o16157j776074k169579j258514m0471L53434K05123
39558b827896N59749J303041J170541r3860j042378o67869J83476M95924O92411
39549b26861J253656J222878j37536j444501j043912J68575P6355j110724j130448
39540b372518O11223K041113J560878J09054n90604k04079M73271P17870L19638
39531B665846k70311j57843P62155J187480J89579j028850p57409M50934N76030
39522C617611p44187k013102k453996k432505j541379R95470L803513M100596
39514C332021J659111n93932p47019p1605q4057j93093L23107N33270k48520r16289
39504B992994n56180k1719p8031m4513K96881k15964j514532j375943Q34151K207183
$$ y = [3096170, 2556951, 2474342, 1858185, 82111, -2087468, -3345982, -3386453, -3033019, -2827896, -2268147, -965106, 205435, 111575, -930803, -1598672, -1415196, -919272, -226861, 1026795, 2249673, 2112137, 667636, -376276, -207701, -131346, -1242070, -2372518, -1761295, 279818, 1840696, 1949750, 1359146, 1155067, 1628338, 2346208, 2665846, 2395535, 2237692, 2999847, 4187327, 4376906, 3348056, 2590647, 3041581, 3617611, 2873424, 860322, -1593674, -4026179, -5567558, -4572088, -768575, 3332021, 4991132, 4397200, 3650181, 3578576, 3494519, 3301426, 3624533, 4157803, 3909283, 2992994, 2436814, 2415095, 2337064, 2292551, 2589432, 2373468, 858936, -517007, 317144, 2524327]
39494B524327O89040j234697n07357J285499P05274j369912j100567J545727K358785
39485D896119k85867k781194j967315M56311J311893N89004K14968N04050M49110
39476C387079O4420M3744N38q75699j965692j809925k91476J168661J406751M20873
39466A549274j166709k422362k202272k19514J999615K402915Q95058m51122k7613
39457C57270J361673J779831O55519q69082j695431j804015j457740m71638J081787
39448a061826K223127K066230J077157L95334J76660l01851j016943j011700j05731
39439B440457N09354q886r30435j152015o35727Q5917Q46485J415459J095178
39430C665787j95723j222262r01954J80145P28213N03241J02349k35402m12878
$$ y = [2524327, 3213367, 1978670, 1471313, 2756812, 3462086, 2092174, 991607, 2537334, 4896119, 4610252, 1829058, -138257, 318054, 1629947, 2218951, 2433919, 2937969, 3387079, 3451499, 3495243, 3495781, 2620082, 654390, -1155535, -1447011, -278350, 1128401, 1549274, 382565, -2039797, -4242069, -4461583, -2461968, -59053, 836005, 384883, 357270, 1718943, 3498774, 4154293, 3285211, 1589780, -214235, -1671975, -2143613, -1061826, 1161301, 3227531, 4304688, 4700022, 4876682, 4574831, 3557888, 2546188, 2440457, 2949811, 2940925, 2010490, 858475, 222748, 308665, 1155150, 2570609, 3665787, 3470064, 2247802, 1345848, 1525993, 2254206, 2757447, 2859796, 2624394, 2211516]
39421B211516J33711J448821K201782J359636K6811j63460J14154j146893l645659
39412B540419m586614k688075j11823O98806K08910L51374J341993J726538Q86685
39403C68213k14913p02316q41795j123010j212167m04188J214559K560019K616043
39394B260445J478652J04969p97860j146200q49882K55304J471411J326030m40679
39385C662190j860199j063877R37432J416998k96384j964152j669211k17763M90330
39376e64636J14756k70002j06938J36405J07347J30115M62841O81377K14985p18403
39366A87847j146696n25799M33858O89503M47488Q51686J913543K071797N96288
39357E519515r26787q72480j39712n41207j538388j064717O45926Q86537j191693
$$ y = [2211516, 2345227, 3794048, 5995830, 7355466, 7382277, 7218817, 7332971, 6186078, 2540419, -2046195, -4734270, -4846093, -4147287, -3938377, -3587003, -2245010, -518472, 368213, 153300, -549016, -1390811, -2513821, -3725988, -4130176, -2915617, -355598, 2260445, 3739097, 3844066, 3046206, 1900006, 1050124, 1305428, 2776839, 4102869, 3662190, 1801991, 738114, 1675546, 3092544, 2796160, 832008, -837203, -1054966, -564636, -449880, -719882, -826820, -690415, -583068, -452953, 9888, 691265, 906250, 187847, -958849, -1484648, -1050790, -361287, 86201, 937887, 2851430, 4923227, 5519515, 4592728, 3720248, 3580536, 3039329, 1500941, 436224, 1082150, 1968687, 776994]
39348G76994k752389j298306J584040K518129R53435p27715r45861m80691l26921
39339f99285p4481Q75389J931971K153648J651560J205344R35976L26919n65787
39330G741254r53541o65702o88584j601567k285101j415585K38592O52230l47661
39321F74335p40882L64503J172454K24563j031562o82491K98133k67363j749000
39312a737310j333003J523561M042908L930680J889932j69980j287938j247630
39304E611220k74843M00998m26377j821248j615657R8449P76619m85894j336035
39295I27232o4407J452601Q00159j083961j548353l02309O96979N42887J12344
39286A533172j20138p54697j787147j991998n00300J930058L532786L093797J110710
$$ y = [776994, -1975395, -3273701, -1689661, 828468, 1781903, 1054188, 108327, -372364, -699285, -773766, 101623, 2033594, 4187242, 5838802, 7044146, 7980122, 8307041, 7741254, 6787713, 6122011, 5433427, 3831860, 1546759, 131174, 369766, 1021996, 674335, -66547, 297956, 1470410, 1694973, 663411, -19080, 279053, 11690, -1737310, -3070313, -1546752, 2496156, 6426836, 8316768, 8146788, 6858850, 5611220, 5336377, 5737375, 5310998, 3489750, 1874093, 1972542, 2749161, 2263267, 927232, 862825, 2315426, 3115585, 2031624, 483271, 180962, 877941, 1420828, 1533172, 1413034, 658337, -1128810, -3120808, -3621108, -1691050, 1841736, 4935533, 6046243]
39277F046243m28606o871J591666K291035J462231K02983j038240k881575m566157
39268B672709l808545n05858K043104J627691L97243J130335K527535J496316
39260G580530j510116l121352k207740q09020j76398N99215J757721J985425J069559
39251E167824N16539O60822j04383k145947l237538j796542P07109K051527K072779
39242C892190J695317R50948k90658j037603m99293K35475l88088j847334k036489
39233F74465j78308K037896K400383N00397k008463l054224k029242k10736P59099
39224a108733O63803N71945J105273J631436J310817K35668p46448q72609l8873
39215B752279R99241J070081j92040j668078j933074r87528j29527k41773r21998
$$ y = [6046243, 5617637, 5610766, 7202432, 9493467, 10955698, 11158681, 10120441, 7238866, 2672709, -1135836, -1641694, 401410, 2029101, 2426344, 3556679, 6084214, 7580530, 6070414, 2949062, 741322, -67698, -244096, 355119, 2112840, 4098265, 5167824, 5684363, 6345185, 6240802, 4094855, 857317, -939225, -232116, 1819411, 3892190, 5587507, 6538455, 6247797, 5210194, 4710901, 4946376, 4558288, 2710954, 674465, 496157, 2534053, 4934436, 5434833, 3426370, 372146, -1657096, -1867832, -1108733, -444930, 127015, 1232288, 2863724, 4174541, 4410209, 3663761, 2791152, 2752279, 3751520, 4821601, 4629561, 2961483, 1028409, 40881, -88646, -330419, -1252417]
39206a252417j186706l83733J351654K906888K892626J269803l32018p66958r15874
39197C583265j824972k416376j033298J462839K510645J532909L56463j12425
39189D059050r62783k446453k784811j071562R17209J358756R19867J027093J339801
39180B356167Q40339N1242R1527M62485j48973j388364j566651l76457N46582
39171H67897J05731o81252k54157J287213K346997J831602L13547q79600j247611
39162C690367j263644j111554k60363J197650J815598N67526j317896j747564
39154A570120o16808K99641J22216k20365M2070M38282N29965N89216N17214k77976
39144B993575j384809j425166k06478Q14939Q42817P23507Q98096L81495j114172
$$ y = [-1252417, -2439123, -2822856, -1471202, 1435686, 4328312, 5598115, 5266097, 4499139, 3583265, 1758293, -658083, -1691381, -228542, 2282103, 3815012, 4171475, 4059050, 3096267, 649814, -2134997, -3206559, -2289350, -930594, -10727, 1016366, 2356167, 3196506, 3247748, 3339275, 3801760, 3652787, 2264423, 697772, 321315, 867897, 973628, 292376, 38219, 1325432, 3672429, 5504031, 5817578, 4937978, 3690367, 2426723, 1315169, 1054806, 2252456, 4068054, 4635580, 3317684, 1570120, 953312, 1252953, 1375169, 1154804, 1196874, 1635156, 2165121, 2754337, 3271551, 2993575, 1608766, 183600, -22878, 792061, 1634878, 2358385, 3256481, 3637976, 2523804]
39135B523804j998724j191051N79q9120j069114j607520j480256r48256L98254
39126e461404K380763L183685J563192r10227j713568o21836O39446J063539Q52850
39117I76440R6844j088639j686792q43024O60801J494251J622129J554266P84010
39108C570286j090090k573799j830008M82789K016132J929539J215725L63630
39100D084204q91489j691452n42021J900379K816926Q08360k223853l517669k429869
39091a686484m24509P63219M91657m30730o16135J21012L95666n47676j365508
39082c299488p36977L17840K66808J2892J338099L220727K885744L68433j257482
39073C116596n76790M93347M72557M45384J121369R81198p01999j782076n38434
$$ y = [2523804, 525080, -665971, -665392, -754512, -1823626, -3431146, -4911402, -5859658, -5461404, -3080641, 103044, 1666236, 756009, -957559, -1579395, -939949, 123590, 976440, 1073284, -15355, -1702147, -2545171, -1884370, -390119, 1232010, 2786276, 3570286, 2480196, -93603, -1923611, -1440822, 575310, 2504849, 3720574, 4084204, 3192715, 1501263, 959242, 2859621, 5676547, 6484907, 4261054, 743385, -1686484, -2110993, -1347774, -856117, -1286847, -1902982, -1781970, -1386304, -1933980, -3299488, -4036465, -3718625, -3451817, -3438925, -2100826, 1119901, 4005645, 4374078, 3116596, 2539806, 3033153, 3505710, 3951094, 5072463, 6053661, 5351662, 3569586, 3031152]
39064C031152J227770R85131m57990m92204R06601J261132l71262k100938k171967
39055A817425j142500n20753o82454q66889m63432K63156N33999K8695n81966
39046a614719m51571K10826N33967O01063J433951K953598L327725J289258j896513
39037F387585l767219l250972j195094Q29306J484845L65301j349400j728939
39029b224587l74195J052725J337821J462505K590557L593990K505802k11024
39021I733594j931519j440048l81191o25606j703295j821604n29765P44387O21873
39012B666826n92677j443035j049689J29784J154887J642436J688268J279882
39004E476682L51586q68295k054111k960824k989338j377053J301747K751080
$$ y = [3031152, 4258922, 5244053, 4786063, 4293859, 5200460, 6461592, 6090330, 3989392, 1817425, 674925, 154172, -528282, -1395171, -1858603, -1595447, -1061448, -1032753, -1614719, -2066290, -1855464, -1321497, -720434, 713517, 3667115, 6994840, 8284098, 6387585, 2620366, -630606, -1825700, -996394, 488451, 853752, -495648, -2224587, -2598782, -1546057, -208236, 1254269, 3844826, 7438816, 9944618, 9733594, 7802075, 6362027, 5980836, 5355230, 3651935, 1830331, 1300566, 2044953, 2666826, 2074149, 631114, -418575, -288791, 866096, 2508532, 4196800, 5476682, 5828268, 4959973, 2905862, -54962, -3044300, -4421353, -3119606, -368526]
38996c68526J529221o44568r15473Q05684J986586J323569J21824l99322p15045
38987B723950j193117j035590q0734M41212O1141p0001M30618J89122j187214
38978B79387j795500n89130N71868J24272l56287Q90310K275611J436611m98215
38969B338927p34111M78141P21790M2776N99940K027062J476402j183944k426991
38960C339992o41932J186482L65548j264568n94769J747395K580500Q71108j409485
38951F180271k334310j747258m34991O31692N61898n10231j104355k38876R33945
38942A937785O64862p37571j359081n79059J93524Q427j8189J401876L271432
38933D784006L210010O96544j909434k184295n73353N00259n8265r91988j016544
$$ y = [-368526, 1160695, 516127, -399346, 406338, 2392924, 3716493, 3838317, 3438995, 2723950, 1530833, 495243, 414509, 855721, 916862, 846861, 1277479, 1466601, 279387, -1516113, -2105243, -1533375, -1409103, -1765390, -875080, 1400531, 2837142, 2338927, 1604816, 2082957, 2804747, 2847523, 3447463, 5474525, 6950927, 5766983, 3339992, 2698060, 3884542, 4250090, 2985522, 2390753, 4138148, 6718648, 7589756, 6180271, 3845961, 2098703, 1663712, 2295404, 2857302, 2347071, 1242716, 1003840, 1937785, 2602647, 1865076, 505995, -73064, 120460, 128887, 110698, 1512574, 4784006, 7994016, 8690560, 6781126, 4596831, 4023478, 4523737, 4465472, 3473484, 2456940]
38924B456940n82096n76425o71379k14096K59212j03438p56104n03194M15325
38915b75255N99995k41749q51517m00430M33225O43298O8446q08631j326732r25154
38905c084504J68279P94907L91987J02846J010084J934588R18862j449602k435507
38896a648060r68855J167867K260869K424024J880084N0581k471664l402248j834495
38887b541897Q8565K34471n55194l76004N46537P74475M91558R85101J984822
38878A632434J890210M88322o49650o43378l64579o21423q20375j59533Q78219
38869A630247J077770J52715p79797n23495O01493R59760k59734j710284j643842
38860d95167m83289q1752o04018k55876J421795K331762J091440o49068q74818
$$ y = [2456940, 1874844, 1298419, 627040, 412944, 672156, 568718, -187386, -690580, -275255, 324740, 82991, -768526, -1168956, -735731, -92433, -23987, -832618, -2159350, -3084504, -2916225, -2121318, -1729331, -1626485, -616401, 1318187, 2237049, 787447, -1648060, -2616915, -1449048, 811821, 3235845, 5115929, 5166510, 2694846, -707402, -2541897, -2453332, -2218861, -2774055, -3150059, -2603522, -1829047, -1337489, -352388, 1632434, 3522644, 4010966, 3361316, 2717938, 2353359, 1731936, 911561, 752028, 1630247, 2708017, 2860732, 2080935, 1557440, 2158933, 3118693, 2858959, 1148675, -495167, -978456, -1060208, -1664226, -1920102, -498307, 1833455, 2924895, 2275827, 1401009]
38851A401009k62387m54783r64076l56696P04123M62594n65087j99163J548184
38842A313718K148798N35125j282110j460126q30344r05039j312532p80649N99128
38833a974031J583425J538015Q61719J41895k70624j95848K78438Q44215J278459
38824D085663J358754O83759o46527j388360l64701J611073K316120R69979p77219
38815G848541j268049r48564j109669j585684j066341O66412K047613J531394
38807F115653n52041k318846k372811j236566n24135q63832j280348q00313K27338
38798c605901J019123J610424K187285K034409O07925r02652p41941R14563K236260
38789E359495K314408J730489P22989j108901l049648l423029k126237r52078
$$ y = [1401009, 1138622, 683839, -280237, -636933, 67190, 529784, -35303, -234466, 1313718, 3462516, 3997641, 2715531, 1255405, 425061, -479978, -1792510, -2573159, -1974031, -390606, 1147409, 2009128, 2151023, 1880399, 1684551, 1962989, 2807204, 4085663, 5444417, 6128176, 5481649, 4093289, 3728588, 5339661, 7655781, 8625760, 7848541, 6580492, 5631928, 4522259, 2936575, 1870234, 2536646, 4584259, 6115653, 5563612, 3244766, 871955, -364611, -888746, -1752578, -3032926, -3833239, -3605901, -2586778, -976354, 1210931, 3245340, 3853265, 2950613, 2208672, 3123235, 5359495, 7673903, 9404392, 10127381, 9018480, 5968832, 2545803, 419566, -532512]
38781e32512o92770j35444J144828J501366K56689m30789J073678K766549J951812
38772F903407l10908p95012Q10046J659451L56304j361617j908171j911711k118342
38763A323447j795943n21076N06190L76986N2545N66235J048837J46757j619773
38754H4205k532803k058294j075469j68195Q69572J940446K323000J636799L08565
38745A327826j005185j817687j722290o49813P27427J460028J272036O35638N9027
38736B87007j47872L52455J532748K394870J713342k93123j837186j582140j36620
38727B283481R58502J056961N36507k55660j156123j569914q48972N59548J271937
38718B836267N80625q05947j829773k084521j559817m31166M63533J19325r37352
$$ y = [-532512, -1225282, -1360726, -215898, 1285468, 1542157, 1111368, 2185046, 4951595, 6903407, 6592499, 5797487, 6607533, 8266984, 8623288, 7261671, 5353500, 3441789, 1323447, -472496, -993572, -487382, -110396, -57851, 508384, 1557221, 1703978, 84205, -2448598, -4506892, -5582361, -5750556, -4880984, -2940538, -617538, 1019261, 1327826, 322641, -1495046, -3217336, -3867149, -3139722, -1679694, -407658, 227980, 287007, 139135, 491590, 2024338, 4419208, 6132550, 5839427, 4002241, 2420101, 2283481, 3241983, 4298944, 4835451, 4579791, 3423668, 1853754, 1004782, 1564330, 2836267, 3416892, 2610945, 781172, -1303349, -2863166, -3294332, -2830799, -2711474, -3648826]
38709c648826p37466J223205K542617J120412j377471j661101K67819J274155
38701i96656J82442n98011M82222J397096L05309r48697k4073J538823P27870
38692B066325j638438k040934j15982Q49467l43958q28788J126285K847734J637500
38683C559211p38949j017799M16086P34280m72023j043589k85729K52344K2320
38674A426152L12035J272505J046539r72033k486681j525690N12930Q30516r64600
38665e48327k713078k624735q54240J363163K782901K543473O83844j544905k560119
38656c472023j785397J11927K018857L077981L004375K176456J180495R3457j281082
38647E125046k375793k041382l01847J078530O93494o37222j124988m20352M35333
$$ y = [-3648826, -4386292, -3163087, -620470, 499942, -877529, -2538630, -2270811, -996656, -814214, -1412225, -930003, 467093, 772402, -176295, -200368, 1338455, 2066325, 427887, -1613047, -1729029, -879562, -1223520, -2052308, -926023, 1921711, 3559211, 2820262, 1802463, 2218549, 2952829, 2480806, 1437217, 1151488, 1403832, 1426152, 1738187, 3010692, 4057231, 3085198, 598517, -927173, -414243, 416273, -548327, -3261405, -5886140, -6740380, -5377217, -2594316, -50843, 633001, -911904, -3472023, -5257420, -5145493, -3126636, -48655, 2955720, 5132176, 6312671, 6406128, 5125046, 2749253, 707871, 406024, 1484554, 2178048, 1540826, 415838, -4514, 430819]
38638D30819Q62609J121224J149924N11821n23092j169266j382516j587557j273629
38629a859663L98020K406190K370577Q8149j435867K2346K522287K525773k48707
38620F789105k765777k985614j922693j203058p55230J08336Q92815N62656p36480
38611b015940j688873j302511K01188J703890K009224P75322r47633j541114o01857
38602c408304N71694P54151M55267R67471K131860K241869M58245j673852j945573
38593E52828l06361R96131K70134j452251j797644j56761J659475J998053J395068
38584C158672J195545J161877M8581j758622k153234m96191Q90579j58025k317546
38575d28364k529755m98806Q73311j56194j643218j012582J114547K037302R61087
$$ y = [430819, 1293428, 2414652, 3564576, 4076397, 3553305, 2384039, 1001523, -586034, -1859663, -1461643, 944547, 3315124, 3403273, 1967406, 1989752, 4512039, 7037812, 6789105, 4023328, 1037714, -884979, -2088037, -2843267, -2734931, -1842116, -1279460, -2015940, -3704813, -5007324, -4806136, -3102246, -1093022, -317700, -1265333, -2806447, -3408304, -2836610, -2082459, -1627192, -659721, 1472139, 3714008, 4172253, 2498401, 552828, 246467, 1242598, 1512732, 60481, -1737163, -1893924, -234449, 1763604, 3158672, 4354217, 5516094, 5564675, 3806053, 1652819, 1156628, 2047207, 1889182, -428364, -2958119, -3456925, -2583614, -2739808, -4383026, -5395608, -4281061, -2243759, -1282672]
38566a282672k51431j37415N85065P35413M01678P5951m60543j181780r63220
38557b478954P54555K281559J515577q39018j847989l62477J494420J617313Q38379
38548B973365J103481K096138J680926p26921l114174l440777j874985m613J127317
38539a80243J586290J812850J938575J665530P02639n13727q67154Q1208J141038
38530G367006Q47564m34352r80169l15784J29059n41808j184374o13240K66083
38521D539985q8686j174751j119787K59068J033311J19747j111625j014042k4826
38512A418394L57513o048M7914Q76345J421556R31509J29086L1418L51367m0118
38502E518936j291957k118876j464228L0149Q58189O55184M90727R85497J106623
$$ y = [-1282672, -1534103, -1671518, -1086453, -351040, 50638, 126589, -333954, -1515734, -2478954, -1724399, 557160, 2072737, 1233719, -614270, -976747, 517673, 2134986, 2973365, 4076846, 6172984, 7853910, 7126989, 4012815, 572038, -1302947, -1307560, -180243, 1406047, 3218897, 5157472, 6823002, 7525641, 7011914, 6144760, 6225968, 7367006, 8214570, 7780218, 6800049, 6484265, 6613324, 6071516, 4887142, 4273902, 4539985, 4451299, 3276548, 2156761, 2415829, 3449140, 3568887, 2457262, 1443220, 1418394, 1775907, 1769859, 1817773, 2694118, 4115674, 5047183, 5176269, 5207687, 5559054, 5518936, 4226979, 2108103, 643875, 674024, 1532213, 2187397, 2678124, 3663621, 4770244]
38493D770244l05717k389480k931300j283906O66308J088766O35152J083499K299094
38484C632660K261376K17057j876239j912349m17977M53556p7230q94300j150968
38475B35586j313893j707663j498066o3589J563449J756926M06887r71005j078301
38466b669669k7325J210198J832445J634716R62874L60381o363m31488r32551
38457A933218q90299Q412R47934R60293L75450K50026N64271K72530p82923j444534
38447B194378j174472r84580j574369j823345m29218J806912K793454J874550
38439B683310M03465l18356m32751o34713q95629n88261N41086J816864K005452
38430D580467N23476j512200k063867n64131J185200J360956N47230M72601J032239
$$ y = [4770244, 4464527, 2075047, -856253, -2140159, -1473851, -385085, 250067, 1333566, 3632660, 5894036, 6111093, 4234854, 2322505, 1904528, 2358084, 2280854, 1386554, 235586, -1078307, -2785970, -4284036, -4347625, -2784176, -1027250, -620363, -1591368, -2669669, -2696994, -1486796, 345649, 1980365, 2943239, 3303620, 3297257, 2865769, 1933218, 1042919, 1051331, 1999265, 2959558, 3335008, 3585034, 4149305, 4421835, 3638912, 2194378, 1019906, 35326, -1539043, -3362388, -3791606, -1984694, 808760, 2683310, 3086775, 2768419, 2335668, 1700955, 805326, 217065, 758151, 2575015, 4580467, 5103943, 3591743, 1527876, 963745, 2148945, 3509901, 4057131, 4529732, 5561971]
38421E561971N49762j114250k024341j389799j045510k292609l219744j353407
38413f327927K226951L946646K559480M75230j2205N01187M74246J22530N22370
38404D488508J277147J009102k53386r47726l65366L24526j8598p47948m88594
38395D277665O91121J198699j5771k029974k884321j701376L42350J186958L3568
38386A098919j776027k228317r15664N96839Q19688J48981M9398Q39724J245143
38377a21316L09293j103347j332554m5857J337605J330481m236j271970j283544
38368b185445j46212J056830J413273Q98514J04788m38670n58821l28029J3083
38359a70689J18146j42484m31174l27537N3615K15857R2257K09055P89776J133247
$$ y = [5561971, 6111733, 4997483, 2973142, 1583343, 537833, -1754776, -4974520, -6327927, -4100976, -154330, 2405150, 2880380, 2868175, 3369362, 3843608, 3966138, 4488508, 5765655, 6774757, 6521371, 5573645, 5208279, 5532805, 5514207, 4766259, 4277665, 4968786, 6167485, 6151714, 4121740, 1237419, -463957, -121607, 1065351, 1098919, -677108, -2905425, -3821089, -3224250, -2404562, -2255581, -2206183, -1366459, -121316, 187977, -915370, -2247924, -2293781, -956176, 374305, 370069, -901901, -2185445, -2331657, -1274827, 138446, 1036960, 1141748, 703078, 144257, -183772, -170689, -52543, -195027, -626201, -953738, -900123, -684266, -592009, -382954, 406822, 1540069]
38349A540069L63054j320098k529218j972718J99739K371273K926695J889844
38341C468640Q52564R40194J213935j08289k913507m744587l598602l94107K068817
38332c214942K145116O86106l13645K28230J631029K230837J135683o85021j493698
38323B349695r78885m57211o25708m28747R36718K178173J598682k04902j086361
38314C281454l59840P03647J155422J239433R42956k73003j830964k132222j114023
38305A612860p76666j974880k565534n49306K373520K686211m9133k406057j472735
38296c121720J688239L672160K765068M71610o50227L1035Q13787J93498r93762
38287D869688r23904K10619L28982j100919j868061n14532R33573j51266k746246
$$ y = [1540069, 1903123, 583025, -1946193, -3918911, -3719172, -1347899, 1578796, 3468640, 4321204, 5261398, 6475333, 6367044, 3453537, -1291050, -4889652, -5283759, -3214942, -1069826, -383720, -697365, -469135, 1161894, 3392731, 4528414, 3843393, 2349695, 1370810, 913599, 287891, -140856, 795862, 2974035, 4572717, 4367815, 3281454, 2921614, 3625261, 4780683, 6020116, 6963072, 6690069, 4859105, 2726883, 1612860, 836194, -1138686, -3704220, -4253526, -1880006, 806205, 757072, -1648985, -3121720, -1433481, 2238679, 5003747, 5475357, 4825130, 4856165, 5669952, 5863450, 4869688, 3945784, 4156403, 4485385, 3384466, 1516405, 1001873, 1935446, 1784180, -962066]
38278i62066l430293j295117J106363J744476J356879J105967N70564o34949j316672
38269a754848m52878R46681J353676R76516R09899R77544K05093j084313j453515
38260F23855o01015J20826k68523j039024q96985L63294J809466K447776K020724
38251D580394J060861L30395K5698l89137j319665k247462k230010j060430M93405
38242g55951J516801J656810J151349N60542M00069P12885J044914R94179N77870
38233G859468m2090p87105j440286j712379j732524j812610j531577r8929J870280
38224E72248K300943M94807j267914o47374J244350J417893m68814j733942r50681
38215I61516J02838k95843j065542m39927J077289J798113J521309J127340N17260
$$ y = [-962066, -4392359, -5687476, -4581113, -2836637, -1479758, -373791, 196773, -438176, -1754848, -2207726, -1261045, 92631, 1069147, 1979046, 2956590, 3161683, 2077370, 623855, 22840, 143666, -124857, -1163881, -2060866, -1697572, 111894, 2559670, 4580394, 5641255, 5971650, 5997348, 5608211, 4288546, 2041084, -188926, -1249356, -755951, 760850, 2417660, 3569009, 4129551, 4529620, 5242505, 6287419, 7281598, 7859468, 7817378, 7030273, 5589987, 3877608, 2145084, 332474, -1199103, -1298032, 572248, 2873191, 3367998, 2100084, 1452710, 2697060, 4114953, 3646139, 1912197, 961516, 1064354, 768511, -297031, -736958, 340331, 2138444, 3659753, 4787093, 5304353]
38206E304353r26712k391374k271182o86186M98784L31689k00103q0602L62791
38197e8542N07294M89045N28524K96259l17719o52343k04650N17847O79076J60624
38187A945415n45384j040949j195203r63533l90365L53413R58834Q48102m94513
38178e24183k412459k830810l85880L258301M626380K366270j206308k962486
38170g1175k194124m01990R32353J398642J321349J318332J703615J827286P60587
38161F594875r69545j498356j88610J209591J019043j0156j86947M37862N96663
38152G004420J15990k52640p15610k005255l276790k685311l55413J305076Q89248
38143B3715k52561l54512L57747O60245L01339k36082q28707j347211j082766
$$ y = [5304353, 4377641, 1986267, -284915, -971101, -472317, -140628, -340731, -421333, -58542, 448752, 937797, 1466321, 1762580, 1444861, 792518, 587868, 1105715, 1784791, 1945415, 1400031, 359082, -836121, -1799654, -2190019, -1836606, -877772, -29670, -524183, -2936642, -5767452, -6153332, -2895031, 1731349, 4097619, 2891311, -71175, -2265299, -2667289, -1734936, -336294, 985055, 2303387, 4007002, 5834288, 6594875, 5625330, 4126974, 3938364, 5147955, 6166998, 6156842, 5969895, 6407757, 7004420, 7120410, 6867770, 6152160, 4146905, 870115, -1815196, -2170609, -865533, 23715, -228846, -583358, -225611, 434634, 735973, 499891, -328816, -1676027, -2758793]
38134b758793K52068J623377J902316J428308J268981J438691J047927l8952q72256
38125E291667q05519l14927k20012o30278q22041K8049J798250L013461K135761
38116I474411l18152j791294o82236J401667J610006l86946k104813j723577k74347
38107E204719K48954l52100o83631m544Q70522Q08107k64285j339221j387393
38098C101128m62707K11237l54236j354916q47899J526264L405889K421073n62340
38089G083493k426091j850868n98967l93750n24228K39181J106745O11623o00782
38080B646356n89798P20253J462021Q77921J93349J56764L1531l26437J98519
38071E370479J485682J430151o89186k316296j174568J181388J765652N42171
$$ y = [-2758793, -2506725, -883348, 1018968, 2447276, 3716257, 5154948, 6202875, 6163923, 5291667, 4486148, 4171221, 3951209, 3320931, 2498890, 2526939, 4325189, 7338650, 9474411, 9156259, 7364965, 6682729, 8084396, 9694402, 9307456, 7202643, 5479066, 5204719, 5453673, 5101573, 4417942, 4413398, 5283920, 6092027, 5827742, 4488521, 3101128, 2638421, 2849658, 2495422, 1140506, 292607, 1818871, 5224760, 7645833, 7083493, 4657402, 2806534, 2207567, 1813817, 1289589, 1528770, 2635515, 3247138, 2646356, 2056558, 2776811, 4238832, 5116753, 5310102, 5466866, 5498397, 5171960, 5370479, 6856161, 8286312, 7597126, 5280830, 4106262, 5287650, 7053302, 7595473]
38063G595473k24716K33617Q36503J211027J776012J905168Q18592k03900O63405
38054A4611181K561568L168860K554807K558363L037324K645201K748557N795353
38046C9681214R858624J0402860Q188192R034323J4111376J8107196K0501725
38039A29885510K9433221M6287657N3997667L3401804j0050503m7511548n7000731
38032A78443077m3686889k7424839j9413625j7084367j4891369j1340304p209143
38025C7392541l558106k010230l196558m852626m174781j645234r5015n70345
38017A7289646j530612j700909j412738j224516j112365j046408j000436o37930
38009G623732p5282k40009j218900j251848R30629L631104M064001K205407O74609
$$ y = [7595473, 7370757, 7604374, 8440877, 9651904, 11427916, 13333084, 14151676, 13947776, 14611181, 17172749, 20341609, 22896416, 25454779, 28492103, 31137304, 33885861, 39681214, 49539838, 59942698, 68130890, 77165213, 91276589, 109383785, 129885510, 159318731, 205606388, 259604055, 293005859, 282955356, 235443808, 178443077, 134756188, 107331349, 87917724, 70833357, 55941988, 44601684, 37392541, 33834435, 31824205, 28627647, 23775021, 19600240, 17955006, 17859991, 17289646, 15759034, 14058125, 12645387, 11420871, 10308506, 9262098, 8261662, 7623732, 7548450, 7308441, 6089541, 4837693, 5768322, 9399426, 13463427, 15668834, 16343443]
38000A6343443R79411K051103K726417L519509N067402O445927O160805L882545
37992D7176562M01368l315167o274714p426734o420609m177629k161575j237733
37984A6563769j441919k321692l010638k488193o02960J281148J470921p3195
37976I377241j658605k027503j747707j820249j850471r17319L11430K06849r38688
37967a065022p31609J685604L737693K771287j82386j991258j687532q76386n26690
37958A133701J15510J338681J999661J334394K5495j042804j689757j817282j222052
37949A75547j81257R17105K202932L310628K714946J18184j663687j71813K243645
37940I666230J259938k485798l888041j333800R33141P2112j034529L28339J580701
$$ y = [16343443, 17322854, 19373957, 22100374, 25619883, 30687285, 37133212, 43294017, 47176562, 47577930, 44262763, 37988049, 30561315, 24140706, 19963077, 17801502, 16563769, 15121850, 12800158, 9789520, 7301327, 6698367, 7979515, 9450436, 9377241, 7718636, 5691133, 3943426, 2123177, 272706, -644613, -333183, -126334, -1065022, -1796631, -111027, 3626666, 6397953, 6215567, 4224309, 2536777, 1660391, 1133701, 1249211, 2587892, 4587553, 5921947, 5947442, 4904638, 3214881, 1397599, 175547, -5710, 911395, 3114327, 6424955, 9139901, 9258085, 7594398, 7422585, 9666230, 10926168, 8440370, 4552329, 3218529, 4151670, 4223782, 3189253, 3517592, 5098293]
37931E098293j40288k192776q91217J618011Q29395k095573k108676J039003K343810
37922C499982p4538k277963j387835M06980P17034R27498K635981M121056L385547
37913A1953742J715949J342366J913143J921058J666657K303233L445497L921622
37905C0183267L690510L219600K173971L48683j286940j998511k616960m064342
37897B9649278n630039o028428n200598l941971k693944j616436q50356m9254
37889C638252J140171J742279L41797k160976k870759r21641J143400J277363
37881C329886O99542J032447J285690J31405j118274p62437q1051j132095k553105
37872H32008j287068K063410L411352J084134j834826k066539k32304J002555
$$ y = [5098293, 4958005, 2765229, 1874012, 3492023, 4321418, 2225845, 117169, 1156172, 3499982, 3425444, 1147481, -240354, 166626, 883660, 1811158, 4447139, 8568195, 11953742, 13669691, 15012057, 16925200, 18846258, 20512915, 22816148, 26261645, 30183267, 33873777, 37093377, 39267348, 39616031, 38329091, 36330580, 33713620, 29649278, 24019239, 17990811, 12790213, 8848242, 6154298, 4537862, 3687506, 3638252, 4778423, 6520702, 6862499, 4701523, 1830764, 909123, 2052523, 3329886, 4029428, 5061875, 6347565, 6478970, 5360696, 4598259, 4517208, 3385113, 832008, -455060, 1608350, 5019702, 6103836, 4269010, 2202471, 1970167, 2972722]
37864B972722O87556j64755o90510r82541j392630j946702k137902j137545J088516
37855c703791K923458K497089J63333j587642j129925M48523J084858M08628j62874
37846I41657M57276J604642J716224L84956q26763k03921J544603J675830r51978
37837F342526l857642l934745j575762Q0161l35165q31046N62182K797992L383801
37828B632302J727928l86456j128069l84183O14880P14400j66252j130956j339204
37819A154390q58121k88904J85788Q01430J376586J273804M26514k62833J7953
37810C826607R33134J408525Q87630j35660p32517m43205M17797J154692J242550
37801H559553N83378m54739j105163p17828L78526Q99080Q7609j149781j318442
$$ y = [2972722, 3660278, 3495523, 2805013, 1822472, 429842, -1516860, -3654762, -4792307, -3703791, -780333, 1716756, 1880089, 292447, -837478, -388955, 695903, 1104531, 941657, 1398933, 3003575, 4719799, 5104755, 4277992, 4074071, 5618674, 7294504, 6342526, 2484884, -1449861, -3025623, -2945462, -3280627, -4111673, -3549491, -751499, 2632302, 4360230, 3973774, 2845705, 2461522, 3076402, 3790802, 3624550, 2493594, 1154390, 296269, 7365, 193153, 994583, 2371169, 3644973, 4071487, 3808654, 3826607, 4759741, 6168266, 7055896, 6920236, 6187719, 5744514, 6162311, 7317003, 8559553, 9142931, 8688192, 7583029, 6865201, 7243727, 8142807, 8230416, 7080635, 5762193]
37792E762193j69581J432959K974837M334702M827489L914168K650161K527241
37784B8254169L082857K921104K757931M332524O533912P140491Q993773J7850326
37776H1867087L0413165L1423306J0706756k0284159l8053630l2995820j7611892
37769D5464813q071952o685199o458627m496610l302224l374755k402763n08148
37761A0164535j98924j440957j666999n60277m32673j696341k051312o87519M60783
37752A890316M29483O81390J763264J799271j19351j855984j399997J09724M26803
37743C724919n09050j178221r79629l31594O46006J849206K365838J483831J3463
37734G084769o76047m81769l16572n38680p74765r08045j098734j062673l95280
$$ y = [5762193, 5592612, 7025571, 10000408, 14335110, 19162599, 23076767, 25726928, 28254169, 31337026, 34258130, 37016061, 41348585, 47882497, 55022988, 64016761, 81867087, 112280252, 143703558, 154410314, 134126155, 96072525, 63076705, 45464813, 37392861, 30707662, 24249035, 19752425, 16450201, 13075446, 10672683, 10164535, 9965611, 8524654, 6857655, 6297378, 5864705, 4168364, 2117052, 1429533, 1890316, 2319799, 3001189, 4764453, 6563724, 6444373, 4588389, 3188392, 3298116, 3724919, 3215869, 2037648, 1058019, 726425, 1372431, 3221637, 5587475, 7071306, 7084769, 6408722, 5926953, 5610381, 5071701, 4296936, 3388891, 2290157, 1227484, 832204]
37725H32204M99697P43745J88879n10545q97563r44404m37469Q24740K090247
37716B389531J972491K33327j510610j552368j56893Q09051J66990j259747j766907
37707f75135q03347M75763O72485j52141o06906J48705J139992P72953q54608
37698A17761j723174m59068J578042J793925k28713k028216j412614P83892K064662
37689D86497J602827P70814N80179L31228n79322j036176K39297K304910K743825
37680G444079P63000j719413k397641j056845O70235J254957M50623r28174j789229
37671B691592j557193o26941O7066R5977j37123k70695o35690j500310k088298
37662c961615j243215Q36510K331543J776949j37524j346735q14624M92436J112658
$$ y = [832204, 1331901, 2075646, 2264525, 1753980, 856417, -87987, -525456, 299284, 2389531, 4362022, 4595349, 3084739, 1532371, 1375478, 2184529, 2351519, 1091772, -675135, -1478482, -1002719, -330234, -482375, -1089281, -940576, 199416, 972369, 117761, -1605413, -2064481, -486439, 1307486, 1078773, -949443, -2362057, -1578165, 486497, 2089324, 2860138, 3440317, 3771545, 3192223, 2156047, 2395344, 4700254, 7444079, 8207079, 6487666, 4090025, 3033180, 3703415, 4958372, 5408995, 4480821, 2691592, 1134399, 507458, 574524, 670501, 533378, 262683, -373007, -1873317, -3961615, -5204830, -4368320, -2036777, -259828, -397352, -1744087, -2558711, -2066275, -953617]
37653i53617Q56416N66036O13861N13599K8199k39179J49728N18705p7163j315151
37643F61434j784187q34310M97241Q25939J69703k33214L51571J231679J236613
37634B122469J96482q50848q74046l2834N27116O4796q02370q24029K63320J292134
37624A082190J088226k7500o31947N3765J318235J866832J091896o12730k212860
37615C016107k495229q81501J613822K762831J334828j231042k213868p05503
37607A200445J511279K313713J499999K44952p16328j405543j699783j294894
37599A653840m98596m5011N0314N68218J702412K434522J878503O13440j17255
37590H240387j70541n11368j434440j801613o67943J001630J228355m60255k361126
$$ y = [-953617, -97201, 468835, 1082696, 1596295, 1624494, 1385315, 1535043, 2053748, 1976585, 661434, -1122753, -1957063, -1459822, -633883, -464180, -697394, -345823, 885856, 2122469, 2318951, 1468103, 594057, 561223, 1088339, 1153135, 350765, -473264, -209944, 1082190, 2170416, 2142916, 1510969, 1564734, 2882969, 4749801, 5841697, 5228967, 3016107, 520878, -360623, 1253199, 4016030, 5350858, 4119816, 1905948, 1200445, 2711724, 5025437, 6525436, 6770388, 6054060, 4648517, 2948734, 1653840, 1155244, 1110233, 1160547, 1728765, 3431177, 5865699, 7744202, 8357642, 8240387, 8069846, 7558478, 6124038, 4322425, 3654482, 4656112, 5884467, 5424212, 3063086]
37581C063086k734310j738805o39359P8402P20497J037345L52980q55992r96785
37572a712941M04199J772597J706543R97300J167590J879691J470661k53708j512191
37563E919741j096034P5901N50623K69015O1055J09776q4712o60987j180082j263402
37553B700894q23247J37759J334816J952821J301876j59633j064259p10268O4098
37544D734857M1629o85917r18946k09302M01569j0357p38483n11141M26340N49604
37534C079853p00366k183861k731220k237963q18667J547997L807141L908514
37526C671428J399784j322691j776536l39398R73891J440289J502663Q61190r18215
37517E492405k472403j862540L03910J358921M25995n03268J85593J640754K456794
$$ y = [3063086, 328776, -1410029, -2049388, -1970986, -1250489, -213144, 139836, -716156, -1712941, -1308742, 463855, 2170398, 3167698, 4335288, 6214979, 7685640, 7431932, 5919741, 4823707, 4899608, 5450231, 5719246, 5780301, 5890077, 5805365, 5144378, 3964296, 2700894, 1877647, 2015406, 3350222, 5303043, 6604919, 6445286, 5381027, 4670759, 4734857, 4776486, 4090569, 3171623, 2962321, 3363890, 3353533, 2615050, 2103909, 2530249, 3079853, 2379487, 195626, -2535594, -4773557, -5592224, -4044227, -237086, 3671428, 5071212, 3748521, 1971985, 1632587, 2606478, 4046767, 5549430, 6410620, 5492405, 3020002, 1157462, 1461372, 2820293, 3246288, 2743020, 2928613, 4569367, 7026161]
37508G026161K613827K506874J811993M24938q57702j469856j645040j374089
37500I037106l60424N42791j94990k115293k638606o77341J613312J958290Q61155
37491H026000p7692p46865j603012j922267j046267k9472p8028n38337k82326
37482A701734J73302j15681m54054J88896R31527L58627p31969l77047J305146
37473B980481K237630J481068J34592o72381q52494o31632l48814o25696j362353
37464B340401j346645l06075n4482j646493k915360j521363Q81731Q56802j255625
37455d967109j749282N39398K578284K092148N79401J06105K75456J06745K82684
37446a56170J542945K773850K522094J028399n88458j854844k565286k232566
$$ y = [7026161, 9639988, 12146862, 13958855, 14383793, 13526091, 12056235, 10411195, 9037106, 8676682, 9219473, 9024483, 6909190, 4270584, 3593243, 5206555, 7164845, 8026000, 7948308, 7201443, 5598431, 3676164, 2629897, 2600425, 2522397, 1984060, 1701734, 1875036, 1759355, 1305301, 1494197, 2425724, 2784351, 2052382, 1675335, 2980481, 5218111, 6699179, 6833771, 6161390, 5308896, 4677264, 4328450, 3702754, 2340401, 993756, 687681, 633199, -1013294, -3928654, -5450017, -4568286, -3711484, -4967109, -6716391, -6176993, -3598709, -1506561, -927160, -821055, -545599, -438854, -156170, 1386775, 4160625, 6682719, 7711118, 7122660, 5267816, 2702530, 469964]
37438D69964r61696K53421Q31462J094416J134777O21380j8330J13864O66241
37429D205499M03431n45208q64813o11274j125823k076648j430670Q53794K064520
37420H72808Q66136o70925o21893M9706J2916P936O95039P30420o39800j480458
37410a78115k15890J409834J110714j90430k37472O74807P14988P2092M56773
37401C617301J887863K706399K276578J492532J181124J671597K996051M280971
37393B2110416M700410O124059J1548110J8531324J8295492O082584j0407350
37386G6985045j8558400j5362345q788155n697724n030932l683770k378288k705915
37378A4779516l294906k439896j205223r56519o18660R23283K222071J689313
$$ y = [469964, -491732, -238311, 593151, 1687567, 2822344, 3443724, 3425394, 3539258, 4205499, 4608930, 4063722, 3198909, 2587635, 1461812, -614836, -2045506, -1191712, 872808, 1738944, 1068019, 446126, 495832, 508748, 516684, 1211723, 1942143, 1302343, -178115, -394005, 1015829, 2126543, 1936113, 1698641, 2373448, 3088436, 3160528, 3617301, 5505164, 8211563, 10488141, 11980673, 13161797, 14833394, 17829445, 22110416, 26810826, 32934885, 44482995, 63014319, 81309811, 87392395, 76985045, 58426645, 43064300, 34276145, 28578421, 23547489, 19863719, 17485431, 14779516, 11484610, 9044714, 7839491, 6882972, 6264312, 7187595, 9409666, 11098979]
37370A1098979M26989J34917J49798r32423k339762k302877r29826K50363O01766
37361F157924M41922j52519r49937j006166J9895J011533J027482N04876j73330
37352F881680j491107k885164k253219O42852K451690N24643k851118l520540
37344b500283j373330K25752R3777M80078K449488L736529K530085M85611J01496
37335F229203J090584J294321m9606j716392k447902k035251q75643L21076O17700
37326B428090k75701j264231r60308M00576J089362K82699o53113j76008Q89306
37317A760672M14062j443164j739284R95538L808109K915398o99553k209454L67581
37308D169905L415601K909013l03799k511384k414277j668379j294095n41805
$$ y = [11098979, 11525968, 11660885, 11810683, 10878260, 8538498, 6235621, 5305795, 5556158, 6157924, 6599846, 6447327, 5497390, 4491224, 4511119, 5522652, 6550134, 7055010, 6881680, 5390573, 2505409, 252190, 895042, 3346732, 3871375, 1020257, -2500283, -3873613, -3647861, -3554084, -3074006, -624518, 3112011, 5642096, 6127707, 6229203, 7319787, 8614108, 8564502, 6848110, 4400208, 2364957, 1489314, 1810390, 2428090, 2152389, 888158, -72150, 328426, 1417788, 1700487, 1047374, 871366, 1760672, 2174734, 731570, -1007714, -12176, 3795933, 6711331, 6011778, 3802324, 4169905, 7585506, 10494519, 10190720, 7679336, 5265059, 3596680, 2302585, 1760780]
37300A760780P18339J150518K42586n26930J56505J459937J623481L19209j149041
37291E755384j549807q87928k0977L96557M57046N23436L95845m98865j866876
37282B703815k300549j048453O12703R02327M1474j52065Q67990J523075O91703
37273C842020l73931K5058J163493O75848j839091l619294j976260K186854N182834
37264E267531M565706J370901j570585k416497j132773J178618K811520K242731
37256A2317152l14905k601934k736763j493383q86244j155521j061774p28019
37248A338609j537977k858851j901895J695611L997189J949810j747850k119586
37240a184940J081762L383756K224903n8305n21728M07736P58264K15823m61656
$$ y = [1760780, 2479119, 3629637, 3872223, 3345293, 3501798, 4961735, 6585216, 6904425, 5755384, 4205577, 3317649, 3296672, 3693229, 4150275, 4673711, 5069556, 4570691, 2703815, 403266, -645187, -32484, 869843, 911317, 759252, 1627242, 3150317, 3842020, 3468089, 3493147, 4656640, 5332488, 3493397, -125897, -2102157, 84697, 5267531, 9833237, 11204138, 9633553, 7217056, 6084283, 7262901, 10074421, 12317152, 12002247, 9400313, 6663550, 5170167, 4283923, 3128402, 2066628, 1338609, -199368, -3058219, -4960114, -3264503, 732686, 2682496, 934646, -1184940, -103178, 3280578, 5505481, 5447176, 4925448, 5333184, 6091448, 6307271, 5845615]
37231E845615j340037k509891k723776j017182J098437J211631n06467j384103
37223a325773O4872K302193L047390J883220p0529j763665k579472k114549p06777
37214a263090L88714L04086l82904o65969n53344m92461r2574J044186J691403
37205b1953K49346k235687k609006m9539K297982J721011j34139q5251J517501
37196F50265J675238j12885j104480J9676J115311L34015j000652r82230k07714
37187C86544k36729p67335m88886N00234J090134J033018P55812K60293k54381
37178B278704J99732J696794K312101O76505j511624j706476k58223M77182m6411
37169D118284l63193j35858n25728j371079r84002O71145J403233K95066q52270
$$ y = [5845615, 4505578, 1995687, -728089, -1745271, -646834, 564797, 58330, -1325773, -1260901, 1041292, 4088682, 5971902, 5901373, 4137708, 1558236, -556313, -1263090, -874376, -570290, -953194, -1619163, -2172507, -2664968, -2757542, -1713356, -21953, 227393, -2008294, -4617300, -4666839, -2368857, -647846, -781985, -867236, 650265, 2325503, 2212618, 1108138, 1127814, 2243125, 2577140, 1576488, 594258, 386544, 149815, -617520, -1106406, -606172, 483962, 1516980, 2272792, 2533085, 2278704, 2478436, 4175230, 6487331, 7163836, 5652212, 3945736, 3687513, 4164695, 4118284, 3755091, 3619233, 3093505, 1722426, 738424, 1409569, 2812802, 3107868, 2255598]
37160B255598p15033n15534j372348j984197r16817Q26708J706539K322332L638636
37151E245884M027622J287025k942930m184620j161953K102663J649318j290019
37143D732990k594649j148964J91423p68870k505744k287950k4495J947232K144953
37134c14074J417788J169971J453602J329205L10013j097754j902068j467413
37126H99270k52424L82038k24296q52205L5729J668566J584808o96767k545043
37117c24j850665K8999O15177K9301J84403J304988J740211R16746J64414M55216
37107C588466J225533J669121J569314P36736p89705j928811j555287l34732Q9713
37098D270348l17366j09218Q52653Q64396q38047k682865k879671j401359O16797
$$ y = [2255598, 1540565, 1025031, -347317, -2331514, -3248331, -2421623, -715084, 1607248, 5245884, 9273506, 10560531, 7617601, 3432981, 2271028, 4373691, 6023009, 4732990, 2138341, 989377, 1180800, 411930, -2093814, -4381764, -4406259, -2459027, -314074, 1103714, 2273685, 3727287, 5056492, 5366505, 4268751, 2366683, 899270, 646846, 1028884, 804588, -47617, -11888, 1656678, 3241486, 2544719, -324, -1850989, -1821990, -1206813, -1177512, -993109, 311879, 2052090, 2968836, 3133250, 3588466, 4813999, 6483120, 8052434, 8789170, 7999465, 6070654, 4515367, 4180635, 4270348, 3952982, 3843764, 4696417, 5560813, 4722766, 2039901, -839770, -2241129, -1624332]
37089a624332J927440J400982r65624k984969k231337N76431K302313J858992
37081B59896J346997K022996K128643K77365j745901j684642j56878Q05701O90145
37072C944322k6922j415388k925836k596210J01191K331189J513032o25819n39640
37063b40081J797469L208099K224103M68092o15044j310926j758560j350021m63614
37054A959517l59649q94287n85969O45738J098284J99150m33262L52439J507390
37045C489351J624431Q16495j14156q67571j208201p29843K04554N45083J30528
37036C890671j13964L8870l19388j318706j614882m83884Q89499J254909J101262
37027C324387J457512K008819J706725N29690n45220r03616p18260l40216p99
$$ y = [-1624332, 303108, 1704090, 738466, -2246503, -4477840, -3901409, -1599096, 259896, 1606893, 3629889, 5758532, 6035897, 4289996, 2605354, 2448476, 3254177, 3944322, 3917400, 2502012, -423824, -3020034, -2918843, -587654, 925378, 299559, -240081, 1557388, 4765487, 6989590, 7457682, 6842638, 5531712, 3773152, 2423131, 1959517, 1599868, 705581, 119612, 765350, 1863634, 2062784, 1629522, 1981961, 3489351, 5113782, 5930277, 5816121, 4948550, 3740349, 3010506, 3215060, 3760143, 3890671, 3776707, 3815577, 3496189, 2177483, 562601, 78717, 968216, 2223125, 3324387, 4781899, 6790718, 8497443, 9027133, 8481913, 7578297, 6860037, 6519821, 6519022]
37018F519022O7764k93166j034115j902880k384091j926104p67158r3577n03708
37009b318013q37265J85221J630407J443073k36880r71297K82824J532486Q86565
37000A597121n63029n82400Q54102J851889J455380M88716j95345p99606j694686
36991B412142k454307k258977r57872N45658J126678P48469N44579J146011J512095
36982B364476M06684j411517j863945l51109J533194K192322J552159L13831p78049
36973C958046p58512P60058K315561J940850J48259m91441O99214J359519r9690
36964I831864k036906k448654j911907j744031j476348m83394q4587j289012k152720
36955c795695m40984K366315K990208J374817L39275O58383J79955j859906l230332
$$ y = [6519022, 6586786, 6293620, 5259505, 3356625, 972534, -953570, -1720728, -1814305, -2318013, -3155278, -2970057, -1339650, 103423, -133457, -1104754, -821930, 710556, 1597121, 1034092, 451692, 1305794, 3157683, 4613063, 5101779, 4906434, 4106828, 2412142, -42165, -2301142, -3259014, -2713356, -1586678, -838209, -293630, 852381, 2364476, 2771160, 1359643, -504302, -855411, 677783, 2870105, 4422264, 4736095, 3958046, 3199534, 3959592, 6275153, 8216003, 8364262, 7872821, 8572035, 9931554, 9831864, 7794958, 5346304, 3434397, 1690366, 214018, -269376, -353963, -1642975, -3795695, -4236679, -1870364, 1119844, 2494661, 2833936, 3492319, 3672274, 1812368, -1417964]
36946a417964k431247r26249k84864K23482J558142K697973K329318J050986K25679
36937C025256L089p6468J57458P29760P59505j24854p96174m30418n0834p21721
36927B474599j432441o79291P81378Q99973m19321j187729m20619O62972Q89087
36918A568608P76626J216779J901488J930518J024228n58384k438958l814480
36910A606425l641737j961256k91946K12985L29815J360098K728739K570797P42312
36901C656232n03739L47040J733892J233798q75664k107129j447269m78728n05278
36892A053155o73169l4403M02089n36783j683638j032665R39079J818010R90383
36883A242058L62865Q76206Q17371j062776k863027k025152P33095K224747J099393
$$ y = [-1417964, -3849211, -4775460, -5060324, -4836842, -3278700, -580727, 1748591, 2799577, 3025256, 3028345, 2951877, 3109335, 3839095, 4598600, 4473746, 3677572, 3247154, 3196320, 2474599, 1042158, 362867, 1144245, 2044218, 1624897, 437168, 16549, 679521, 1568608, 2345234, 3562013, 5463501, 7394019, 8418247, 7859863, 5420905, 1606425, -2035312, -3996568, -4288514, -4075529, -3745714, -2385616, 343123, 2913920, 3656232, 3152493, 3499533, 5233425, 6467223, 5591559, 3484430, 2037161, 1558433, 1053155, 379986, 345583, 747672, 210889, -1472749, -2505414, -1566335, 251675, 1242058, 1604923, 2481129, 3298500, 2235724, -627303, -2652455, -1919360, 305387, 1404780]
36874A404780p44640j221935o66014n49588r30181n27152J005039K158258J509180
36865A437747m8201j07914J928234L443467J702980k222706m333710k641863N48818
36856b93148K001419J388764M65766K5918l20909l45920N30410J492832J021833
36847E966965o00441j465947r41346l68460m34258l1171J313659J977657P16062
36838F132720j094166j468967p93132q41204j727233j902031p96372M58600Q91908
36829a139877O20414o8183r61286j190402Q9210J988508K444291J013063l36034
36820B459704J01197J583155K238622J494406L01246k92338n6848L27092l14266
36811G841970k369682m332093m081354j684561L99365N40848r6603K45538J284642
$$ y = [1404780, 660140, -561795, -1227809, -1777397, -2707578, -3234730, -2229691, -71433, 1437747, 1389546, 1281632, 3209866, 6653333, 8356313, 6133607, 1799897, -841966, -293148, 1708271, 3097035, 3562801, 3588719, 3267810, 2921890, 3452300, 4945132, 5966965, 5366524, 3900577, 2959231, 2590771, 2156513, 2125342, 3439001, 5416658, 6132720, 5038554, 3569587, 2776455, 1935251, 208018, -1694013, -2490385, -2031785, -1139877, -519463, -587646, -1548932, -2739334, -2650124, -661616, 1782675, 2795738, 2459704, 2560901, 4144056, 6382678, 7877084, 8178330, 7885992, 7829144, 8156236, 7841970, 5472288, 1140195, -2941159, -4625720, -4226355, -3685507, -3782110, -3536572, -2251930]
36802b251930J655660J237005Q84443P81092O45799P24331R65789J68381k157837
36793B652733l956615k908124J2768J669287J152999M66652Q44250J213103Q34125
36784A981178O55948J019993O37131p93150j389750j80535Q59926j66533j990674
36775F33534k297284j219196l08562M93467K100196L481712K582611k07021k127813
36766C131644j730242k75693O24566O09545l47222k179471l522491k389166J046338
36757e032192M005036M293871K520868M78642j061835k001263j894551o48173
36749F60403O96366J066917O42323J88518j77055o87988j046594p87600j29481
36740D25809L29855M75217N74503N73463J14573q06149j615713j662693r10189
$$ y = [-2251930, -596270, 640735, 1525178, 2306270, 2952069, 3676400, 4642189, 4810570, 2652733, -1303882, -4212006, -4199238, -2529951, -1376952, -910300, -66050, 1147053, 1981178, 2637126, 3657119, 4294250, 3501100, 2111350, 1930815, 2790741, 2624208, 633534, -1663750, -2882946, -3191508, -2698041, -597845, 2883867, 5466478, 5259457, 3131644, 1401402, 1125709, 1750275, 2359820, 2012598, -166873, -3689364, -6078530, -5032192, -1027156, 3266715, 5787583, 6266225, 5204390, 3203127, 1308576, 660403, 1356769, 2423686, 3066009, 3254527, 3077472, 2389484, 1342890, 555290, 425809, 755664, 1230881, 1805384, 2378847, 2493420, 1687271, 71558, -1591135, -2501324]
36731b501324k07034n97556j950863k609685j144937J709319L719151L677310
36723I4381K371842J096148K87003j71936l54093m04721n19554o31049p53829
36714A014192j381284k514779k731620q32366J785461K453354J130176O00149
36706d76717K044492L045070J577855m78873k83065J317013J043336j730639m111779
36697A946693l892324k062905o33243n6403L33446Q48144J328598J594317J452594
36688H58917R08962M95363O28948P34151p337j126872j299328m02110J32254o12090
36678C10858j747217j890767q50441N30167J463881J661215J281325Q79955R69823
36669B608799J375043J415976Q06737r0430q52613j271112j153694n37656L888
$$ y = [-2501324, -2708358, -3305914, -5256777, -7866462, -9011399, -7302080, -3582929, 94381, 2466223, 3562371, 3849374, 3677438, 3323345, 2918624, 2399070, 1768021, 1014192, -367092, -2881871, -5613491, -6445857, -4660396, -2207042, -1076866, -476717, 1567775, 4612845, 6190700, 5711827, 5428762, 6745775, 7789111, 6058472, 1946693, -1945631, -4008536, -4641779, -4698182, -4364736, -3516592, -2187994, -593677, 858917, 1767879, 2263242, 2892190, 3626341, 3619004, 2492132, 1192804, 790694, 922948, 310858, -1436359, -3327126, -4177567, -3647400, -2183519, -522304, 759021, 1638976, 2608799, 3983842, 5399818, 6206555, 6116125, 5263512, 3992400, 2838706, 2301050, 2304938]
36660B304938N732r0750L77763J026105R13208K03266N1567O75415Q75460q7611
36650F255093j386978k011556k107381k149917j779701m84604J162440J916842
36642e85762J292954j7700r59342r74545k98827L68834O65351R10305J284549
36633A685817J142663P0193q07976k0960J809524K385036Q78374j046539j856369
36624D239763j884412j605534k99716K025404L267990J898123l42393o77954O81224
36615G302495J109425m06639k226676k876891k544021j587811J21649J829535
36607G21066J983940N67150m53114O6129Q54863N34548j01148M05117J578012
36598F156563J633575J50444j382852j569459n41809O05418R86661M60644m31158
$$ y = [2304938, 2310670, 2219920, 2597683, 3623788, 4536996, 4740262, 4791829, 5467244, 6342704, 6255093, 4868115, 2856559, 749178, -1400739, -3180440, -3665044, -2502604, -585762, 707192, 689492, -269850, -1244395, -1543222, -1174388, -509037, 401268, 1685817, 2828480, 2898673, 2090697, 2069737, 3879261, 6264297, 7142671, 6096132, 4239763, 2355351, 749817, 450101, 2475505, 5743495, 7641618, 7299225, 6621271, 7302495, 8411920, 8005281, 5778605, 2901714, 357693, -1230118, -1108469, 721066, 2705006, 3272156, 2819042, 2885171, 3740034, 4274582, 4173434, 4578551, 6156563, 7790138, 7940582, 6557730, 4988271, 4446462, 5051880, 6038541, 6499185, 6068027]
36589F068027r72572r73404q46609q67323p42964j88907M65203O15028J04618
36580B661097o08102q37490k48251O41413P15822m62687j880235k272222j751679
36571d042334j241779o85236O62370K236269K345772Q44997k13805N33470J894074
36562B333798K159846J367173L17396r43488k131425j872414K45889K164943J930167
36553E571885M87649k24882n31502j689334k617135j311105J130987J526764l90473
36544A952854j647764j057654o75095j305665p03465J866772L234065J289681
36536B953729j061993l76538J692610J245739j362639k298372n76365P83909k8788
36527I71292j232110r98632L4110Q79649J863118K833178K276577j69283k294784
$$ y = [6068027, 5095455, 4122051, 3275442, 2408119, 1665155, 1476248, 1941451, 2556479, 2661097, 2052995, 1215505, 967254, 1608667, 2324489, 1861802, -18433, -2290655, -4042334, -5284113, -5969349, -5306979, -3070710, -724938, 120059, -93746, 439724, 2333798, 4493644, 5860817, 6178213, 5234725, 3103300, 1230886, 1476775, 3641718, 5571885, 6059534, 5834652, 5303150, 3613816, 996681, -314424, 816563, 2343327, 1952854, 305090, -752564, -1427659, -2733324, -3436789, -1570017, 1664048, 2953729, 1891736, 1515198, 3207808, 4453547, 3090908, 792536, 216171, 1000080, 971292, -260818, -1259450, -1225340, -345691, 1517427, 4350605, 6627182, 6457899, 4163115]
36518D163115k018864p3016J338323J317160N43904j46031l94295l32809o24154
36509C773333j639226k330741j212280J219671K623152J913611N56989P3670P2665
36500E050844k56021n39003l75408l70719o43925p0442J406535J619593n70633
36491E250821k638009j684107R28945J315426j203939l326330k775833r62709
36483e095735N8072M11111Q81765R59877J39083n20611Q1791J126656J071324
36474h86667K5343n77061j74825M27329N28996L18295K29258M49136J075200J974820
36464C389824K426806J592154m51801k554120l470181k747462p92455J413301
36456a193934K613264J910660l90094k715526l418397k170544k1419J847834K994947
$$ y = [4163115, 2144251, 2071235, 3409558, 4726718, 5270622, 5124591, 4730296, 4397487, 3773333, 2134107, -196634, -1408914, -189243, 2433909, 4347520, 4904509, 4978179, 5050844, 4794823, 4255820, 3880412, 3509693, 2865768, 2795326, 4201861, 5821454, 5250821, 2612812, 928705, 1857650, 3173076, 1969137, -1357193, -4133026, -5095735, -5037663, -4626552, -3744787, -2784910, -2645827, -3166438, -3084647, -1957991, -886667, -861324, -1438385, -1613210, -1185881, -656885, -338590, -109332, 339804, 1415004, 3389824, 5816630, 7408784, 6956983, 4402863, 932682, -1814780, -2607235, -1193934, 1419330, 3329990, 2939896, 224370, -3194027, -5364571, -5385990, -3538156, -543209]
36447e43209L236390K067254n51309l120852l535622j463118J125387K289164
36439d95915K068875J478470O58296p15545j899392j575610J22289J408275R86031
36430B035774n44685j691598j683500q19373J23076N47653N04049N02997N89276
36421d36331Q7929j084766j585902l39528J477385J764753O08487J76529J292937
36412A961493K146136J177008o48746j639181j771956j792690j372362n7700R48719
36403a049279J15790j682204j847897L27201K508141K344932L08607j223242p89758
36394i87709R35386K169676J747457J66945q78564l70124P30105P12327m47938
36385C777561r82533K2364J081932L58724j588136k421364j134248Q29039J822582
$$ y = [-543209, 2693181, 4760435, 4209126, 1088274, -2447348, -3910466, -2785079, -495915, 1572960, 3051430, 3709726, 2994181, 1094789, -480821, -358532, 1049743, 2035774, 1491089, -200509, -1884009, -2703382, -2580306, -2032653, -1528604, -1025607, -436331, -348402, -1433168, -3019070, -3358598, -1881213, -116460, 492027, 668556, 1961493, 4107629, 5284637, 4635891, 2996710, 1224754, -567936, -1940298, -1997998, -1049279, -933489, -2615693, -4463590, -4136389, -1628248, 716684, 1025291, -197951, -987709, -52323, 2117353, 3864810, 4031755, 3153191, 2783067, 3513172, 4225499, 3777561, 2795028, 2817392, 3899324, 4258048, 2669912, 248548, -885700, -56661, 1765921]
36376A765921K048697K474421K688523J372889j202978k749068j754781L93489
36368E037113J211202L32806m36410j1809N96833J46812j024547j866683k195731
36359A789586k325445j926199n97350P86120P53700n52894j139285K31429K106277
36350h74061J972743n46158l066017l123349p98931J685305K488537J665653L78210
36341b18068n50381r23802o83744Q2095Q20139R19810M90056J56024Q2844j10342
36331F4631l86552j20717P10745J029746R4067j170274j207662P3565J181396
36322B68945R95245l2108q16131r75905p88705m43822L096K70785J64676J51772
36312a202152Q57995J822074J578812l89181k391690k213377J09142K239414K413396
$$ y = [1765921, 3814618, 6289039, 8977562, 10350451, 9147473, 6398405, 4643624, 5037113, 6248315, 6581121, 6144711, 6132902, 6729735, 6876547, 5852000, 3985317, 1789586, -535859, -2462058, -3059408, -2273288, -1519588, -2072482, -3211767, -2980338, -874061, 1098682, 552524, -2513493, -5636842, -6435773, -4750468, -2261931, -596278, -218068, -768449, -1692251, -2375995, -2293900, -1473761, -553951, -63895, 92129, 174973, 64631, -321921, -442638, 268107, 1297853, 1391920, 221646, -986016, -912451, 268945, 1264190, 1232082, 415951, -559954, -1348659, -1792481, -1789385, -1518600, -1353924, -1202152, -344157, 1477917, 3056729, 2667548, 275858, -1937519, -1828377, 411037, 2824433]
36303B824433J279853M30140K14028n7595n59349p91140n99339l06587k7613K57058
36293B663889K18682l13921o90214l04660K01995k01027j141437j287386m86008
36284a340087O8001n3111J66715J255855K113008J575579N1306j115049j082673
36275A639544P3778J505726J923342Q10182n96176p23786L0939L4532o39285k13746
36265C845050J464891K136420O57281j149811j550860j352742j572179j169086
36257A308964N69008J672764L78253j477801j091615P32465J018779m30949j149183
36248A530685m96523k67563q03644l19464J244000J373107p16089k212256r44584
36239a612331J240202J414956k45198j395190j103360m02312j87642l23524l71077
$$ y = [2824433, 4104286, 4534426, 4748454, 4690859, 4131510, 3340370, 2741031, 2434444, 2406831, 2663889, 2882571, 2568650, 1878436, 1573776, 1775771, 1574744, 433307, -854079, -1340087, -1272086, -1325197, -1158482, 97373, 2210381, 3785960, 3837266, 2722217, 1639544, 1713322, 3219048, 5142390, 5952572, 5356396, 4632610, 4663549, 4698081, 4058796, 3845050, 5309941, 7446361, 8103642, 6953831, 5402971, 4050229, 2478050, 1308964, 1877972, 3550736, 3928989, 2451188, 1359573, 2092038, 3110817, 2679868, 1530685, 1034162, 766599, -37045, -356509, 887491, 2260598, 1544509, -667747, -1612331, -372129, 1042827, 797629, -597561, -1700921, -2103233, -2290875, -2614399, -2985476]
36230b985476n6381N73056Q84345K84908n75238l48269R44149J782545J480338
36221A983977R82953P69772j06440j888840k964717k254838j035303p34931m82677
36212e731044J159918L210685L272889J036314j250538j772992r93685l40702
36204a409155l60239n97599n59032l43254l89449o23001k17005J152345K220986
36195a125403J562968q8287o46670J09864K77343o61964o10990J453755L014880
36186C285496J463220j819438l358591k284510n53859N75419J543891K373942
36178A225570K221315J201961M97141M03905J21501m38610m80195p5935k45746
36169D430907j044884j324967o94064n4702Q6648J85728K67557k81147j136894
$$ y = [-2985476, -3041857, -2468801, -1584456, -1299548, -1874786, -2223055, -1278906, 503639, 1983977, 2966930, 3736702, 3630262, 1741422, -1223295, -3478133, -4513436, -5248367, -5731044, -4571126, -1360441, 1912448, 2948762, 1698224, -74768, -1068453, -1409155, -1769394, -2366993, -2926025, -3269279, -3658728, -4281729, -4498734, -3346389, -1125403, 437565, 349278, -297392, -187528, 89815, -572149, -1183139, 270616, 3285496, 4748716, 2929278, -429313, -2713823, -3267682, -2692263, -1148372, 1225570, 3446885, 4648846, 5145987, 5549892, 5671393, 5232783, 4752588, 4676653, 4430907, 3386023, 2061056, 1366992, 1312290, 1398938, 1584666, 1852223, 1571076, 434182]
36160D34182j050226J7115N55858J2946k01771P98040J660006R52095m10342n29784
36150B238119O56001J536191J212844K47357o48791j329240j678125j440430o95158
36141I8768J83741R63557J405509J030147j98502j255045j070042o8238L08015
36132A397910l09413o98256l0629P32459L37735o76704o96501M67977J264266
36123A788844Q20164K04293M89805R17870L13714p27600q48210m54108j040311
36114A464461k097337j252880J695549L369746J184510k687876l963143j800281
36106d087251O37056P90062m36040p96955J75383J119689Q69432l70589j495297
36097c594510j615109p42330M82264J565324K327932K462906J722348O57868K06442
$$ y = [434182, -616044, -598929, -43071, -30125, -231896, 566144, 2226150, 3178245, 2767903, 2238119, 2894120, 4430311, 5643155, 5890512, 5241721, 3912481, 2234356, 793926, 98768, 282509, 1246066, 2651575, 3681722, 3483220, 2228175, 1158133, 1089895, 1397910, 1088497, 390241, 359612, 1092071, 1429806, 753102, 56601, 524578, 1788844, 2609008, 2813301, 3303106, 4220976, 4534690, 3807090, 2958880, 2504772, 1464461, -632876, -1885756, -190207, 3179539, 4364049, 1676173, -2286970, -4087251, -3450195, -2660133, -3096173, -3893128, -3717745, -2598056, -1728624, -2099213, -3594510, -5209619, -5951949, -5469685, -3904361, -1576429, 886477, 2608825, 3266693, 3473135]
36088C473135K74142j38541j049783j175943j41374O20174J66407m50238k58854
36079A319125j22060p22136o80941J062038K680021J971897Q2528l15408N02815
36070E777879N0538j761110k430166j317141o15883j275840j477735k35869P70402
36061b514925L78640m7268N66211R32190J1986p76329J4524J341782J594099J148164
36051B649074J055276R70235L80375J93984J020779J452504K53308j159851p57516
36042F058168P46834R87585m19408j639105j479303m02185Q76671J809093J402565
36033G940915q09207l276324l706369j896629K02583J227299J673504K257193
36025C612965K460430J392133o43863k092561j699061o3170P06153n64622k444590
$$ y = [3473135, 3747277, 3608736, 2558953, 1383010, 1241636, 1861810, 2028217, 1577979, 1319125, 1197065, 474929, -206012, 856026, 3536047, 5507944, 5590472, 5275064, 5777879, 5828417, 4067307, 1637141, 320000, -295883, -1571723, -3049458, -3285327, -2514925, -2136285, -2183553, -1617342, -685152, -673166, -1449495, -1434971, -93189, 1500910, 2649074, 3704350, 4674585, 5054960, 5248944, 6269723, 7722227, 7975535, 6815684, 6058168, 6805002, 7792587, 7373179, 5734074, 4254771, 3852586, 4729257, 6538350, 7940915, 7131708, 3855384, 149015, -1747614, -1545031, -317732, 1355772, 3612965, 6073395, 7465528, 6821665, 4729104, 3030043, 2966873, 3673026, 3108404, 663814]
36016F63814k747636j580351p98814o93085K95326K165650K576634P09449r07730
36007c16743k68857J032975Q22667o6606Q7233M65114m42902j429025m74281J340806
35997G50381J399757k9020n68272j16652o22301j900349j677188O0582O75769
35988b027293n77691j325383k81203Q17555O31750K57868M77838J43789j042978
35979b925748j084156J045740L201385L111867J454653P1419p57897j383847j190900
35970A542516J1120P75711K12908k74572N23013J084261n34155l183898l967647
35961c810743k301775k42934P84088J279287J728671J504335K87434q46728o04623
35952b222988Q01375J658779O35214j329307j586291R64359L781844L410512N2092
$$ y = [663814, -2083822, -3664173, -4462987, -5156072, -4860746, -2695096, -118462, 590987, -316743, -585600, 447375, 1270042, 1203436, 1290669, 1755783, 1312881, -116144, -590425, 750381, 2150138, 2121118, 1552846, 1436194, 813893, -1086456, -2763644, -2703062, -2027293, -2604984, -3930367, -4211570, -3394015, -2762265, -2504397, -2026559, -1882770, -2925748, -4009904, -2964164, 237221, 3349088, 4803741, 4875160, 4117263, 2733416, 1542516, 1553636, 2329347, 2542255, 2267683, 2790696, 3874957, 3340802, 156904, -3810743, -6112518, -6355452, -5571364, -4292077, -2563406, -1059071, -771637, -1618365, -2222988, -1421613, 237166, 872380, -456927, -2043218, -1078859, 2702985, 6113497, 6165589]
35943F165589k633992k481555j141129p03621o74148R9185Q80613O27190K64293
35934D02425R90185J721812O95414j427303k487370k088208j541995j157361o0049
35925d952450J501211K068715J366156P03804O97516M49529n44993j310209q51192
35916h71913M69725J563788J837632J502897J189854J197092Q32974q19157l019672
35907C883220l528785j702541L4027m85073j753270q58392J843903L200708K083220
35898B717017O97278O92948R12812J03555o83105m8068J205245J202792m24301
35889F376173k447762l662338l541732k116279j81557J043983J225438J206653
35881b097421J492740J412631N06524k63880K65831J642448K165393Q51544j500775
$$ y = [6165589, 3531597, 1050042, -91087, -794708, -1468856, -1369671, -489058, 138132, 402425, 1392610, 3114422, 3809836, 2382533, -104837, -2193045, -3735040, -4892401, -4952450, -3451239, -1382524, -16368, 687436, 1384952, 1834481, 1289488, -20721, -871913, -402188, 1161600, 2999232, 4502129, 5691983, 6889075, 7722049, 6902892, 3883220, 354435, -1348106, -1314079, -1799152, -3552422, -4410814, -2566911, 633797, 2717017, 3414295, 4107243, 5020055, 5123610, 4440505, 4392437, 5597682, 6800474, 6376173, 3928411, 266073, -3275659, -5391938, -5573495, -4529512, -3304074, -2097421, -604681, 807950, 1314474, 1050594, 1316425, 2958873, 5124266, 5975810, 4475035]
35872D475035k957760k001742R67215L510476L302887O64151j823349k329255
35864C807658j359561j86219Q19489J586509J488800K68929j089957j516089j215189
35855B604370j027681j183935j539822k145437k593618j806724K71205J765640
35847e656002J252431J83853R10402K780520K678366k76617l052379k804249n59458
35838d543133Q23806P45068P75931J427419J444041L50334m76371J0292R08639
35829A466026Q80668O838r08777j758008k565125k426326o41499J553359K106784
35820b286060R65608R7024M86078Q91170K55387m22803P4996Q57647J78640j656944
35810e59257k403504q75351J534090K604536J634578k12161j236254o65397P99016
$$ y = [4475035, 1517275, -484467, 482748, 3993224, 7296111, 7960262, 6136913, 3807658, 2448097, 2261878, 3081367, 4667876, 6156676, 6425605, 5335648, 3819559, 2604370, 1576689, 392754, -1147068, -3292505, -5886123, -7692847, -7421642, -5656002, -4403571, -4219718, -3309316, -528796, 2149570, 1872953, -1179426, -3983675, -4543133, -3719327, -2974259, -2198328, -770909, 673132, 1023466, 547095, 557387, 1466026, 2346694, 2353532, 1444755, -313253, -2878378, -5304704, -5946203, -4392844, -2286060, -1320452, -1223428, -737350, 153820, 409207, -13596, 61400, 919047, 1097687, -559257, -2962761, -3838112, -2304022, 300514, 1935092, 1722931, 486677, -178720, 620296]
35801F20296J799366J782288J312128Q42856J9274j269803k084089j627872n20400
35792H74044J66562M31606P42755P08746j02194o25723N10654K429295K641159
35783G776904N56289j520450j584575m81877k87326j414394k493227k367558j200035
35774c016249P4464P70698J058317J621948K428901K249475K75590k168282k855932
35765D38930j539733j70692r8123n61998l61318M63551J228281J597576J368774
35756B365248M10315o99031j096700r69472j147601j303349l59856J108231J192028
35747e00187j9290q4529J606223K170345k22414k872067k436192l9048R16617
35738a480542L43399Q79373K548538K383651k45013k037418q71967R66576O50488
$$ y = [620296, 2419662, 4201950, 5514078, 6356934, 6376208, 5106405, 3022316, 1394444, 874044, 1040606, 1472212, 2214967, 2923713, 2821519, 2195796, 2706450, 5135745, 7776904, 8333193, 6812743, 5228168, 4746291, 4458965, 3044571, 551344, -1816214, -3016249, -2941785, -2171087, -1112770, 509178, 2938079, 5187554, 5463144, 3294862, 438930, -1100803, -1271495, -1369618, -1931616, -2292934, -1829383, -601102, 996474, 2365248, 2775563, 2076532, 979832, 10360, -1137241, -2440590, -2800446, -1692215, -500187, -519477, -604006, 1002217, 3172562, 2950148, 78081, -2358111, -2397159, -1480542, -1137143, -257770, 2290768, 4674419, 4429406, 2391988, 1520021, 2486597, 3137085]
35729C137085r16966j138770K6520N95207J72312L09034J507177K210059J247085
35720G148743l76173r14971j44976N88794J49851j151322k007106j480737P9401
35711A891504J308311R92603p98929k597808k806369j421902j94850m60822j159789
35702e248051j68764K396465L825246K459377O9963p46024j23489m382p13133
35693A747208q39932j66316j58797j162094j408206K33440K328743K820940J522912
35684D917898l54539j891368k560592j795570J78152J774848J593463K10731n43355
35675A529668J19793J162964J122639k47088j684035j615268Q5142J610590J134374
35666C218779q51392k070276j423354j66669K79653K66578P09690J170688N37364
$$ y = [3137085, 2220119, 1081349, 1107869, 1703076, 1875388, 2184422, 3691599, 5901658, 7148743, 6772570, 5857599, 5712623, 6301417, 6451268, 5299946, 3292840, 1812103, 1891504, 3199815, 4192418, 3393489, 795681, -2010688, -3432590, -3627440, -4088262, -5248051, -5416815, -3020350, 804896, 3264273, 3334236, 2588212, 2464723, 2460341, 1747208, 907276, 740960, 582163, -579931, -1988137, -1754697, 574046, 3394986, 4917898, 4563359, 2671991, 111399, -1684171, -1506019, 268829, 1862292, 2073023, 1529668, 1649461, 2812425, 3935064, 3687976, 2003941, 388673, 473815, 2084405, 3218779, 2367387, 297111, -1126243, -1292912, -1013259, -746681, -36991, 1133697, 1671061]
35657A671061j015705k065642j711876l13650J348243K735782L405091K919527
35649F972831J136607j514470l897066m544893k980012o64172M37816L87941R51576
35640c713842K388313K545414L43667j834604j326679P30730J149529l06653p05747
35631g29872J159224K679324J377407j407304k504170j127056O38696Q37333l57565
35622E66017j455711j435491n98382k2188j55847j12132J100190K838491L329388
35613D054335K012452K45702o57942r03249j190448j459784j462000j443219j298063
35604b102216j61304J928718L005956J469438j203958j859785K93395K736579
35596D106823L024003J568744L72835K31084K52689m70070j739374k730482k977325
$$ y = [1671061, 655356, -1410286, -3122162, -3435812, -2087569, 648213, 4053304, 6972831, 8109438, 6594968, 2697902, -1846991, -4827003, -5491175, -5053359, -4665418, -3713842, -1325529, 1219885, 1563552, -271052, -1597731, -867001, 282528, -24125, -729872, 429352, 3108676, 4486083, 3078779, 574609, -552447, 86249, 923582, 566017, -889694, -2325185, -2923567, -2945755, -3101602, -3213734, -2113544, 724947, 4054335, 6066787, 6312489, 5654547, 4751298, 3560850, 2101066, 639066, -804153, -2102216, -2263520, -334802, 2671154, 4140592, 2936634, 1076849, 1370244, 4106823, 7130826, 8699570, 9072405, 9303489, 9556178, 9086108, 7346734, 4616252, 1638927]
35587A638927k723527k459244k216388j513488j61305J183985J717249J521394
35579c012397J331177J378352J165674M60219j80106j52973L93428P79181M98659
35570B661214l98742j321864j525056q24370J47138P40693J053777J340378J116372
35561B989540j45494j675637k032744j144649m11910n23975o27733k07918k11541
35552c992061j256618k079466j153899J064512K826078L243478K539973J029818
35544B221815p00005j377240m61730N88210J18421j171435j241844K04313J612502
35535b06993K155090K195891J425512q20923l134548k766926L17551K773123K441709
35526D379486R68734L64332k30835k053575l510020k501218k29403N36251j77557
$$ y = [1638927, -1084600, -3543844, -5760232, -7273720, -7435025, -6251040, -4533791, -3012397, -1681220, -302868, 862806, 1323025, 1142919, 989946, 1383374, 2162555, 2661214, 2262472, 940608, -584448, -1408818, -1261680, -520987, 532790, 1873168, 2989540, 2844046, 1168409, -864335, -2008984, -2420894, -2944869, -3572602, -3780520, -3992061, -5248679, -7328145, -8482044, -7417532, -4591454, -1347976, 1191997, 2221815, 1521810, 144570, -317160, 271050, 389471, -781964, -2023808, -1819495, -206993, 1948097, 4143988, 5569500, 4748577, 1614029, -1152897, -835346, 1937777, 4379486, 5348220, 5712552, 5481717, 3428142, -81878, -2583096, -2812499, -2276248, -2453805]
35517b453805k32963L62006m68923k557714k950194n61101J876187J950345Q89132
35508d147030R03031J534838R55911o38292j328936m59854P20978J177393J200904
35499h1057J347165J484008J144158J39615j218433k099595j644042k824J418518
35490D87513J341790M4373j057307j010268n5773R95618J573544J537994R64033
35481D821517J765r60971j171701j49891J231788J075683j230775l600405l392186
35472c375176p07684J812162K330510J368802J7852j416616k419504j960330l23714
35463d673698N17513k34765n91682J237432L693504L886408J796014L4268j55385
35454E509609j30719r03684j419244o80595L74682M46943l0578J96718J040409
$$ y = [-2453805, -2686768, -2324762, -2793685, -5351399, -8301593, -8862694, -6986507, -5036162, -4147030, -3243999, -1709161, -753250, -1391542, -2720478, -3180332, -2459354, -1281961, -81057, 1266108, 2750116, 3894274, 4033889, 2815456, 715861, -928181, -931005, 487513, 1829303, 1873676, 816369, -193899, -249672, 745946, 2319490, 3857484, 4821517, 4823282, 3862311, 2690610, 2540719, 3772507, 4848190, 3617415, 17010, -3375176, -4082860, -2270698, 59812, 1428614, 1446466, 29850, -2389654, -4349984, -4673698, -4156185, -4390950, -4982632, -3745200, -51696, 3834712, 5630726, 5664994, 5509609, 5378890, 4475206, 3055962, 2375367, 2750049, 3196992, 3166414, 3363132, 4403541]
35445D403541J269218N47232n3957K66065Q79793P52200o3004o93256r12190j349562
35435E046080j981394j496260P60188K868396K056415j451109m003397k876986
35427a078067L04487J860267P41118q18694q62920K5909L24422k23888q32936
35418e60302j037869q89516l83330M28456J011616P89793J2908m15197j66694
35409a210135k5759p06374j484287r25255Q48420J736100L80898j625960j730083
35400d742435l6428R92100M03634k2875Q24066J213556m57520k465863j991753
35391f283518N30085J916382Q02337p74067o89578N25410J130236P40803K93688
35382a808222L53006N34797L48633p2499j84717K03340O07465N96833N86011J094634
$$ y = [4403541, 5672759, 6219991, 6166034, 6432099, 7311892, 8064092, 8001088, 7307832, 6395642, 5046080, 3064686, 1568426, 2328614, 5197010, 7253425, 5802316, 1798919, -1078067, -773580, 1086687, 1827805, 1009111, 146191, 172100, 496522, 272634, -560302, -1598171, -2487687, -2871017, -2442561, -1430945, -641152, -628244, -1043441, -1210135, -1235894, -1942268, -3426555, -4351810, -3503390, -1767290, -1386392, -3012352, -4742435, -4778863, -3786763, -3383129, -3406004, -2581938, -1368382, -1825902, -4291765, -6283518, -5753433, -3837051, -3034714, -3808781, -4498359, -3972949, -2842713, -2101910, -1808222, -1455216, -920419, -571786, -644285, -829002, -625662, -18197, 578636, 1164647, 2259281]
35372B259281J377836K25309j592038j590519O85044K210121N73803k243860k578463
35363f73486k35062J802046J918260J154935L78860p32679j759595j511737l64292
$$ y = [2259281, 3637117, 3862426, 2270388, 679869, 1364913, 3575034, 4148837, 1904977, -673486, -908548, 893498, 2811758, 3966693, 4345553, 3612874, 1853279, 341542, -22750]
$$ [...]
##END NTUPLES=NMR SPECTRUM
##END=
