##TITLE=31Pdec_B3d2001
 CDCl3, 24 sc
 21.1.2025
##JCAMPDX= 6.0         $$ Bruker NMR JCAMP-DX V2.0
##DATA TYPE= NMR SPECTRUM
##DATA CLASS= NTUPLES
##ORIGIN= UXNMR, Bruker Analytische Messtechnik GmbH
##OWNER= root
$$ XWIN-NMR		Version 3.5
$$ Tue Jan 21 13:52:23 2025 Russian Standard Time (UT+4h)  she@DPX200
##.OBSERVE FREQUENCY= 81.013821
##.OBSERVE NUCLEUS= ^31P
##.ACQUISITION MODE= SIMULTANEOUS
##.ACQUISITION SCHEME= undefined
##.AVERAGES= 24
##.DIGITISER RES= 17
##SPECTROMETER/DATA SYSTEM= spect
##.PULSE SEQUENCE= zgpg30
##.SOLVENT NAME= CDCl3
##.SHIFT REFERENCE= (INTERNAL, CDCl3, 0, 198.062)
##AUDIT TRAIL= $$ (NUMBER, WHEN, WHO, WHERE, WHAT)
$$ ##TITLE= Audit trail, XWIN-NMR		Version 3.5
$$ ##JCAMPDX= 5.01
$$ ##ORIGIN= Bruker BioSpin GmbH
$$ ##OWNER= she
$$ F:/spectra/data/she/nmr/P31/2/pdata/1/auditp.txt
$$ ##AUDIT TRAIL=  $$ (NUMBER, WHEN, WHO, WHERE, WHAT)
(   1,<2025-01-21 13:51:09.68 +0400>,<she>,<DPX200>,
      <created by zg, POWCHK disabled, PULCHK disabled
       configuration hash MD5:
       00 E9 B6 7A A2 85 ED C7 34 08 36 98 17 FE 4E 26
       data hash MD5: 32K
       C7 04 9A AA 1A DA 33 E5 95 CC 43 9B B6 AF 4E 71>)
(   2,<2025-01-21 13:51:12.35 +0400>,<she>,<DPX200>,
      <Start of raw data processing
       efp BC_mod = 2 LB = 1.5 FT_mod = 6 PKNL = 1 PHC0 = 1796.432 PHC1 = -0.5136108 SI = 64K 
       data hash MD5: 64K
       48 1C 75 2C D7 62 01 76 D9 05 00 49 62 4B 65 07>)
(   3,<2025-01-21 13:51:47.51 +0400>,<she>,<DPX200>,
      <pk PHC0 = 19.06834 PHC1 = -45.40001 
       data hash MD5: 64K
       43 62 2E 98 DC 99 D6 00 43 18 1D 3B 49 B1 B7 58>)
(   4,<2025-01-21 13:51:52.04 +0400>,<she>,<DPX200>,
      <abs ABSG = 5 
       data hash MD5: 64K
       BB DA 5D C9 81 4A 78 51 FC 22 F8 45 1B 21 33 01>)
$$ ##END=
$$ 
$$ hash MD5
$$ 55 1C 70 4E F5 01 DB E3 85 E0 44 D5 43 5B 96 E3
##$RELAX= 
##$RELAX= 
##$RELAX= 
##$RELAX= 
##$RELAX= 
##$RELAX= 
##$RELAX= 
##$RELAX= 
$$ Bruker specific parameters
$$ --------------------------
##$DU= <F:/spectra>
##$EXPNO= 2
##$NAME= <P31>
##$PROCNO= 1
##$TYPE= <nmr>
##$USER= <she>
##$AMP= (0..31)
100 100 100 100 100 100 100 100 100 100 100 100 100 100 100 100 100 100 
100 100 100 100 100 100 100 100 100 100 100 100 100 100 
##$AQSEQ= 0
##$AQ_mod= 1
##$AUNM= <au_zg>
##$AUTOPOS= <>
##$BF1= 81.014009
##$BF2= 200.13
##$BF3= 200.13
##$BF4= 200.13
##$BF5= 200.13
##$BF6= 200.13
##$BF7= 200.13
##$BF8= 200.13
##$BYTORDA= 1
##$CFDGTYP= 0
##$CFRGTYP= 5
##$CHEMSTR= <none>
##$CNST= (0..31)
1 1 145 1 1 1 1 1 1 1 1 1 1 1 1 1 1 1 1 1 1 1 1 1 1 1 1 1 1 1 1 1 
##$CPDPRG= <waltz16>
##$CPDPRG1= <>
##$CPDPRG2= <waltz16>
##$CPDPRG3= <>
##$CPDPRG4= <mlev>
##$CPDPRG5= <mlev>
##$CPDPRG6= <mlev>
##$CPDPRG7= <mlev>
##$CPDPRG8= <mlev>
##$CPDPRGB= <>
##$CPDPRGT= <>
##$D= (0..31)
0 1 0 0 0 0 0 0 0 0.06 0 0.03 2e-05 3e-06 0 0 0.0002 0 0 0 0 0 0 0 0 0 
0 0 0 0 0 0 
##$DATE= 1737453069
##$DBL= (0..7)
120 120 120 11 120 120 24 19 
##$DBP= (0..7)
150 150 150 150 150 150 150 150 
##$DBP07= 0
##$DBPNAM0= <>
##$DBPNAM1= <>
$$ [...]
##$SUBNAM3= <"">
##$SUBNAM4= <"">
##$SUBNAM5= <"">
##$SUBNAM6= <"">
##$SUBNAM7= <"">
##$SUBNAM8= <"">
##$SUBNAM9= <"">
##$SW= 400.765351723535
##$SWIBOX= (0..15)
0 1 3 0 0 0 0 0 0 0 0 0 0 0 0 0 
##$SW_h= 32467.5324675325
##$TD= 32768
##$TD0= 1
##$TE= 0
##$TE2= 300
##$TE3= 300
##$TEG= 300
##$TL= (0..7)
0 120 53 12 22 120 120 120 
##$TP= (0..7)
150 150 150 150 150 150 150 150 
##$TP07= 0
##$TPNAME0= <>
##$TPNAME1= <>
##$TPNAME2= <>
##$TPNAME3= <>
##$TPNAME4= <>
##$TPNAME5= <>
##$TPNAME6= <>
##$TPNAME7= <>
##$TPOAL= (0..7)
0.5 0.5 0.5 0.5 0.5 0.5 0.5 0.5 
##$TPOFFS= (0..7)
0 0 0 0 0 0 0 0 
##$TUNHIN= 0
##$TUNHOUT= 0
##$TUNXOUT= 0
##$USERA1= <user>
##$USERA2= <user>
##$USERA3= <user>
##$USERA4= <user>
##$USERA5= <user>
##$V9= 5
##$VALIST= <valist>
##$VCLIST= <CCCCCCCCCCCCCCC>
##$VD= 0
##$VDLIST= <DDDDDDDDDDDDDDD>
##$VPLIST= <PPPPPPPPPPPPPPP>
##$VTLIST= <TTTTTTTTTTTTTTT>
##$WBST= 1024
##$WBSW= 4
##$XGAIN= (0..3)
0 0 0 0 
##$XL= 0
##$YL= 0
##$YMAX_a= 5255
##$YMIN_a= -4427
##$ZGOPTNS= <>
##$ZL1= 120
##$ZL2= 120
##$ZL3= 120
##$ZL4= 120
##$ABSF1= 198.0616
##$ABSF2= -202.7028
##$ABSG= 5
##$ABSL= 3
##$ALPHA= 0
##$AQORDER= 0
##$ASSFAC= 0
##$ASSFACI= 0
##$ASSFACX= 0
##$ASSWID= 0
##$AUNMP= <proc_1d>
##$AZFE= 0.1
##$AZFW= 0.5
##$BCFW= 0
##$BC_mod= 2
##$BYTORDP= 0
##$COROFFS= 0
##$CY= -3
##$DATMOD= 1
##$DC= 0
##$DFILT= <>
##$DTYPP= 0
##$F1P= 0
##$F2P= 0
##$FCOR= 1
##$FTSIZE= 65536
##$FT_mod= 6
##$GAMMA= 0
##$GB= 0
##$INTBC= 1
##$INTSCL= 9.790993e-09
##$ISEN= 30
##$LB= 1.5
##$LEV0= 0
##$LPBIN= 0
##$MAXI= 10000
##$MC2= 0
##$MEAN= 0
##$ME_mod= 0
##$MI= 50
##$NCOEF= 0
##$NC_proc= -7
##$NLEV= 6
##$NOISF1= 182.463
##$NOISF2= 159.3651
##$NSP= 0
##$NTH_PI= 0
##$NZP= 0
##$OFFSET= 198.0616
##$PC= 4
##$PHC0= 1815.5
##$PHC1= -45.91362
##$PH_mod= 1
##$PKNL= yes
##$PPARMOD= 0
##$PSCAL= 0
##$PSIGN= 0
##$REVERSE= no
##$SF= 81.0140089999434
##$SI= 65536
##$SIGF1= 159.3651
##$SIGF2= -187.1042
##$SINO= 113.3802
##$SIOLD= 16384
##$SREGLST= <1H.CDCl3>
##$SSB= 0
##$STSI= 65536
##$STSR= 0
##$SW_p= 32467.5324675325
##$SYMM= 0
##$S_DEV= 0
##$TDeff= 32768
##$TDoff= 0
##$TI= <>
##$TILT= no
##$TM1= 0
##$TM2= 0
##$TOPLEV= 0
##$USERP1= <user>
##$USERP2= <user>
##$USERP3= <user>
##$USERP4= <user>
##$USERP5= <user>
##$WDW= 1
##$XDIM= 65536
##$YMAX_p= 310322493
##$YMIN_p= -23513292
$$ End of Bruker specific parameters
$$ ---------------------------------
##NTUPLES= NMR SPECTRUM
##VAR_NAME=  FREQUENCY,     SPECTRUM/REAL,   SPECTRUM/IMAG
##SYMBOL=    X,             R,               I
##VAR_TYPE=  INDEPENDENT,   DEPENDENT,       DEPENDENT
##VAR_FORM=  AFFN,          ASDF,            ASDF
##VAR_DIM=   65536,         65536,           65536
##UNITS=     HZ,            ARBITRARY UNITS, ARBITRARY UNITS
##FACTOR=    0.49542278885378, 1,            1
##FIRST=     16045.7642231865, 0,            0
##LAST=      -16421.768244346, 0,            0
##MIN=       -16421.768244346, -23513292,    0
##MAX=       16045.7642231865, 310322493,    0
$$ Real data points
##PAGE= N=1
##DATA TABLE= (X++(R..R)), XYDATA
$$ [...]
40818B005241J333655m60267j759431j388308k54159K44278k0947l08817k77654
$$ 2005241 3338896 2878629 1119198 -269110 -523269 -278991 -299938 -608755 -886409
40809h86409j14002O6307K57341K67008r2055o09263p81580k78562P44902J628366
$$ -886409 -1000411 -934104 -676763 -409755 -501810 -1111073 -1892653 -2171215 -1426313 202053
40799B02053J568613L85319j044787j532434q45490J40343N86760M99771K94599
$$ 202053 1770666 2155985 1111198 -421236 -1266726 -1126383 -539623 -39852 254747
40790B54747J32338k621q558J69162L37352K99218J05350r8177k31913j84092
$$ 254747 387085 384464 375906 545068 882420 1181638 1286988 1188811 956898 772806
40780G72806J34013M89957M23832j65479q15824j051306q50200m32063O3993M79344
$$ 772806 906819 1396776 1820608 1655129 839305 -212001 -1062201 -1494264 -1430271 -950927
40770i50927N57265K54470r2058j48917L5956K04581K44226K11920J72256J46693
$$ -950927 -393662 -139192 -231250 -380167 -344211 -139630 104596 316516 488772 635465
40760F35465J13702K1298r2052p3471O7558L0555l42178p15603p24115n28431
$$ 635465 749167 770465 678413 604942 672500 703055 360877 -354726 -1078841 -1607272
40750a607272m27600k32173L10065P80030O56940L80256P58205J421654J162562
$$ -1607272 -2034872 -2267045 -1956980 -1176950 -520010 -139754 618451 2040105 3202667
40741C202667n0554q19390m87287p7408l56046m83571K86554R42679K61167r93108
$$ 3202667 3152113 2332723 1845436 1768028 1411982 928411 1214965 2157644 2418811 1425703
40731A425703j108311n8988N95750J56468m93482n85896m13579l91975m16369
$$ 1425703 317392 258404 854154 1010622 517140 -68756 -482335 -874310 -1290679
40722a290679m04732m63807l56865K56381R97683J151375Q49130Q12432R38998
$$ -1290679 -1695411 -2159218 -2516083 -2259702 -1262019 -110644 738486 1550918 2489916
40713B489916L86798p91180j413229r46466k91215k77849n12664l42378N2055
$$ 2489916 2876714 2085534 672305 -274161 -565376 -843225 -1355889 -1698267 -1646212
40704a646212K36281L43816O07917P66199N46045J40493k36765n84622n85956
$$ -1646212 -1409931 -1066115 -458198 308001 854046 994539 757774 173152 -412804
40695d12804K22473J311575J282771j68513j467822j229200j21769L82803K07216
$$ -412804 -190331 1121244 2404015 2235502 767680 -461520 -583289 -200486 6730
40686F730L09090Q02737R03412M54114J52999L08262N15939N64686N96044L71173
$$ 6730 315820 1118557 2021969 2476083 2629082 2937344 3453283 4017969 4614013 4985186
40676D985186n18603j588060j691374o20482M75563O39958K20905o600k2596k30283
$$ 4985186 4466583 2878523 1187149 566667 1042230 1682188 1903093 1896493 1873897 1643614
40666A643614n27595m49136J7154L78405L57601K06551K29129L16254J44881k84441
$$ 1643614 1116019 666883 684037 1062442 1420043 1626594 1855723 2171977 2316858 2032417
40656B032417n42039l05399J48634K33540k00049p05608q56112o59539k73020
$$ 2032417 1490378 1184979 1333613 1567153 1367104 661496 -194616 -854155 -1127175
40647a127175K55792P47474Q33843M61855P9126K007j2302k43817n15219o05788
$$ -1127175 -871383 -123909 709934 1171789 1250915 1252922 1240620 996803 481584 -124204
40637a24204o61155p13694l35371N96674J282020R24083o8249n91029k88693K79539
$$ -124204 -785359 -1499053 -1834424 -1237750 44270 968353 900104 309075 20382 299921
40627B99921O33023O80469K80460n50392j102672o41662L71123O96655N5034n42957
$$ 299921 932944 1613413 1893873 1343481 240809 -400853 -29730 666925 721959 179002
40617A79002l98936m6412j75721n60599o16652l27221n3414L9402r4352n07681
$$ 179002 -219934 -266346 -442067 -1002666 -1619318 -1946539 -1999953 -1960551 -2054903 -2562584
40607b562584q79654n43588N97958J634806J653835Q43807J14298q0859j5585
$$ -2562584 -3442238 -3985826 -3387868 -1753062 -99227 744580 858878 778019 762434
40598G62434J4294J00479L58719N47937L05919l01867p01692m86382n0917j21430
$$ 762434 776728 877207 1235926 1783863 2089782 1787915 1086223 599841 548924 427494
40588D27494o07151n77605K91623J034632Q27195L14604M77590Q60883L48121
$$ 427494 -179657 -757262 -465639 568993 1396188 1710792 2188382 3049265 3397386
40579C397386p08740q36405Q9266N16554k52404r86150p19912l18123p17315j103195
$$ 3397386 2688646 1852241 1941507 2458061 2205657 1219507 499595 181472 -535843 -1639038
40569a639038l02117J114970J681437J215504O21309R5644q52328j850808j725972
$$ -1639038 -1941155 -826185 855252 2070756 2692065 2787709 1935381 84573 -1641399
40560a641399k78482J228663J638026J060438K91368j59204k62004k61773l97071
$$ -1641399 -1919881 -691218 946808 2007246 2298614 2139410 1877406 1615633 1218562
40551A218562n36799l23753M8500j83535j062009j411237n25987M71899K15533
$$ 1218562 681763 358010 406510 222975 -839034 -2250271 -2776258 -2304359 -2088826
40542b088826o72824n14439O85990J253700N66216j13476J17886N24776L83965
$$ -2088826 -2761650 -3276089 -2590099 -1336399 -770183 -883659 -765773 -240997 142968
40533A42968K61028O54976P88362l6662r78239q52485J6862M34867K19706J47599
$$ 142968 403996 1058972 1847334 1810672 832433 -20052 -3190 431677 651383 798982
40523G98982L82150K50030m77310j172413j313682r95992m15638L48742R27667
$$ 798982 1181132 1431162 953852 -218561 -1532243 -2528235 -2943873 -2595131 -1667464
40514a667464P94488L7183n95608o16893k53326J49985N70645R12331P81727J08920
$$ -1667464 -872976 -835793 -1431401 -2048294 -2301620 -2151635 -1580990 -668659 113068 221988
40504B21988m58551l15638K28497M01388J24969O7679M93431P69800L91576j12102
$$ 221988 -236563 -552201 -323704 77684 202653 270332 763763 1533563 1925139 1813037
40494A813037M3745N78352M57979n16207j343760j299762q90014q10599p64066
$$ 1813037 1856782 2435134 2893113 2376906 1033146 -266616 -1156630 -1967229 -2731295
40485b731295j30486P68888J066892O95739L55533L10191K12770N6045K10928
$$ -2731295 -2861781 -2092893 -1026001 -330262 25271 335462 548232 604277 815205
40476H15205M27055m9533j044847j301943l33497O32605L73255n41348o65317
$$ 815205 1242260 1192727 147880 -1154063 -1487560 -854955 -481700 -1023048 -1688365
40467a688365K45333J131714J242019Q23633L75942J45098L22176Q88357J205447
$$ -1688365 -1443032 -311318 930701 1754334 2130276 2275374 2597550 3485907 4691354
40458D691354N51399p80576j615493j334905n50716j05925n5153n1181j80053
$$ 4691354 5242753 4462177 2846684 1511779 961063 855138 799985 748804 568751
40449E68751p61902j548177j760281j032268R2762Q07549R41268R61605J167363
$$ 568751 -193151 -1741328 -3501609 -4533877 -4441115 -3633566 -2692298 -1730693 -563330
40440e63330J191583M85498q34800j880873j821709p30199M66384Q58541L73950
$$ -563330 628253 1113751 278951 -1601922 -3423631 -4153830 -3687446 -2828905 -2454955
40431b454955k46746k90640J74126N17398M30504K22706J53993k763l52980l40628
$$ -2454955 -2701701 -2992341 -2818215 -2300817 -1870313 -1647607 -1493614 -1496377 -1849357 -2189985
40421b189985M96490J521705J577093N35194n10267o87804k16960L14054P12286
$$ -2189985 -1693495 -171790 1405303 1940497 1430230 742426 525466 839520 1551806
40412A551806Q87688N54282k89248j118220j499107j451206r84786j676J034846
$$ 1551806 2439494 2993776 2704528 1586308 87201 -1364005 -2348791 -2350467 -1315621
40403a315621J195602L73924l43392j93064K38048K10028Q3171L85295N58868
$$ -1315621 -120019 253905 -89487 -282551 -44503 165525 248696 633991 1192859
40394A192859n6955p26528l24557O35062O51519k70543n56013L49780J095627
$$ 1192859 1135904 409376 84819 719881 1371400 1100857 544844 894624 1990251
40385A990251O69961r3613j15638K00923p5296p77812j123285j041629r02375
$$ 1990251 2660212 2566599 2450961 2651884 2576588 1798776 675491 -366138 -1268513
40376a268513n25992L79628J212110J063037J45474l99863r0370M31682N56993
$$ -1268513 -1794505 -1414877 -202767 860270 1005744 605881 515511 947193 1504186
40367A504186M41749L90755K93126O472k80331m02852m85848n65595l84547J00114
$$ 1504186 1945935 2336690 2629816 2636288 2355957 1953105 1467257 901662 517115 617229
40357F17229L95020R0629m67378o15001l37491k46865n45162o12078J7772P50129
$$ 617229 1012249 1102878 635500 20499 -316992 -563857 -1109019 -1721097 -1703325 -953196
40347i53196O53321j05378l47462M23038J208092R10328j16773o96872n65291
$$ -953196 -299875 -405253 -752715 -329677 878415 1788743 1671970 975098 409807
40338D09807m76552p19492o41076R2871P66483O79600J65254r0186j02511k44764
$$ 409807 -66745 -786237 -1427313 -1334442 -567959 111641 276895 186709 84198 -160566
40328a60566l68354j12579K16424m9244q32088j283050r20260j55120L83753M57992
$$ -160566 -528920 -641499 -425075 -474319 -1306407 -2589457 -3509717 -3664837 -3281084 -2823092
40318b823092R4347n05729p87378k33739P84419J158729M32450m94950n31427
$$ -2823092 -2728745 -3234474 -4021852 -4255591 -3471172 -2312443 -1879993 -2374943 -2906370
40309b906370K03072P23682N75315J77037m5653r9626M5236N95841J318243J425768
$$ -2906370 -2703298 -1979616 -1404301 -1227264 -1272917 -1372543 -1327307 -731466 586777 2012545
40299B012545N59399n52667r17070m50641J55557M47928M67619J97168m62352
$$ 2012545 2571944 2019277 1102207 651566 807123 1255051 1722670 1919838 1457486
40290A457486j089198r08582Q3726Q00658L76314o48270j015612l37159N87258
$$ 1457486 368288 -540294 -456568 344090 720404 72134 -943478 -1280637 -693379
40281f93379Q85424M98297l8554k44320m6395K32779K19294l1880p1449K32933
$$ -693379 192045 690342 651788 407468 361073 593852 813146 781266 709817 942750
40271I42750L62009q3699o40680o03302j00556J92024K20312M95751Q63420M37786
$$ 942750 1304759 1221060 580380 -22922 -123478 68546 288858 784609 1648029 2085815
40261B085815q15190j472829m56612J253078J685907L55657j261033j655499q36110
$$ 2085815 1270625 -202204 -658816 594262 2280169 2635826 1374793 -280706 -1116816
40252a116816K13109Q38768J014964Q30267L21928k49457m81429l57826l38843
$$ -1116816 -903707 -64939 950025 1780292 2102220 1852763 1371334 1013508 674665
40243F74665o37199o97285R5649J282632J594419N88484o39987q80759l50975
$$ 674665 37466 -659819 -564170 718462 2312881 2901365 2261378 1380619 1029644
40234A029644r1834l18576l70642p6678k0336l39797l76881J19152M48742J53442
$$ 1029644 937810 619234 248592 171914 151578 -188219 -565100 -445948 2794 156236
40224A56236j43344K37357Q87874R40140K94553m65183r27867r96805o29426o4032
$$ 156236 12892 250249 1138123 2078263 2372816 1907633 979766 -17039 -646465 -710497
40214g10497J21575k19090m32050p2786K70914p4255o38055m63996L83760R57610
$$ -710497 -588922 -808012 -1240062 -1312848 -1041934 -1116189 -1754244 -2218240 -1834480 -876870
40204h76870Q28629L82610j00167o41687r14177m41675M39147P73799L31046j15764
$$ -876870 -48241 334369 234202 -407485 -1321662 -1763337 -1324190 -550391 -219345 -335109
40194c35109m3625J55217O1166l8916K57059P64826J032371R18739N57746J24963
$$ -335109 -378734 -223517 -162351 -201267 55792 820618 1852989 2771728 3329474 3454437
40184C454437j78916k68230l41265n36058n58777j88566J03107j76449m98811
$$ 3454437 3275521 3007291 2666026 2129968 1571191 1382625 1485732 1309283 810472
40175H10472j0794Q32273O60442n87528j297695o02745K76344L1971p17036o86547
$$ 810472 799678 1631951 2292393 1704865 407170 -195575 80769 112740 -604296 -1290843
40165a290843j14985j16653n56997l24178N27894O74709k19246p48655P5867J217430
$$ -1290843 -1405828 -1522481 -2079478 -2403656 -1875762 -1201053 -1420299 -2168954 -2093087 -875657
40155h75657J114877q2855q81852o06248r3831k17819o61389n81889J10260P55747
$$ -875657 239220 156365 -725487 -1331735 -1425566 -1643385 -2304774 -2886663 -2776403 -2020656
40145b020656R79670J044420J111896Q37832Q8601n10487l93076k7473k50661
$$ -2020656 -1040986 3434 1115330 1953162 2041763 1531276 1138200 1110727 860066
40136H60066q48355q14004n8862K93440k86658p84721k67798N31406L64194m59907
$$ 860066 11711 -802293 -861155 -567715 -854373 -1639094 -1906892 -1375486 -1011292 -1471199
40126a471199m59359P52751J831044J538659K76141o27645n28067N8471K78561
$$ -1471199 -1930558 -1177807 653237 2191896 2468037 1840392 1312325 1370796 1649357
40117A649357p4762l79809J4200Q58441J235719Q28908L58209L69632K99719n11811
$$ 1649357 1574595 1194786 1208986 2067427 3303146 4132054 4490263 4859895 5159614 4647803
40107D647803j497650j588594q92259m85158o74438p05668k93147j47562n62249
$$ 4647803 3150153 1561559 669300 184142 -490296 -1195964 -1489111 -1636673 -2198922
40098b198922o65280J98853J259081J337616M50736m40243q28665r68814j015848
$$ -2198922 -2864202 -2665349 -1406268 -68652 382084 -58159 -886824 -1855638 -2871486
40089b871486o94495O6560P29761O52786j64656r75722r72515j19608Q10337J162451
$$ -2871486 -3565981 -3499421 -2769660 -2116874 -2281530 -3257252 -4229767 -4349375 -3539038 -2376587
40079b376587J103832J077954R19331J99771p24300r08827j87265N08268M41898
$$ -2376587 -1272755 -194801 724530 924301 200001 -708826 -896091 -387823 54075
40070E4075j08089o04064r44381r99320l89713O48750J045196L09992n82356n60220
$$ 54075 -54014 -658078 -1602459 -2601779 -2991492 -2342742 -1297546 -987554 -1569910 -2130130
40060b130130K7184K28787J40984N35401J290308J495367R56754L81048Q9932
$$ -2130130 -2102946 -1874159 -1733175 -1197774 92534 1587901 2544655 2925703 3015635
40051C015635k80929p36376p33413k39334R8777R3754K66133O53271N06257l32849
$$ 3015635 2734706 1998330 1264917 1025583 1124360 1218114 1484247 2137518 2643775 2310926
40041B310926q64367m50692Q1413k67148j079633j217653n24019J71191L59187
$$ 2310926 1446559 995867 1077280 810132 -269501 -1487154 -2011173 -1839982 -1480795
40032a480795K09576j17916n88250q44667n05681J22484L79467K49490K82298
$$ -1480795 -1271219 -1389135 -1977385 -2822052 -3327733 -3205249 -2825782 -2576292 -2293994
40023b293994N69490O36953M23895M77589R05737R70438J89123q24370j165897
$$ -2293994 -1724504 -1087551 -663656 -186067 719670 1690108 1879231 1054861 -111036
40014a11036p99931l72981k52510l00442l29818k51053O2465N71206Q69057O52152
$$ -111036 -910967 -1283948 -1536458 -1836900 -2166718 -2417771 -2355306 -1784100 -915043 -262891
40004b62891K80964L90416R78355J359057J049848K58930n48126j088896j180774
$$ -262891 18073 408489 1386844 2745901 3795749 4054679 3506553 2417657 1236883
39995A236883p57650k04406j58491o18311p25376P2557J060940J134595L75249
$$ 1236883 479233 274827 116336 -501975 -1227351 -1154794 -93854 1040741 1415990
39986A415990p1459L05262O89491K69821n16820o84560j24582L98724M26457K48500
$$ 1415990 1344531 1649793 2339284 2609105 2092285 1407725 1283143 1681867 2108324 2356824
39976B356824J96794J61233k6659k34020k81885k04976o8028J58988L60055K26124
$$ 2356824 2553618 2714851 2688192 2454172 2172287 1967311 1899283 2058271 2418326 2644450
39966B644450l03859p94665p71584k86484J69723K04272j72390o47028q70022
$$ 2644450 2340591 1545926 774342 487858 657581 861853 689463 42435 -827587
39957h27587p29079m48134l04225k35386O2810O27664J093435J137618P81589
$$ -827587 -1556666 -2004800 -2309025 -2544411 -2481601 -1853937 -760502 377116 1158705
39948A158705J97792m11390o68065k54648M84208P00622J36170m84454n72521
$$ 1158705 1356497 945107 277042 22394 506602 1207224 1343394 858940 286419
39939B86419n47216r11953j089381k34881J107072J412993L59215n97386k64930
$$ 286419 -260797 -1172750 -2262131 -2497012 -1389940 23053 382268 -215118 -480048
39930d80048O74537Q03990m8880q41165q81553m80807j61143J6469K00468L42726
$$ -480048 194489 998479 949599 108434 -773119 -1253926 -1415069 -1398600 -1198132 -855406
39920h55406K95924J01431n531J13345K34697m3371o63369q75743j35876Q71574
$$ -855406 -559482 -458051 -463582 -350237 -115540 -158911 -822280 -1698023 -1833899 -962325
39910i62325Q56068k52457r53542j77020J135753J276571O5713j075146j086186
$$ -962325 -106257 -358714 -1312256 -1489276 -353523 923048 988761 -86385 -1172571
39901a172571k98350M83183R44087J068088P90258K40678k13519m87029q71915
$$ -1172571 -1470921 -987738 -43651 1024437 1814695 2055373 1841854 1354825 482910
39892D82910j376727j490635r28757j42189K96752M31146O44256R69048J096853
$$ 482910 -893817 -2384452 -3313209 -3455398 -3158646 -2727500 -2083244 -1114196 -17343
39883a7343Q64239L55974l09907r47744j189086p72602N4335O71994O43896K4472
$$ -17343 846896 1202870 892963 -54781 -1243867 -2016469 -1962134 -1290140 -646244 -621772
39873f21772p78757j274182j118591l29181O72276J326791J335061Q59045L70068
$$ -621772 -1400529 -2674711 -3793302 -4122483 -3450207 -2123416 -788355 70690 440758
39864D40758K05897J99537r1250o48333p93589j13071O92552N37578n06459j147275
$$ 440758 646655 846192 754942 106609 -686980 -800051 -107499 430079 -76380 -1223655
39854a223655n70264N00630Q51217K94819l96646o21894l89730P9889N63523P59587
$$ -1223655 -1793919 -1293289 -442072 -147253 -543899 -1165793 -1555523 -1475634 -912111 -152524
39844a52524N37939K26898K35729M46886L67805j51189o90514p42375j93760N88200
$$ -152524 385415 612313 848042 1294928 1662733 1511544 821030 78655 -115105 473095
39834D73095R98047P20933J56069l8517K7225m81683j662002k231285j187925
$$ 473095 1471142 2192075 2348144 2309627 2336852 1855169 193167 -2038118 -3226043
39825c226043N08345J069545L58268j02547M19383Q77460L55713m03082k61862
$$ -3226043 -2717698 -1648153 -1289885 -1392432 -973049 -95589 260124 -142958 -404820
39816d04820N31771Q97598N93579K48348J15186j37510n23315n89551k36535J02707
$$ -404820 126951 1024549 1618128 1866476 1981662 1844152 1320837 731286 494751 597458
39806E97458K22223L87426O50919N82812j7277o67581q33461o32142n30874o09655
$$ 597458 819681 1207107 1858026 2440838 2423561 1755980 922519 290377 -240497 -850152
39796h50152n42350k19787K797j92338n56006m94314J51679P78231P18226J57466
$$ -850152 -1392502 -1612289 -1609492 -1801830 -2357836 -2852150 -2700471 -1922240 -1204014 -1046548
39786a046548n9288L80789P64755L97461l13145m14589J95235O58182M35373l5182
$$ -1046548 -1105836 -725047 39708 437169 124024 -290565 -95330 562852 998225 963043
39776I63043j68763n0842l1860o2228K6842k5361n26541j076153q60680K26725
$$ 963043 794280 743438 711578 649350 676192 650831 124290 -951863 -1812543 -1585818
39766a585818J299424J501018R15647K32215j56302l87806o52612q42100p08759
$$ -1585818 -286394 1214624 2130271 2362486 2206184 1818378 1165766 323666 -385093
39757c85093j91480M60807Q19987N94115n7134n65316m83771p52K36531j16200
$$ -385093 -576573 -115766 704221 1298336 1241202 675886 192115 191363 427894 311694
39747C11694o66970p73286l68865n8202l15746q17633q19293j36635N58475N71006
$$ 311694 -355276 -1128562 -1497427 -1555629 -1871375 -2689008 -3508301 -3644936 -3086461 -2515455
39737b515455Q8320m9416N42522J233600J113373J25038p93682p39307J45339
$$ -2515455 -2427135 -2476551 -1934029 -700429 412944 537982 -255700 -995007 -849668
39728h49668Q10167M41478o14934j172039m84459Q81770J603268R83704m04098
$$ -849668 -39501 401977 -212957 -1384996 -1869455 -987685 615583 1599287 1195189
39719A195189j441579j522026p79135L18515J181678J182339J70939j018793j184039
$$ 1195189 -246390 -1768416 -2547551 -2229036 -1047358 134981 305920 -712873 -1896912
39710a896912j75758P62132N08681m51264o67348L20538J405568J461444P67808
$$ -1896912 -2072670 -1310538 -801857 -1253121 -1920469 -1599931 -194363 1267081 2034889
39701B034889L64978M56540K76053m86207j008340n57936K59191K75181n08934
$$ 2034889 2399867 2856407 3132460 2646253 1637913 1079977 1339168 1614349 1105415
39692A105415r35485m97273q0071m14565p82555j99503Q36688J012958K51119
$$ 1105415 169930 -327343 -407414 -821979 -1604534 -1804037 -967349 45609 296728
39683B96728k77012j22271n7388l31387l6485J012579J309918j18314j711134
$$ 296728 19716 -102555 -159943 -491330 -527815 484764 1794682 1676368 -34766
39674c4766j269435Q38749K142979J455232K1881p43452q86263q24314l14193
$$ -34766 -1304201 -465452 1677527 3132759 3154640 2411188 1524925 700611 386418
39665C86418O12823R89124K49690o90776p08268o6124K52216J48123K47336N78926
$$ 386418 999241 1988365 2238055 1547279 839011 772887 1025103 1173226 1420562 1999488
39655A999488N51636Q6911k40034k03034k06551m64281o32923m39261q0379J88333
$$ 1999488 2551124 2638035 2398001 2194967 1988416 1524135 891212 451951 371572 559905
39645E59905L80309N04012L64595j21815o40846p03624j35403O54545R22587L10513
$$ 559905 940214 1444226 1808821 1687006 1046160 342536 207133 861678 1784265 2094778
39635B094778o70566j188523j124201j037906j031697m69258P36349J451361P99803
$$ 2094778 1424212 235689 -888512 -1926418 -2958115 -3427373 -2691024 -1239663 -439860
39626d39860l64075n54538K03649N59716r441n56144l45229Q4979M3498j81206
$$ -439860 -803935 -1358473 -1154824 -595108 -604549 -1160693 -1505922 -1420943 -1377445 -1558651
39616a558651j4265L44172L18291o7379l17565k84533k42543k68994n1095O19840
$$ -1558651 -1572916 -1228744 -910453 -977832 -1295397 -1579930 -1822473 -2091467 -2142562 -1522722
39606a522722J382261J452233L96651j107697j626874n58372R32282J289576O43301
$$ -1522722 -140461 1311772 1708423 600726 -1026148 -1584520 -652238 637338 1280639
39597A280639M60254J133094J285491K1949j456245j543951n64378q3308m86285
$$ 1280639 1740893 2873987 4159478 4181427 2725182 1181231 616853 533545 47260
39588D7260p05443j98558K61737O5529k07439J39193P03254O16511j09807o15707
$$ 47260 -658183 -856741 -595004 -529475 -736914 -597721 105533 722044 612237 -3470
39578c470l70733K80795P22227P28548M34503K6810k92176k65873J51309N36129
$$ -3470 -374203 -93408 628819 1357367 1791870 1818680 1526504 1260631 1411940 1948069
39568A948069L79512j53897k58068M02782J015257O10968n46785j314989j247060
$$ 1948069 2327581 2173684 1915616 2318398 3333655 3944623 3397838 2082849 835789
39559H35789q82722m75958L49650J308553J177786k89098j383109o84206O70781
$$ 835789 -46933 -522891 -173241 1135312 2313098 2024000 640891 -43315 627466
39550F27466O07147o46685r31127L42570J224995L46920r68499q78686K24238
$$ 627466 1234613 587928 -343199 -629 1224366 1571286 602787 -275899 -51661
39541e1661O37247K0734m50382j10437M84398P02332M70654j74125j067912j460738
$$ -51661 585586 606320 155938 45501 529899 1232231 1702885 1528760 460848 -999890
39531i99890o72381O66737J079960K17385o12621k73674P49763J276450J005952
$$ -999890 -1672271 -1005534 74426 291811 -320810 -594484 155279 1431729 2437681
39522B437681M84605J03834j02236n5658K23496L17876o0902m39138j91446L26232
$$ 2437681 2922286 3026120 2923884 2868226 3091722 3409598 3348696 2909558 2718112 3044344
39512C044344Q7741j010721j694487r39440N15816R76388j04608j501523j769374
$$ 3044344 3132085 2121364 426877 -512563 3253 979641 875033 -626490 -2395864
39503b395864q51166J72638N22733L71929J80710L0777r3181J33180R19790J659112
$$ -2395864 -3247030 -3074392 -2551659 -2179730 -1999020 -1968243 -2061424 -1928244 -1008454 650658
39493F50658J401640J86219p73181o32388p5634k84909j142544j340297k64040
$$ 650658 2052298 2238517 1465336 832948 757314 472405 -670139 -2010436 -2274476
39484b274476J097664J440989O74867k84689p32854o42693k63012J42978K87661
$$ -2274476 -1176812 264177 939044 654355 -78499 -721192 -984204 -841226 -553565
39475e53565J02372m5816K09590O42073O96738L08403J254J31099M58975N71667
$$ -553565 -451193 -497009 -287419 354654 1051392 1359795 1361049 1492148 1951123 2522790
39465B522790L34789j64971p17853r15231m42858L32464N39599r3042p28130m67290
$$ 2522790 2857579 2692608 1974755 1059524 616666 949130 1488729 1395687 667557 200267
39455B00267M14184Q32613L31170m35528o70387l50967P932R8838K0892o5136
$$ 200267 614451 1447064 1778234 1342706 672319 321352 329284 428122 449014 383878
39445C83878j72960l63188n34043m52023l3743M58574O46757M80728K64189J71564
$$ 383878 210918 -152270 -686313 -1138336 -1172079 -713505 -66748 413980 678169 849733
39435H49733K168m04639p80386p50959l52124R2673M14525N61601L53828k15656
$$ 849733 851901 447262 -333124 -1084083 -1436207 -1343534 -929009 -367408 -13580 -229236
39425b29236n94830k27094N24528P07063J57898k01070K24810P54240M76959l55687
$$ -229236 -824066 -1051160 -526632 180431 338329 137259 362069 1116309 1593268 1237581
39415A237581p42447l51127K64154O28700P03992L81697m81721j398723j470038
$$ 1237581 495134 144007 408161 1036861 1740853 2122550 1640829 242106 -1227932
39406a227932n85570L26457O24973P70495J245258J419355M56764j062715j581305
$$ -1227932 -1813502 -1487045 -862072 -91577 1153681 2573036 3029800 1967085 385780
39397C85780o80331K97481J38659o28348p12985n362M41506J57182p2140M51291
$$ 385780 -294551 2930 141589 -486759 -1199744 -1205106 -763600 -606418 -678558 -227267
39387b27267J184919J170097M65559m8427q2471k70348r49766j437942j002608
$$ -227267 957652 2127749 2593308 2544881 2462410 2192062 1242296 -195646 -1198254
39378a198254L3522P72126R20336Q19701N97252R6936m52330n73224m23181o56052
$$ -1198254 -1164732 -392606 527730 1347431 1944683 2041619 1589289 1016065 592884 -63168
39368f3168j190644j090229j16874O08377K58388l22160L7637Q71778Q30734n6348
$$ -63168 -1253812 -2344041 -2460915 -1852538 -1594150 -1916310 -1878673 -1006895 -176161 -232509
39358b32509m45358P4085M41044J23438j5674M48689M11821q31081j874213j002553
$$ -232509 -677867 -603782 -162738 -39300 -54974 393715 805536 -25545 -1899758 -2902311
39348b902311J096457K108222J233407p0417m73793l19968m00145n57314k68756
$$ -2902311 -1805854 302368 1535775 1465358 991565 671597 271452 -285862 -554618
39339e54618K76942M71363J72297k46977l92569p6872N69012R91758O57333k32253
$$ -554618 -277676 193687 365984 119007 -273562 -350434 218578 1210336 1867669 1635416
39329A635416r33999j163969j274087j309551p30146N34398J557394J550213Q89713
$$ 1635416 701417 -462552 -1736639 -3046190 -3776336 -3241938 -1684544 -134331 755382
39320G55382L78871P7192l85304q27052p34895k19022P2326r5263l58357m47287
$$ 755382 1134253 1211445 826141 -911 -735806 -954828 -882502 -977765 -1336122 -1783409
39310a783409m25202k91380L9720L77719M34229L25068L35000K59758l29433j125156
$$ -1783409 -2208611 -2499991 -2460271 -2082552 -1648323 -1323255 -988255 -728497 -1057930 -2183086
39300b183086j146917m5600J265765J665306J062607K16849l07662n56129p47919
$$ -2183086 -3330003 -3375603 -2109838 -444532 618075 834924 527262 -28867 -776786
39291g76786q63879p18382k39183L95918Q69320R68637O97893J58355n11313r95485
$$ -776786 -1640665 -2359047 -2598230 -2202312 -1332992 -364355 333538 491893 -19420 -1014905
39281a014905q88111k05751M09247L95593M5402J12336P01082J068661O47005
$$ -1014905 -1903016 -2108767 -1699520 -1303927 -1258525 -1146189 -445107 623554 1270559
39272A270559j94302o36839l50271K86787O81631N29945n0538p04948j129596
$$ 1270559 1076257 439418 89147 375934 1057565 1587510 1536972 832024 -297572
39263b97572j174375p34919J79174J143567J448844Q74570O0223k78476k09666
$$ -297572 -1471947 -2206866 -2027692 -884125 564719 1439289 1499512 1221036 1011370
39254A011370k13996l32422l45280m67407r85771j381925q42044L33978R25613
$$ 1011370 797374 464952 119672 -347735 -1333506 -2715431 -3557475 -3223497 -2297884
39245b297884N91572L14010O44585P66869O4053n70563j19205P85879Q22346J02860
$$ -2297884 -1706312 -1392302 -747717 19152 83205 -487358 -606563 179316 1001662 1104522
39235A104522j17512M43581P76361L91075j6684l5114l06351j189422j777225
$$ 1104522 987010 1430591 2206952 2598027 2581343 2546229 2239878 1050456 -726769
39226g26769j118236L23283J252985J080273J83793q47329j510038j360228m87533
$$ -726769 -1845005 -1521722 -268737 811536 995329 148000 -1362038 -2722266 -3209799
39217c209799K50552K07278p6915L49600J291462J546035O49100m27215o07437
$$ -3209799 -2959247 -2751969 -2828884 -2479284 -1187822 358213 1007313 580098 -27339
39208b7339J9265O57587Q70844O80160J29530o35691j156305j067219n46259K6578
$$ -27339 -8074 649513 1520357 2200517 2330047 1694356 538051 -529168 -1075427 -1048849
39198a048849N85116J129122J302955Q28579J46475m2681K17625K68424p1296
$$ -1048849 -463733 665389 1968344 2796923 2943398 2900717 3118342 3386766 3315470
39189C315470l01871k37265l80383r72269j420892j208554p66614p91020j101097
$$ 3315470 3013599 2776334 2395951 1423682 2790 -1205764 -1972378 -2763398 -3864495
39180c864495q91379P4283J162800J708299J609305J090028L64732l26089o92852
$$ -3864495 -4755874 -4681591 -3518791 -1810492 -201187 888841 1253573 927484 234632
39171B34632o23509l47253k85458o67281j181531j131394k44034P78053J007911
$$ 234632 -388877 -736130 -1021588 -1688869 -2870400 -4001794 -4245828 -3467775 -2459864
39162b459864N46149L30466O40226P27471K53966M08M56127P76616J70104o22779
$$ -2459864 -1913715 -1583249 -943023 -215552 38414 38822 494949 1271565 1441669 818890
39152H18890n19799K1635j62339q11010o89127J26957L13080l01632l45437O72358
$$ 818890 299091 320726 158387 -652623 -1341750 -1214793 -901713 -1203345 -1548782 -876424
39142h76424J418065R20852j0597m33255o97261j154514r94732K68571J439587
$$ -876424 541641 1462493 1451896 1018641 321380 -833134 -1827866 -1559295 -119708
39133a19708J249490K93102j00085K1634j91061n28769j70017N42060M91486k98124
$$ -119708 1129782 1422884 1322799 1344433 1153372 624603 454586 996646 1488132 1190008
39123A190008p09103l38869J73580M77937P47233P22691O34p80092n40511M10071
$$ 1190008 480905 142036 315616 793553 1540786 2263477 2264111 1484019 943508 1353579
39113A353579O64741n3678n42456k36323r117l84439n97358j78908N4886m46934
$$ 1353579 2018320 1964642 1422186 1185863 1176746 792307 194949 16041 70927 -376007
39103c76007p76321m6565J020914J182893N33470J31933L64209O97370O27360
$$ -376007 -1152328 -1198893 -177979 1004914 1538384 1670317 2034526 2731896 3359256
39094C359256L9151r38396j735132j519131k60712R30745J169245Q28940N58079
$$ 3359256 3398407 2460011 724879 -794252 -1054964 -124219 1045026 1873966 2432045
39085B432045J26269p74604j395506q74227K01904N18660N2058K1620Q51167J460559
$$ 2432045 2558314 1783710 388204 -486023 -284119 234541 286599 308219 1159386 2619945
39075B619945Q64018n33387j586943j629351q00123K20448O60001L73557J04408
$$ 2619945 3483963 2950576 1363633 -265718 -1065841 -845393 -185392 188165 292573
39066B92573M64514Q55139K34250j162275j908487j337214l70322o5352k87271
$$ 292573 757087 1612226 1846476 684201 -1224286 -2561500 -2931822 -2997174 -3284445
39057c284445l16375N7240O24393J226551J530044R88458k83795j160477p83003
$$ -3284445 -3600820 -3543580 -2919187 -1692636 -162592 825866 542071 -618406 -1401409
39048a401409K32875O30779J94591k47192k61865k94618o52058q99886o07989
$$ -1401409 -1168534 -537755 -343164 -590356 -852221 -1146839 -1798897 -2698783 -3306772
39039c306772l7953L24799M43787N01122L66174j84012q73319j066010n66128
$$ -3306772 -3344725 -3019926 -2576139 -2075017 -1708843 -1892855 -2766174 -3832184 -4398312
39030d398312Q1252K61728N3508Q5231O73287J333583J322502N82858j28722j95701
$$ -4398312 -4317060 -4055332 -4001824 -3916593 -3243306 -1909723 -587221 -4363 -133085 -328786
39020c28786M3597j92698r08432j166525l65993Q04107J164633N20583k32985
$$ -328786 -285189 -477887 -1386319 -2552844 -2918837 -2114730 -950097 -429514 -662499
39011f62499l60220q74M17975P91948J051898Q79745K33791k62532n5619M59601
$$ -662499 -1022719 -1023593 -605618 186330 1238228 2117973 2351764 2089232 2033613 2493214
39001B493214L94542m04926j131470j010733j01431Q46000R68317p0968j528912
$$ 2493214 2887756 2482830 1351360 340627 239196 1085196 2053513 1982545 453633
38992D53633j922222o06683J153552J515253L64508o80089n94460n8373J03023
$$ 453633 -1468589 -2075272 -921720 593533 958041 277952 -316508 -374881 -271858
38983b71858K19672O80568P65871j46151j070562o29497O82185J027000p2624
$$ -271858 -52186 628382 1394253 1248102 177540 -451957 230228 1257228 1184604
38974A184604j133333j056242n52338n98503q04468l13805O04611J000166P44926
$$ 1184604 51271 -1004971 -1557309 -2155812 -2960280 -3274085 -2669474 -1669308 -924382
38965i24382N29107O18360N84889K09269k05075m79763p71585r90615p12056N5993
$$ -924382 -395275 223085 807974 1017243 812168 332405 -439180 -1429795 -2141851 -2085858
38955b085858O35190O03702M46101P53835J154440P22105o26891j811636j838281
$$ -2085858 -1450668 -846966 -400865 352970 1507410 2229515 1602624 -209012 -2047293
38946b047293q82873J29690N99485N47840K18501r0029P562O00851J112096Q84934
$$ -2047293 -2930166 -2800476 -2200991 -1653151 -1434650 -1524679 -1517117 -916266 195830 1080764
38936A080764J75433r4142K78059M01734k70174r08293m88920N34871P58107j75526
$$ 1080764 1256197 1162055 1440114 1841848 1571674 663381 174461 709332 1467439 1291913
38926A291913j143686j207462o91857k53101J83443Q69328J310623Q20882k57845
$$ 1291913 148227 -1059235 -1751092 -2004193 -1820750 -951422 359201 1180083 922238
38917I22238p46078j24647P83608Q52632l7057r86392j136582m88166K54046M54243
$$ 922238 176160 51513 835121 1687753 1650696 664304 -472278 -960444 -706398 -252155
38907b52155J02953l28803m54465k73475J2775K39082K65445j3491m53228o29143
$$ -252155 -149202 -478005 -932470 -1205945 -1193170 -954088 -688643 -702134 -1155362 -1784505
38897a784505k60035M15813Q74395Q45511M67200K6215k38510j77862J42499L79444
$$ -1784505 -2044540 -1628727 -754332 91179 558379 584594 346084 168222 310721 690165
38887F90165K38750j10197j92362J41626M81171L70951j24018n13499m29483M2731
$$ 690165 928915 818718 626356 767982 1249153 1620104 1496086 982587 553104 595835
38877E95835N08621O46223M72857K54575J31463o6541m91898r06308r45924p12058
$$ 595835 1104456 1750679 2223536 2478111 2609574 2543033 2051135 1144827 198903 -513155
38867e13155o71052q66830p29147K5068P58633O99792O0722k54474O5228M12339
$$ -513155 -1184207 -2051037 -2780184 -2755116 -1996483 -1296691 -1235969 -1490443 -1425215 -1012876
38857a012876K69883j08312k43329r0622J55802M38605O64175N79313K02840j8472
$$ -1012876 -742993 -851305 -1094634 -1185256 -1029454 -590849 73326 652639 855479 837007
38847H37007J01415P3850m46728q37671k52785J006168J686651J189371K07028
$$ 837007 938422 1012272 565544 -272127 -524912 481256 2167907 3357278 3564306
38838C564306m06791o36654p94091p03626o5614P32327Q80868J96971o34588r63173
$$ 3564306 3157515 2520861 1726770 1023144 957530 1689857 2570725 2767696 2133108 1169935
38828A169935q82788q46452r32949q64576n83542l47143j90923K16457Q87981
$$ 1169935 287147 -559305 -1492254 -2356830 -2940372 -3287515 -3478438 -3261981 -2374000
38819b374000J151070N42373k45867j31709P22578J028099L32553k29137K59635
$$ -2374000 -1222930 -680557 -926424 -1058133 -335555 692544 1025097 795960 1055595
38810A055595R83357O52240n27713j297853j188935o88696j5517Q94123J428431
$$ 1055595 2038952 2691192 2163479 865626 -323309 -1012005 -1027522 -133399 1295032
38801A295032Q32769l02380n85733k249K6239r08131j379055m61694P18206Q03916
$$ 1295032 2127801 1825421 1239688 1237439 1263678 355547 -1023508 -1485202 -766996 36920
38791C6920J95605J255J68426K3710k44153o0258K60544R6420j58178K84634J073465
$$ 36920 232525 233780 402206 425916 181763 121505 382049 478469 320291 604925 1678390
38780A678390J171574N66249J71648J62965k29604j164529j667493j007656K90992
$$ 1678390 2849964 3416213 3587861 3750826 3521222 2356693 689200 -318456 -27464
38771b7464J113014Q22697l79254j581367j721051o25201O42176J005446O05216
$$ -27464 1085550 1908247 1528993 -52374 -1773425 -2398626 -1756450 -751004 -145788
38762a45788J90084j37466o28037q83026l60581M36335N43551J11862R8109N08465
$$ -145788 44296 -93170 -721207 -1604233 -1964814 -1528479 -984928 -873066 -774957 -266492
38752b66492L85679l65052o12438J73217J040900J017072L42413k47971n01883
$$ -266492 119187 -245865 -858303 -685086 355814 1372886 1715299 1467328 965445
38743I65445m39060o0283K91816Q0599n75048r53390q05798n24415j74205N52866
$$ 965445 526385 466102 757918 838517 263469 -689921 -1495719 -2020134 -2194339 -1641473
38733a641473J269023J033485p9233p98606n19406j17390l49570o93482n02308
$$ -1641473 -372450 661035 581802 -216804 -736210 -853600 -1203170 -1896652 -2398960
38724b398960j31519n9667N6316N34325Q10705L66647k82318l98103j11278O7985
$$ -2398960 -2530479 -2590146 -2533830 -1999505 -1188800 -822153 -1104471 -1502574 -1613852 -1545867
38714a545867J00208O4083k61861p56330p33785r4864K13937l03856p09722r5653
$$ -1545867 -1445659 -1381576 -1643437 -2399767 -3133552 -3228416 -3014479 -3318335 -4028057 -4123710
38704d123710Q94656J088577N08386l8819l33644n46958l66445M47784J176867
$$ -4123710 -3229054 -2140477 -1632091 -1670910 -2004554 -2551512 -2917957 -2470173 -1293306
38695a293306R91248K33832k01758k59300m22602n89078l72073r620J53103N24587
$$ -1293306 -302058 -68226 -269984 -529284 -951886 -1540964 -1913037 -1922657 -1769554 -1244967
38685a244967J412682J911569J026752n43434j193904o69724j25048j82890l75646
$$ -1244967 167715 2079284 3106036 2562602 1368698 698974 573926 391036 15390
38676A5390l61781k74214N1493P93834J185915L24338j072136j289664j83247
$$ 15390 -346391 -620605 -569112 224722 1410637 1734975 662839 -626825 -810072
38667h10072M72898l93157j656428j724066n08927R59291J814356J637378M59359
$$ -810072 -337174 -730331 -2386759 -4110825 -4619752 -3660461 -1846105 -208727 250632
38658B50632q68963j139452k14267O99554O47163P2783o3666M03240R10775R70132
$$ 250632 -618331 -1757783 -1972050 -1272496 -625333 -552550 -616216 -212976 697799 1667931
38648A667931M79991k97768p89537n61431J28694O27825O84683M59798k6077p27827
$$ 1667931 2147922 1850154 1060617 499186 627880 1255705 1940388 2400186 2374109 1646282
38638A646282j098749o79983K187J03185j60922P4985O99988P57674K00037K1356
$$ 1646282 547533 -132450 -130263 -27078 -188000 -113015 586973 1344647 1544684 1566040
38628A566040M20001L90177l78735p64358j32987M55465j1866p78689n45732M77253
$$ 1566040 1986041 2376218 1997483 1233125 1100138 1555603 1543737 765048 219316 696569
38618F96569R91701N35809j30565k97983p3551N2784j51723m44972l78306M0827
$$ 696569 1688270 2224079 2093514 1795531 1721980 1774764 1623041 1178069 799763 840590
38608H40590J38822m27367p90127J6904J295147J411629L35031k02467N10935
$$ 840590 979412 552045 -238082 -221178 1073969 2485598 2820629 2618162 3129097
38599C129097R91103K5892j351586j585171q71798k99961Q1644P57638J258011
$$ 3129097 4120200 4146092 2794506 1209335 337537 37576 119220 876858 2134869
38590B134869Q42176J6571k28966j88736q41173j844227j798799m61241Q34099
$$ 2134869 2977045 2993616 2764650 2575914 1734741 -109486 -1908285 -2369526 -1535427
38581a535427J096454O71363J19679n65642j190397r68913L81657J849402K092882
$$ -1535427 -438973 232390 352069 -213573 -1403970 -2372883 -1991226 -141824 1951058
38572A951058R19197n52898j051602l62472M99899L93732o11341j315038r46311
$$ 1951058 2870255 2317357 1265755 903283 1403182 1796914 1185573 -129465 -1075776
38563a075776r6696K59609M6668k02758l34282m87468m43808R1127P73128R41100
$$ -1075776 -1172472 -912863 -866195 -1068953 -1403235 -1890703 -2334511 -2243384 -1470256 -529156
38553e29156N29468O5193p4924Q5613L23122K07280o41652j737026j762932k02186
$$ -529156 312 65505 -9419 76194 399316 606596 -35056 -1772082 -3535014 -3737200
38543c737200J612670J984072R39836j13935l86397k20292Q3042O65171J278585
$$ -3737200 -2124530 -140458 799378 685443 299046 78754 161796 826967 2105552
38534B105552J200429K73764p74655j255704j099365n02989K52204O05437J29008
$$ 2105552 3305981 3579745 2805090 1549386 450021 -52968 199236 804673 933681
38525I33681p30454j007807m35660K99703N63396M12058J80002K7324j6722l7525
$$ 933681 203227 -804580 -1240240 -940537 -377141 34917 214919 242243 225521 187996
38515A87996k40870n65438n11694J30768P24234O21223J89626J71761L88429J18015
$$ 187996 -52874 -618312 -1130006 -999238 -275004 346219 535845 707606 1096035 1214050
38505A214050m79465n22273L0654K27387k53287n31691j7724N95685M35954k97174
$$ 1214050 734585 212312 242966 470353 217066 -314625 -332349 263336 699290 402116
38495D02116q28544q96093p09011l41938J81445N29911L82269k3299r7585L31173
$$ 402116 -426428 -1322521 -2031532 -2373470 -2192025 -1662114 -1279845 -1303144 -1400729 -1069556
38485a069556P15890L74517o38790j382478j005845J46596Q57045N70354M149
$$ -1069556 -353666 20851 -617939 -2000417 -3006262 -2859666 -2002621 -1432267 -1428118
38476a428118n0673K05059K37559J43523K08508J85612j26078k30196K01734M96393
$$ -1428118 -1478791 -1273732 -1036173 -892650 -684142 -498530 -624608 -854804 -653070 -156677
38466a56677Q5916k82932K43191R14500M74450n92500p58678n9397P5277m41241
$$ -156677 -70761 -353693 -110502 803998 1278448 685948 -72730 -132127 -56850 -498091
38456d98091o9690J436937K097977O87758j268203j750230r47760l52173m13913
$$ -498091 -567781 869156 2967133 3654891 2386688 636458 -311302 -663475 -1077388
38447a077388n28656m41846l28843r1321L50817O00743M53743M10007P91532J066861
$$ -1077388 -1606044 -2047890 -2376733 -2468054 -2117237 -1516494 -1062751 -652744 138788 1205649
38437A205649P73277L16803J10899k15546r25708j379017j055312n38062n02334
$$ 1205649 1978926 2295729 2406628 2191082 1265374 -113643 -1168955 -1707017 -2209351
38428b209351n35267m540O73466P52430M56359M26626N00043J92181j92734j25412
$$ -2209351 -2744618 -2749158 -2075692 -1323262 -866903 -440277 59766 251947 59213 -66199
38418f6199K6295l31966p50711m47756J69544J07329m30504l71079K77657L80654
$$ -66199 -39904 -371870 -1122581 -1570337 -1400793 -1293464 -1723968 -2095047 -1817390 -1436736
38408a436736l31218p53676k39455M32705M32480O4161N08K87875O64323J028236
$$ -1436736 -1767954 -2521630 -2761085 -2328380 -1895900 -1831739 -1831231 -1543356 -879033 149203
38398A49203J092281M04987p34021j179221m00794O55386Q58072M00506K07102
$$ 149203 1241484 1646471 912450 -266771 -667565 -12179 845893 1246399 1453501
38389A453501L62169J53939n18911q64013n07591j56800m54876q83523n40868
$$ 1453501 1815670 1969609 1450698 586685 79094 -77706 -532582 -1416105 -1956973
38380a956973M14105R90732R19977R71560J470934J534497M79094q52087j192973
$$ -1956973 -1542868 -552136 367841 1339401 2810335 4344832 4823926 3971839 2778866
38371B778866p14321n74184r41413q78474k12383O2o57750j026783j45338J142046
$$ 2778866 2064545 1490361 548948 -329526 -541909 -541847 -1199597 -2226380 -2371718 -1229672
38361a229672J373062N17627j69028J19906J010072J640642J445959N14682m06961
$$ -1229672 143390 661017 491989 611895 1621967 3262609 4708568 5223250 4816289
38352D816289o27233m33292o78072j295353j228258k14276N66753L15344j52179
$$ 4816289 4189056 3755764 3077692 1782339 554081 339805 906558 1221902 1069723
38343A069723P7341M89086L13455N0236L93759O86948Q6473o29275k46845O07697
$$ 1069723 1147064 1636150 1949605 1999841 2393600 3080548 3167021 2537746 2290901 2898598
38333B898598L89430o69814r66429m02232n01481j452921j445697K91685J961998
$$ 2898598 3288028 2618214 1651785 1249553 748072 -704849 -2150546 -1858861 103137
38324A03137J865814Q07248M63727P88650O01712j95707n83425j72697L12077
$$ 103137 1968951 2776199 3239926 4028576 4630288 4434581 3851156 3678459 3990536
38315C990536K07420l44719q20676q88664n72689j82031k2379j09641l66209r03196
$$ 3990536 4197956 3853237 3032561 2143897 1571208 1389177 1366798 1257157 890948 -12248
38305a2248j581088j566416k52265J458222J919046R46269N0266J50556M15181
$$ -12248 -1593336 -3159752 -3412017 -1953795 -34749 911520 961786 1112342 1527523
38296A527523J1972l83485Q2963P37038L77030p13204j149666n13004K46968L85274
$$ 1527523 1539495 1156010 1238973 1976011 2353041 1639837 490171 -22833 224135 609409
38286F09409K24675L33937P23265J053602J035653N26759k75812p68829n69377
$$ 609409 834084 1168021 1891286 2944888 3980541 4507300 4231488 3462659 2893282
38277B893282j14783r0123l73911k31634M24053P14776K9195j000683j212959
$$ 2893282 2778499 2688376 2314465 2082831 2506884 3221660 3250855 2250172 1037213
38268A037213l24254P82562J088171M49688m27999p99098n24522k3075K24615
$$ 1037213 712959 1495521 2583692 3033380 2605381 1806283 1281761 1258686 1483301
38259A483301P1259k40746k91379J39180P68923J007237O05664k8369l60325l83838
$$ 1483301 1554560 1313814 1022435 1161615 1930538 2937775 3543439 3515070 3154745 2770907
38249B770907m66614p15000q55722o62725j76605L98345P20927M52535k33288
$$ 2770907 2304293 1589293 733571 70846 -105759 292586 1013513 1466048 1232760
38240A232760n49612n1917N54821K73764o77109j073992m35982L38973L29695
$$ 1232760 683148 631231 1186052 1459816 782707 -291285 -727267 -388294 -58599
38231e8599k52985o51236n71413j54207M35469Q95281Q01182K26833j27612J22288
$$ -58599 -311584 -962820 -1534233 -1688440 -1252971 -357690 443492 670325 542713 665001
38221F65001M73726L90458J80898L84923P49303N95674o1859n70051o96759q35244
$$ 665001 1138727 1529185 1710083 2095006 2844309 3439983 3378124 2808073 2111314 1276070
38211A276070j090707r57733k12817N22971N96411K51846J80172M18465L87561
$$ 1276070 185363 -772370 -985187 -462216 134195 386041 566213 984678 1372239
38202A372239j1613j12003M11162Q49977M81139k71243n17246l62464o07590j115894
$$ 1372239 1360626 1248623 1659785 2509762 2990901 2719658 2202412 1839948 1232358 116464
38192A16464q02763M44924J204196N98919k85969j25340N68824M41790m10728
$$ 116464 -686299 -241375 962821 1561740 1275771 1150431 1719255 2161045 1750317
38183A750317p09435j58710K41984J6113j22857L48459R26185R43642L46221n78075
$$ 1750317 1040882 882172 1124156 1140269 1017412 1365871 2292056 3235698 3581919 3003844
38173C003844j410173j530971p28976J93112L55102J31963M26008R05198M68109
$$ 3003844 1593671 62700 -666276 -473164 -118062 13901 439909 1345107 1813216
38164A813216o10876p45180M53771J456970J190194M84778L61807M20130j7437
$$ 1813216 1202340 457160 910931 2367901 3558095 4042873 4404680 4824810 4807373
38155D807373m87392l17374O8605n1775m49787n81288o70595j038417j051386
$$ 4807373 4319981 4002607 4071212 4019437 3569650 2988362 2317767 1279350 227964
38146B27964K5941J541913J984361R04953n50024j071587n90466j64813o79435
$$ 227964 253905 1795818 3780179 4685132 4135108 3063521 2473055 2308242 1628807
38137A628807j686120j761809l31879J331700J681653R46147M34965K69673m92433
$$ 1628807 -57313 -1819122 -2151001 -819301 862352 1808499 2243464 2513137 2020704
38128B020704j569879j335622N06871K032491J737718M36470l88581n58685n24256
$$ 2020704 450825 -884797 -377926 1654565 3392283 3828753 3440172 2881487 2357231
38119B357231k04566M00476P20391O76067R46085J440594J089243p0389m80165
$$ 2357231 2152665 2553141 3273532 3949599 4895684 6336278 7425521 7355132 6874967
38110F874967K52588L61649j030369k082927j235102J14731Q5096n21838k8894
$$ 6874967 7127555 7489204 6458835 4375908 3140806 3255537 3340633 2818795 2789901
38101B789901Q95130O36533j30805L86651J663401J593558Q7419r51103r03425
$$ 2789901 3685031 4321564 4190759 4577410 6240811 7834369 7921788 6970685 6067260
38092F067260r37224j390540j305735o13035l32402m95817j45622N34022L40197
$$ 6067260 5130036 3739496 2433761 1820726 1488324 992507 846885 1380907 1721104
38083A721104n84038p23829K51108R83374P30688K33369M2183k15414o72772r02812
$$ 1721104 1137066 413237 664345 1647719 2378407 2611776 2653959 2438545 1765773 862961
38073H62961q08670m90763L74813J590845J713615J09546j256489l35085J662434
$$ 862961 54291 -436472 -61659 1529186 3242801 3352347 2095858 1760773 3423207
38064C423207J989726N65728l81201j47458J6695j82348J53862P65517O40088
$$ 3423207 5412933 5978661 5597460 5450002 5466697 5284349 5438211 6203728 6843816
38055F843816L42911R79633J587330Q09371J21097J603035L668337L404671J988689
$$ 6843816 7186727 8166360 9753690 10563061 10684158 12287193 15955530 19360201 21348890
38046B1348890K677191M538986M156492K697002M355325Q162574R279293Q561880
$$ 21348890 24026081 28565067 32721559 35418561 39773886 47936460 57215753 65777633
38038F5777633J1621166J7597738K0267750K2770755L6498935N7328690N8084252
$$ 65777633 77398799 94996537 115264287 138035042 174533977 231862667 289946919
38031B89946919K0375574l4928399o6699235n9828563l6319537k1548942j7588091
$$ 289946919 310322493 275394094 208694859 148866296 112546759 90997817 73409726
38024G3409726j4264498r546954p891715q504398o861663l410690k123434l133498
$$ 73409726 59145228 49598274 41706559 33202161 26340498 22929808 20806374 17672876
38016A7672876l401666k489009k180614k214732j095744L90893M76854k45248
$$ 17672876 14271210 11782201 9601587 7386855 6291111 6682004 7158858 6913610
38008F913610k12448k6545r57383j908689j077331P13442J311256O66090K66830
$$ 6913610 6701162 6674617 5717234 3808545 2731214 3444656 4755912 5422002 5688832
37999E688832L11759j9252n06155l71340J58246O09717J330905K206998K027940
$$ 5688832 6000591 5981339 5475184 5103844 5262090 5871807 7202712 9409710 11437650
37990A1437650Q06655O19243K228181L368059K768601L000447N929780P973331
$$ 11437650 12244305 12863548 15091729 18459788 21228389 24228836 30158616 38131947
37982C8131947M362339l328335q534574q100280n052829l046608k315487j896164
$$ 38131947 42494286 39165951 30631377 22531097 17478268 14431660 12116173 10220009
37974A0220009j958294k378100j929466m46984M46557k2000m85336J00538O73661
$$ 10220009 8261715 5883615 3954149 3507165 3953722 3931722 3446386 3546924 4220585
37965D220585j404j255114j624712q41323K76843R39819P44855j29584p02440
$$ 4220585 4219181 2964067 1339355 498032 774875 1714694 2459549 2329965 1627525
37956A627525j75391P06271M97342o77202j189600m38630L52929K94752Q5324
$$ 1627525 1452134 2158405 2655747 1978545 788945 350315 703244 997996 1083320
37947A083320M24287P48416M48570J0872j250J4726m20424r04524q83053n20224
$$ 1083320 1507607 2256023 2704593 2715465 2714215 2728941 2308517 1403993 520940 716
37937G16j80749J67984N05364N26341K92919K58623L40092j3560n62157l51427
$$ 716 -180033 -12049 493315 1019656 1312575 1571198 1911290 1897730 1335573 984146
37927I84146N42646P68798j43903q25738j66021R67798J196170O26263K00989
$$ 984146 1526792 2295590 2151687 1325949 1159928 2127726 3323896 3950159 4151148
37918D151148Q9791k2430P7761O03191R68813O99455M05739P13622J038949P10848
$$ 4151148 4240939 4218509 4296270 4899461 5868274 6567729 6973468 7687090 8726039 9436887
37908I436887M80572J362044K607089K572395J310125N86350J341304K721704
$$ 9436887 9917459 11279503 13886592 16458987 17769112 18355462 19696766 22418470
37900B2418470L778801M586308N254748N134512L601181Q23806k499401n390878
$$ 22418470 26197271 30783579 36038327 41172839 44774020 45597826 43098425 37707547
37892C7707547o651901n819925m166762l503853l776192l193980j147720N32702
$$ 37707547 31055646 25235721 21068959 17565106 13788914 10594934 9447214 9979916
37884I979916R6339j651648k565227j932255q05374j93493j68800m46812p14904
$$ 9979916 10076255 8424607 5859380 3927125 3121751 2928258 2759458 2312646 1597742
37875A597742m86820M14497J255546J104323J41074n24748l84047p5323k26707
$$ 1597742 1110922 1525419 2780965 3885288 4026362 3501614 3117567 3042244 2815537
37866B815537n22276l30079L00357P85606Q43999O80044M56492Q3334l58140m18772
$$ 2815537 2293261 1963182 2263539 3049145 3893144 4573188 5029680 5113014 4754874 4336102
37856D336102J08112O00623K05067q90784j406953o08478N59851O75347k11040
$$ 4336102 4444214 5044837 5249904 4359120 2952167 2343689 2903540 3578887 3367847
37847C367847p42520k32305N65637P93551N66764L53868K10528J03529J66519
$$ 3367847 2625327 2393022 2958659 3752210 4318974 4672842 4883370 4986899 5153418
37838E153418J67343m12412j280917j325116l37136L59453j06842o99639k00638
$$ 5153418 5320761 4908349 3627432 2302316 1965180 2324633 2217791 1518152 1317514
37829A317514O96132N67154l04023m68159K12973N12028P1105j77376J00317J28967
$$ 1317514 2013646 2580800 2276777 1808618 2021591 2533619 2604724 2427348 2527665 2656632
37819B656632l16365m38043k0236J03638k89965k37875O68831J392943J048490
$$ 2656632 2340267 1902224 1881988 1985626 1695661 1457786 2126617 3519560 4568050
37810D568050J45903m51884o53178o04989k02912K93966K99867r657J17626M65487
$$ 4568050 4713953 4262069 3608891 3003902 2800990 3094956 3394823 3385166 3502792 3968279
37800C968279L3397r24937r20717J85574P08400K5998l15243N34112J136618M85546
$$ 3968279 4001676 3076739 2156022 2341596 3049996 3075994 2760751 3294863 4431481 4917027
37790D917027n6584P21564J719495J792903J839706K532101K464730R70545J64108
$$ 4917027 4860443 5582007 7301502 9094405 10934111 13466212 15930942 16901487 17065595
37781A7065595J455083K848313K779006L309173N733244P105707O524708J0180415
$$ 17065595 18520678 21368991 24147997 27457170 33190414 40296121 46820829 57001244
37773E7001244K1547065K9619590J8639759r013331l1008880l1013750j6984005
$$ 57001244 78548309 108167899 126807658 117794327 86785447 55771697 38787692
37766C8787692p145078o581402p145293m259908j938950k631410k818546m91185
$$ 38787692 31642614 25061212 17915919 13656011 11717061 9085651 6267105 5775920
37758E775920J049490m53584k185501j406810K18224K19755o62503p24061l91837
$$ 5775920 6825410 6371826 4186325 2779515 2997739 3217494 2554991 1830930 1439093
37749A439093o14028p16425k4589N26347J98165j29032J44437N2830q47610j145571
$$ 1439093 825065 108640 84051 610398 808563 679531 823968 876798 29188 -1116383
37739a116383P7726J416198J261431J27655o32956q70211r29428m12131Q41812
$$ -1116383 -1038657 377541 1638972 1766627 1133671 263460 -665968 -1078099 -236287
37730b36287J815814J709569J068121M41687o03961j979008k264825r03636M05551
$$ -236287 1579527 3289096 4357217 4798904 4194943 2215935 -48890 -952526 -546975
37721e46975J62934n95037k37609O63245O23695P8404M60178J281118P59765r18211
$$ -546975 -384041 -979078 -1216687 -553442 70253 148657 608835 1889953 2649718 1731507
37711A731507j530236k59975J055718P41270n39202j228919r74751l47518L50499
$$ 1731507 201271 -58704 997014 1738284 1199082 -29837 -1004588 -1352106 -1001607
37702a001607R92764J118339M54835m21401o26062r550P28375Q53449L24887k13832
$$ -1001607 -8843 1109496 1564331 1142930 516868 507318 1235693 2089142 2414029 2200197
37692B200197j41070L86136N52140q4806r61462j194358o19831J79656O18387
$$ 2200197 2059127 2445263 2997403 2912597 1951135 756777 136946 316602 934989
37683I34989N28442R2612l14247m45188n41375j006475j575001j409337l28468
$$ 934989 1463431 1556043 1241796 796608 255233 -751242 -2326243 -3735580 -4064048
37674d064048P52242J052784Q73182P59172N38053l0642l96441J939O58579P18140
$$ -4064048 -3311806 -2259022 -1385840 -626668 -88615 -119257 -515698 -513759 144820 862960
37664H62960L18453J94247L47037J98380k32124m05445l11788l74758m96533k66943
$$ 862960 1181413 1375660 1722697 1921077 1688953 1283508 971720 596962 100429 -166514
37654a66514P9517N5846N4601P78639J664696J390356Q9628n43963J87836R22956
$$ -166514 -86997 -31151 23450 802089 2466785 3857141 3946769 3402806 3590642 4513598
37644D513598M89509k93279k09584K15125l28673j597832k020728j047034J54776
$$ 4513598 5003107 4709828 4500244 4715369 4386696 2788864 768136 -278898 -124122
37635a24122N17926M00184O00418R35005N74091n46912j421708j236520m29550
$$ -124122 393804 793988 1394406 2329411 2903502 2356590 934882 -301638 -731188
37626g31188l1186j77370M919Q48735J311654M11647j093839j537251o26769K82415
$$ -731188 -762374 -939744 -934825 -86090 1225564 1637211 543372 -993879 -1620648 -1338233
37616a338233K72762m3300P5700K47586r4499n05313k66755L68928O74025O50678
$$ -1338233 -1065471 -1108771 -1033071 -785485 -879984 -1385297 -1652052 -1283124 -609099 41579
37606D1579P44144Q04925M16303o1892P1086N35260L90370k97529l78976M92272
$$ 41579 785723 1590648 2006951 1945059 2016145 2551405 2941775 2644246 2265270 2757542
37596B757542J133475N99954l76129n23598K27997J066506J670667K164546K127042
$$ 2757542 3891017 4490971 4114842 3591244 3819241 4885747 6556414 8720960 10848002
37587A0848002R09962j039097k298616k207231j557469j201825r02265j94159
$$ 10848002 11757964 10718867 8420251 6213020 4655551 3453726 2551461 2357302
37579B357302M42350K57953l81799l95218L06600N81058k20747j234553j308772
$$ 2357302 2799652 3057605 2675806 2280588 2587188 3168246 2947499 1712946 404174
37570D04174n08156K82325O88496R52712J046115O13652j98221o91754n83425
$$ 404174 -103982 178343 866839 1819551 2865666 3479318 3281097 2589343 2005918
37561B005918l40054l26578k76671O6647M13869M75264M81821O21980M71892l18047
$$ 2005918 1665864 1339286 1062615 1129262 1543131 2018395 2500216 3122196 3594088 3276041
37551C276041j140314j045152r4451O74139O26071J44828j89174k86630k26640
$$ 3276041 2135727 1090575 996124 1670263 2296334 2441162 2251988 1965358 1738718
37542A738718M4069L75763L83367P9538k2755K38229L34047m8802m30098l87148
$$ 1738718 1782787 2158550 2541917 2621455 2598700 2836929 3170976 3122174 2692076 2304928
37532B304928l11169o34751r51823p48863m05086m28561k51646Q68536K076800
$$ 2304928 1993759 1359008 407185 -341678 -746764 -1175325 -1426971 -558435 1518365
37523A518365J686765j50474j241331m05731Q43643O67603m34248p09174P7473
$$ 1518365 3205130 3054656 1813325 1407594 2251237 2918840 2484592 1775418 1852891
37514A852891N72959Q9634o14458p59304m49558k6353M06631O21669L57430n6860
$$ 1852891 2425850 2515484 1901026 1141722 692164 665811 1072442 1694111 2051541 1994681
37504A994681j3350L38227K98040L505N11058K045972L199172K609621P04354
$$ 1994681 1981331 2319558 2617598 2621103 3132161 5178133 8377305 10986926 11691280
37495A1691280j026112j897684k284394k387734j822845n71633M66669L68318
$$ 11691280 10665168 8767484 6483090 4095356 2272511 1700878 2167547 2535865
37487B535865o77000j528521j361723m94268J57089K04923N1843J02376K14069
$$ 2535865 1858865 330344 -1031379 -1525647 -1368558 -1163635 -1111792 -1009416 -795347
37478g95347J38749L1488J15473K17460J11290j1899O2577N9108l00973o55773
$$ -795347 -656598 -625110 -509637 -292177 -180887 -192786 -130209 -71101 -372074 -1027847
37468a027847n57860l05373l69685l69544L09381J146259J027628Q8432m04539
$$ -1027847 -1585707 -1891080 -2260765 -2630309 -2320928 -1174669 -147041 -58609 -463148
37459d63148j34290j44383p71835q37161K75029J276241R10076l0542j1907Q60422
$$ -463148 -597438 -741821 -1513656 -2350817 -2075788 -799547 110529 79987 68080 928502
37449I28502J224842N77629l79706j035343j228592p37101L25214R49514L45262
$$ 928502 2153344 2730973 2351267 1315924 87332 -649769 -324555 624959 970221
37440I70221o73449o85597K29887P56870M99648L20785M89646J58540q85191j471976
$$ 970221 296772 -388825 -158938 597932 1097580 1418365 1908011 2066551 1181360 -290616
37430b90616p96369L03863O33665K26657j58141k61826k07353J03193N95891O37616
$$ -290616 -1086985 -783122 -149457 77200 -80941 -342767 -550120 -446927 148964 786580
37420G86580q1825q03410p27772k91003l81486o94881j64531J046736J429150
$$ 786580 704755 -98655 -826427 -1117430 -1498916 -2193797 -2358328 -1311592 117558
37411A17558M09756n95846k66588O20818N25785l16713l07848Q43587J632658
$$ 117558 527314 -68532 -335120 285698 811483 494770 186922 1030509 2663167
37402B663167J197984N16561M96818N76643K72866M41354J489245J955192Q71178
$$ 2663167 3861151 4377712 4874530 5451173 5724039 6165393 7654638 9609830 10481008
37393A0481008J3950J228665K945965K836616K857296O801700J2406605J1545910
$$ 10481008 10494958 11723623 14669588 17506204 20363500 27165200 39571805 51117715
37385E1117715J137697j0813600j4325559r298838l587455j805509j738198q29517
$$ 51117715 52255412 41441812 27116253 17817415 14229960 12424451 10686253 9856736
37377I856736q6045m71238n09556M56607M80323j376665k846537k031565l86613
$$ 9856736 9770691 9299453 8789897 9246504 9726827 8350162 5503625 3472060 3085447
37368C085447N7936j03306M23801Q11234j69129j430934j246966k35626j10786
$$ 3085447 3143383 3040077 3463878 4275112 4105983 2675049 1428083 1192457 1081671
37359A081671o12388k58169P18428P44633l03416j060111j077940j076909j072174
$$ 1081671 469283 211114 929542 1674175 1370759 310648 -767292 -1844201 -2916375
37350b916375m37192L09439l4743j045092r39193N66120J663727J189171J29619
$$ -2916375 -3353567 -3044128 -3078871 -4123963 -5063156 -4497036 -2833309 -1644138 -1514519
37341a514519j76358K95648J005895J715237J918744R07828p83621j368760j83138
$$ -1514519 -1690877 -1395229 -389334 1325903 3244647 4152475 3368854 2000094 1816956
37332A816956J154123R79964j35805n62650j34976o2118p84922j362578j027587
$$ 1816956 2971079 3951043 3815238 3252588 3117612 3055494 2270572 907994 -119593
37323a19593k18571K27060J26934j56274l55243m40533l86946j38171K25370M61280
$$ -119593 -338164 -111104 15830 -140444 -495687 -936220 -1323166 -1461337 -1235967 -774687
37313g74687L66369k8199m92757q16088r29196q19024m56082R2230N73305P17507
$$ -774687 -408318 -436517 -929274 -1745362 -2674558 -3493582 -3949664 -3857434 -3284129 -2566622
37303b566622M98243J77469Q6708L04429N00877K58838l08615n19227j1713O31932
$$ -2566622 -2068379 -1890910 -1804202 -1499773 -998896 -740058 -1048673 -1567900 -1579613 -947681
37293i47681O69132K97304K22044L68533O5327n10535l41865O52778J177623N46773
$$ -947681 -278549 18755 240799 609332 674659 164124 -177741 475037 1652660 2199433
37283B199433j73419M4809M62903r1406j148259j361486o79642j59960k6161M27522
$$ 2199433 2026014 2070823 2533726 2442320 1294061 -67425 -747067 -907027 -933188 -505666
37273e05666J107079R54161k37836j274928j261356o65796k41218M8290M75254
$$ -505666 601413 1555574 1317738 42810 -1218546 -1884342 -2125560 -2077270 -1602016
37264a602016Q06945P03826K46717l35893r05345j117679n42078O01045J407378
$$ -1602016 -795071 -91245 155472 -180421 -1085766 -2203445 -2745523 -2144478 -737100
37255g37100J343594Q83076Q26742J363188J950605J809977N67040j209003k262169
$$ -737100 606494 1489570 2316312 3679500 5630105 7440082 8007122 6798119 4535950
37246D535950j924579q88279j52904L38624J128849J767221J208059l76335j518878
$$ 4535950 2611371 1723092 1570188 1908812 3037661 4804882 6012941 5636606 4117728
37237D117728j419855p87458m43525l12599k05675l80287p27007n27912K78634
$$ 4117728 2697873 1910415 1466890 1154291 948616 568329 -158678 -686590 -407956
37228d07956O39871k4203p55105m78359L63082N93800L5820n76627q70546r56662
$$ -407956 231915 207712 -547393 -1025752 -662670 -68870 -33050 -609677 -1480223 -2436885
37218b436885o43325L75693J615422K004838J139481k59693j195582j253820o59736
$$ -2436885 -3080210 -2704517 -1089095 915743 2055224 1795531 599949 -653871 -1313607
37209a313607N2133L84652K39926R140J42877O42382J023703P04247m67594j804114
$$ -1313607 -1261474 -876822 -636896 -627756 -484879 157503 1181206 1885453 1417859 -386255
37199c86255k092504q56064P78317J162451J42361p60061l61778Q02073J469700
$$ -386255 -2478759 -3334823 -2556506 -1394055 -1251694 -2011755 -2373533 -1571460 -101760
37190a01760J229725N72042Q696k46581j64223J8405p3472m17766n79186m17750
$$ -101760 1127965 1700007 1708703 1462122 1297899 1316304 1242832 825066 245880 -171870
37180a71870k68008k35504j5198L49816L49018j4842k8736M79607O51789j0349
$$ -171870 -439878 -675382 -690580 -340764 8254 -6588 -35324 444283 1096072 1085723
37170A085723p06676n60466J01188N19050O67047P07676J97366r97237j770982
$$ 1085723 379047 -181419 -80231 438819 1105866 1813542 2010908 1013671 -757311
37161g57311j087996L59981J115765J045406J051107J176869O68786k46132m01667
$$ -757311 -1845307 -1485326 -369561 675845 1726952 2903821 3572607 3326475 2924808
37152B924808K87880N08672k84543r21795m75104J94160j43320j134096j462191
$$ 2924808 3212688 3721360 3436817 2515022 2039918 2234078 2090758 956662 -505529
37143e05529q01868m3967J41893o316p0485o7030j34009j41111P2904L34256L28782
$$ -505529 -1307397 -1351364 -1209471 -1215787 -1286272 -1353302 -1487311 -1628422 -1555518 -1221262 -892480
37132h92480J24722J90951P01890J079035O76882j53782l44665L48544Q22709
$$ -892480 -767758 -576807 125083 1204118 1881000 1727218 1382553 1731097 2553806
37123B553806J73299q96147j024090j21972N90372L18747m53552q76519o79256
$$ 2553806 2727105 1830958 806868 684896 1275268 1594015 1140463 263944 -415312
37114d15312q2947N14323O13225K1858o61242n90784J60356O23116K90429k41541
$$ -415312 -498259 16064 629289 651147 -10095 -600879 -440523 182593 473022 231481
37104B31481k88740n4410j03599l89439m21262j44309m1320l33948n51339j69217
$$ 231481 -57259 -111669 -215268 -604707 -1025969 -1170278 -1211598 -1545546 -2096885 -2266102
37094b266102N03251M93086n43940j518003j008364Q11321K117444J680165M14673
$$ -2266102 -1762851 -1269765 -1813705 -3331708 -4340072 -3528751 -1411307 268858 683531
37085F83531R654O44055J050912N09726l40945p07062o58647o60518q04886q47106
$$ 683531 693185 1337240 2388152 2897878 2556933 1849871 1191224 530706 -274180 -1121286
37075a121286n74400J2750N64326N28904j32986o30629l43835J55178r7862q72720
$$ -1121286 -1695686 -1682936 -1118610 -589706 -722692 -1353321 -1697156 -1541978 -1639840 -2512560
37065b512560r92591j42852O71031O65465K22846l5939j22780j75903O59L48605
$$ -2512560 -3505151 -3648003 -2976972 -2311507 -2088661 -2124600 -2247380 -2423283 -2422624 -2074019
37055b074019L14495k15551m51481K08218J203320J522252R10849j14478r81884
$$ -2074019 -1759524 -1975075 -2426556 -2218338 -1015018 507234 1418083 1303605 321721
37046C21721j338298j067335m56239L0362L61270Q17125J183678Q86054J27886
$$ 321721 -1016577 -2083912 -2540151 -2509789 -2148519 -1331394 -147716 738338 866224
37037H66224j32187K43175J68910q06641j458255p44820L73559L55130m97641
$$ 866224 734037 977212 1146122 339481 -1118774 -1863594 -1490035 -1134905 -1632546
37028a632546o13857L11499J019465Q14581L79171K60834M2399m92946o57489
$$ -1632546 -2246403 -1934904 -915439 -100858 278313 539147 581546 88600 -568889
37019e68889k5160O72769N56221k06236q24854q72706k89548Q86358K070649K049055
$$ -568889 -594049 78720 634941 428705 -396149 -1268855 -1558403 -672045 1398604 3447659
37009C447659K93696j924120k648109j436304K87020J076686Q88378M79415J98239
$$ 3447659 3741355 1817235 -830874 -2267178 -1980158 -903472 -15094 464321 662560
37000F62560n9685j88706O8023M56216K71514o71038j566264j500752n94918J40219
$$ 662560 602875 414169 482192 938408 1209922 538884 -1027380 -2528132 -3123050 -2982831
36990b982831N3473m20051m13626K76570J013508J138232P02975K97490K92989
$$ -2982831 -2929358 -3349409 -3763035 -3486465 -2472957 -1334725 -631750 -334260 -41271
36981d1271M68463M32063J87118J6361p9586l91339q48174q48352j03208P26342
$$ -41271 427192 859255 1046373 1062734 983148 591809 -256365 -1104717 -1207925 -481583
36971d81583P49465p065o98152p81746m88445k22687q5939o7796j69161k04213
$$ -481583 267882 260817 -437335 -1219081 -1707526 -1930213 -2016152 -2083948 -2253109 -2457322
36961b457322M3236L60852L04024l6268j6281O10482J258643J277423O66586j98242
$$ -2457322 -2414086 -2053234 -1749210 -1785478 -1801759 -1191277 67366 1344789 2011375 1813133
36951A813133j009381j401874r72714J05645R25189P74659o4417p96712j020150
$$ 1813133 803752 -598122 -1570836 -1465191 -540002 234657 170240 -626472 -1646622
36942a646622p99538k58107M18592Q55220Q09156M41876J1881l83474n21084m108
$$ -1646622 -2446160 -2704267 -2285675 -1430455 -621299 -179423 -167542 -551016 -1072100 -1076208
36932a076208J064015J794848J438754L02638o96067j069188r30654n33323j57740
$$ -1076208 -12193 1782655 3221409 3524047 2827980 1758792 828138 294815 137075
36923A37075j08223k77752o5566P08538J202480N62708p68434j517428j162912
$$ 137075 28852 -248900 -314466 394072 1596552 2159260 1390826 -126602 -1289514
36914a289514l15905L22049N87983N12797J78280J2090M68646J220788J330066
$$ -1289514 -1605419 -1283370 -695387 -182590 -4310 7780 476426 1697214 3027280
36905C027280M79345n16859p10579q3643O38175Q39383M11802l89581j166067
$$ 3027280 3506625 2989766 2279187 2195544 2833719 3673102 4084904 3695323 2529256
36896B529256j543307j317057n30054M64651J026651O70883k88438q83721o01195
$$ 2529256 985949 -331108 -861162 -396511 630140 1301023 1012585 128864 -472331
36887d72331J2362K06820K7852p2334j27232l88066n42618j42407L84266J73889
$$ -472331 -459969 -253149 -225297 -297631 -424863 -812929 -1355547 -1497954 -1113688 -939799
36877i39799o14136q35802p2732P09700O27522R3624j5382L32118N47275M34235
$$ -939799 -1553935 -2389737 -2462469 -1752769 -1125247 -1031623 -1047005 -714887 -167612 266623
36867B66623K54467Q3279k19234n08260m03795J02952M91946L12584k43977n10708
$$ 266623 521090 604369 385135 -123125 -526920 -423968 67978 380562 136585 -374123
36857c74123q6293O53271R26678M78411r5837j35937K42742M16318J16975l78239
$$ -374123 -460416 192855 1119533 1597944 1502107 1366170 1608912 2025230 2142205 1763966
36847A763966p26795p42441l22667L55377P39935N19604J29991Q8826J28014k59754
$$ 1763966 1037171 294730 -27937 327440 1067375 1586979 1716970 1805796 1933810 1674056
36837A674056p11016m54555K12427J01550r88988j725648j063508L37883J107806
$$ 1674056 963040 508485 720912 822462 -166526 -1892174 -2955682 -2617799 -1509993
36828a509993P91142p1050p69176q04342j30863M94481J43574q42456r50817L49739
$$ -1509993 -718851 -789901 -1559077 -2363419 -2494282 -1999801 -1856227 -2698683 -3649500 -3299761
36818c299761J577105J269047Q1640l46608J54368M24092R6817M60M62751O96098
$$ -3299761 -1722656 -453609 -371969 -718577 -564209 -140117 -43300 -42840 419911 1116009
36808A116009J83305n14715p42501n65481k21119L27897Q51696P15779j68333
$$ 1116009 1299314 784599 42098 -523383 -744502 -416605 435091 1150870 982537
36799I82537r39493q63091k24576L17877O39620Q50618P09949P2797n07750l95672
$$ 982537 43044 -820047 -1044623 -726746 -87126 763492 1473441 1546238 1038488 642816
36789F42816J66434M22022K25098N7545M4634k11269p24348q79085m08962Q8015
$$ 642816 809250 1231272 1456370 1513915 1558549 1347280 622932 -256153 -665115 -577100
36779e77100Q9035J0512M86187J185395J145226J88414p49816q72503m78332l54543
$$ -577100 -488065 -477553 8634 1194029 2339255 2527669 1777853 905350 427018 72475
36769G2475o72167q94720n40557L15641J173494J501472J134868M57629K8340
$$ 72475 -599692 -1494412 -2034969 -1719328 -545834 955638 2090506 2548135 2576475
36760B576475q6093l24409q36353j102336o97523m1665J29541k17239m86297l88559
$$ 2576475 2490382 2165973 1329620 227284 -470239 -511904 -382363 -599602 -1085899 -1474458
36750a474458k15076k14397k53479j58361N9106L63495P01277Q60837P05480M67116
$$ -1474458 -1689534 -1903931 -2157410 -2315771 -2256665 -1893170 -1191893 -331056 374424 841540
36740H41540M11047L79082J51085L906K36807L90973j54982r25513p76237K80053
$$ 841540 1252587 1631669 1782754 1786660 2023467 2414440 2259458 1333945 557708 837761
36730H37761Q32243P6531j020536j191852n27202J28339N65558J002573J106633
$$ 837761 1670004 1746535 725999 -465853 -993055 -864716 -299158 703415 1810048
36721A810048L52321q64888j429806q46341K53145R12114P05612q3227p37479
$$ 1810048 2162369 1297481 -132325 -978666 -725521 186593 892205 808978 71499
36712G1499p00687j68614J72670J42306K45648O18624N98810j04115o47246k87556
$$ 71499 -629188 -797802 -625132 -482826 -237178 381446 980256 876141 228895 -58661
36702e8661L57046K97031j73678o182P76250J048247L31617n55892p32017k29395
$$ -58661 298385 595416 421738 415556 1191806 2240053 2571670 2015778 1283761 1054366
36692A054366L76433N80818J76430m82197n98234J3863L87696j89374p81131j38787
$$ 1054366 1430799 2011617 2188047 1705850 1107616 1121479 1509175 1319801 538670 399883
36682C99883J003816P54882q14163j403211L8218J516294Q98121r44291j505293
$$ 399883 1403699 2158581 1344418 -58793 -20575 1495719 2393840 1449549 -55744
36673e5744j68470J343805J589262Q96101K42805o2119k65635n62752r44007j243206
$$ -55744 -224214 1119591 2708853 3604954 3847759 3785640 3520005 2957253 2013246 770040
36663G70040j238491r51151o94340n72906k66628L36737P23289M72030j2125p6251
$$ 770040 -468451 -1419602 -2113942 -2686848 -2953476 -2616739 -1893450 -1421420 -1433545 -1509796
36653a509796K33304M50339N59983Q10856R12779L32891o25817r28893k01497
$$ -1509796 -1276492 -826153 -266170 544686 1457465 1790356 1164539 235646 34149
36644C4149P08204Q69186M13191J76529N64769J116556J049432R7849j091245
$$ 34149 742353 1611539 2024730 2201259 2766028 3882584 4932016 5029865 3938620
36635C938620j474701p58609J25575P7729p73385j254810o85860L94822J125687
$$ 3938620 2463919 1705310 1830885 1908614 1135229 -119581 -805441 -410619 715068
36626G15068J251350Q80131L1070j011481j430854p28481L94864P49751J89371
$$ 715068 1966418 2846549 2877619 1866138 435284 -293197 101667 851418 1040789
36617A040789k96598r3583K24665m7692n93552o29892j64318R6731r6036k88132
$$ 1040789 744191 650608 875273 827581 234029 -395863 -560181 -463450 -559486 -847618
36607h47618k35312k16694k28083K55116J223551J661834R07747j45696j99308
$$ -847618 -1082930 -1299624 -1527707 -1272591 -49040 1612794 2520541 2374845 2175537
36598B175537M91803M76686o25639j459607r08958L30774Q50572M31465n922O8654
$$ 2175537 2667340 3144026 2518387 1058780 149822 480596 1331168 1762633 1756711 1825365
36588A825365J98791j58316q02124j066538o26561J36330N25698K81062j33547
$$ 1825365 2024156 1865840 1063716 -2822 -629383 -493053 32645 313707 180160
36579A80160j47810J52276K50801Q0741Q6942L47647L35535j49385m85623j50248
$$ 180160 32350 184626 435427 516168 603110 950757 1286292 1136907 651284 501036
36569E01036M32072N33543J59564j73427l13943m63387n64557l83523n2217P8093
$$ 501036 933108 1466651 1626215 1452788 1138845 675458 110901 -272622 -324839 -246746
36559b46746J7284M3538J85193L18566N59256R32814Q82312r8151j393472j688097
$$ -246746 -229462 -185924 -731 317835 877091 1809905 2692217 2594066 1200594 -487503
36549d87503o41061N89165P89156P0333n27375l43665L38131P33408L25942n83241
$$ -487503 -1128564 -539399 249757 320090 -207285 -550950 -212819 520589 846531 263290
36539B63290j042002m76341M75571O33490j95657r52167p52545L8265M94330L37944
$$ 263290 -778712 -1255053 -779482 -145992 -341649 -1293816 -2046361 -2008096 -1513766 -1175822
36529a175822Q701o7415K00839O95261J088578R29821J41880p09619r84332o59299
$$ -1175822 -1167121 -1234536 -1033697 -338436 750142 1679963 1821843 1112224 127892 -531407
36519e31407j67658K27629N17189N97177L24605j09654l01959j89060j10477k33405
$$ -531407 -699065 -471436 45753 642930 967535 857881 555922 366862 256385 22980
36509B2980k84252l1924K84400K96654O6210m9688p883j56940o08832r14311o58623
$$ 22980 -261272 -293196 -8796 287858 354068 304380 296497 139557 -469275 -1383586 -2042209
36498b042209j16641J09367k4434p717L00081L71454o8765m09401N941Q05766
$$ -2042209 -2158850 -2049483 -2073917 -2081634 -1781553 -1410099 -1478864 -1888265 -1882324 -1076558
36488a076558J046662N38404k2065k02585l37735o85707q12744k61868O55690
$$ -1076558 -29896 508508 486443 283858 -53877 -739584 -1552328 -1814196 -1158506
36479a158506J238310J282020J137116J029152P47705M7738q91618j525878j444610
$$ -1158506 79804 1361824 2498940 3528092 4275797 4323535 3431917 1906039 461429
36470D61429p96187j40640J54091J77727M7899l69087r15621p89688M66189J840985
$$ 461429 -334758 -475398 -321307 -143580 -95681 -464768 -1380389 -2170077 -1703888 137097
36460A37097J744497J63425j091049p05310N07423R21184K08591o72500r57004
$$ 137097 1881594 2045019 953970 248660 756083 1677267 1885858 1213358 256354
36451B56354o29751N1461O95424P47236J38664l28194m5831L42649p0923p97077
$$ 256354 -373397 -321936 373488 1120724 1259388 931194 885363 1228012 1157089 360012
36441C60012n49276N91407J046441Q3971j056572j015662j34221M30181M76818
$$ 360012 -189264 402143 1448584 1532555 475983 -539679 -673900 -243719 233099
36432B33099O09400R06507Q32085K68123k37869k50247J04441M10943K92703l44071
$$ 233099 842499 1749006 2581091 2849214 2611345 2361098 2465539 2876482 3169185 2825114
36422B825114j043043j094794m75311l1826k53364m52242Q9771P58769M68181
$$ 2825114 1782071 687277 211966 180140 -73224 -525466 -435695 323074 791255
36413G91255m88693p37795M5304O36471K10653m59562l60503K68605N95829N05340
$$ 791255 302562 -435233 -389929 246542 457195 -2367 -362870 -94265 501564 1006904
36403A006904L52114P0450n04619q99090n86927l0337j47188q68494j170929n35692
$$ 1006904 1359018 1429468 924849 25759 -561168 -591505 -738693 -1607187 -2778116 -3313808
36393c313808N15925J370650J865288J754379O95660p98140j364636m65345O56293
$$ -3313808 -2797883 -1427233 438055 2192434 2888094 2089954 725318 259973 916266
36384I16266M97755p26149j483179r72672J28274Q57279J001953P93280L49399
$$ 916266 1414021 687872 -795307 -1767979 -1639705 -782426 219527 1012807 1362206
36375A362206j94929n14173m40450j88462K3087K63178N47157N45947K3046o48947
$$ 1362206 1167277 653104 212654 24192 47279 310457 857614 1403561 1426607 777660
36365G77660q37193m60248p0936q3045k54045j00509M14906Q59806Q90566N70645
$$ 777660 -59533 -519781 -590717 -673762 -927807 -1028316 -613410 246396 1136962 1707607
36355A707607J19391l72900p94110q03391j70911O61530P95567o5098j055323
$$ 1707607 1826998 1454098 659988 -143403 -314314 347216 1142783 1077685 22362
36346B2362j051365k0692R44702R41727J83929m83650n72358k03620K80746N86495
$$ 22362 -1029003 -1049695 -104993 836734 1020663 537013 -35345 -238965 41781 628276
36336F28276N06210N0614m63935o76537n27023k30653p651M5526k2172K1409L79467
$$ 628276 1134486 1185100 721165 44628 -482395 -713048 -720699 -675173 -697345 -675936 -296469
36325b96469P78833N70745l38901j007469n40098N32019P81616j28325q93067
$$ -296469 482364 1053109 714208 -293261 -833359 -301340 480276 351951 -541116
36316e41116m14164O32107Q21863J2704n96001k36261N03706O44315Q473p85898
$$ -541116 -955280 -323173 498690 511394 -84607 -320868 182838 827153 835626 49728
36306D9728j064336o43510M1925L28440J25549J28059P50330J203395N25254o78515
$$ 49728 -1014608 -1658118 -1616193 -1287753 -1162204 -1034145 -283815 919580 1444834 766319
36296G66319p98488K82195P30325m66663j714445j106574O21438J186342J76535
$$ 766319 -32169 250026 980351 513688 -1200757 -2307331 -1685893 -499551 -323016
36287c23016o12516j92830L16852n6336m65258Q9755Q79515O51685k34455l89944
$$ -323016 -935532 -1128362 -811510 -867846 -1333104 -1243349 -363834 287851 53396 -336548
36277c36548L82608Q96799M86090j86041l61983j55504M0319K47268N53961O69586
$$ -336548 46060 942859 1428949 1242908 880925 725421 765740 1013008 1566969 2236555
36267B236555K94896l77089q54248q63519n35676k44287k94972n89403o46832
$$ 2236555 2531451 2154362 1300114 436595 -99081 -343368 -638340 -1227743 -1874575
36258a874575j75126N04470Q73583Q60400O90420L33307l35176r44621q76997
$$ -1874575 -2049701 -1545231 -671648 188752 879172 1212479 877303 -67318 -944315
36249i44315j67222M58035N69306M62013M24733K42247k13869m78975j03502N79220
$$ -944315 -1111537 -653502 -84196 377817 802550 1044797 830928 351953 248451 827671
36239H27671P87584K26922o43229j111699p58045K48963J138627J113031K38491
$$ 827671 1615255 1842177 1198948 87249 -670796 -421833 716794 1829825 2068316
36230B068316n15820m43591L2734R1825k39848k36479K57822M77161j29439j022685
$$ 2068316 1552496 1108905 1141639 1233464 993616 757137 1014959 1492120 1362681 339996
36220C39996j265683p27496j11310N8482j3080R9954M03551N73094M24879L0341
$$ 339996 -925687 -1653183 -1764493 -1706011 -1719091 -1619137 -1215586 -642492 -217613 -187272
36210a87272m78578r14801r43080l57529N06549R90853Q58817N02022K93060J37371
$$ -187272 -665850 -1580651 -2523731 -2881260 -2374711 -1383858 -525041 -23019 270041 407412
36200D07412j18426k83985j97496j03283k17397k88995r8474N443k92828n21899
$$ 407412 288986 5001 -192495 -295778 -513175 -802170 -900644 -895201 -1188029 -1709928
36190a709928r1486N81370O09216J54357K57581J052320J393799O67701k31212
$$ -1709928 -1801414 -1220044 -610828 -456471 -198890 853430 2247229 2914930 2683718
36181B683718l75632j58758l09503n30039k04621K68907P1504n70617p15856k57020
$$ 2683718 2308086 2149328 1839825 1309786 1105165 1374072 1445576 874959 159103 -97917
36171i7917Q018k33784m30350k17127J15375K94490L32610P8534n89242j074471
$$ -97917 -89899 -323683 -754033 -971160 -855785 -561295 -228685 -150151 -739393 -1813864
36161a813864n91481M45199O53199l25731j152205o93787L98018Q08799M22525
$$ -1813864 -2405345 -1960146 -1306947 -1632678 -2784883 -3478670 -3080652 -2271853 -1849328
36152a849328J04419K22515M14303M89249N78243N27474M0381n94250p23760l35591
$$ -1849328 -1744909 -1522394 -1108091 -618842 -40599 486875 527256 -66994 -790754 -1126345
36142a126345q8983k31655k37688K21606O39136M16677k67245p77211q26454n39974
$$ -1126345 -1215328 -1446983 -1684671 -1463065 -823929 -407252 -674497 -1451708 -2278162 -2818136
36132b818136m5787N22021Q37904O92056L75273L20183M36930K61939k52061n92142
$$ -2818136 -2863923 -2341902 -1503998 -811942 -436669 -116486 320444 582383 330322 -261820
36122b61820m34113p1811R1995N8019k1743j92195m20866l31184K98331R74877
$$ -261820 -695933 -767744 -675749 -617730 -639473 -831668 -1252534 -1583718 -1285387 -310510
36112c10510R48088J69350o32899q05371l40370L00329N29249m2351j102850j598854
$$ -310510 637578 806928 174029 -631342 -971712 -671383 -142134 -184485 -1287335 -2886189
36102b886189q38690M36401Q47877K52749j15450M21129R99171P15416O8039j1907
$$ -2886189 -3724879 -3288478 -2440601 -2187852 -2303302 -1882173 -883002 -167586 -99547 -111454
36092a11454K43885n1892q26490j114911n60382J97585N80754N92309L25475j27571
$$ -111454 132431 80539 -745951 -1860862 -2421244 -2223659 -1642905 -1050596 -725121 -852692
36082h52692k76537L21949J148207J178012L77109k24063j38459o2868n34815
$$ -852692 -1129229 -807280 340927 1518939 1896048 1671985 1533526 1470658 935843
36073I35843r79608p03942K0297N60280Q87183J185273J105080K65663q51929
$$ 935843 -43765 -747707 -727410 -167130 720053 1905326 3010406 3276069 2424140
36064B424140j309891q74756j91193Q7077j07487l99586l72092K6449L08998J0797
$$ 2424140 1114249 239493 48300 135377 27890 -371696 -743788 -717339 -408341 -397544
36054c97544m82563k75983O22724J040679L32472n02564k70387N37258M68591
$$ -397544 -880107 -1156090 -533366 507313 839785 337221 66834 604092 1072683
36045A072683o48294j459769j094941k42103R9048l2346J4700L99102P05953O33334
$$ 1072683 424389 -1035380 -2130321 -2372424 -2273376 -2305722 -2291022 -1891920 -1185967 -552633
36035e52633L13817R0618J91566M99260N88815J93075l76731n43171j85197K53681
$$ -552633 -238816 -148198 43368 542628 1131443 1324518 947787 404616 219419 473100
36025D73100L75961K22246L1166o2218j9807J34462K74346K87507K21635J53135
$$ 473100 849061 1071307 1102473 1040255 1020448 1154910 1429256 1716763 1938398 2091533
36015B091533L4865j11277n9746K39169L73872P67n25193n61370j04328K41177
$$ 2091533 2126398 2015121 1955375 2194544 2568416 2569183 2043990 1482620 1378292 1619469
36005A619469J60713q6406k92020n77505q90454p97061q4508P81316J051668L80331
$$ 1619469 1780182 1693776 1401756 824251 -66203 -863264 -947772 -166456 885212 1265543
35995A265543q85250j843664j612933k24474J120967J210286K22247n51033l54997
$$ 1265543 380293 -1463371 -3076304 -3300778 -2179811 -969525 -747278 -1298311 -1653308
35986a653308K87098N27144J83089l95001p78143n49069L98764J371795J343172
$$ -1653308 -1366210 -839066 -655977 -1050978 -1829121 -2378190 -1979426 -607631 735541
35977G35541K54441p70124q61046l90327j03337p749K23981L75414M4685m77406
$$ 735541 989982 219858 -641188 -1031515 -1134852 -1142601 -918620 -543206 -498521 -975927
35967i75927n01906K0812M24619K54321k34568m78871j54043N89338J163053J004379
$$ -975927 -1477833 -1457021 -1032402 -778081 -1012649 -1491520 -1645563 -1056225 106828 1111207
35957A111207K44161l67594m27735l46944n46991p39284n04906p7040R7823J52153
$$ 1111207 1355368 987774 560039 213095 -333896 -1073180 -1578086 -1655126 -1557303 -1405150
35947a405150M40878P46224O07045J83663P572M8148j81993p02222j020006r46787
$$ -1405150 -964272 -218048 388997 572660 580232 628380 446387 -255835 -1275841 -2222628
35937b222628p06175k94282M62856J211359J263998O13780J138j57154j73781
$$ -2222628 -2928803 -3223085 -2760229 -1548870 -284872 328908 330046 172892 -889
35928h89l07413l49252j87042l9545Q4474M22431P42982M08228n29610j100698
$$ -889 -308302 -657554 -844596 -884141 -799667 -377236 365746 773974 244364 -856334
35918h56334p17752K4433L09494J64381N9478R6935J48617K36680K65942o3904
$$ -856334 -1574086 -1549653 -1240159 -1075778 -1016300 -919365 -770748 -534068 -268126 -332030
35908c32030o09088o76761p7836M12123K33083q4062M6605J69611k98518p95175
$$ -332030 -941118 -1617879 -1695715 -1283592 -1050509 -1134571 -1087966 -918355 -1216873 -2012048
35898b012048m66606K32750J65185n42229o20977K60779R74057P55320K11194
$$ -2012048 -2478654 -2245904 -2080719 -2622948 -3243925 -2983146 -2009089 -1253769 -1042575
35889a042575N694j93964o93291p65197K76100J647632J842416N89226q05646
$$ -1042575 -1036881 -1230845 -1924136 -2689333 -2413233 -765601 1076815 1666041 860395
35880H60395j078072l23116M16064M29312n394j23294K90832N36234j06680j258693
$$ 860395 -217677 -540793 -124729 304583 299189 175895 466727 1002961 896281 -362412
35870c62412j720191r47125K75395Q60746O36881K25530J45445M21297P52986
$$ -362412 -2082603 -3029728 -2754333 -1893587 -1256706 -1031176 -885731 -464434 288552
35861B88552P22835J36120n52242n36800K57765Q29518L30079p25826j082639
$$ 288552 1011387 1147507 595265 58465 316230 1145748 1475827 750001 -332638
35852c32638l36025P22437J223987J057701N86288J05095k73013n75974r07769
$$ -332638 -668663 53774 1277761 2335462 2921750 3026845 2753832 2177858 1270089
35843A270089j173915r82471k00176N37936M21410m41147j075143q51241q3145
$$ 1270089 96174 -886297 -1086473 -548537 -127127 -568274 -1643417 -2494658 -2577803
35834b577803O72762J226320J379767O93695p21181j667450r75280R07351K170222
$$ -2577803 -1905041 -678721 701046 1394741 673560 -993890 -1969170 -1061819 1108403
35825A108403J670336J69693p24827m22698K64457L52156k21258p95540q82250
$$ 1108403 2778739 2948432 2223605 1800907 2065364 2417520 2196262 1400722 518472
35816E18472n72599k11367K2487J54591K38947K88394L17666L46729L61475L17324
$$ 518472 -54127 -265494 -243007 -88416 150531 438925 756591 1103320 1464795 1782119
35806A782119J81126l6769k70774m35329n14162n78605o43442n62120k02135L04579
$$ 1782119 1963245 1926476 1655702 1220373 706211 127606 -515836 -1077956 -1280091 -975512
35796i75512O50158O80330M66979R8032l40821n85290l67071R9000J76829l81635
$$ -975512 -325354 354976 821955 919987 579166 -6124 -373195 -274195 -97366 -479001
35786d79001r87783q94414j00060P47130J152633J116394Q07245L12768k55012
$$ -479001 -1466784 -2361198 -2461258 -1714128 -561495 554899 1362144 1674912 1419900
35777A419900o89659q10194n76549j67839L1342k00244m69997j25678O94796R28504
$$ 1419900 730241 -79953 -656502 -824341 -792999 -993243 -1463240 -1588918 -894122 34382
35767C4382R307j118681j175656l21049K26156J26587K92167J157037J773164
$$ 34382 43689 -1074992 -2250648 -2571697 -2345541 -2218954 -1926787 -769750 1003414
35758A003414J222982K6362o36268n07628k73255l52359m12664l325Q35832J581560
$$ 1003414 2226396 2252758 1616490 1108862 835607 483248 70584 67259 903091 2484651
35748B484651J604958P26629m12124q36631l21338L62028M80712J54003j44834
$$ 2484651 4089609 4816238 4404114 3567483 3246145 3608173 4088885 4242888 4098054
35739D098054l15529m02619k06212K64215M09868j94073j014768j242463r37098
$$ 4098054 3782525 3379906 3173694 3437909 3847777 3653704 2638936 1396473 459375
35730D59375p50115p82759n69581n8253K65568K41941K25873L37803K72689j8706
$$ 459375 -290740 -1073499 -1643080 -1701333 -1435765 -1193824 -967951 -630148 -357459 -376165
35720c76165j58548j4115R3692N596n4267L322o418o9035R690N2418k95983p42302
$$ -376165 -534713 -548828 -455136 -449540 -503807 -500485 -506903 -575938 -566248 -513830 -809813 -1552115
35708a552115n49791K58225Q06624P40396O78949Q86146O12361n02268j411349
$$ -1552115 -2101906 -1843681 -1037057 -296661 382288 1268434 1880795 1378527 -32822
35699c2822j064763k4833M34061K02543R8443K33195j2560n43341m52857M38079
$$ -32822 -1097585 -1122418 -688357 -485814 -387371 -154176 -166736 -710077 -1162934 -724855
35689g24855J102451P26058k79114j007133j058765n62244Q8914L07821j70367
$$ -724855 377596 1103654 824540 -182593 -1241358 -1803602 -1714688 -1406867 -1577234
35680a577234p03574m58790K01190P7491q67669j128492O7940J324000J002373
$$ -1577234 -2280808 -2739598 -2538408 -2460917 -3328586 -4457078 -4389138 -3065138 -2062765
35671b062765l43614q33843K828Q34490P16440K29574J85790M44743N52809O10486
$$ -2062765 -2406379 -3240222 -3237394 -2402904 -1686464 -1456890 -1271100 -826357 -273548 336938
35661C36938Q47604R87074O66811O8675l80696n73852n62551k30669L87165P95074
$$ 336938 1184542 2171616 2838427 2907102 2526406 1952554 1390003 1159334 1546499 2341573
35651B341573N70795k3428m46854o41495q29251p95170j42512P38872Q05720j93468
$$ 2341573 2912368 2888940 2442086 1800591 971340 176170 33658 772530 1578250 1384782
35641A384782j108186q14158K19637N54521k06943q89421m32702O44713J028962
$$ 1384782 276596 -537562 -317925 236596 29653 -859768 -1292470 -647757 381205
35632C81205L75501m70341q55397j053265j375224j337889l76630J032199J744099
$$ 381205 756706 286365 -569032 -1622297 -2997521 -4335410 -4712040 -3679841 -1935742
35623a935742J379176O96624M21258L32283j39907q78822j148662n57944M20701
$$ -1935742 -556566 140058 561316 893599 753692 -125130 -1273792 -1831736 -1411035
35614a411035R34346O10976p3764l03526J27929N21623K02994m48472m71221J94274
$$ -1411035 -476689 134287 60523 -243003 -115074 406549 609543 161071 -310150 -115876
35604a15876M73806k69623j199614j158799k55958M79058N88425M39091K55185
$$ -115876 357930 88307 -1111307 -2270106 -2526064 -2047006 -1458581 -1019490 -764305
35595g64305j01678m22578k26094K77934K32929n15770r64091l27174Q36384J442428
$$ -764305 -865983 -1288561 -1514655 -1236721 -1003792 -1519562 -2483653 -2810827 -1974443 -532015
35585e32015J240476P50117L19898p5648l90422m81744m02268k84622j08001P8106
$$ -532015 708461 1458578 1778476 1702828 1312406 830662 428394 143772 35771 113877
35575A13877o955m02369n97557j94441M08351N46101K57801J08308K14025J39024
$$ 113877 106922 -295447 -893004 -1087445 -679094 -132993 124808 233116 447141 586165
35565E86165k45739m68782j83279L29284N80559M27744N6291k70206l15315M867
$$ 586165 340426 -128356 -311635 17649 598208 1025952 1082243 812037 496722 501589
35555E01589M75984P25426N43792m660o24002q00685j30045J000212J409196L95327
$$ 501589 977573 1702999 2246791 2242131 1618129 817444 687399 1687611 3096807 3492134
35545C492134j196761j836034j122592m1098N50932Q15149J089622J030954K01966
$$ 3492134 2295373 459339 -663253 -704351 -153419 661730 1751352 2782306 2984272
35536B984272r96163j619522j225882k13917P06020J029136O18761k29566q63189
$$ 2984272 1988109 368587 -857295 -1071212 -365192 663944 1282705 1053139 189950
35527A89950p13239J65929J044491J123101L00340o75904r63921n17123K2993
$$ 189950 -523289 -357360 687131 1810232 2110572 1434668 470747 -46376 -23383
35518b3383K72249M41778O16240M09301k10857m79760L0753M74452q4919j053155
$$ -23383 248866 690644 1306884 1716185 1505328 1025568 1056321 1530773 1445854 392699
35508C92699j077845j43631M58080J74182k46723l67447o80501j189140r48168
$$ 392699 -685146 -828777 -370697 -196515 -443238 -810685 -1491186 -2680326 -3628494
35499c628494K21813J008183N62621j31510L7694N05648K90974q1801M08527J176704
$$ -3628494 -3406681 -2398498 -1835877 -1967387 -1929693 -1424045 -1133071 -1214872 -806345 370359
35489C70359Q04733m92407j041519l07619M37792K79206j29189j3861K53098N5658
$$ 370359 1175092 682685 -358834 -666453 -228661 50545 -78644 -92505 160593 216251
35479B16251l71458n09316m35263m50758m16091o5313M15357N88749K91846k60434
$$ 216251 -155207 -664523 -1099786 -1550544 -1966635 -2031948 -1616591 -1027842 -735996 -996430
35469i96430o29741m04747L05389P31285L54698j92621R4180J007440J288969
$$ -996430 -1626171 -2030918 -1725529 -994244 -639546 -832167 -737987 269453 1558422
35460A558422N04820k81528j03766N76827P11545R2726o82142j110824j062159
$$ 1558422 2063242 1781714 1677948 2254775 2966320 3059046 2376904 1266080 203921
35451B03921n87412K0388L01248J50664k2386J14115M43666P64571J027780J068583
$$ 203921 -383491 -363103 -61855 88809 66423 180538 624204 1388775 2416555 3485138
35441C485138O86079J52327o375J16387p5923n25832m57124J87806L42272n42939
$$ 3485138 4171217 4323544 4317169 4433556 4357633 3831801 3374677 3562483 3904755 3361816
35431C361816j517702j600785j218862j187404j205500n99235K03052L46964J78064
$$ 3361816 1844114 243329 -975533 -2162937 -3368437 -3967672 -3764620 -3417656 -3239592
35422c239592O96496J659386J762162P34291j98762k02369J20805k0991m55474
$$ -3239592 -2543096 -883710 878452 1612743 1413981 1211612 1332417 1311426 855952
35413H55952o61742o03177m29908j30726R1281j46635o27809o12939r2457k9576
$$ 855952 194210 -408967 -838875 -969601 -878320 -1024955 -1652764 -2265703 -2358160 -2387736
35403b387736p67877j143943p2444J701415K465890J745449O36276J31918P4855
$$ -2387736 -3155613 -4299556 -4372000 -2670585 -204695 1540754 2177030 2308948 2383803
35394B383803j47029o32975r73762q16253k50145K06999J05610l02016k52884
$$ 2383803 2236774 1603799 630037 -186216 -436361 -229362 -123752 -425768 -678652
35385f78652M08602P96373K40316n06617k18329Q99353J355665N31157m32570
$$ -678652 -270050 526323 766639 260022 41693 941046 2296711 2827868 2395298
35376B395298l59065L36131N04648Q719l57546k72833j89096l18823k82500N7208
$$ 2395298 2036233 2372364 2877012 2885731 2528185 2255352 2066256 1747433 1464933 1522141
35366A522141K22399o9294l63773j85515K04649K83058J30007K25603N57572N71372
$$ 1522141 1744540 1675246 1311473 1125958 1330607 1613665 1743672 1969275 2526847 3098219
35356C098219Q8644k70885J00112Q62814J017342J35723r97223j230903m59821
$$ 3098219 3186863 2915978 3016090 3878904 4896246 5031969 4034746 2803843 2344022
35347B344022J89162j93108j014441r20224K78995J198307P13143n11656r79965
$$ 2344022 2533184 2340076 1325635 405411 684406 1882713 2595856 2084200 1104235
35338A104235l60276L33679L62377J25017K47214O02785O49976K30727l64041
$$ 1104235 743959 1077638 1440015 1565032 1812246 2415031 3065007 3295734 2931693
35329B931693p90836q14476l82553J75999K96137k03920q54230j093424q86418
$$ 2931693 2140857 1326381 943828 1119827 1415964 1212044 357814 -735610 -1622028
35320a622028o00785m86530m68550k97231J92828Q07622J014870N53889n0334
$$ -1622028 -2222813 -2709343 -3177893 -3475124 -3282296 -2474674 -1459804 -905915 -956249
35311i56249p8680K95188J94782n30221q89569k17727P27382Q47247K70266n4260
$$ -956249 -1034929 -739741 -544959 -1075180 -1964749 -2182476 -1455094 -607847 -337581 -391841
35301c91841P7507j4771n74750r57849o97707k01175k2746p2078K1231J98402
$$ -391841 -314334 -329105 -903855 -1861704 -2559411 -2760586 -2783332 -2855410 -2834179 -2635777
35291b635777J10398k58817n41660n12556l25789j48782J76658Q38356J496983
$$ -2635777 -2525379 -2784196 -3325856 -3838412 -4164201 -4312983 -4136325 -3297969 -1800986
35282a800986J452814O28501j4800L68107J158911R31115m75520j528759j092507
$$ -1800986 -348172 280329 265529 633636 1792547 2723662 2248142 719383 -373124
35273c73124L0141M23237Q2051O774L48518L05155k77203n34297n1973M29760
$$ -373124 -342983 80254 162305 169079 517597 822752 545549 11252 -40721 389039
35263C89039K31012k56180l20747K370K17349K25085L02306M83328M44430m4308
$$ 389039 620051 363871 43124 45494 262843 487928 790234 1273562 1717992 1673684
35253A673684p63748j117657o35313L83962R08894K77809q82967j363569q57226
$$ 1673684 909936 -207721 -843034 -459072 449822 727631 -155336 -1518905 -2376131
35244b376131j07017K99548M41433L51956k05874r38565r42245L0564R89221J003279
$$ -2376131 -2483148 -2183600 -1742167 -1390211 -1596085 -2534650 -3476895 -3446331 -2457110 -1453831
$$ [...]
##END NTUPLES=NMR SPECTRUM
##END=
