##TITLE=31Pdec_B3d1701
 CDCl3, 24 sc
 17.1.2025
##JCAMPDX= 6.0         $$ Bruker NMR JCAMP-DX V2.0
##DATA TYPE= NMR SPECTRUM
##DATA CLASS= NTUPLES
##ORIGIN= UXNMR, Bruker Analytische Messtechnik GmbH
##OWNER= root
$$ XWIN-NMR		Version 3.5
$$ Fri Jan 17 16:30:24 2025 Russian Standard Time (UT+4h)  she@DPX200
##.OBSERVE FREQUENCY= 81.013821
##.OBSERVE NUCLEUS= ^31P
##.ACQUISITION MODE= SIMULTANEOUS
##.ACQUISITION SCHEME= undefined
##.AVERAGES= 40
##.DIGITISER RES= 17
##SPECTROMETER/DATA SYSTEM= spect
##.PULSE SEQUENCE= zgpg30
##.SOLVENT NAME= CDCl3
##.SHIFT REFERENCE= (INTERNAL, CDCl3, 0, 198.062)
##AUDIT TRAIL= $$ (NUMBER, WHEN, WHO, WHERE, WHAT)
$$ ##TITLE= Audit trail, XWIN-NMR		Version 3.5
$$ ##JCAMPDX= 5.01
$$ ##ORIGIN= Bruker BioSpin GmbH
$$ ##OWNER= she
$$ F:/spectra/data/she/nmr/P31/2/pdata/1/auditp.txt
$$ ##AUDIT TRAIL=  $$ (NUMBER, WHEN, WHO, WHERE, WHAT)
(   1,<2025-01-17 16:29:29.64 +0400>,<she>,<DPX200>,
      <created by zg, POWCHK disabled, PULCHK disabled
       configuration hash MD5:
       00 E9 B6 7A A2 85 ED C7 34 08 36 98 17 FE 4E 26
       data hash MD5: 32K
       95 A2 68 94 AD 03 C5 49 42 96 47 48 A7 92 87 E6>)
(   2,<2025-01-17 16:29:32.10 +0400>,<she>,<DPX200>,
      <Start of raw data processing
       efp BC_mod = 2 LB = 1.5 FT_mod = 6 PKNL = 1 PHC0 = 1752.171 PHC1 = 100.6864 SI = 64K 
       data hash MD5: 64K
       C2 E5 1E 52 C3 B5 44 6A 0C 91 52 80 14 98 87 8E>)
(   3,<2025-01-17 16:29:52.07 +0400>,<she>,<DPX200>,
      <pk PHC0 = -13.7521 PHC1 = 35 
       data hash MD5: 64K
       EA 76 CF F9 37 A6 04 19 03 3E 6F AC C9 3C 42 E2>)
(   4,<2025-01-17 16:29:57.57 +0400>,<she>,<DPX200>,
      <abs ABSG = 5 
       data hash MD5: 64K
       4D BA B9 CF 06 59 82 47 BD D2 6E 0F D0 82 54 6E>)
$$ ##END=
$$ 
$$ hash MD5
$$ B2 9A 58 6B 83 0A 5B 34 35 19 C3 9F 81 5D 80 86
##$RELAX= 
##$RELAX= 
##$RELAX= 
##$RELAX= 
##$RELAX= 
##$RELAX= 
##$RELAX= 
##$RELAX= 
$$ Bruker specific parameters
$$ --------------------------
##$DU= <F:/spectra>
##$EXPNO= 2
##$NAME= <P31>
##$PROCNO= 1
##$TYPE= <nmr>
##$USER= <she>
##$AMP= (0..31)
100 100 100 100 100 100 100 100 100 100 100 100 100 100 100 100 100 100 
100 100 100 100 100 100 100 100 100 100 100 100 100 100 
##$AQSEQ= 0
##$AQ_mod= 1
##$AUNM= <au_zg>
##$AUTOPOS= <>
##$BF1= 81.014009
##$BF2= 200.13
##$BF3= 200.13
##$BF4= 200.13
##$BF5= 200.13
##$BF6= 200.13
##$BF7= 200.13
##$BF8= 200.13
##$BYTORDA= 1
##$CFDGTYP= 0
##$CFRGTYP= 5
##$CHEMSTR= <none>
##$CNST= (0..31)
1 1 145 1 1 1 1 1 1 1 1 1 1 1 1 1 1 1 1 1 1 1 1 1 1 1 1 1 1 1 1 1 
##$CPDPRG= <waltz16>
##$CPDPRG1= <>
##$CPDPRG2= <waltz16>
##$CPDPRG3= <>
##$CPDPRG4= <mlev>
##$CPDPRG5= <mlev>
##$CPDPRG6= <mlev>
##$CPDPRG7= <mlev>
##$CPDPRG8= <mlev>
##$CPDPRGB= <>
##$CPDPRGT= <>
##$D= (0..31)
0 1 0 0 0 0 0 0 0 0.06 0 0.03 2e-05 3e-06 0 0 0.0002 0 0 0 0 0 0 0 0 0 
0 0 0 0 0 0 
##$DATE= 1737116969
##$DBL= (0..7)
120 120 120 11 120 120 24 19 
##$DBP= (0..7)
150 150 150 150 150 150 150 150 
##$DBP07= 0
##$DBPNAM0= <>
##$DBPNAM1= <>
$$ [...]
##$SUBNAM3= <"">
##$SUBNAM4= <"">
##$SUBNAM5= <"">
##$SUBNAM6= <"">
##$SUBNAM7= <"">
##$SUBNAM8= <"">
##$SUBNAM9= <"">
##$SW= 400.765351723535
##$SWIBOX= (0..15)
0 1 3 0 0 0 0 0 0 0 0 0 0 0 0 0 
##$SW_h= 32467.5324675325
##$TD= 32768
##$TD0= 1
##$TE= 0
##$TE2= 300
##$TE3= 300
##$TEG= 300
##$TL= (0..7)
0 120 53 12 22 120 120 120 
##$TP= (0..7)
150 150 150 150 150 150 150 150 
##$TP07= 0
##$TPNAME0= <>
##$TPNAME1= <>
##$TPNAME2= <>
##$TPNAME3= <>
##$TPNAME4= <>
##$TPNAME5= <>
##$TPNAME6= <>
##$TPNAME7= <>
##$TPOAL= (0..7)
0.5 0.5 0.5 0.5 0.5 0.5 0.5 0.5 
##$TPOFFS= (0..7)
0 0 0 0 0 0 0 0 
##$TUNHIN= 0
##$TUNHOUT= 0
##$TUNXOUT= 0
##$USERA1= <user>
##$USERA2= <user>
##$USERA3= <user>
##$USERA4= <user>
##$USERA5= <user>
##$V9= 5
##$VALIST= <valist>
##$VCLIST= <CCCCCCCCCCCCCCC>
##$VD= 0
##$VDLIST= <DDDDDDDDDDDDDDD>
##$VPLIST= <PPPPPPPPPPPPPPP>
##$VTLIST= <TTTTTTTTTTTTTTT>
##$WBST= 1024
##$WBSW= 4
##$XGAIN= (0..3)
0 0 0 0 
##$XL= 0
##$YL= 0
##$YMAX_a= 6795
##$YMIN_a= -13827
##$ZGOPTNS= <>
##$ZL1= 120
##$ZL2= 120
##$ZL3= 120
##$ZL4= 120
##$ABSF1= 198.0616
##$ABSF2= -202.7028
##$ABSG= 5
##$ABSL= 3
##$ALPHA= 0
##$AQORDER= 0
##$ASSFAC= 0
##$ASSFACI= 0
##$ASSFACX= 0
##$ASSWID= 0
##$AUNMP= <proc_1d>
##$AZFE= 0.1
##$AZFW= 0.5
##$BCFW= 0
##$BC_mod= 2
##$BYTORDP= 0
##$COROFFS= 0
##$CY= -3
##$DATMOD= 1
##$DC= 0
##$DFILT= <>
##$DTYPP= 0
##$F1P= 0
##$F2P= 0
##$FCOR= 1
##$FTSIZE= 65536
##$FT_mod= 6
##$GAMMA= 0
##$GB= 0
##$INTBC= 1
##$INTSCL= 9.790993e-09
##$ISEN= 30
##$LB= 1.5
##$LEV0= 0
##$LPBIN= 0
##$MAXI= 10000
##$MC2= 0
##$MEAN= 0
##$ME_mod= 0
##$MI= 50
##$NCOEF= 0
##$NC_proc= -6
##$NLEV= 6
##$NOISF1= 182.463
##$NOISF2= 159.3651
##$NSP= 0
##$NTH_PI= 0
##$NZP= 0
##$OFFSET= 198.0616
##$PC= 4
##$PHC0= 1738.419
##$PHC1= 135.6864
##$PH_mod= 1
##$PKNL= yes
##$PPARMOD= 0
##$PSCAL= 0
##$PSIGN= 0
##$REVERSE= no
##$SF= 81.0140089999434
##$SI= 65536
##$SIGF1= 159.3651
##$SIGF2= -187.1042
##$SINO= 113.3802
##$SIOLD= 16384
##$SREGLST= <1H.CDCl3>
##$SSB= 0
##$STSI= 65536
##$STSR= 0
##$SW_p= 32467.5324675325
##$SYMM= 0
##$S_DEV= 0
##$TDeff= 32768
##$TDoff= 0
##$TI= <>
##$TILT= no
##$TM1= 0
##$TM2= 0
##$TOPLEV= 0
##$USERP1= <user>
##$USERP2= <user>
##$USERP3= <user>
##$USERP4= <user>
##$USERP5= <user>
##$WDW= 1
##$XDIM= 65536
##$YMAX_p= 275931332
##$YMIN_p= -26797415
$$ End of Bruker specific parameters
$$ ---------------------------------
##NTUPLES= NMR SPECTRUM
##VAR_NAME=  FREQUENCY,     SPECTRUM/REAL,   SPECTRUM/IMAG
##SYMBOL=    X,             R,               I
##VAR_TYPE=  INDEPENDENT,   DEPENDENT,       DEPENDENT
##VAR_FORM=  AFFN,          ASDF,            ASDF
##VAR_DIM=   65536,         65536,           65536
##UNITS=     HZ,            ARBITRARY UNITS, ARBITRARY UNITS
##FACTOR=    0.49542278885378, 1,            1
##FIRST=     16045.7642231865, 0,            0
##LAST=      -16421.768244346, 0,            0
##MIN=       -16421.768244346, -26797415,    0
##MAX=       16045.7642231865, 275931332,    0
$$ Real data points
##PAGE= N=1
##DATA TABLE= (X++(R..R)), XYDATA
$$ [...]
$$ plain form
40919 -438903 -522120 -29354 703225 975851 648705 187200 -150127 -551585 -1005683 -1059791
40909 -1059791 -515867 149350 457721 639587 1207695 2061529 2517805 2195745 1467507
40900 1467507 952673 848331 893973 844220 801949 1027110 1466466 1666551 1334092 822959
40890 822959 701838 880177 642371 -323068 -1428139 -1980107 -1988388 -1813929 -1509188 -1040866
40880 -1040866 -752151 -934921 -1222655 -1103907 -790998 -775766 -731059 102115 1378679 1663183
40870 1663183 417171 -1058884 -1348804 -703347 -234856 -86542 438525 1323953 1697397
40861 1697397 1289464 903775 1093847 1304927 876124 194192 157282 875072 1562920 1578566
40851 1578566 1012661 282555 -357886 -781321 -854007 -598833 -298969 -184499 -87572 336411
$$ packed form
40919d38903q3217M92766P32579K72626l27146m61505l37327m01458m54098n4108
40909a059791N43924O65217L08371J81866N68108Q53834M56276l22060p28238
40900A467507n14834j04342M5642m9753m2271K25161M39356K00085l32459n11133
40890H22959j21121J78339k37806r65439j105071n51968q281J74459L04741M68322
40880a040866K88715j82770k87734J18748L12909J5232M4707Q33174J276564K84504
40870A663183j246012j476055k89920O45457M68491J48314N25067Q85428L73444
40861A697397m07933l85689J90072K11080m28803o81932l6910P17790O87848J5646
40851A578566n65905p30106o40441m23435p2686K55174K99864J14470R6927M23983
$$ plain form
40841 336411 1002431 1271660 664266 -420104 -998314 -565808 396672 1074297 1192945
40832 1192945 1042518 903504 816758 806699 925382 1014574 748949 69409 -632917 -925030
40822 -925030 -802517 -617410 -620575 -732546 -787005 -872381 -1261940 -1943006 -2385961 -2040095
40812 -2040095 -1045803 -160048 111224 -3347 -72176 -91760 -247045 -363831 -115130 346019
40802 346019 479969 120433 -304692 -412394 -332507 -380762 -586639 -741510 -702594 -499027
40792 -499027 -281558 -215600 -254110 -47435 648676 1485453 1783058 1335401 607957 62878
40782 62878 -308584 -629773 -749978 -514115 -117937 106925 45472 -282011 -877318 -1576942
40772 -1576942 -1982941 -1896667 -1594742 -1369854 -1054603 -380851 419881 854297 901004 1027656
$$ packed form
40841C36411O66020K69229o07394j084370n78210M32506R62480O77625J18648
40832A192945j50427j39014q6746j0059J18683Q9192k65625o79540p02326k92113
40822i25030J22513J85107l165j11971n4459q5376l89559o81066m42955L45866
40812b040095R94292Q85755K71272j14571o8829j9584j55285j16786K48701M61149
40802C46019J33950l59536m25125j07702P9887m8255k05877j54871L8916K03567
40792d99027K17469O5958l8510K06675O96111Q36777K97605m47657p27444n45079
40782F2878l71462l21189j20205K35863L96178K24862o1453l27483n95307o99624
40772a576942m05999Q6274L01925K24888L15251O73752Q00732M34416M6707J26652
$$ plain form
40762 1027656 1465761 1886579 1871938 1370630 625690 -31875 -253185 125012 812612 1279853
40752 1279853 1375315 1470647 1839476 2173439 1980727 1292962 667526 505798 609040 484135
40742 484135 -51515 -683150 -984082 -892435 -741846 -845781 -1156135 -1382070 -1339209 -1058841
40732 -1058841 -624689 -93946 386697 562014 300497 -215803 -658052 -908161 -1137335
40723 -1137335 -1468185 -1670221 -1379763 -632428 61660 333970 437932 819627 1347849
40714 1347849 1405948 791713 69206 -190998 -135575 -275761 -719388 -1150907 -1378955 -1485295
40704 -1485295 -1526323 -1477866 -1433245 -1498930 -1531121 -1338764 -1105467 -1172256 -1364609 -1027443
40694 -1027443 66309 1245899 1669575 1248022 586388 260539 439165 999038 1639739
$$ packed form
40762A027656M38105M20818j4641n01308p44940o57565k21310L78197O87600M67241
40752A279853R5462R5332L68829L33963j92712o87765o25436j61728J03242j24905
40742D84135n35650o31635l00932R1647J50589j03935l10354k25935M2861K80368
40732a058841M34152N30743M80643J75317k61517n16300m42249k50109k29174
40723a137335l30850k02036K90458P47335O94088K72310J03962L81695N28222
40714A347849N8099o14235p22507k60204N5423j40186m43627m31519k28048j06340
40704a485295m1028M8457M4621o5685l2191J92357K33297o6789j92353L37166
40694a027443J093752J179590M23676m21553o61634l25849J78626N59873O40701
$$ plain form
40685 1639739 1965344 1799809 1454670 1432967 1813498 2135911 1987958 1548235 1394094 1805702
40675 1805702 2394009 2508227 1981689 1329249 1111895 1251557 1213275 805854 445066 493113
40665 493113 684327 531827 105340 -9061 481702 1178341 1521084 1441414 1297239 1353195
40655 1353195 1547142 1666974 1537557 1068090 321433 -435809 -916606 -1101175 -1223326
40646 -1223326 -1444203 -1688907 -1851453 -1964616 -2037375 -1912643 -1509110 -1089765 -1029603 -1349001
40636 -1349001 -1713731 -1877016 -1862530 -1705338 -1323075 -746866 -209426 133227 338262 433612
40626 433612 338056 188510 405437 1133367 1887062 2112285 1898427 1754739 1841060 1852363
40616 1852363 1589273 1201067 853273 564476 432200 630616 1054721 1282450 1040057
$$ packed form
40685A639739L25605j65535l45139k1703L80531L22413j47953m39723j54141M11608
40675A805702N88307J14218n26538o52440k17354J39662l8282m07421l60788M8047
40665D93113J91214j52500m26487j14401M90763O96639L42743p9670j44175N5956
40655A353195J93947J19832j29417m69467p46657p57242m80797j84569j22151
40646a223326k20877k44704j62546j13163p2759J24732M03533M19345O0162l19398
40636a349001l64730j63285J4486J57192L82263N76209N37440L42653K05035R5350
40626D33612r5556j49546K16927P27930P53695K25223k13858j43688Q6321J1303
40616A852363k63090l88206l47794k88797j32276J98416M24105K27729k42393
$$ plain form
40607 1040057 484981 -47967 -356009 -388436 -213563 -12336 119303 332676 717307 940038
40597 940038 642519 160843 258541 998334 1486580 1062752 213683 -134715 182259 572459
40587 572459 587293 298349 -59475 -361195 -574160 -777385 -1080535 -1305654 -1027316 -230270
40577 -230270 430493 464895 293197 595386 1229703 1512489 1379643 1427771 1785046 1810361
40567 1810361 1170907 466034 380235 803193 1210304 1420016 1536650 1565308 1528988 1610606
40557 1610606 1763037 1548638 823607 209648 331719 894416 1149106 1056950 1255306 1916674
40547 1916674 2403751 2235425 1738952 1421682 1216098 772673 164086 -149705 71927
40538 71927 595921 994581 959665 424875 -404701 -1150692 -1510629 -1422691 -1005473 -458258
$$ packed form
40607A040057n55076n32948l08042l2427J74873K01227J31639K13373L84631K22731
40597I40038k97519m81676R7698P39793M88246m23828q49069l48398L16974L90200
40587E72459J4834k88944l57824l01720k12965k03225l03150k25119K78338P97046
40577b30270O60763L4402j71698L02189O34317K82786j32846M8128L57275K5315
40567A810361o39454p04873q5799M22958M07111K09712J16634K8658l6320Q1618
40557A610606J52431k14399p25031o13959J22071N62697K54690r2156J98356O61368
40547A916674M87077j68326m96473l17270k05584m43425o08587l13791K21632
40538G1927N23994L98660l4916n34790q29576p45991l59937Q7938M17218N47215
$$ plain form
40528 -458258 -14262 207838 360384 684509 1137904 1451546 1598368 1853630 2238517 2299248
40518 2299248 1750370 1017723 746718 995299 1322305 1482668 1567332 1578280 1381489 1066800
40508 1066800 864476 673644 162935 -591984 -1088929 -1154824 -1192179 -1452072 -1598148 -1331490
40498 -1331490 -958384 -894406 -1002492 -917991 -714394 -713089 -860490 -843314 -684933 -697148
40488 -697148 -909992 -1040393 -985324 -886599 -755944 -506856 -303794 -355051 -377281 143740
40478 143740 1073559 1598960 1266871 540864 118959 183093 521504 863118 824452 71512
40468 71512 -1096320 -1806642 -1648481 -1178706 -988837 -811195 -141565 734279 1109304 967248
40458 967248 913285 1099635 1027159 488691 -26917 -86554 131941 289509 379408 492223
$$ packed form
40528d58258M43996K22100J52546L24125M53395L13642J46822K55262L84887O0731
40518B299248n48878p32647k71005K48581L27006J60363Q4664J0948j96791l14689
40508A066800k02324j90832n10709p54919m96945o5895l7355k59893j46076K66658
40498a331490L73106O3978j08086Q4501K03597J305j47401J7176J58381j2215
40488f97148k12844j30401N5069R8725J30655K49088K03062n1257k2230N21021
40478A43740R29819N25401l32089p26007m21905O4134L38411L41614l8666p52940
40468G1512j167832p10322J58161M69775J89869J77642O69630Q75844L75025j42056
40458I67248n3963J86350p2476n38468n15608n9637K18495J57568Q9899J12815
$$ plain form
40448 492223 529697 456470 463622 570494 399687 -291791 -1106582 -1410332 -1101924 -643920
40438 -643920 -402069 -280326 -39161 291214 465494 403698 372215 689028 1253286 1526721
40428 1526721 1131694 351454 -199756 -341947 -462940 -869365 -1344347 -1489747 -1219926
40419 -1219926 -724037 -183832 242396 371368 226494 198961 678932 1549335 2285008 2552874
40409 2552874 2493833 2385703 2259080 1973349 1531496 1149103 1016199 1083896 1120917 957301
40399 957301 656864 452113 502897 705470 760792 498723 154028 203143 799118 1461480
40389 1461480 1557401 1080413 661749 724720 963211 876030 486168 156378 -64425 -418003
40379 -418003 -847652 -939833 -513202 158284 782427 1284729 1522286 1265391 695130 447708
$$ packed form
40448D92223L7474p3227P152J06872j70807o91478q14791l03750L08408M58004
40438f43920K41851J21743K41165L30375J74280o1796l1483L16813N64258K73435
40428A526721l95027p80240n51210j42191j20993m06425m74982j45400K69821
40419a219926M95889N40205M26228J28972j44874k7533M79971Q70403P35673K67866
40409B552874n9041j08130j26623k85731m41853l82393j32904O7697L7021j63616
40399I57301l00437k04751N0784K02573N5322k62069l44695M9115N95975O62362
40389A461480R5921m76988m18664O2971K38491q7181l89862l29790k20803l53578
40379d18003m29649r2181M26631O71486O24143N02302K37557k56895n70261k47422
$$ plain form
40369 447708 808643 1240816 1122247 632047 407948 541823 500143 26751 -427996 -353412
40359 -353412 152053 616254 840714 1015205 1277196 1431010 1197919 624833 84579 -182085
40349 -182085 -404263 -982792 -1866504 -2453724 -2243643 -1437299 -731602 -592329 -854340 -979595
40339 -979595 -609058 100070 646415 759191 749394 1073047 1574040 1549839 724821 -256177
40329 -256177 -631108 -458751 -307574 -309142 -131738 233162 356044 139966 56694 347994
40319 347994 557921 253620 -262587 -473811 -532943 -1005970 -1884799 -2508372 -2528751 -2363131
40309 -2363131 -2456516 -2597124 -2347383 -1809473 -1490915 -1565948 -1729964 -1753464 -1725516 -1657413
40299 -1657413 -1292596 -579775 -14194 -140225 -855178 -1524802 -1702618 -1434520 -935935
$$ packed form
40369D47708L60935M32173j18569m90200k24099J33875m1680m73392m54747P4584
40359c53412N05465M64201K24460J74491K61991J53814k33091n73086n40254k66664
40349a82085k22178n78529q83712n87220K10081Q06344P05697J39273k62011j25255
40339i79595L70537P09128N46345J12776r797L23653N00993k4201q25018r80998
40329b56177l74931J72357J51177j568J77404L64900J22882k16078q3272K91300
40319C47994K09927l04301n16207k11224n9132m73027q78829o23573k0379J65620
40309b363131r3385j40608K49741N37910L18558p5033j64016k3500K7948O8103
40299a657413L64817P12821N65581j26031p14953o69624j77816K68098M98585
$$ plain form
40290 -935935 -354125 107524 212445 14817 -112195 38975 224223 147102 -71520 -91733
40280 -91733 118102 262247 209115 230450 651220 1399114 2008502 2061343 1607057 1123768
40270 1123768 1010990 1149834 1083909 613588 9398 -400311 -589751 -643763 -473227 16041
40260 16041 645966 1146694 1495974 1773984 1770360 1126965 -54803 -1084089 -1355144 -978845
40250 -978845 -581566 -600200 -942699 -1278129 -1461307 -1581958 -1686171 -1625338 -1281527 -849938
40240 -849938 -711700 -1001778 -1456078 -1729367 -1715441 -1517323 -1286054 -1140658 -1033040 -648821
40230 -648821 241419 1216931 1413699 605416 -305955 -344213 281821 546344 67258 -486597
40220 -486597 -502287 -250502 -301494 -634945 -781197 -573808 -338785 -428128 -863908 -1402668
$$ packed form
40290i35935N81810M61649J04921j97628j27012J51170J85248p7121k18622k0213
40280i1733K09835J44145n3132K1335M20770P47894O09388N2841m54286m83289
40270A123768j12778J38844o5925m70321o04190m09709j89440n4012J70536M89268
40260A6041O29925N00728L49280K78010l624o43395j181768j029286k71055L76299
40250i78845L97279j8634l42499l35430j83178j20651j04213O0833L43811M31589
40240h49938J38238k90078m54300k73289J3926J98118K31269J45396J07618L84219
40230f48821Q90240R75512J96768q08283r11371l8258O26034K64523m79086n53855
40220d86597j5690K51785n0992l33451j46252K07389K35023q9343m35780n38760
$$ plain form
40210 -1402668 -1727942 -1593429 -962908 -73460 696855 1071321 1037379 815363 622560 427540
40200 427540 36266 -530895 -964823 -1137776 -1380444 -1950721 -2440296 -2195146 -1259018 -386192
40190 -386192 -83229 -158378 -322259 -650479 -1164778 -1464635 -1201193 -598774 -136995 11593
40180 11593 -109303 -588333 -1473703 -2435108 -2993013 -2973564 -2455947 -1504138 -339459 451784
40170 451784 417484 -109572 -353370 -101813 103036 -147637 -554979 -646601 -459132 -343732
40160 -343732 -372659 -340930 -238082 -305262 -547439 -510072 216204 1374253 2156850 1991853
40150 1991853 1079737 104052 -437535 -509614 -336701 -180531 -251587 -566004 -860027 -850891
40140 -850891 -566932 -189519 346839 1198401 2050148 2229982 1597712 851701 637156 789039
$$ packed form
40210a402668l25274J34513O30521Q89448P70315L74466l3942k22016j92803j95020
40200D27540l91274n67161m33928j72953k42668n70277m89575K45150R36128Q72826
40190c86192L02963p5149j63881l28220n14299k99857K63442O02419M61779J48588
40180A1593j20896m79030q85370r61405n57905J9449N17617R51809J164679P91243
40170D51784l4300n27056k43798K51557K04849k50673m07342r1622J87469J15400
40160c43732k8927L1729J02848o7180k42177L7367P26276J158049P82597j64997
40150A991853r12116r75685n41587p2079J72913J56170p1056l14417k94023R136
40140h50891K83959L77413N36358Q51562Q51747J79834o32270p46011k14545J51883
$$ plain form
40130 789039 865630 985075 1506144 2130454 2042177 977543 -400020 -1294657 -1507758 -1286245
40120 -1286245 -874121 -391099 136576 751900 1365179 1595359 1123748 192542 -617211
40111 -617211 -1116144 -1598661 -2160800 -2430289 -2176926 -1737291 -1524812 -1457783 -1194060 -676544
40101 -676544 -147609 177929 212413 -20328 -281443 -241052 62681 166208 -141197 -396217
40091 -396217 -108643 442654 562119 131911 -292804 -356351 -317230 -479766 -722142 -835816
40081 -835816 -931398 -1182408 -1434441 -1401208 -1092002 -756718 -517545 -321943 -178718 -166016
40071 -166016 -228655 -218432 -146049 -160692 -251754 -218499 -23468 54135 -236590 -793841 -1326012
40060 -1326012 -1663496 -1741858 -1483743 -985167 -688542 -1006113 -1758311 -2300934 -2268972 -1905536
$$ packed form
40130G89039P6591J19445N21069O24310q8277j064634j377563q94637k13101K21513
40120a286245M12124M83022N27675O15324O13279K30180m71611r31206q09753
40111f17211m98933m82517n62139k69489K53363M39635K12479O7029K63723N17516
40101f76544N28935L25538L4484k32741k61115M0391L03733J03527l07405k55020
40091c96217K87574N51297J19465m30208m24715o3547L9121j62536k42376j13674
40081h35816r5582k51010k52033L3233L09206L35284K39173J95602J43225J2702
40071a66016o2639J0223P2383j4643r1062L3255J95031P7603k90725n57251n32171
40060a326012l37484p8362K58115M98576K96625l17571p52198n42623L1962L63436
$$ plain form
40050 -1905536 -1585291 -1345171 -1052154 -738817 -540682 -511904 -690999 -1113242 -1564896 -1621736
40040 -1621736 -1210377 -830549 -858061 -925127 -473593 318329 761344 687275 598524 780833
40030 780833 966622 1035971 1332905 1926647 2185932 1602912 587634 -96397 -337212 -556282
40020 -556282 -860849 -927943 -606161 -61152 619970 1411774 1945802 1728264 923432 390521
40010 390521 652840 1221733 1269346 681675 75186 -75444 55258 37586 -181547 -214118
40000 -214118 235591 900034 1148865 694389 -50947 -439212 -253507 272431 895660 1460342
39990 1460342 1659195 1205159 368514 -104920 127788 556229 539503 153984 -80846 -73083
39980 -73083 -224894 -670573 -972209 -749258 -240121 23917 -106497 -310005 -300206 -201068
$$ packed form
40050a905536L20245K40120K93017L13337J98135K8778j79095m22243m51654n6840
40040a621736M11359L79828k7512o7066M51534P91922M43015p4069q8751J82309
40030G80833J85789O9349K96934N93742K59285n83020j015278o84031k40815k19070
40020e56282l04567o7094L21782N45009O81122P91804N34028k17538q04832n32911
40010C90521K62319N68893M7613n87671o06489j50630J30702j7672k19133l2571
40000b14118M49709O64443K48831m54476p45336l88265J85705N25938O23229N64682
39990A460342J98853m54036q36645m73434K32708M28441j6726l85519k34830P763
39980g3083j51811m45679l01636K22951N09137K64038j30414k03508R799R9138
$$ plain form
39970 -201068 -364228 -882625 -1356549 -1235773 -453875 393751 674491 448014 337586 699890
39960 699890 1232778 1487714 1432209 1282818 1067009 692624 297913 163221 298158 418972
39950 418972 343531 142774 -93192 -335807 -438341 -226500 112117 78704 -469672 -985982
39940 -985982 -853950 -143905 542458 807574 698752 347671 -188913 -684313 -745723 -271303
39930 -271303 333506 590348 435283 109523 -257605 -698213 -1102005 -1150671 -676356 58139
39920 58139 586732 705845 586534 434557 215992 -172319 -601803 -789398 -643308 -342168
39910 -342168 -89277 -9286 -274382 -1001032 -1897767 -2342993 -2054062 -1431424 -987120 -691294
39900 -691294 -217787 391956 745115 677125 413163 208914 205396 560890 1280162 1917505
$$ packed form
39970b01068j63160n18397m73924J20776P81898Q47626K80740k26477j10428L62304
39960F99890N32888K54936n5505j49391k15809l74385l94711j34692J34937J20814
39950D18972p5441k00757k35966k42615j02534K11841L38617l3413n48376n16310
39940i85982J32032P10045O86363K65116j08822l51081n36584m95400o1410M74420
39930b71303O04809K56842j55065l25760l67128m40608m03792m8666M74315P34495
39920E8139N28593J19113j19311j51977k18565l88311m29484j87595J46090L01140
39910c42168K52891P9991k65096p26650q96735m45226K88931O22638M44304K95826
39900f91294M73507O09743L53159o7990k63962k04249l518L55494P19272O37343
$$ plain form
39890 1917505 1899575 1203820 336472 -338257 -771144 -777274 -99858 893735 1276533 720043
39880 720043 33520 101091 773039 1310398 1462251 1483744 1441850 1204782 944552 994577
39870 994577 1275240 1422414 1409175 1476937 1521872 1174904 513615 73799 48946 67337
39860 67337 -85925 -123952 125107 332666 260455 254220 706875 1378364 1710504 1599400
39850 1599400 1424677 1424597 1418465 1145060 633174 208045 196526 537411 696487 231938 -516532
39839 -516532 -708591 -160832 246187 -279046 -1280271 -1642866 -1126492 -608837 -753044
39830 -753044 -1100816 -813889 129486 910532 859454 114132 -670351 -1006034 -908689 -705196
39820 -705196 -635118 -679684 -741214 -853322 -1101801 -1419708 -1614421 -1556356 -1201870 -527238
$$ packed form
39890A917505j7930o95755q67348o74729m32887o130O77416R93593L82798n56490
39880G20043o86523O7571O71948N37359J51853K1493m1894k37068k60230N0025
39870I94577K80663J47174j3239O7762M4935l46968o61289m39816k4853J8391
39860F7337j53262l8027K49059K07559p2211o235M52655O71489L32140j11104
39850A599400j74723q0o132k73405n11886m25129j1519L40885J59076m64549p48470
39839e16532j92059N47759M07019n25233j001225l62595N16374N17655j44207
39830g53044l47772K86927R43375P81046n1078p45322p84483l35683R7345K03493
39820g05196P0078m4566o1530j12108k48479l17907j94713N8065L54486O74632
$$ plain form
39810 -527238 314612 836673 585616 -233507 -842804 -797592 -500753 -544422 -836051 -795920
39800 -795920 -255161 332715 571119 548439 491706 430494 397010 560435 879453 959719
39790 959719 607633 253463 416947 949206 1249296 1104512 830091 620646 292963 -231032
39780 -231032 -668153 -792038 -721658 -605884 -388049 -90026 36384 -104019 -240640 -172961
39770 -172961 -87600 -165257 -223743 -86200 50989 20809 106480 561005 998766 844857
39760 844857 194189 -369660 -648608 -862041 -905404 -354804 672064 1384302 1316922 879503
39750 879503 636500 598799 561388 622826 943102 1371048 1704537 1991528 2229384 2123996
39740 2123996 1538916 862368 516095 377037 82252 -386185 -858339 -1420897 -2174664
$$ packed form
39810e27238Q41850N22061k51057q19123o09297M5212K96839m3669k91629M0131
39800g95920N40759N87876K38404k2680n6733o1212l3484J63425L19018Q0266
39790I59719l52086l54170J63484N32259L00090j44784k74421k09445l27683n23995
39780b31032m37121j23885P0380J15774K17835K98023J26410j40403j36621O7679
39770a72961Q5361p7657n8486J37543J37189l0180Q5671M54525M37761j53909
39760H44857o50668n63849k78948k13433m3363N50600J026868P12238o7380m37419
39750H79503k43003l7701l7411O1438L20276M27946L33489K86991K37856j05388
39740B123996n85080o76548l46273j39058k94785m68437m72154n62558p53767
$$ plain form
39731 -2174664 -2763170 -2724263 -2213227 -1815208 -1673533 -1377338 -783668 -394065 -690050 -1489111
39721 -1489111 -2196208 -2432586 -2255155 -1986243 -1952522 -2185516 -2301694 -1898687 -1120578 -568504
39711 -568504 -577265 -854402 -926864 -644036 -98074 626873 1359628 1726550 1453565 712916
39701 712916 -50225 -564476 -809288 -748655 -295242 393348 834867 650574 9735 -529107
39691 -529107 -631809 -469265 -297940 21759 777618 1730126 2113276 1531332 539653 -9968
39681 -9968 3187 3085 -343483 -730244 -821625 -758412 -792120 -796672 -523888 -121168 28647
39670 28647 -83711 -64749 206228 235981 -469502 -1627194 -2357259 -2181594 -1567842 -1312262
39660 -1312262 -1581453 -1841310 -1644500 -1131074 -681072 -431189 -357347 -535700 -959956 -1248149
$$ packed form
39731b174664n88506L8907N11036L98019J41675K96195N93670L89603k95985p99061
39721a489111p07097k36378J77431K68912L3721k32994j16178M03007P78109N52074
39711e68504q761k77137p2462K82828N45962P24947P32755L66922k72985p40649
39701G12916p63141n14251k44812O0633M53413O88590M41519j84293o40839n38842
39691e29107j02702J62544J71325L19699P55859R52508L83150n81944r91679n49621
39681i968J3155j02l46568l86761r1381O3213l3708m552K72784M02720J49815
39670B8647j12358J8962K70977K9753p05483j157692p30065J75665O13752K55580
39660a312262k69191k59857J96810N13426M50002K49883P3842j78353m24256k88193
$$ plain form
39650 -1248149 -928905 -41650 833539 1180871 962407 451578 -48848 -268290 -42746
39641 -42746 516985 1096134 1500644 1756532 1861510 1679873 1187602 609802 189208 -8610
39631 -8610 24259 319535 756135 1040744 1068300 1100569 1351565 1584045 1423329 944929
39621 944929 579566 448018 189857 -396108 -881472 -697681 43128 554568 249400 -629281
39611 -629281 -1343549 -1419881 -913694 -113686 706741 1285119 1462377 1399206 1438218 1600885
39601 1600885 1481291 851119 104893 -219332 -160080 -169099 -346254 -322963 43234 319905
39591 319905 48801 -670502 -1352387 -1656418 -1590596 -1394548 -1353301 -1520477 -1530678 -954906
39581 -954906 30594 653941 453509 -121316 -320056 -64192 59065 -354971 -1058594 -1509314
$$ packed form
39650a248149L19244Q87255Q75189L47332k18464n10829n00426k19442K25544
39641d2746N59731N79149M04510K55888J04978j81637m92271n77800m20594j97818
39631h610L2869K95276M36600K84609K7556L2269K50996K32480j60716m78400
39621I44929l65363j31548k58161n85965m85364J83791P40809N11440l05168q78681
39611f29281p14268p6332N06187Q00008Q20427N78378J77258o3171L9012J62667
39601A600885j19594o30172p46226l24225N9252r019j77155K3291L66197K76671
39591C19905k71104p19303o81885l04031O5822J96048M1247j67176j0201N75772
39581i54906R85500O23347k00432n74825j98740K55864J23257m14036p03623m50720
$$ plain form
39571 -1509314 -1396790 -795078 -38708 495545 647390 563194 460232 356053 123745 -276370
39561 -276370 -736540 -1081366 -1127945 -835816 -501677 -545188 -893933 -882085 -116581 809211
39551 809211 950589 227817 -522017 -670065 -388077 -35950 392953 899179 1104119 747042
39541 747042 216460 84706 327496 484043 421757 409646 506381 456851 269846 322783
39531 322783 668831 770156 290878 -285354 -320877 27978 142830 38830 386266 1351339
39521 1351339 2143993 2071035 1452698 996284 733005 233956 -417557 -662749 -450455 -409323
39511 -409323 -834418 -1190712 -1006799 -679114 -828398 -1248789 -1160835 -369941 457088 728646
39501 728646 616589 622383 851103 988236 769458 213903 -497200 -1151549 -1536908 -1511803
$$ packed form
39571a509314J12524O01712P56370N34253J51845q4196j02962j04179k32308m00115
39561b76370m60170l44826m6579K92129L34139m3511l48745J1848P65504R25792
39551H09211J41378p22772p49834j48048K81988L52127M28903N06226K04940l57077
39541G47042n30582j31754K42790J56547o2286j2111R6735m9530j87005N2937
39531C22783L46048J01325m79278n76232l5523L48855J14852j04000L47436R65073
39521A351339P92654p2958o18337m56414k63279m99049o51513k45192K12294M1132
39511d09323m25095l56294J83913L27685j49284m20391Q7954P90894Q27029K71558
39501G28646j12057N794K28720J37133k18778n55555p11103o54349l85359K5105
$$ plain form
39491 -1511803 -1119604 -595454 -202180 -9971 165927 548574 1093905 1476314 1427292 1009254
39481 1009254 500688 121399 -37577 57224 345512 610880 619403 356089 73430 120944
39471 120944 709126 1694825 2551758 2759431 2364496 1968351 1980635 2099725 1800706 1140164
39461 1140164 689044 740482 993686 1066979 948887 804339 635380 335240 -84496 -460559
39451 -460559 -575040 -265501 393695 1005539 1158715 869895 522711 357134 285375 252984
39441 252984 433942 890839 1338262 1502022 1518668 1722232 2156709 2519770 2504772 2033333
39431 2033333 1259794 517442 151472 216572 404985 410136 262898 176942 206463 243969
39421 243969 224673 109878 -217314 -762903 -1174385 -973836 -101969 957859 1637647 1716007
$$ packed form
39491a511803L92199N24150L93274J92209J75898L82647N45331L82409m9022m18038
39481A009254n08566l79289j58976R4801K88288K65368Q523k63314k82659M7514
39471A20944N88182R85699Q56933K07673l94935l96145J2284J19090k99019o60542
39461A140164m51120N1438K53204P3293j18092j44548j68959l00140m19736l76063
39451d60559j14481L09539O59196O11844J53176k88820l47184j65577p1759l2391
39441B52984J80958M56897M47423J63760J6646K03564M34477L63061j4998m71439
39431B033333p73539p42352l65970O5100J88413N151j47238q5956K9521L7506
39421B43969j9296j14795l27192n45589m11482K00549Q71867J059828O79788P8360
$$ plain form
39411 1716007 1314515 703357 191477 9347 135799 295266 209387 -168785 -664090 -1042031
39401 -1042031 -1162626 -1071530 -960739 -965408 -1006710 -926366 -749651 -670506 -757143 -821793 -648244
39390 -648244 -240094 214526 523876 585961 412670 133968 -113388 -357509 -735083 -1191811
39380 -1191811 -1394675 -1100783 -511292 -74261 9821 -93180 -171932 -177914 -109535 46838
39370 46838 159101 -28263 -531440 -955031 -892772 -397872 132156 425737 473453 317433
39360 317433 18369 -209239 -187257 -152807 -580290 -1479858 -2231233 -2359995 -2159738 -2206015
39350 -2206015 -2505568 -2548885 -2066954 -1295147 -540883 52471 280242 -98758 -926116 -1625350
39340 -1625350 -1868218 -1947578 -2221120 -2486740 -2291052 -1686842 -1264147 -1419064 -1899293 -2136243
$$ packed form
39411A716007m01492o11158n11880j82130J26452J59467q5879l78172m95305l77941
39401a042031j20595R1096J10791m669m1302Q0344J76715P9145q6637o4650J73549
39390f48244M08150M54620L09350O2085j73291k78702k47356k44121l77574m56728
39380a191811k02864K93892N89491M37031Q4082j03001p8752n982O8379J56373
39370D6838J12263j87364n03177m23591O2259M94900N30028K93581M7716j56020
39360C17433k99064k27608K1982L4450m27483q99568p51375j28762K00257m6277
39350b206015k99553m3317M81931P71807P54264N93354K27771l79000q27358o99234
39340a625350k42868p9360k73542k65620J95688O04210M22695j54917m80229k36950
$$ plain form
39330 -2136243 -1813568 -1060773 -272663 198667 314417 369160 638866 999016 1024641 489141
39320 489141 -382874 -1193280 -1723991 -1923625 -1734473 -1155962 -417591 154481 514500 971141
39310 971141 1757344 2626260 3030715 2677405 1770384 728216 -157644 -735496 -877661
39301 -877661 -554848 29611 550488 831539 930835 973546 977244 826851 367146 -430605
39291 -430605 -1321494 -1871006 -1800516 -1245822 -633345 -350245 -525903 -952177 -1139610 -696460
39281 -696460 152062 649353 374382 -209778 -427804 -365772 -636152 -1296884 -1688745 -1461587
39271 -1461587 -1085456 -1029834 -1041287 -719224 -331074 -433877 -947175 -1223443 -946601 -405763
39261 -405763 105613 610354 1057126 1116681 654785 100173 23124 463203 908075 910853
$$ packed form
39330b136243L22675P52795P88110M71330J15750N4743K69706L60150K5625n35500
39320D89141q72015q10406n30711j99634J89152N78511P38371N72072L60019M56641
39310I71141P86203Q68916M04455l53310r07021j042168q85860n77852j42165
39301h77661L22813N84459N20877K81051R9296M2711L698j50393m59705p97751
39291d30605q90889n49512P0490N54694O12477K83100j75658m26274j87433M43150
39281f96460Q48522M97291k74971n84160k18026O2032k70380o60732l91861K27158
39271a461587L76131N5622j1453L22063L88150j02803n13298k76268K76842N40838
39261d05763N11376N04741M46772N9555m61896n54612p7049M40079M44872K778
$$ plain form
39251 910853 556018 257546 192938 100341 -277216 -702976 -685423 -204011 157073 -39216
39241 -39216 -524797 -782059 -756980 -747891 -815406 -771052 -655093 -742783 -1048831 -1257896 -1236739
39230 -1236739 -1220626 -1346799 -1361115 -1006161 -440863 -50464 -13115 -233996 -557768 -867347
39220 -867347 -1066187 -1110627 -1030142 -869308 -669952 -505894 -427109 -376588 -272348 -119500
39210 -119500 101212 532754 1155245 1494972 1044632 60998 -478607 20544 984712 1279008
39200 1279008 449413 -878306 -1724992 -1663405 -1064668 -634262 -725356 -1079844 -1294426 -1439318
39190 -1439318 -1911485 -2631394 -2814722 -1875102 -300363 773670 772032 113254 -502762
39181 -502762 -823745 -962647 -953409 -675045 -113913 488197 750428 399312 -479957 -1367088
$$ packed form
39251I10853l54835k98472o4608r2597l77557m25760J7553M81412L61084j96289
39241c9216m85581k57262K5079R089o7515M4354J15959q7690l06048k09065K1157
39230a236739J6113j26173j4316L54954N65298L90399L7349k20881l23772l09579
39220h67347j98840m4440Q0485J60834J99356J64058P8785N0521J04240J52848
39210a19500K20712M31542O22491L39727m50340r83634n39605M99151R64168K94296
39200A279008q29595j327719q46686O1587N98737M30406r1094l54488k14582j44892
39190a439318m72167p19909j83328R39620J574739J074033j638o58778o16016
39181e02762l20983j38902R238K78364N61132O02110K62231l51116q79269q87131
$$ plain form
39171 -1367088 -1625160 -1062843 -138016 525887 780488 956796 1276986 1534909 1484489 1290401
39161 1290401 1299294 1479685 1447888 1074815 699558 585519 502728 131723 -369639 -563571
39151 -563571 -354495 -28101 281492 745104 1353996 1636938 1121081 -51212 -1158600
39142 -1158600 -1559117 -1272305 -916240 -1039381 -1507264 -1668111 -1169724 -401052 21346
39133 21346 -40718 -299535 -542819 -711903 -679523 -416297 -281272 -656978 -1324950 -1704269
39123 -1704269 -1716718 -1863173 -2355143 -2756466 -2691321 -2357082 -2052073 -1702585 -1207550 -806017
39113 -806017 -708044 -716987 -580164 -383146 -268627 -134908 21828 -149881 -840001 -1633148
39103 -1633148 -2009851 -1968919 -1724787 -1165859 -158915 916135 1516525 1583546 1309836
$$ packed form
39171a367088k58072N62317R24827O63903K54601J76308L20190K57923n0420j94088
39161A290401Q893J80391l1797l73073l75257j14039q2791l71005n01362j93932
39151e63571K09076L26394L09593M63612O08892K82942n15857j172293j107388
39142a158600m00517K86812L56065j23141m67883j60847M98387P68672M22398
39133B1346o2064k58817k43284j69084L2380K63226J35025l75706o67972l79319
39123a704269j2449j46455m91970m01323O5145L34239L05009L49488M95035M01533
39113h06017R7973q943J36823J97018J14519J33719J56736j71709o90120p93147
39103a633148l76703M0932K44132N58928J006944J075050O00390O7021k73710
$$ plain form
39094 1309836 587468 -636856 -1725737 -1879163 -1221651 -620088 -459998 -343631 33654
39085 33654 541683 1204632 2223852 3196800 3234437 2267915 1407159 1467130 1883334 1726734
39075 1726734 1114394 802497 868193 709912 148824 -309448 -290753 66286 584309 1275376
39065 1275376 1969610 2250960 1968192 1433459 959962 533624 77218 -279401 -364097 -157349
39055 -157349 304687 976810 1607130 1732181 1105292 40706 -830918 -1120773 -946230
39046 -946230 -740355 -878588 -1399463 -1975352 -2170351 -1793041 -1028967 -272186 127607 17505
39036 17505 -504203 -1122374 -1471600 -1363100 -888354 -326556 46476 121308 -3780 -150559
39026 -150559 -247181 -341513 -420886 -338790 -17734 371363 581054 594590 603497 689838 714607
$$ packed form
39094A309836p22368j224324j088881j53426O57512O01563J60090J16367L77285
39085C3654N08029O62949J019220R72948L7637r66522q60756N9971M16204j56600
39075A726734o12340l11897O5696j58281n61088m58272J8695L57039N18023O91067
39065A275376O94234K81350k82768n34733m73497m26338m56406l56619q4696K06748
39055a57349M62036O72123O30320J25051o26889j064586q71624k89855J74543
39046i46230K05875j38233n20875n75889j94999L77310P64074P56781L99793j10102
39036A7505n21708o18171l49226J08500M74746N61798L73032P4832j25088j46779
39026a50559r6622r4332p9373Q2096L21056L89097K09691J3536Q907Q6341K4769
$$ plain form
39015 714607 584291 457898 534843 714135 646501 166606 -445051 -723952 -505509 -69372
39005 -69372 182568 97331 -206402 -577265 -964398 -1312528 -1444266 -1158421 -467434 318029
38995 318029 818334 926957 874363 919582 1068676 1186729 1254236 1285049 1070713 373150
38985 373150 -541091 -957253 -572163 27937 131919 -105677 54314 768956 1310853 1053894
38975 1053894 262481 -364130 -567163 -624049 -799037 -1032413 -1117979 -983951 -809027 -919647
38965 -919647 -1476865 -2229419 -2711931 -2694310 -2257161 -1485003 -444865 476356 665258 -19973
38955 -19973 -961082 -1455394 -1391705 -1011530 -403806 325094 726404 480539 64669 307571
38945 307571 1229608 1919018 1735559 1092761 746081 781535 760533 542790 401306 401026
$$ packed form
39015G14607j30316j26393P6945J79292o7634m79895o11657k78901K18443M36137
39005f9372K51940q5237l03733l70863l87133l48130j31738K85845O90987P85463
38995C18029N00305J08623n2594M5219J49094J18053O7507L0813k14336o97563
38985C73150r14241m16162L85090O00100J03982k37596J59991P14642N41897k56959
38975A053894p91413o26611k03033n6886j74988k33376q5566J34028J74924j10620
38965i19647n57218p52554m82512J7621M37149P72158J040138R21221J88902o85231
38955a9973r41109m94312O3689L80175O07724P28900M01310k45865m15870K42902
38945C07571R22037O89410j83459o42798l46680L5454k1002k17743j41484k80
$$ plain form
38935 401026 208416 -324933 -782969 -672119 -88262 377607 306819 -225813 -931086 -1567633
38925 -1567633 -1851140 -1476716 -545126 235281 163646 -647959 -1388524 -1470227 -1028056 -496275
38915 -496275 -107186 28218 -236729 -809999 -1197710 -1012881 -517965 -298170 -469300 -576917
38905 -576917 -276023 268829 768696 1252988 1876142 2468317 2590569 2073640 1305504 857150
38895 857150 910159 1204668 1497271 1791782 2006249 1750748 818815 -276519 -755942 -566641
38885 -566641 -420034 -736465 -1100256 -1020919 -697053 -596201 -711074 -752824 -751714 -886577
38875 -886577 -940255 -534984 188969 694894 793870 721720 527085 9548 -669879 -965050
38865 -965050 -752893 -607592 -966768 -1499757 -1669692 -1527302 -1494446 -1595814 -1381823 -602355
$$ packed form
38935D01026j92610n33349m58036J10850N83857M65869p0788n32632p05273o36547
38925a567633k83507L74424R31590P80407p1635q11605p40565q1703M42171N31781
38915d96275L89089J35404k64947n73270l87711J84829M94916K19795j71130j07617
38905e76917L00894N44852M99867M84292O23154N92175J22252n16929p68136m48354
38895H57150N3009K94509K92603K94511K14467k55501r31933j095334m79423J89301
38885e66641J46607l16431l63791P9337L23866J00852j14873m1750J110j34863
38875h86577n3678M05271P23953N05925R8976p2150j94635n17537o79427k95171
38865i65050K12157J45301l59176n32989j69935J42390L2856j01368K13991P79468
$$ plain form
38855 -602355 372724 899008 683460 -4716 -708563 -1276168 -1837284 -2302006 -2232586 -1495791
38845 -1495791 -739300 -718332 -1276073 -1551107 -1189662 -747041 -749951 -964014 -893960 -519041
38835 -519041 -154821 58927 181818 268096 423877 776300 1120537 933287 66043 -871492
38825 -871492 -1161918 -755371 -89224 543601 1037497 1160796 714280 -60619 -606259 -568801
38815 -568801 -10009 721731 1126553 839206 81362 -440095 -395800 -265714 -535403 -867574
38805 -867574 -634127 62276 583530 746314 851779 835150 244435 -817790 -1539670 -1475222
38795 -1475222 -1107618 -1011857 -1066502 -899690 -582885 -403523 -350755 -285822 -290423 -415142
38785 -415142 -404228 -125823 32871 -273765 -640810 -372377 459572 1041974 938367 574308
$$ packed form
38855f02355R75079N26284k15548o88176p03847n67605n61116m64722O9420P36795
38845a495791P56491K0968n57741k75034L61445M42621k910k14063P0054L74919
38835e19041L64220K13748J22891Q6278J55781L52423L44237j87250q67244r37535
38825h71492k90426M06547O66147O32825M93896J23299m46516p74899n45640L7458
38815e68801N58792P31740M04822k87347p57844n21457M4295J30086k69689l32171
38805h67574K33447O96403N21254J62784J05465j6629n90715j062225p21880O4448
38795a475222L67604R5761n4645J66812L16805J79362N2768O4933m601j24719
38785d15142J0914K78405J58694l06636l67045K68433Q31949N82402j03607l64059
$$ plain form
38775 574308 435064 351747 -42172 -553417 -631182 -175884 315293 436584 330331 316102
38765 316102 370479 254168 -2330 -99413 8445 -68976 -589262 -1147141 -1057362 -236301
38755 -236301 623499 847520 468743 -49006 -529462 -1196874 -2114892 -2844876 -2858768 -2185458
38745 -2185458 -1445462 -1184135 -1281205 -1147461 -465897 452832 1119825 1452769 1685904 1837012
38735 1837012 1626011 990156 356459 181646 403810 589349 526496 420061 495866 645609
38725 645609 585571 252058 -107171 -231618 -131784 -11187 40685 161295 484089 892249
38715 892249 1101308 953112 550420 132187 -111965 -149709 -119088 -191604 -337748 -302769
38705 -302769 66900 566373 872426 952038 996318 1005866 761855 269984 -78276 41469
$$ packed form
38775E74308j39244q3317l93919n11245p7765M55298M91177J21291j06253j4229
38765C16102N4377j16311k56498r7083J07858p7421n20286n57879Q9779Q21061
38755b36301Q59800K24021l78777n17749m80456o67412r18018p29984j3892O73310
38745b185458P39996K61327r7070J33744O81564R18729O66993L32944K33135J51108
38735A837012k11001o35855o33697j74813K22164J85539o2853j06435P5805J49743
38725F45609o0038l33513l59229j24447R9834J20597N1872J20610L22794M08160
38715H92249K09059j48196m02692m18233k44152l7744L0621p2516j46144L4979
38705c02769L69669M99473L06053P9612M4280R548k44011m91871l48260J19745
$$ plain form
38695 41469 478355 807299 776884 447215 84866 55808 586164 1412294 1861281 1534825
38685 1534825 781077 256908 177765 279950 361641 455227 495802 257663 -240330 -595036
38675 -595036 -476076 -7686 439299 604988 356310 -350776 -1249122 -1738773 -1467512 -834330
38665 -834330 -539385 -669827 -654084 -188731 271074 215903 -138910 -238156 -104905 -297401
38655 -297401 -954177 -1443976 -1183158 -386216 284455 500760 386073 116199 -214627 -478032
38645 -478032 -616811 -765634 -954587 -844044 -153524 768247 1294514 1402820 1640613 2131894
38635 2131894 2258706 1631552 800392 512310 671256 597797 68526 -485682 -700391 -630169
38625 -630169 -380305 83666 634510 922222 801120 515636 323203 216364 143142 195311
$$ packed form
38695D1469M36886L28944l0415l29669l62349k9058N30356Q26130M48987l26456
38685A534825p53748n24169p9143J02185Q1691R3586M0575k38139m97993l54706
38675e95036J18960M68390M46985J65689k48678p07086q98346m89651K71261O33182
38665h34330K94945j30442J5743M65353M59805n5171l54813r9246J33251j92496
38655b97401o56776m89799K60818P96942O70671K16305j14687k69874l30826k63405
38645d78032j38779j48823j88953J10543O90520R21771N26267J08306K37793M91281
38635B131894J26812o27154q31160k88082J58946p3459n29271n54208k14709P0222
38625f30169K49864M63971N50844K87712j21102k85484j92433j06839p3222N2169
$$ plain form
38615 195311 388670 510346 392141 139035 -84077 -266283 -348467 -68188 653721 1322238
38605 1322238 1273886 507025 -224416 -266590 238665 679908 789506 862013 1214335 1709605
38595 1709605 1949716 1788481 1453583 1181547 941193 629217 386903 495194 948295
38586 948295 1337004 1282512 884676 595313 677624 936177 1020635 870432 739034 827871
38576 827871 1053080 1219533 1278991 1285205 1199061 943331 619925 426975 310375 -29597
38566 -29597 -632675 -1046991 -878647 -384854 -166303 -354206 -487753 -209550 314529 776353
38556 776353 1133721 1413588 1441255 1098628 656774 519886 738279 1052133 1317532 1587792
38546 1587792 1831718 1889529 1718880 1411591 961479 303947 -391265 -784671 -796243 -656528
$$ packed form
38615A95311J93359J21676j18205k53106k23112j82206q2184K80279P21909O68517
38605A322238m8352p66861p31441m2174N05255M41243J09598P2507L52322M95270
38595A709605K40111j61235l34898k72036k40354l11976k42314J08291M53101
38586I48295L88709n4492l97836k89363Q2311K58553Q4458j50203j31398Q8837
38576H27871K25209J66453N9458O214q6144k55730l23406j92950j16600l39972
38566b9597o03078m14316J68344M93793K18551j87903j33547K78203N24079M61824
38556G76353L57368K79867K7667l42627m41854j36888K18393L13854K65399K70260
38546A587792K43926N7811j70649l07289m50112o57532o95212l93406j1572J39715
$$ plain form
38536 -656528 -451088 -4800 598666 821631 375128 -211407 -205307 337699 712919 602238
38526 602238 404299 485532 673965 705148 673780 732068 743775 593106 491857 585219 570256
38515 570256 184802 -183847 32637 628040 780116 221481 -369475 -358680 20302 180512
38505 180512 68157 65939 268766 328559 -52826 -818577 -1688773 -2309353 -2332718 -1659843
38495 -1659843 -634493 207137 587009 555585 236253 -238181 -595642 -556777 -184898 104798
38485 104798 -24706 -511243 -999074 -1113660 -672823 146111 840050 1028083 919108 1085822
38475 1085822 1698108 2266605 2302031 1935393 1613473 1422975 1122697 756703 755990 1272058
38465 1272058 1777596 1644279 937863 307511 142155 179547 24894 -267965 -355560 -134765
$$ packed form
38536f56528K05440M46288O03466K22965m46503n86535O100N43006L75220j10681
38526F02238j97939Q1233J88433L1183l1368N8288J1707j50669j01249R3362j4963
38515E70256l85454l68649K16484N95403J52076n58635n90956J0795L78982J60210
38505A80512j12355k218K02827N9793l81385p65751q70196o20580k3365O72875
38495a659843J025350Q41630L79872l1424l19332m74434l57461L8865L71879K89696
38485A04798j29504m86537m87831j14586M40837Q18934O93939J88033j08975J66714
38475A085822O12286N68497L5426l66638l21920j90498l00278l65994p13N16068
38465A272058N05538j33317p06416o30352j65356L7392j54653k92859q7595K20795
$$ plain form
38455 -134765 166187 328316 300103 61220 -379723 -826160 -1013745 -966830 -975027 -1115289
38445 -1115289 -1069683 -571099 226111 999484 1614990 1999322 1939147 1363908 654795 294058
38435 294058 283925 236449 -45694 -416754 -728370 -924784 -826247 -257596 521492 910685
38425 910685 651851 116495 -213582 -250122 -153673 -13536 118782 134311 25691 -37869
38415 -37869 57749 265413 607501 1216281 1944786 2233106 1680010 597121 -262920 -418395
38405 -418395 71433 836209 1431690 1520859 1133828 676500 444961 253504 -169151 -535647
38395 -535647 -165610 1118758 2575135 3210884 2737338 1730225 944518 638984 601460
38386 601460 671635 971489 1515744 1866769 1545011 714227 52095 -94941 18046 211497
$$ packed form
38455a34765L00952J62129k8213k38883m40943m46437j87585M6915q197j40262
38445a115289M5606M98584P97210P73373O15506L84332o0175n75239p09113l60737
38435B94058j0133m7476k82143l71060l11616j96414R8537N68651P79088L89193
38425I10685k58834n35356l30077l6540R6449J40137J32318J5529j08620o3560
38415c7869R5618K07664L42088O08780P28505K88320n53096j082889q60041j55475
38405d18395M89828P64776N95481Q9169l87031m57328k31539j91457m22655l66496
38395e35647L70037J284368J456377O35749m73546j007113p85707l05534l7524
38386F01460P0175K99854N44255L51025l21758q30784o62132j47036J12987J93451
$$ plain form
38376 211497 760076 1750867 2580144 2643484 2195147 1923899 1904175 1626721 960526 365746
38366 365746 75661 -248019 -804393 -1181607 -956118 -346226 102306 183567 47813 -200460
38356 -200460 -563668 -943397 -1168244 -1178147 -1009156 -686343 -266648 130419 448202 702184
38346 702184 772102 413490 -334505 -943958 -851856 -55493 888376 1367512 1127807 373023
38336 373023 -363521 -582721 -247391 225089 486390 600241 745256 840463 732080 545233
38326 545233 494035 436163 -11543 -883571 -1686832 -1891680 -1410184 -561035 241991 738870
38316 738870 949732 1073972 1099126 589885 -790320 -2498333 -3277633 -2414815 -598009
38307 -598009 799277 1120482 740222 125821 -795308 -2095203 -3215288 -3473087 -3028382
$$ packed form
38376B11497N48579R90791Q29277O3340m48337k71248j9724k77454o66195n94780
38366C65746k90085l23680n56374l77214K25489O09892M48532Q1261j35754k48273
38356b00460l63208l79729k24847r903J68991L22813M19695L97067L17783K53982
38346G02184O9918l58612p47995o09453R2102P96363R43869M79136k39705p54784
38336C73023p36544k19200L35330M72480K61301J13851J45015R5207j08383j86847
38326E45233n1198n7872m47706q72028q03261k04848M81496Q49149Q03026M96879
38316G38870K10862J24240K5154n09241j380205j708013p79300Q62818J816806
38307e98009J397286L21205l80260o14401r21129j299895j120085k57799M44705
$$ plain form
38298 -3028382 -2715597 -2823368 -2654453 -1658311 -498941 -365001 -1398467 -2456418 -2494728
38289 -2494728 -1626718 -627697 75467 553532 912375 1180135 1507754 2040969 2575497
38280 2575497 2639854 1987489 856465 -247767 -916782 -1080255 -1043428 -1206636 -1608575
38271 -1608575 -1857076 -1644105 -1143562 -695278 -325078 85102 341242 135434 -318106
38262 -318106 -350089 295502 1064176 1308801 1089489 950587 1122154 1315305 1256777 1085128
38252 1085128 1105007 1341308 1495530 1302294 829688 413622 352035 691475 1248261 1746180
38242 1746180 1963034 1877942 1695770 1591233 1421172 905562 153379 -301387 -211185 -86168
38232 -86168 -592327 -1621043 -2339749 -2133097 -1169802 -65225 697731 1032128 1253280
$$ packed form
38298c028382L12785j07771J68915R96142J159370J33940j033466j057951l8310
38289b494728Q68010R99021P03164M78065L58843K67760L27619N33215N34528
38280B575497O4357o52365j131024j104232o69015j63473L6827j63208m01939
38271a608575k48501K12971N00543M48284L70200M10180K56140k05808m53540
38262c18106l1983O45591P68674K44625k19312j38902J71567J93151n8528j71649
38252A085128J9879K36301J54222j93236m72606m16066o1587L39440N56786M97919
38242A746180K16854q5092j82172j04537j70061n15610p52183m54766R0202J25017
38232h6168n06159j028716p18706K06652R63295J104577P62956L34397K21152
$$ plain form
38223 1253280 1802544 2662119 3148406 2704182 1785322 1382404 1679202 1910829 1714222
38214 1714222 1771437 2612426 3524974 3450316 2522733 1870116 2081566 2674722 3028374 3054652
38204 3054652 2832275 2300509 1612357 1247618 1435613 1840119 2078137 2194541 2361920
38195 2361920 2460867 2287653 1928826 1623466 1456896 1470657 1854669 2662969 3454787 3610436
38185 3610436 3044613 2319321 1966567 1929490 1810045 1493759 1285087 1413787 1635470 1524084
38175 1524084 1075703 732723 738941 789731 558735 288230 461829 1058699 1607796 1923906
38165 1923906 2254016 2630058 2666544 2256090 1938813 2185068 2715572 2973198 2936024 2968524
38155 2968524 3122870 3139985 3006128 2957479 2974219 2793894 2445294 2261573 2298642 2257164
$$ packed form
38223A253280N49264Q59575M86287m44224r18860m02918K96798K31627j96607
38214A714222N7215Q40989R12548p4658r27583o52617K11450N93156L53652K6278
38204C054652k22377n31766o88152l64739J87995M04506K38018J16404J67379
38195B361920R8947j73214l58827l05360j66570J3761L84012Q08300P91818J55649
38185C610436n65823p25292l52754l7077j19445l16286k08672J28700K21683j11386
38175A524084m48381l42980O218N0790k30996k70505J73599N96870N49097L16110
38165A923906L30110L76042L6486m10454l17277K46255N30504K57626l7174L2500
38155B968524J54346J7115j33857m8649J6740j80325l48600j83721L7069m1478
$$ plain form
38145 2257164 2111425 2268122 2830003 3203467 2858879 2128311 1775925 1990316 2276321
38136 2276321 2235912 1973263 1707799 1449108 1232052 1321831 1900885 2722213 3326498 3529415
38126 3529415 3495860 3405523 3301877 3286998 3565096 4100582 4439710 4167662 3469972 2930652
38116 2930652 2778918 2707831 2552900 2713056 3529455 4529278 4790207 4027860 2920590
38107 2920590 2310740 2406913 2815496 3026125 2759377 2104582 1432607 1005785 700391 353245
38097 353245 245169 771441 1662565 2140776 2000972 1892217 2220716 2455930 2068227 1556761
38087 1556761 1778460 2623951 3184010 3053036 2664310 2404314 2214448 2122841 2349000 2688475
38077 2688475 2564755 1979466 1687926 2077120 2579990 2651146 2622245 3003180 3577990 3920408
$$ packed form
38145B257164j45739J56697N61881L73464l44588p30568l52386K14391K86005
38136B276321m0409k62649k65464k58691k17056Q9779N79054Q21328O04285K02917
38126C529415l3555r0337j03646j4879K78098N35486L39128k72048o97690n39320
38116B930652j51734p1087j54931J60156Q16399R99823K60929p62347j107270
38107B920590o09850R6173M08583K10629k66748o54795o71975m26822l05394l47146
38097C53245j08076N26272Q91124M78211j39804j08755L28499K35214l87703n11466
38087A556761K21699Q45491N60059j30974l88726k59996j89866r1607K26159L39475
38077B688475j23720n85289k91540L89194N02870P1156k8901L80935N74810L42418
$$ plain form
38067 3920408 4265317 5013521 5759378 5751320 5126881 4770755 5027719 5471090 5919623 6649081
38057 6649081 7424455 7421060 6590757 6155411 7072407 8772463 10151521 11131497 12360733
38048 12360733 13896771 15208088 16248681 17580698 19482655 21737099 24263713 27225221
38040 27225221 30595854 34413822 39350064 46125767 54470430 63739349 74536360 88467329
38032 88467329 106366036 128615074 157329253 194783147 236699830 269004186 275931332
38025 275931332 253304918 212312309 169524098 134770379 108769055 88848349 73400812
38018 73400812 61590720 52197035 44219224 37472247 31891858 27086364 22976594 20026267
38010 20026267 18333454 17129985 15631589 13865367 12261627 10903757 9600344 8327393
$$ packed form
38067C920408L44909P48204P45857q058o24439l56126K56964M43371M48533P29458
38057F649081P75374l395q30303m35346R16996J700056J379058R79976J229236
38048A2360733J536038J311317J040593J332017J901957K254444K526614K961508
38040B7225221L370633L817968M936242O775703Q344663R268919J0797011J3930969
38032H8467329J7898707K2249038K8714179L7453894M1916683L2304356O927146
38025B75931332k2626414m0992609m2788211l4753719k6001324j9920706j5447537
38018G3400812j1810092r393685p977811o746977n580389m805494m109770k950327
38010B0026267j692813j203469j498396j766222j603740j357870j303413j272951
$$ plain form
38002 8327393 7200250 6259584 5567088 5265410 5334717 5559006 5865572 6324083 6673707
37993 6673707 6375235 5442802 4710626 4818833 5352638 5488189 5098952 4618254 4146010
37984 4146010 3470574 2856643 2981435 3924096 4883733 5161400 4878997 4440818 3822639
37975 3822639 2854210 1840515 1360411 1555523 2016716 2315851 2318002 2032670 1537134 1095715
37965 1095715 1011558 1220503 1296079 1020221 705476 726528 949060 950844 682698 502068
37955 502068 550980 562501 449560 618190 1326332 2092365 2250182 1882270 1634858 1707102
37945 1707102 1672665 1367082 1254506 1617667 1990782 1856761 1450189 1331082 1475190 1361373
37935 1361373 817137 270219 206247 762979 1781786 2886972 3591647 3685129 3447886
$$ packed form
38002H327393j127143r40666o92496l01678O9307K24289L06566M58511L49624
37993F673707k98472r32433p32176J08207N33805J35551l89237m80698m72244
37984D146010o75436o13931J24792R42661R59637K77667k82403m38179o18179
37975C822639r68429j013695m80104J95112M61193K99135K151k85332m95536m41419
37965A095715q4157K08945P5576k75858l14745K1052K22532J784k68146j80630
37955E02068M8912J1521j12941J68630P08142P66033J57817l67912k47412P2244
37945A707102l4437l05583j12576L63161L73115j34021m06572j19107J44108j13817
37935A361373n44236n46918o3972N56732J018807J105186P04675R3482k37243
$$ plain form
37926 3447886 3189672 2770691 1986745 1208376 1064368 1567547 2134231 2462499 2792872
37917 2792872 3241795 3514349 3466259 3375352 3415049 3392249 3275607 3452493 4127664 4965486
37907 4965486 5711046 6684394 8199507 9934536 11436692 12916425 14929383 17481596
37899 17481596 20076682 22576927 25420738 28901424 32665519 36003612 38275607 39000135
37891 39000135 37924829 35219759 31437755 27201380 23023019 19322451 16322569 13878882
37883 13878882 11635438 9440512 7503967 6129129 5369992 4931795 4379227 3545678 2751864
37874 2751864 2428343 2516614 2577129 2550931 2891597 3645774 3964777 3113565 1586473 544530
37864 544530 382829 559117 653043 745530 737423 195227 -835452 -1597703 -1586186 -1164898
$$ packed form
37926C447886k58214m18981p83946p78369j44008N03179N66684L28268L30373
37917B792872M48923K72554m8090r0907L9697k2800j16642J76886O75171Q37822
37907D965486P45560R73348J515113J735029J502156J479733K012958K552213
37899A7481596K595086K500245K843811L480686L764095L338093K271995P24528
37891C9000135j075306k705070l782004m236375m178361l700568k999882k443687
37883A3878882k243444k194926j936545j374838p59137m38197n52568q33549p93814
37874B751864l23521Q8271O0515k6198L40666P54177L19003q51212j527092j041943
37864E44530j61701J76288R3926R2487q107n42196j030679p62251J1517M21288
$$ plain form
37854 -1164898 -882241 -751682 -612709 -623224 -857504 -891511 -401356 164803 134878 -389711
37844 -389711 -675964 -355763 268093 797464 1066012 961353 508529 169885 499931 1357432
37834 1357432 1932965 1721023 1026778 341205 -289785 -952802 -1359938 -1144380 -459446
37825 -459446 176138 559158 916073 1329733 1470951 1080937 427527 16520 -11025 55819
37815 55819 -29200 -193001 -277914 -315655 -429017 -612737 -769064 -855434 -841294 -626632 -204641
37804 -204641 178421 272430 192651 265109 507567 591868 400637 269965 485134 836977
37794 836977 950410 835168 817049 1066246 1468554 1861466 2150039 2276148 2295210 2393689
37784 2393689 2643196 2886341 3074601 3491878 4314384 5159744 5521340 5546135 5911893 6970002
$$ packed form
37854a164898K82657J30559J38973j0515k34280l4007M90155N66159k9925n24589
37844c89711k86253L20201O23856N29371K68548j04659m52824l38644L30046Q57501
37834A357432N75533k11942o94245o85573o30990o63017m07136K15558O84934
37825d59446O35584L83020L56915M13660J41218l90014o53410m11007k7545O6844
37815E5819q5019j63801q4913l7741j13362j83720j56327q6370J4140K14662M21991
37804b04641L83062R4009p9779P2458K42458Q4301j91231j30672K15169L51843
37794H36977J13433j15242j8119K49197M02308L92912K88573J26109J9062R8479
37784B393689K49507K43145J88260M17277Q22506Q45360L61596K4795L65758J058109
$$ plain form
37774 6970002 8478911 10158372 11987279 14001621 16522465 20656523 27480797 35936223
37766 35936223 42248824 42672725 36959423 28489366 21002701 15860078 12416700 9917719
37758 9917719 8224429 7206311 6385253 5365018 4194754 3176771 2549408 2390479 2586693
37749 2586693 2822666 2780711 2419073 1928654 1429000 913926 517488 546485 1073151 1696928
37739 1696928 1939486 1760572 1463366 1194250 825801 328715 -41578 -49435 226489 525578
37729 525578 682959 662497 452322 75254 -351492 -644579 -607696 -111241 688444 1230942
37719 1230942 983938 131115 -496941 -417062 -104529 -266901 -798103 -963386 -495410 59369
37709 59369 144583 -151646 -396886 -354687 -37441 426945 784324 821270 716025 893153
$$ packed form
37774F970002J508909J679461J828907K014342K520844M134058O824274Q455426
37766C5936223O312601M23901n713302q470057p486665n142623l443378k498981
37758I917719j693290j018118q21058j020235j170264j017983o27363j58929J96214
37749B586693K35973m1955l61638m90419m99654n15074l96438K8997N26666O23777
37739A696928K42558j78914k97206k69116l68449m97086l70293p857K75924K99089
37729E25578J57381k0462k10175l77068m26746k93087L6883M96455P99685N42498
37719A230942k47004q52823o28056P9879L12533j62372n31202j65283M67976N54779
37709E9369Q5214k96229k45240M2199L17246M64386L57379L6946j05245J77128
$$ plain form
37699 893153 1346034 1487348 946955 147773 -269009 -266138 -239239 -300730 -227784 41956
37689 41956 352597 663156 961748 946470 348972 -424458 -579850 -16129 449689 219270
37679 219270 -232111 -63087 734154 1365664 1330404 991231 976518 1349724 1581134 1256877
37669 1256877 656886 512486 1155258 2056208 2407863 2055444 1527826 1189060 840817
37660 840817 332182 46492 339677 822269 751174 31565 -677581 -874648 -769816 -799705
37650 -799705 -975792 -958699 -566951 2077 362992 249265 -261801 -751217 -787432 -317392
37640 -317392 337765 853377 1129231 1187738 1082196 963793 1015502 1200402 1244112 983297
37630 983297 587839 337086 322298 457045 593640 507335 -4942 -778237 -1205619 -825309
$$ packed form
37699H93153M52881J41314n40393p99182m16782K871K6899o1491P2946K69740
37689D1956L10641L10559K98592j5278n97498p73430j55392N63721M65818k30419
37679B19270m51381J69024P97241O31510l5260l39173j4713L73206K31410l24257
37669A256877n99991j44400O42772R00950L51655l52419n27618l38766l48243
37660H40817n08635k85690K93185M82592p1095p19609p09146j97067J04832k9889
37650g99705j76087J7093L91748N69028L60915j13727n11066m89416l6215M70040
37640c17392O55157N15612K75854N8507j05542j18403N1709J84900M3710k60815
37630I83297l95458k50753j4788J34747J36595q6305n12277p73295m27382L80310
$$ plain form
37620 -825309 54647 598199 353028 -288658 -597680 -283005 344400 822680 961300 822501
37610 822501 457999 -153415 -865171 -1243097 -948615 -250921 139392 -84452 -401062 -159829
37600 -159829 500394 851136 645285 500102 1023058 1942393 2452709 2231324 1753475 1640926
37590 1640926 2012163 2558540 3044022 3559106 4319152 5310355 6187249 6547662 6297007
37581 6297007 5686876 5008170 4356713 3725567 3179725 2839872 2794954 3100063 3699324 4231942
37571 4231942 4136361 3222103 2015655 1222523 902383 524469 -171577 -805019 -972950
37562 -972950 -800453 -593649 -334736 52236 225766 -209192 -941873 -1151970 -585141 84779
37552 84779 207984 9166 103435 518643 727916 520023 288443 362121 494582 267510
$$ packed form
37620h25309Q79956N43552k45171o41686l09022L14675O27405M78280J38620j38799
37610H22501l64502o11414p11756l77926K94482O97694L90313k23844l16610K41233
37600a59829O60223L50742k05851j45183N22956R19335N10316k21385m77849j12549
37590A640926L71237N46377M85482N15084P60046R91203Q76894L60413k50655
37581F297007o10131o78706o51457o31146n45842l39853m4918L05109N99261N32618
37571D231942r5581r14258j206448p93132l20140l77914o96046o33442j67931
37562i72950J72497K06804K58913L86972J73530m34958p32681k10097N66829O69920
37552H4779J23205j98818R4269M15208K09273k07893k31580P3678J32461k27072
$$ plain form
37542 267510 -266953 -635871 -531416 -106959 303353 576759 842404 1219418 1618432 1834819
37532 1834819 1794078 1622956 1461196 1302690 1094156 886047 750203 626783 441278 338930
37522 338930 562640 1036800 1303544 1034299 463867 136833 290000 650432 830288 772371
37512 772371 738326 910316 1091793 888232 214417 -485681 -663736 -259394 303387 673836
37502 673836 884626 1080649 1248341 1388710 1714373 2421400 3395250 4354371 5173893 5874406
37492 5874406 6413596 6701511 6711595 6368823 5475511 4030551 2514994 1533971 1205769
37483 1205769 1189107 1243465 1390459 1529391 1347699 799760 344585 462260 1110130 1809542
37473 1809542 2100026 1797908 1016526 97483 -603427 -964179 -1042272 -830099 -332459 128032
$$ packed form
37542B67510n34463l68918J04455M24457M10312K73406K65645L77014L99014K16387
37532A834819m0741j71122j61760j58506k08534k08109j35844j23420j85505j02348
37522C38930K23710M74160K66744k69245n70432l27034J53167L60432J79856n7917
37512G72371l4045J71990J81477k03561o73815p00098j78055M04342N62781L70449
37502F73836K10790J96023J67692J40369L25663P07027R73850R59121Q19522P00513
37492E874406N39190K87915J0084l42772q93312j444960j515557r81023l28202
37483A205769j6662N4358J46994J38932j81692n47939m55175J17675O47870O99412
37473A809542K90484l02118p81382r19043p00910l60752p8093K12173M97640M60491
$$ plain form
37463 128032 90089 -407761 -739982 -478492 64968 346246 302351 203156 84843 -207284
37453 -207284 -564316 -664095 -451866 -207077 -142155 -246139 -491850 -870734 -1222048 -1326525
37443 -1326525 -1179161 -919116 -552870 -57239 320664 271618 -67693 -241284 -167798 -264466
37433 -264466 -760611 -1365419 -1837358 -2382001 -3092498 -3423514 -2794791 -1510732 -485749
37424 -485749 -86730 178330 707293 1120668 903731 336770 236809 849033 1490617 1435705
37414 1435705 786561 218737 126239 362747 694852 1091351 1491103 1636608 1357288 844190
37404 844190 473718 473400 849307 1450899 1957222 1988188 1458630 753952 413885 700283
37394 700283 1502128 2475814 3233054 3672290 4211432 5329084 6764797 7729445 8215481
$$ packed form
37463A28032l7943m97850l32221K61490N43460K81278m3895r9195j18313k92127
37453b07284l57032r9779K12229K44789O4922j03984k45711l78884l51314j04477
37443a326525J47364K60045L66246M95631L77903m9046l39311j73591P3486r6668
37433b64466m96145o04808m71939n44643p10497l31016O28723J284059J024983
37424d85749L99019K65060N28963M13375k16937n66961r9961O12224O41584n4912
37414A435705o49144n67824r2498K36508L32105L96499L99752J45505k79320n13098
37404H44190l70472l18L75907O01592N06323L0966n29558p04678l40067K86398
37394G00283Q01845R73686P57240M39236N39142J117652J435713R64648M86036
$$ plain form
37385 8215481 9391332 11962480 14648153 15287272 13325747 10276561 7744275 6016461
37377 6016461 4787702 4152363 4237377 4610782 4767001 4744069 4727666 4509835 3874904 3082400
37367 3082400 2427529 1758890 1005606 718390 1356541 2366277 2750630 2371585 1934829
37358 1934829 1815990 1718678 1512909 1575599 2041480 2381839 2100404 1406860 862349 657012
37348 657012 517100 141670 -449710 -899790 -828486 -312581 44143 -234264 -896495 -1341490
37338 -1341490 -1445903 -1573442 -1847820 -1944104 -1652290 -1172105 -759705 -507535 -523039 -843931
37328 -843931 -1087904 -707149 227795 962922 970939 499455 63068 -119863 -3015 410526
37318 410526 766232 477179 -454351 -1199284 -1105734 -505570 -85154 71137 239994 285923
$$ packed form
37385H215481J175851K571148K685673O39119j961525l049186k532286j727814
37377F016461j228759o35339Q5014L73405J56219k2932j6403k17831o34931p92504
37367C082400o54871o68639p53284k87216O38151J009736L84353l79045m36756
37358A934829j18839r7312k05769O2690M65881L40359k81435o93544n44511k05337
37348F57012j39912l75430n91380m50080P1304N15905L56724k78407o62231m44995
37338a341490j04413j27539k74378r6284K91814M80185M12400K52170j5504l20892
37328h43931k43973L80755R34944P35127Q017m71484m36387j82931J16848M13541
37318D10526L55706k89053r31530p44933R3550O00164M20416J56291J68857M5929
$$ plain form
37308 285923 -140662 -837457 -1193356 -1052717 -832995 -801379 -825576 -871174 -1131828 -1512280
37298 -1512280 -1544437 -1081426 -616683 -590058 -740500 -534763 -11553 220052 -207669 -926645
37288 -926645 -1228645 -781606 129433 960339 1384350 1442592 1372177 1382768 1511996 1548692
37278 1548692 1148914 224089 -801909 -1357743 -1354719 -1162587 -934172 -393619 498079 1139024
37268 1139024 986532 344831 -63042 -121129 -361140 -1037237 -1724206 -1932575 -1655629 -1159317
37258 -1159317 -631211 -210236 -12248 60542 226766 379072 78596 -760202 -1502802 -1462395
37248 -1462395 -744347 -83955 47466 -156134 -287078 -239671 -172256 -174269 -136144 104949
37238 104949 575439 1108503 1445003 1404831 994952 395941 -122767 -316158 -98763 377405
$$ packed form
37308B85923m26585o96795l55899J40639K19722L1616k4197m5598k60654l80452
37298a512280l2157M63011M64743K6625j50442K05737N23210K31605m27721p18976
37288i26645l02000M47039R11039Q30906M24011N8242p0415J0591J29228L6696
37278A548692l99778r24825j025998n55834L024J92132K28415N40553Q91698O40945
37268A139024j52492o41701m07873n8087k40011o76097o86969k08369K76946M96312
37258a159317N28106M20975J97988P2790J66224J52306l00476q38798p42600M0407
37248a462395P18048O60392J31421k03600j30944M7407O7415k013L8125K41093
37238A04949M70490N33064L36500m0172m09879n99011n18708j93391K17395M76168
$$ plain form
37228 377405 813899 976121 828853 508148 215556 114577 239166 467971 637315 719459
37218 719459 868901 1249389 1795860 2189521 2166338 1876788 1795016 2141656 2543004 2500921
37208 2500921 2082539 1772845 1659432 1252670 312804 -598549 -756828 -146733 684811
37199 684811 1364676 1836615 2003292 1777035 1424379 1357159 1556432 1617797 1359563 950496
37189 950496 444363 -291782 -1075269 -1342825 -838564 -16433 460622 347165 -186341 -839935
37179 -839935 -1281125 -1254239 -809753 -250416 213255 518877 507438 42920 -578854 -827377
37169 -827377 -670949 -607543 -804871 -814297 -440524 -250073 -702550 -1310669 -1300149 -730214
37159 -730214 -306788 -349567 -587470 -782566 -915148 -877745 -599035 -359207 -368393 -181102
$$ packed form
37228C77405M36494J62222j47268l20705k92592j00979J24589K28805J69344Q2144
37218G19459J49442L80488N46471L93661k3183k89550q1772L46640M01348m2083
37208B500921m18382l09694j13413m06762r39866r11353j58279O10095Q31544
37199F84811O79865M71939J66677k26257l52656o7220J99273O1365k58234m09067
37189I50496n06133p36145p83487k67556N04261Q22131M77055j13457n33506o53594
37179h39935m41190K6886M44486N59337M63671L05622j1439m64518o21774k48523
37169h27377J56428O3406j97328r426L73773J90451m52477o08119J0520N69935
37159g30214M23426m2779k37903j95096j32582L7403K78710K39828r186J87291
$$ plain form
37149 -181102 721789 1837681 2034661 1214772 664748 1297379 2350783 2520585 1775871
37140 1775871 1180232 1220249 1260127 714393 -76165 -495336 -575258 -741589 -969266 -801528
37130 -801528 -177876 314308 229691 -108283 -139105 41995 -178404 -949084 -1627973 -1602320
37120 -1602320 -1013914 -414742 -66382 82062 29143 -227730 -451212 -402686 -228836 -228641
37110 -228641 -343761 -314168 -267589 -640217 -1446378 -2110261 -2188409 -1854971 -1478572 -1091926
37100 -1091926 -537931 141073 724019 1038921 999833 628180 203799 166312 655724 1313673
37090 1313673 1699675 1729261 1568540 1332629 1091337 967131 990509 999606 876514 734632
37080 734632 699727 698366 671474 769856 1030994 1049766 387808 -718415 -1455389 -1340010
$$ packed form
37149a81102R02891J115892J96980q19889n50024O32631J053404J69802p44714
37140A775871n95639M0017L9878n45734p90558m19171p9922j66331k27677J67738
37130h01528O23652M92184q4617l37974l0822J81100k20399p70680o78889K5653
37120a602320N88406N99172L48360J48444n2919k56873k23482M8526J73850J95
37110b28641j15120K9593M6579l72628q06161o63883p8148L33438L76399L86646
37100a091926N53995O79004N82946L14902l9088l71653m24381l7487M89412O57949
37090A313673L86002K9586j60721k35911k41292j24206K3378R097j23092j41882
37080G34632l4905j361k6892R8382K61138J8772o61958j106223p36974J15379
$$ plain form
37070 -1340010 -735596 -332419 -367916 -553655 -578907 -402449 -91645 324703 701642 686566
37060 686566 72643 -770970 -1126459 -743498 -204923 -234695 -792122 -1155672 -835934 -78707
37050 -78707 535659 655773 272017 -370093 -814220 -665288 -43132 447979 391719 6124
37040 6124 -246897 -262879 -267790 -373827 -444996 -342041 -92680 170673 346618 476827 716077
37029 716077 1058674 1175707 840301 485450 843142 1863936 2534917 2136811 1197812
37020 1197812 683049 642852 351632 -421953 -1043375 -957080 -367427 186336 428800 338082
37010 338082 -18280 -401641 -488137 -242323 51323 242948 485458 811772 901420 516382
37000 516382 -81459 -380352 -101851 714125 1846177 2894507 3393829 3231584 2836978
$$ packed form
37070a340010O04414M03177l5497j85739k5252J76458L10804M16348L76939j5076
37060F86566o13923q43613l55489L82961N38575k9772n57427l63550L19738P57227
37050g8707O14366J20114l83756o42110m44127J48932O22156M91111n6260l85595
37040F124k53021j5982m911j06037p1169J02955K49361K63353J75945J30209K39250
37029G16077L42597J17033l35406l54851L57692J020794O70981l98106r38999
37020A197812n14763m0197k91220p73585o21422Q6295N89653N53763K42464r0718
37010C38082l56362l83361q6496K45814K93646J91625K42510L26314Q9648l85038
37000E16382n97841k98893K78501Q15976J132052J048330M99322j62245l94606
$$ plain form
36991 2836978 2696986 2768094 2609120 2042469 1421649 1189942 1362388 1565956 1518592 1340012
36981 1340012 1349776 1644354 1995627 2138904 1974922 1458244 561844 -489712 -1258088 -1657616
36971 -1657616 -2183426 -3122383 -3793987 -3245736 -1663458 -348078 -108641 -404218 -438194
36962 -438194 -366318 -755595 -1384117 -1472368 -949183 -639949 -1070921 -1769079 -2021888 -1805968
36952 -1805968 -1593756 -1601730 -1657763 -1648373 -1697053 -1883536 -2068153 -2101796 -2057261 -2121530 -2303565
36941 -2303565 -2365742 -2090494 -1561833 -1117088 -1032468 -1305791 -1717125 -2015270 -2060859 -1905966
36931 -1905966 -1761953 -1789208 -1885947 -1770333 -1284848 -529165 285166 962250 1309503 1203145
36921 1203145 755503 289519 79294 189758 523474 850019 840665 338851 -382355 -868465
$$ packed form
36991B836978j39992P1108j58974n66651o20820k31707J72446K03568m7364j78580
36981A340012R764K94578L51273J43277j63982n16678q96400j051556p68376l99528
36971a657616n25810r38957o71604N48251J582278J315380K39437k95577l3976
36962d38194P1876l89277o28522q8251N23185L09234m30972o98158k52809K15920
36952a805968K12212p974n6033R390m8680j86483j84617l3643M4535o4269j82035
36941b303565o2177K75248N28661M44745Q4620k73323m11334k98145m5589J54893
36931a905966J44013k7255r6739J15614M85485P55683Q14331O77084L47253j06358
36921A203145m47642m65984k10225J10464L33716L26545r354n01814p21206m86110
$$ plain form
36911 -868465 -964652 -774118 -264049 573167 1190322 852599 -180726 -567235 468564
36902 468564 1966625 2403766 1592939 605195 110166 -227542 -714556 -986292 -727135
36893 -727135 -279192 -73864 28478 384977 924417 1268152 1251307 987518 606858 215669
36883 215669 -29485 -45150 68184 153044 104609 -173453 -675263 -1096698 -1050331 -613297
36873 -613297 -350601 -609021 -1072265 -1215957 -926697 -451408 -8285 291624 371652 306403
36863 306403 314977 408649 282792 -171437 -501854 -204544 565756 1163396 1227895 932401
36853 932401 524095 22604 -541351 -906231 -789058 -200973 539499 1048835 1110142 728601
36843 728601 11345 -944750 -1976170 -2750702 -2955625 -2612310 -2016829 -1373078 -735599
$$ packed form
36911h68465r6187J90534N10069Q37216O17155l37723j033325l86509J035799
36902D68564J498061M37141q10827r87744m95029l37708m87014k71736K59157
36893g27135M47943K05328J02342L56499N39440L43735j6845k63789l80660l91189
36883B15669k45154j5665J13334Q4860m8435k78062n01810m21435M6367M37034
36873f13297K62696k58420m63244j43692K89260M75289M43123K99909Q0028o5249
36863C06403Q574R3672j25857m54229l30417K97310P70300N97640O4499k95494
36853I32401m08306n01491n63955l64880J17173N88085P40472N09336O1307l81541
36843G28601p17256r56095j031420p74532k04923L43315N95481O43751O37479
$$ plain form
36834 -735599 -302546 -376977 -907381 -1434065 -1670705 -1775991 -1864856 -1706582 -1219622 -801766
36824 -801766 -725394 -617763 -80612 532577 599976 232639 76361 237239 144719 -495751
36814 -495751 -1314165 -1944752 -2415985 -2691858 -2477497 -1795362 -1211996 -1113991 -1166197 -840255
36804 -840255 -141859 512986 846013 827034 496378 -10418 -436081 -629646 -649676 -535578
36794 -535578 -246909 54697 37508 -261024 -295225 273228 1022115 1274824 917245 368287
36784 368287 -44954 -302650 -425886 -377369 -209605 -58359 -8120 -108121 -411896 -859633
36774 -859633 -1269734 -1574561 -1867791 -2107374 -2071690 -1795472 -1698129 -1992347 -2307307 -2260188
36764 -2260188 -2067281 -2126918 -2281712 -2071676 -1581284 -1433273 -1903751 -2534597 -2726489 -2349128
$$ packed form
36834g35599M33053p4431n30404n26684k36640j05286q8865J58274M86960M17856
36824h01766P6372J07631N37151O13189O7399l67337j56278J60878r2520o40470
36814d95751q18414o30587m71233k75873K14361O82135N83366R8005n2206L25942
36804h40255O98396O54845L33027j8979l30656n06796m25663j93565k0030J14098
36794e35578K88669L01606j7189k98532l4201N68453P48887K52709l57579n48958
36784C68287m13241k57696j23236M8517J67764J51246N0239j00001l03775m47737
36774h59633m10101l04827k93230k39583L5684K76218R7343k94218l14960M7119
36764b260188J92907n9637j54794K10036M90392J48011m70478o30846j91892L77361
$$ plain form
36754 -2349128 -1697759 -1173079 -1053471 -1286160 -1465153 -1260600 -837033 -596622 -620708 -691303
36744 -691303 -728262 -782235 -697909 -291784 150901 93240 -456852 -869144 -740960 -353072
36734 -353072 -124036 -89304 -149291 -398898 -915529 -1528686 -2026639 -2324629 -2310204 -1875894
36724 -1875894 -1220647 -701556 -266372 449882 1285425 1459032 708489 -98055 -65025 513382
36714 513382 712416 364996 109814 258662 431386 326036 114911 -70993 -412810 -914893
36704 -914893 -1162692 -874397 -324695 62844 257767 491621 809235 1029601 1057795 1024172
36694 1024172 1102405 1261338 1241717 878355 471046 593766 1336493 2000421 1911808 1331956
36684 1331956 1063496 1266053 1283343 716113 11324 -294796 -335252 -467998 -528557 -115413
$$ packed form
36754b349128O51369N24680J19608k32689j78993K04553M23567K40411k4086p0595
36744f91303l6959n3973Q4326M06125M42685n7661n50092m12292J28184L87888
36734c53072K29036L4732n9987k49607n16631o13157m97953k97990J4425M34310
36724a875894O55247N19091M35184P16254Q35543J73607p50543q06544L3030N78407
36714E13382J99034l47420k55182J48848J72724j05350k11125j85904l41817n02083
36704i14893k47799K88295N49702L87539J94923K33854L17614K20366K8194l3623
36694A024172P8233J58933j9621l63362m07309J22720P42727O63928q8613n79852
36684A331956k68460K02557J7290n67230p04789l06120m0456j32746o0559M13144
$$ plain form
36674 -115413 593774 894798 440572 -341813 -782321 -617900 -59424 525468 889332 1017027
36664 1017027 1041199 1003116 765935 279850 -175602 -235319 80356 344472 215944 -201116
36654 -201116 -542053 -595946 -449662 -282546 -125574 92742 245813 -84665 -1141014 -2422943
36644 -2422943 -2935256 -2223197 -911506 65050 526493 943496 1458076 1609292 1133389
36635 1133389 470410 139199 5812 -382526 -954605 -1093576 -453677 584539 1369528
36626 1369528 1615103 1467384 1165059 819928 444392 50917 -279420 -402619 -234354
36617 -234354 117173 408211 483130 408548 389326 581249 927964 1114414 787567 -16893
36607 -16893 -760607 -959876 -812061 -938771 -1463273 -1750695 -1278526 -380355 245072 464087
$$ packed form
36674a15413P09187L01024m54226p82385m40508J64421N58476N84892L63864J27695
36664A017027K4172l8083k37181m86085m55452n9717L15675K64116j28528m17060
36654b01116l40937n3893J46284J67116J56972K18316J53071l30478j056349j281929
36644b422943n12313P12059J311691R76556M61443M17003N14580J51216m75903
36635A133389o62979l31211j33387l88338n72079j38971O39899J038216P84989
36626A369528K45575j47719l02325l45131l75536l93475l30337j23199J68265
36617b34354L51527K91038P4919p4582j9222J91923L46715J86450l26847q04460
36607a6893p43714j99269J47815j26710n24502k87422M72169Q98171O25427K19015
$$ plain form
36597 464087 652120 875718 724654 22955 -812428 -1301798 -1361183 -1032348 -214236 980984
36587 980984 1962116 2211774 1932114 1727100 1753824 1610390 1045740 364213 1519 -19403
36577 -19403 -56208 -414231 -1026778 -1492745 -1461033 -1068969 -877361 -1186885 -1561021 -1316755
36567 -1316755 -403499 544439 997966 998284 807944 530459 242086 118632 168246 115931
36557 115931 -181003 -433383 -306023 100919 450392 674398 941500 1224768 1281532 1079934
36547 1079934 898315 871199 695367 1168 -1083754 -1931111 -2009255 -1416256 -769241 -579338
36537 -579338 -815567 -1130927 -1376823 -1666485 -1963235 -1937076 -1401232 -648869 -110597 159547
36527 159547 381907 550884 379538 -223531 -908912 -1246270 -1161559 -900377 -675317 -479712
$$ packed form
36597D64087J88033K23598j51064p01699q35383m89370n9385L28835Q18112J195220
36587I80984R81132K49658k79660k05014K6724j43434n64650o81527l62694k0922
36577a9403l6805l58023o12547m65967L1712L92064J91608l09524l74136K44266
36567a316755R13256R47938M53527L18j90340k77485k88373j23454M9614n2315
36557A15931k96934k52380J27360M06942L49473K24006K67102K83268N6764k01598
36547A079934j81619k7116j75832o94199j084922q47357p8144N92999O47015J89903
36537e79338k36229l15360k45896k89662k96750K6159N35844P52363N38272K70144
36527A59547K22360J68977j71346o03069o85381l37358Q4711K61182K25060J95605
$$ plain form
36517 -479712 -212770 120149 392816 541788 683574 931755 1128910 969591 467198 66421
36507 66421 99837 329341 310401 80784 116176 589883 1050837 1012424 606020 399381
36497 399381 661758 1031824 953622 329133 -356582 -572843 -322605 -61306 -70253 -148271
36487 -148271 -26218 195063 292890 386073 741331 1200186 1261938 815405 366529 353446
36477 353446 583112 587054 255653 -147779 -376819 -317599 107330 829800 1507639 1780629
36467 1780629 1632258 1303642 926345 485924 115432 140111 708613 1498134 1889970 1478723
36457 1478723 488416 -315786 -309722 314635 770273 687476 569838 932676 1340794 910690
36447 910690 -320081 -1215857 -943338 15266 605273 506231 215514 120098 58078 -236994
$$ packed form
36517d79712K66942L32919K72667J48972J41786K48181J97155j59319n02393m00777
36507F6421L3416K29504j8940k29617L5392M73707M60954l8413m06404k06639
36497C99381K62377L70066p8202o24489o85715k16261K50238K61299q947p8018
36487a48271J22053K21281R7827R3183L55258M58855O1752m46533m48876j3083
36477C53446K29666L942l31401m03432k29040N9220M24929P22470O77839K72990
36467A780629j48371l28616l77297m40421l70492K4679N68502P89521L91836m11247
36457A478723r90307q04202O064O24357M55638q2797j17638L62838M08118m30104
36447I10690j230771q95776K72519R58604N90007r9042k90717r5416o2020k95072
$$ plain form
36437 -236994 -731426 -1213481 -1475113 -1296390 -587121 303378 701248 273995 -541873 -954821
36427 -954821 -596130 212703 876484 1099515 1098595 1319073 1904732 2462728 2478955 1961266
36417 1961266 1463368 1403856 1598865 1611462 1309725 831471 226401 -481919 -975137 -826155
36407 -826155 -101965 563566 658344 289407 -168539 -644873 -1311913 -2102756 -2611103 -2510317
36397 -2510317 -1894565 -1146631 -559552 -137103 267132 666428 862940 679912 170492
36388 170492 -498070 -1228501 -1875296 -2113535 -1777409 -1243271 -1021343 -965896 -461823 467542
36378 467542 943374 534443 83637 514730 1344350 1343841 424918 -226451 40416 492658
36368 492658 345537 -54681 -34966 201725 24474 -477590 -689911 -551222 -566461 -829586
$$ packed form
36437b36994m94432m82055k61632J78723P09269Q90499L97870m27253q15868m12948
36427i54821L58691Q08833O63781K23031r20K20478N85659N57996J6227n17689
36417A961266m97898n9512J95009J2597l01737m78254o05070p08320m93218J48982
36407h26155P24190O65531R4778l68937m57946m76334o67040p90843n08347J00786
36397b510317O15752P47934N87079M22449M04235L99296J96512j83028n09420
36388A70492o68562p30431o46795k38239L36126N34138K21928N5447N04073R29365
36378D67542M75832m08931m50806M31093Q29620n09r18923o51369K66867M52242
36368D92658j47121m00218J9715K36691j77251n02064k12321J38689j5239k63125
$$ plain form
36358 -829586 -887490 -671996 -746156 -1308185 -1648233 -1107261 -102612 395406 161618 -108529
36348 -108529 125901 580838 740110 653663 733927 976638 899022 341763 -110359 160817
36338 160817 923527 1346470 1058635 510733 207843 42230 -347747 -903425 -1202062 -1021265
36328 -1021265 -538711 -74091 125868 -27614 -351345 -489086 -357479 -328123 -695923 -1157617
36318 -1157617 -1161723 -607654 188217 1034563 1860867 2291557 1882330 896248 242277 377853
36308 377853 756570 665738 171115 -151645 -75261 130510 209748 186035 204582 374356
36298 374356 660955 750433 231851 -822943 -1664644 -1572140 -638945 388489 884975 702019
36288 702019 16569 -734370 -920147 -243082 763467 1197563 831506 301515 164616
$$ packed form
36358h29586n7904K15494p4160n62029l40048N40972J004649M98018k33788k70147
36348a08529K34430M54937J59272q6447Q0264K42711p7616n57259m52122K71176
36338A60817P62710M22943k87835n47902l02890j65613l89977n55678k98637J80797
36328a021265M82554M64620J99959j53482l23731j37741J31607K9356l67800m61694
36318a157617m106N54069P95871Q46346Q26304M30690m09227r86082o53971J35576
36308C77853L78717r0832m94623l22760P6384K05771P9238k3713J8547J69774
36298C74356K86599Q9478n18582j054794q41701R2504R33195J027434M96486j82956
36288G02019o85450p50939j85777O77065J006549M34096l66057n29991j36899
$$ plain form
36279 164616 210626 -48065 -585976 -945259 -896370 -607888 -204372 445044 1347644 2072351
36269 2072351 2106079 1483279 814324 612761 793698 967637 987885 902585 555795 -243228
36259 -243228 -1115360 -1259506 -498169 313437 349412 -121880 -252431 169776 684875 1078407
36249 1078407 1507102 1762423 1323480 369033 -118318 297821 775940 394136 -520038
36240 -520038 -963516 -715745 -404039 -340272 -159860 331472 726354 702644 569664 759407
36230 759407 1136606 1193989 751265 126775 -358683 -799050 -1487473 -2328236 -2662298 -1923777
36220 -1923777 -444989 751093 1115370 1148261 1514985 1997374 1867015 1047678 245504
36211 245504 -30960 48883 181671 320511 358914 22605 -643079 -1152246 -1203808 -991368
$$ packed form
36279A64616M6010k58691n37911l59283M8889K88482M03516O49416R02600P24707
36269B072351L3728o22800o68955k01563J80937J73939K0248q5300l46790p99023
36259b43228q72132j44146P61337Q11606L5975m71292j30551M22207N15099L93532
36249A078407M28695K55321m38943r54447m87351M16139M78119l81804r14174
36240e20038m43478K47771L11706O3767J80412M91332L94882k3710j32980J89743
36230G59407L77199N7383m42724o24490m85458m40367o88423q40763l34062P38521
36220a923777J478788J196082L64277L2891L66724M82389j30359q19337q02174
36211B45504k76464P9843J32788J38840L8403l36309o65684n09167n1562K12440
$$ plain form
36201 -991368 -687347 -161388 482589 673148 152617 -485269 -574580 -300995 -292923 -649537
36191 -649537 -990046 -1175214 -1318407 -1302947 -984980 -718722 -942014 -1316669 -1059807 -156745
36181 -156745 554695 638741 573163 730275 683674 57989 -589904 -410549 595895 1657194
36171 1657194 2177995 2110042 1636748 1036185 720801 906058 1267213 1311781 1046652 911340
36161 911340 1083140 1223283 971429 401203 -118742 -339021 -316982 -270074 -292810 -257579
36151 -257579 -64915 106157 28226 -159126 -120786 86288 64345 -188713 -167322 257811
36141 257811 463245 32289 -499710 -491713 -272680 -552534 -1111033 -1031162 -137795 747289
36131 747289 1076379 1202193 1488706 1630274 1283999 731706 432295 386726 373598 421707
$$ packed form
36201i91368L04021N25959O43977J90559n20531o37886q9311K73585Q072l56614
36191f49537l40509j85168j43193J5460L17967K66258k23292l74655K56862R03062
36181a56745P11440Q4046o5578J57112m6601o25685o47893J79355J006444J061299
36171A657194N20801o7953m73294o00563l15384J85257L61155M4568k65129j35312
36161I11340J71800J40143k51854n70226n19945k20279K2039M6908k2736L5231
36151b57579J92664J71072p7931j87352L8340K07074k1943k53058K1391M25133
36141B57811K05434m30956n31999P997K19033k79854n58499P9871Q93367Q85084
36131G47289L29090J25814K86513J41568l46275n52293k99411m5569j3128M8109
$$ plain form
36121 421707 655841 990012 1283779 1499325 1497790 1099010 573476 551337 1089222 1363686
36111 1363686 766651 -198185 -691915 -746534 -958761 -1304542 -1129788 -280258 553156 757816
36101 757816 434395 -52706 -561771 -960577 -966507 -580244 -312345 -580472 -1102561 -1253397
36091 -1253397 -901421 -548799 -645417 -1043934 -1239370 -981824 -492472 -130569 -51659 -278553
36081 -278553 -886959 -1821456 -2605905 -2645922 -1942027 -1137794 -656076 -160107 801612 1950987
36071 1950987 2544617 2302690 1627789 1006508 610678 394823 157550 -409709 -1276894
36062 -1276894 -1759926 -1186899 128074 1141346 1353451 1214252 1160818 1001979 599026
36053 599026 426701 844122 1317365 1076912 260897 -279640 -153077 260406 595565 896254
$$ packed form
36121D21707K34134L34171K93767K15546j535l98780n25534k2139N37885K74464
36111A363686n97035r64836m93730n4619k12227l45781J74754Q49530Q33414K04660
36101G57816l23421m87101n09065l98806n930L86263K67899k68127n22089j50836
36091a253397L51976L52622r6618l98517j95436K57546M89352L61903P8910k26894
36081b78553o08406r34497p84449m0017P03895Q04233M81718M95969R61719J149375
36071A950987N93630k41927o74901o21281l95830k15855k37273n67259q67185
36062a276894m83032N73027J314973J013272K12105j39199n3434j58839m02953
36053E99026j72325M17421M73243k40453q16015n40537J26563M13483L35159L00689
$$ plain form
36043 896254 1113296 873509 77102 -734012 -979424 -725396 -451910 -384479 -401126 -420193
36033 -420193 -487835 -535135 -416003 -224605 -243033 -463704 -481769 -86995 289803 64482
36023 64482 -668249 -1165311 -950459 -372199 -101407 -345884 -779015 -1030021 -975077 -693539
36013 -693539 -431593 -513160 -977710 -1366865 -1207418 -684866 -451071 -706265 -900103 -538526
36003 -538526 102907 387952 159220 -196921 -340718 -245651 29974 424149 688096 498210
35993 498210 -83659 -516735 -357013 207991 582965 444492 11813 -349833 -593351 -923378
35983 -923378 -1367666 -1644464 -1545898 -1276690 -1194739 -1278043 -1125396 -568857 -43411 -145507
35973 -145507 -935496 -1862862 -2330744 -2183569 -1686048 -1200659 -914971 -764377 -567710 -273372
$$ packed form
36043H96254K17042k39787p96407q11114k45412K54028K73486O7431j6647j9067
36033d20193o7642m7300J19132J91398j8428k20671j8065L94774L76798k25321
36023F4482p32731m97062K14852N78260K70792k44477m33131k51006N4944K81538
36013f93539K61946q1567m64550l89155J59447N22552K33795k55194j93838L61577
36003e38526O41433K85045k28732l56141j43797R5067K75625L94175K63947j89886
35993D98210n81869m33076J59722N65004L74974j38473m32679l61646k43518l30027
35983i23378m44288k76798R8566K69208Q1951q3304J52647N56539N25446j02096
35973a45507p89989r27366m67882J47175M97521M85389K85688J50594J96667K94338
$$ plain form
35963 -273372 -46498 -46438 -164201 -108382 231568 628553 794860 730632 671663 698569 553557
35952 553557 -26046 -865399 -1435280 -1405231 -922978 -273693 478022 1289943 1828148 1738239
35942 1738239 1156336 558519 99258 -477404 -1176144 -1472647 -990109 -121746 374931
35933 374931 221561 -231872 -542327 -581334 -528781 -701408 -1277314 -2001228 -2333143 -2095124
35923 -2095124 -1748349 -1770927 -2028434 -2117017 -2049592 -2093933 -2124469 -1765268 -1150574 -888244
35913 -888244 -1133412 -1314088 -1025055 -613534 -503203 -460481 -68103 429205 371773 -352204
35903 -352204 -1140135 -1472122 -1420426 -1314588 -1317456 -1461923 -1752055 -2029566 -2003836 -1639493
35893 -1639493 -1329726 -1436047 -1738085 -1576514 -581105 868425 1956338 2160731 1671574
$$ packed form
35963b73372K26874O0j17763N5819L39950L96985J66307o4228n8969K6906j45012
35952E53557n79603q39353n69881L0049M82253O49285P51715Q11921N38205q9909
35942A738239n81903n97817m59261n76662o98740k96503M82538Q68363M96677
35933C74931j53370m53433l10455l9007N2553j72627n75906p23914l31915K38019
35923b095124L46775k2578k57507q8583O7425m4341l0536L59201O14694K62330
35913h88244k45168j80676K89033M11521J10331M2722L92378M97308n7432p23977
35903c52204p87931l31987N1696J05838k868j44467k90132k77511K5730L64343
35893a639493L09767j06321l02038J61571R95409J449530J087913K04393m89157
$$ plain form
35884 1671574 1139329 1036049 1251298 1294164 846555 65306 -631022 -952978 -865087 -453282
35874 -453282 149237 709307 962741 858196 630569 505637 421127 208875 -26110 23089
35864 23089 387052 711280 764476 754320 875506 832904 267376 -486682 -655675 -142294
35854 -142294 190573 -315466 -1140656 -1294210 -685471 -143941 -162226 -315411 -83367 407326
35844 407326 835299 1325898 2069616 2655904 2471213 1638106 890217 506136 61395 -613402
35834 -613402 -985469 -734162 -435262 -707090 -1187619 -1125452 -628150 -421993 -534130 -233825
35824 -233825 596514 1067189 678921 200477 499446 1238384 1546495 1422687 1506259 1773158
35814 1773158 1508338 567098 -294573 -545005 -503992 -541754 -418146 97173 557851 413249
$$ packed form
35884A671574n32245j03280K15249M2866m47609p81249o96328l21956Q7891M11805
35874d53282O02519N60070K53434j04545k27627j24932q4510k12252k34985M9199
35864B3089L63963L24228N3196j0156J21186m2602n65528p54058j68993N13381
35854a42294L32867n06039q25190j53554O08739N41530j8285j53185K32044M90693
35844D07326M27973M90599P43718N86288j84691q33107p47889l84081m44741o74797
35834f13402l72067K51307K98900k71828m80529O2167M97302K06157j12137L00305
35824b33825Q30339M70675l88268m78444K98969P38938L08111j23808Q3572K66899
35814A773158k64820r41240q61671k50432M1013l7762J23608N15319M60678j44602
$$ plain form
35804 413249 -116119 -332234 -35627 324642 382757 234862 60976 -180565 -515156 -724996
35794 -724996 -601837 -278326 -84386 -111915 -124825 37321 154455 -72176 -511000 -720038
35784 -720038 -645509 -828596 -1646625 -2652452 -3070643 -2752248 -2181436 -1687282 -1217452 -855664
35774 -855664 -895572 -1224228 -1247372 -742044 -261829 -323636 -664113 -736173 -515242 -308301
35764 -308301 -132172 144354 333354 232780 185163 639786 1258450 1203419 376864 -360767
35754 -360767 -417005 -217758 -376690 -740080 -792484 -561771 -485787 -616530 -597968 -386729
35744 -386729 -393650 -773652 -1064552 -801046 -165538 268362 235907 -71286 -422590 -770441
35734 -770441 -1054118 -1108757 -916201 -728792 -751041 -831207 -670598 -257524 117111 233769
$$ packed form
35804D13249n29368k16115K96607L60269N8115j47895j73886k41541l34591k09840
35794g24996J23159L23511J93940k7529j2910J62146J17134k26631m38824k09038
35784g20038P4529j83087q18029j005827m18191L18395N70812M94154M69830L61788
35774h55664l9908l28656k3144N05328M80215o1807l40477p2060K20931K06941
35764c08301J76129K76526J89000j00574m7617M54623O18664n5031q26555p37631
35754c60767n6238J99247j58932l63390n2404K30713P5984j30743J8562K11239
35744c86729o921l80002k90900K63506O35508M33900l2455l07193l51304l47851
35734g70441k83677n4639J92556J87409k2249q0166J60609M13074L74635J16658
$$ plain form
35724 233769 115099 -153934 -504924 -726726 -520506 102141 693661 879079 836688 990306
35714 990306 1302572 1218670 407066 -713058 -1392424 -1364194 -996637 -664265 -266132 436487
35704 436487 1206910 1448587 998597 443871 402725 769540 1022404 1058198 1216269 1523233
35694 1523233 1492144 862331 75439 -276163 -140216 129809 282459 230924 -99498 -607213
35684 -607213 -899966 -723243 -360022 -241075 -281305 -4773 708280 1390873 1577070 1332855
35674 1332855 1088209 1100619 1175670 905482 231159 -289893 -49859 725211 1060238 419989
35664 419989 -619322 -1236428 -1417228 -1564031 -1488215 -669049 593986 1216354 738255
35655 738255 -41481 -171856 327149 843113 1124247 1313285 1371205 1053204 395936 -187775
$$ packed form
35724B33769j18670k69033l50990k21802K06220O22647N91520J85418m2391J53618
35714I90306L12266q3902q11604j120124o79366K8230L67557L32372L98133P02619
35704D36487P70423K41677m49990n54726m1146L66815K52864L5794J58071L06964
35694A523233l1089o29813p86892l51602J35947K70025J52650n1535l30422n07715
35684f07213k92753J76723L63221J18947m0230K76532P13053O82593J86197k44215
35674A332855k44646J2410P5051k70188o74323n21052K40034P75070L35027o40249
35664D19989j039311o17106j80800j46803P5816Q19166J263035O22368m78099
35655G38255p79736j30375M99005N15964K81134J89038N7920l18001o57268n83711
$$ plain form
35645 -187775 -356305 -173196 19559 -55076 -380244 -708304 -864278 -917872 -962265 -876814
35635 -876814 -539901 -127999 132915 396521 951018 1601077 1785313 1343659 680448 117411
35625 117411 -363920 -644669 -400202 220028 488706 98320 -287997 18348 705811 951765
35615 951765 579616 130876 14437 144008 279898 244559 -89899 -609598 -878252 -618267
35605 -618267 -104634 264482 521072 824759 927425 529865 -50048 -231059 -87738 -246301
35595 -246301 -876333 -1448552 -1557290 -1329797 -890233 -93079 932356 1558212 1360276
35586 1360276 638934 -62305 -563258 -874780 -841841 -381487 193032 484648 480654 396781
35576 396781 238902 -134644 -621622 -877025 -709302 -283974 43244 -16665 -487864 -1044385
$$ packed form
35645a87775j68530J83109J92755p4635l25168l28060j55974n3594m4393Q5451
35635h76814L36913M11902K60914K63606N54497O50059J84236m41654o63211n63037
35625A17411m81331k80749K44467O20230K68678l90386l86317L06345O87463K45954
35615I51765l72149m48740j16439J29571J35890l5339l34458n19699k68654K59985
35605f18267N13633L69116K56590L03687J02666l97560n79913j81011J43321j58563
35595b46301o30032n72219j08738K27493M39564P97154J025435O25856j97936
35586A360276p21342p01239n00953l11522L2939M60354N74519K91616l994q3873
35576C96781j57879l73546m86978k55403J67723M25328L27218n9909m71199n56521
$$ plain form
35566 -1044385 -1229405 -903661 -381105 -17215 178745 377628 564102 575509 413280 291263
35556 291263 406231 811571 1432205 2012525 2139982 1607579 792031 406490 718828 1176737
35546 1176737 1014452 176257 -580158 -551431 137942 783598 960762 836760 645388 246090
35536 246090 -544338 -1440646 -1890708 -1744950 -1407207 -1272083 -1271779 -1094265 -674620 -311785
35526 -311785 -312839 -574148 -584912 17020 893140 1271874 907575 458396 614333 1161744
35516 1161744 1386067 1175254 1087618 1362962 1557454 1324558 914773 600006 195759 -407953
35506 -407953 -751861 -426116 140849 132457 -543211 -1126498 -959750 -118374 902227 1700429
35496 1700429 2105834 2166130 2118349 2150746 2155577 1906528 1414775 841833 151426 -764652
$$ packed form
35566a044385j85020L25744N22556L63890J95960J98883J86474J1407j62229j22017
35556B91263J14968M05340O20634N80320J27457n32403q15548l85541L12338M57909
35546A176737j62285q38195p56415K8727O89373O45656J77164j24002j91372l99298
35536B46090p90428q96308m50062J45758L37743J35124L04J77514M19645L62835
35526c11785j054k61309j0764O01932Q76120L78734l64299m49179J55937N47411
35516A161744K24323k10813q7636K75344J94492k32896m09785l14767m04247o03712
35506d07953l43908L25745N66965q392o75668n83287J66748Q41376J020601P98202
35496A700429M05405O0296m7781L2397M831k49049m91753n72942o90407r16078
$$ plain form
35486 -764652 -1621129 -1852963 -1343176 -651092 -298153 -158288 178852 743680 1236183 1514542
35476 1514542 1612873 1379438 574677 -586597 -1403762 -1432728 -1000565 -738226 -797418 -808765
35466 -808765 -479836 95317 674189 1051908 960652 183847 -995148 -1765068 -1567186 -781413
35456 -781413 -320851 -613200 -1286398 -1806103 -2041755 -2116395 -2045500 -1749912 -1251167 -678380
35446 -678380 -181708 83147 42123 -128431 -87543 282783 701305 814774 588800 276505
35436 276505 119226 174747 328661 398084 343412 413552 887168 1601246 1988308 1739316
35426 1739316 1200167 910425 966466 1088775 1114069 1091830 1022164 869317 809922 1104279
35416 1104279 1642929 1923063 1619859 970289 449930 251897 255313 346892 499729 553366
$$ packed form
35486g64652q56477k31834N09787O92084L52939J39865L37140N64828M92503K78359
35476A514542R8331k33435q04761j161274q17165k8966M32163K62339n9192j1347
35466h08765L28929N75153N78872L77719r1256p76805j178995p69920J97882P85773
35456g81413M60562k92349o73198n19705k35652p4640P0895K95588M98745N72787
35446f78380M96672K64855m1024j70554M0888L70326M18522J13469k25974l12295
35436B76505j57279N5521J53914O9423n4672P0140M73616P14078L87062k48992
35426A739316n39149k89742N6041J22309K5294k2239o9666j52847n9395K94357
35416A104279N38650K80134l03204o49570n20359j98033L416R1579J52837N3637
$$ plain form
35406 553366 227213 -444662 -874215 -458824 604875 1384205 1274506 693237 397821
35397 397821 406338 126082 -581968 -1151280 -1250772 -1308770 -1741837 -2224509 -2239449 -1927944
35387 -1927944 -1769306 -1670787 -1065908 105786 1128205 1355605 884560 222362 -350108
35378 -350108 -876336 -1426551 -1921280 -2194615 -2162286 -1927590 -1636557 -1212498 -481150 316649
35368 316649 517852 -94167 -738426 -495022 453124 1031983 692090 3590 -251550 2138
35358 2138 331735 417298 208263 -153750 -326642 -22995 529291 744461 489850 317101
35348 317101 609887 937321 664009 -137743 -862894 -1239447 -1517560 -1871859 -2082340 -1887327
35338 -1887327 -1336748 -687839 -145778 208500 358983 311155 99908 -175584 -400278 -618111
$$ packed form
35406E53366l26153o71875m29553M15391J063699P79330j09699n81269k95416
35397C97821Q517k80256p08050n69312r9492n7998m33067m82672j4940L11505
35387a927944J58638R8519O04879J171694J022419K27400m71045o62198n72470
35378c50108n26228n50215m94729k73335L2329K34696K91033M24059P31348P97799
35368C16649K01203o12019o44259K43404R48146N78859l39893o88500k55140K53688
35358B138L29597Q5563k09035l62013j72892L03647N52286K15170k54611j72749
35348C17101K92786L27434k73312q01752p25151l76553k78113l54299k10481J95013
35338a887327N50579O48909N42061L54278J50483m7828k11247k75492k24694k17833
$$ plain form
35328 -618111 -1040244 -1650011 -1906177 -1239575 105501 1148874 1253599 738382 236030
35319 236030 -86247 -336600 -390678 -97544 271659 300300 11924 -255934 -404147 -529574
35309 -529574 -466052 89004 989556 1671631 1830374 1651894 1342837 898380 441826 307080
35299 307080 529782 616257 111591 -828024 -1666570 -2107079 -2251710 -2265224 -2106889 -1625643
35289 -1625643 -853995 -146475 113994 29306 196564 985511 2024932 2741717 3160551
35280 3160551 3626913 3899178 3288521 1837812 588916 292707 504936 458407 215435
35271 215435 259357 419548 82995 -719773 -1307596 -1415408 -1435972 -1476429 -1039087 -23235
35261 -23235 699345 312140 -811802 -1601894 -1604686 -1240582 -987890 -919655 -954695 -990781
$$ packed form
35328f18111m22133o09767k56166O66602J345076J043373J04725n15217n02352
35319B36030l22277k50353n4078K93134L69203K8641k88376k67858j48213j25427
35309e29574O3522N55056R00552O82075J58743j78480l09057m44457m56554j34746
35299C07080K22702Q6475n04666r39615q38546m40509j44631j3514J58335M81246
35289a625643P71648P07520K60469q4688J67258P88947J039421P16785M18834
35280C160551M66362K72265o10657j450709j248896k96209K12229m6529k42972
35271B15435M3922J60191l36553q02768n87823j07812k0564m0457M37342J015852
35261b3235P22580l87205j123942p90092k792L64104K52692O8235l5040l6086
$$ plain form
35251 -990781 -780900 -188009 414945 522971 324936 538179 1235692 1527808 865236 54984
35241 54984 254605 1296070 1864093 1319993 509087 466878 1012409 1160165 514313 -361602
35231 -361602 -817034 -780643 -490008 -31042 604483 1268869 1743251 1973358 2011532 1782696
35221 1782696 1141756 217914 -498773 -594026 -197797 146080 95248 -140318 -114591 308686
35211 308686 827054 1052841 904132 661113 661324 900973 979156 577571 -46952 -322050
35201 -322050 -155739 -84270 -406112 -603429 -96447 748595 1023906 580062 193397 340061
35191 340061 551586 333208 65865 419144 1269048 1820248 1646496 1102749 760738 832383
35181 832383 1126183 1265127 982917 443820 183161 518182 1164727 1651021 1870486 1920249
$$ packed form
35251i90781K09881N92891O02954J08026j98035K13243O97513K92116o62572q10252
35241E4984J99621J041465N68023n44100q10906m2209N45531J47756o45852q75915
35231c61602m55432L6391K90635M58966O35525O64386M74382K30107L8174k28836
35221A782696o40940r23842p16687r5253L96229L43877n0832k35566K5727M23277
35211C08686N18368K25787j48709k43019K11K39649P8183m01585o24523k75098
35201c22050J66311P1469l21842j97317N06982Q45042K75311m43844l86665J46664
35191C40061K11525k18378k67343L53279Q49904N51200j73752n43747l42011P1645
35181H32383K93800J38944k82210n39097k60659L35021O46545M86294K19465M9763
$$ plain form
35171 1920249 1683882 1060745 441010 395594 894206 1312744 1259412 944454 663446 380924
35161 380924 4735 -303883 -330098 -97914 180732 300392 196520 70277 283708 844467
35151 844467 1154771 742400 151896 487890 1976431 3606737 4423393 4548287 4575581
$$ packed form
35171A920249k36367o23137o19735m5416M98612M18538n3332l14958k81008k82522
35161C80924l76189l08618k6215K32184K78646J19660j03872j26243K13431N60759
35151H44467L10304m12371n90504L35994J488541J630306Q16656J24894K7294
$$ [...]
##END NTUPLES=NMR SPECTRUM
##END=
