##TITLE=31Pdec_B3c-2101
 CDCl3, 24 sc
 21.1.2025
##JCAMPDX= 6.0         $$ Bruker NMR JCAMP-DX V2.0
##DATA TYPE= NMR SPECTRUM
##DATA CLASS= NTUPLES
##ORIGIN= UXNMR, Bruker Analytische Messtechnik GmbH
##OWNER= root
$$ XWIN-NMR		Version 3.5
$$ Tue Jan 21 18:16:05 2025 Russian Standard Time (UT+4h)  she@DPX200
##.OBSERVE FREQUENCY= 81.013821
##.OBSERVE NUCLEUS= ^31P
##.ACQUISITION MODE= SIMULTANEOUS
##.ACQUISITION SCHEME= undefined
##.AVERAGES= 24
##.DIGITISER RES= 17
##SPECTROMETER/DATA SYSTEM= spect
##.PULSE SEQUENCE= zgpg30
##.SOLVENT NAME= CDCl3
##.SHIFT REFERENCE= (INTERNAL, CDCl3, 0, 198.062)
##AUDIT TRAIL= $$ (NUMBER, WHEN, WHO, WHERE, WHAT)
$$ ##TITLE= Audit trail, XWIN-NMR		Version 3.5
$$ ##JCAMPDX= 5.01
$$ ##ORIGIN= Bruker BioSpin GmbH
$$ ##OWNER= she
$$ F:/spectra/data/she/nmr/P31/2/pdata/1/auditp.txt
$$ ##AUDIT TRAIL=  $$ (NUMBER, WHEN, WHO, WHERE, WHAT)
(   1,<2025-01-21 18:15:07.70 +0400>,<she>,<DPX200>,
      <created by zg, POWCHK disabled, PULCHK disabled
       configuration hash MD5:
       00 E9 B6 7A A2 85 ED C7 34 08 36 98 17 FE 4E 26
       data hash MD5: 32K
       04 6A 37 FB DC A9 60 FE 9E 9C 9B 59 15 D1 4E 24>)
(   2,<2025-01-21 18:15:09.75 +0400>,<she>,<DPX200>,
      <Start of raw data processing
       efp BC_mod = 2 LB = 1.5 FT_mod = 6 PKNL = 1 PHC0 = 1791.691 PHC1 = 20.88631 SI = 64K 
       data hash MD5: 64K
       3F 85 BB 0C 2E 53 D9 C9 38 A4 B7 1C 23 9B FB 5E>)
(   3,<2025-01-21 18:15:31.35 +0400>,<she>,<DPX200>,
      <pk PHC0 = 30.05581 PHC1 = -70.00001 
       data hash MD5: 64K
       37 57 B1 70 BA 49 0A A1 E1 58 EB 44 15 E7 F4 0F>)
$$ ##END=
$$ 
$$ hash MD5
$$ 1A 77 79 7B 17 7F F5 0B FB CB B7 58 03 4F 1E 3C
##$RELAX= 
##$RELAX= 
##$RELAX= 
##$RELAX= 
##$RELAX= 
##$RELAX= 
##$RELAX= 
##$RELAX= 
$$ Bruker specific parameters
$$ --------------------------
##$DU= <F:/spectra>
##$EXPNO= 2
##$NAME= <P31>
##$PROCNO= 1
##$TYPE= <nmr>
##$USER= <she>
##$AMP= (0..31)
100 100 100 100 100 100 100 100 100 100 100 100 100 100 100 100 100 100 
100 100 100 100 100 100 100 100 100 100 100 100 100 100 
##$AQSEQ= 0
##$AQ_mod= 1
##$AUNM= <au_zg>
##$AUTOPOS= <>
##$BF1= 81.014009
##$BF2= 200.13
##$BF3= 200.13
##$BF4= 200.13
##$BF5= 200.13
##$BF6= 200.13
##$BF7= 200.13
##$BF8= 200.13
##$BYTORDA= 1
##$CFDGTYP= 0
##$CFRGTYP= 5
##$CHEMSTR= <none>
##$CNST= (0..31)
1 1 145 1 1 1 1 1 1 1 1 1 1 1 1 1 1 1 1 1 1 1 1 1 1 1 1 1 1 1 1 1 
##$CPDPRG= <waltz16>
##$CPDPRG1= <>
##$CPDPRG2= <waltz16>
##$CPDPRG3= <>
##$CPDPRG4= <mlev>
##$CPDPRG5= <mlev>
##$CPDPRG6= <mlev>
##$CPDPRG7= <mlev>
##$CPDPRG8= <mlev>
##$CPDPRGB= <>
##$CPDPRGT= <>
##$D= (0..31)
0 1 0 0 0 0 0 0 0 0.06 0 0.03 2e-05 3e-06 0 0 0.0002 0 0 0 0 0 0 0 0 0 
0 0 0 0 0 0 
##$DATE= 1737468906
##$DBL= (0..7)
120 120 120 11 120 120 24 19 
##$DBP= (0..7)
150 150 150 150 150 150 150 150 
##$DBP07= 0
##$DBPNAM0= <>
##$DBPNAM1= <>
##$DBPNAM2= <>
##$DBPNAM3= <>
##$DBPNAM4= <>
##$DBPNAM5= <>
##$DBPNAM6= <>
##$DBPNAM7= <>
##$DBPOAL= (0..7)
0.5 0.5 0.5 0.5 0.5 0.5 0.5 0.5 
##$DBPOFFS= (0..7)
$$ [...]
##$SUBNAM2= <"">
##$SUBNAM3= <"">
##$SUBNAM4= <"">
##$SUBNAM5= <"">
##$SUBNAM6= <"">
##$SUBNAM7= <"">
##$SUBNAM8= <"">
##$SUBNAM9= <"">
##$SW= 400.765351723535
##$SWIBOX= (0..15)
0 1 3 0 0 0 0 0 0 0 0 0 0 0 0 0 
##$SW_h= 32467.5324675325
##$TD= 32768
##$TD0= 1
##$TE= 0
##$TE2= 300
##$TE3= 300
##$TEG= 300
##$TL= (0..7)
0 120 53 12 22 120 120 120 
##$TP= (0..7)
150 150 150 150 150 150 150 150 
##$TP07= 0
##$TPNAME0= <>
##$TPNAME1= <>
##$TPNAME2= <>
##$TPNAME3= <>
##$TPNAME4= <>
##$TPNAME5= <>
##$TPNAME6= <>
##$TPNAME7= <>
##$TPOAL= (0..7)
0.5 0.5 0.5 0.5 0.5 0.5 0.5 0.5 
##$TPOFFS= (0..7)
0 0 0 0 0 0 0 0 
##$TUNHIN= 0
##$TUNHOUT= 0
##$TUNXOUT= 0
##$USERA1= <user>
##$USERA2= <user>
##$USERA3= <user>
##$USERA4= <user>
##$USERA5= <user>
##$V9= 5
##$VALIST= <valist>
##$VCLIST= <CCCCCCCCCCCCCCC>
##$VD= 0
##$VDLIST= <DDDDDDDDDDDDDDD>
##$VPLIST= <PPPPPPPPPPPPPPP>
##$VTLIST= <TTTTTTTTTTTTTTT>
##$WBST= 1024
##$WBSW= 4
##$XGAIN= (0..3)
0 0 0 0 
##$XL= 0
##$YL= 0
##$YMAX_a= 17482
##$YMIN_a= -3874
##$ZGOPTNS= <>
##$ZL1= 120
##$ZL2= 120
##$ZL3= 120
##$ZL4= 120
##$ABSF1= 0
##$ABSF2= 0
##$ABSG= 0
##$ABSL= 0
##$ALPHA= 0
##$AQORDER= 0
##$ASSFAC= 0
##$ASSFACI= 0
##$ASSFACX= 0
##$ASSWID= 0
##$AUNMP= <proc_1d>
##$AZFE= 0.1
##$AZFW= 0.5
##$BCFW= 0
##$BC_mod= 2
##$BYTORDP= 0
##$COROFFS= 0
##$CY= -3
##$DATMOD= 1
##$DC= 0
##$DFILT= <>
##$DTYPP= 0
##$F1P= 0
##$F2P= 0
##$FCOR= 1
##$FTSIZE= 65536
##$FT_mod= 6
##$GAMMA= 0
##$GB= 0
##$INTBC= 1
##$INTSCL= 9.790993e-09
##$ISEN= 30
##$LB= 1.5
##$LEV0= 0
##$LPBIN= 0
##$MAXI= 10000
##$MC2= 0
##$MEAN= 0
##$ME_mod= 0
##$MI= 50
##$NCOEF= 0
##$NC_proc= -8
##$NLEV= 6
##$NOISF1= 182.463
##$NOISF2= 159.3651
##$NSP= 0
##$NTH_PI= 0
##$NZP= 0
##$OFFSET= 198.0616
##$PC= 4
##$PHC0= 1821.747
##$PHC1= -49.1137
##$PH_mod= 1
##$PKNL= yes
##$PPARMOD= 0
##$PSCAL= 0
##$PSIGN= 0
##$REVERSE= no
##$SF= 81.0140089999434
##$SI= 65536
##$SIGF1= 159.3651
##$SIGF2= -187.1042
##$SINO= 113.3802
##$SIOLD= 16384
##$SREGLST= <1H.CDCl3>
##$SSB= 0
##$STSI= 65536
##$STSR= 0
##$SW_p= 32467.5324675325
##$SYMM= 0
##$S_DEV= 0
##$TDeff= 32768
##$TDoff= 0
##$TI= <>
##$TILT= no
##$TM1= 0
##$TM2= 0
##$TOPLEV= 0
##$USERP1= <user>
##$USERP2= <user>
##$USERP3= <user>
##$USERP4= <user>
##$USERP5= <user>
##$WDW= 1
##$XDIM= 65536
##$YMAX_p= 410526928
##$YMIN_p= -29541408
$$ End of Bruker specific parameters
$$ ---------------------------------
##NTUPLES= NMR SPECTRUM
##VAR_NAME=  FREQUENCY,     SPECTRUM/REAL,   SPECTRUM/IMAG
##SYMBOL=    X,             R,               I
##VAR_TYPE=  INDEPENDENT,   DEPENDENT,       DEPENDENT
##VAR_FORM=  AFFN,          ASDF,            ASDF
##VAR_DIM=   65536,         65536,           65536
##UNITS=     HZ,            ARBITRARY UNITS, ARBITRARY UNITS
##FACTOR=    0.49542278885378, 1,            1
##FIRST=     16045.7642231865, 0,            0
##LAST=      -16421.768244346, 0,            0
##MIN=       -16421.768244346, -29541408,    0
##MAX=       16045.7642231865, 410526928,    0
$$ Real data points
##PAGE= N=1
##DATA TABLE= (X++(R..R)), XYDATA
$$ [...]
40513e32635l69956q19257j409778j396437n61150M63597R35996P13234J89180
40504b787206j39422K4275O47792J429713K049301K312196K062892J219102J1504
40495F830147j099954j895103k443194k552744j706149P5585J776445K329688
40487A314721J734574Q07320J86188O8659M91334J149067J185821p5817k206204
40478D655663l953647m315771k995440l65480K290593L144513J643934l37959
40470b33594n08747Q24666J288326O7052r34656k87988N94627j29864j462049
40461g82227q84117J691136L556158K912003R51797l43155p60995j168594j580702
40452C591304j342399o05283k59240n16656o51356k32546K93311M65074M10317
$$ plain form
40513 -532635 -902591 -1721848 -3131626 -4528063 -5089213 -4625616 -3689620 -2976386 -2787206
40504 -2787206 -2926628 -2902353 -2254561 -824848 1224453 3536649 5599541 6818643 6830147
40495 6830147 5730193 3835090 1391896 -1160848 -2866997 -2791412 -1014967 1314721
40487 1314721 3049295 3856615 4042803 4111462 4602796 5751863 6937684 6861867 4655663
40478 4655663 702016 -3613755 -6609195 -6974675 -4684082 -1539569 104365 -233594
40470 -233594 -742341 82325 1370651 1437703 503047 215059 809686 679822 -782227
40461 -782227 -1666344 24792 3580950 6492953 7444750 7101595 6340600 5172006 3591304
40452 3591304 2248905 1643622 1384382 867726 216370 -16176 277135 742209 1152526
40443A152526J95920o08502j962736k529699r62541J962213L636277K589112K71258
40434C743828r62376q60310r35813j545008j196789O85897K129095J178309j065805
40425A171028j852809p15299P5756q13918j740327p65051J255936J953562R74621
40416d56501L59296J409700K829587K621893P13017j247911k108858k205375k186524
40407b71676j771913k39770K131737L723296L002640K12040k623517l494979k134797
40398a466939P9313J673949K194219J880531Q77259o97406k123136k302404j006636
40389h91250N45993R26925J47010m90309j13682Q13382J421755J484276J121871
40380D965971K10054j177292k226004k159318j317124o26573j94944O02960J684266
$$ plain form
40443 1152526 1348446 739944 -1222792 -3752491 -4715032 -2752819 883458 3472570 3743828
40434 3743828 2781452 1921142 985329 -559679 -1756468 -1070571 1058524 2236833 1171028
40425 1171028 -681781 -1397080 -1321324 -2135242 -3875569 -4640620 -3384684 -1431122 -456501
40416 -456501 -97205 1312495 4142082 6763975 7476992 6229081 4120223 1914848 -271676
40407 -271676 -2043589 -2283359 -151622 3571674 6574314 6786354 4162837 667858 -1466939
40398 -1466939 -1387626 286323 2480542 4361073 5238332 4540926 2417790 115386 -891250
40389 -891250 -345257 581668 728678 238369 124687 938069 2359824 3844100 4965971
40380 4965971 5176025 3998733 1772729 -386589 -1703713 -2330286 -2525230 -1922270 -238004
40371b38004K044358J310032M88989N91118J277060J488424P69517o33137k310061
40362D788296l593407l546850j990142j67040N40515L49399O15822J769452K711471
40353A477516K417978J229441J63469l60337o10071p92751p42637k76133M12520
40344B918995P76317M10144m23068j006479j087308j161581j448611j165339L10614
40335a876316J943569J954505L33536q41481j35561J304755J389739j94948j952733
40326A925065k675775k390655j448791O5774J761606K731589K432083J289236
40318C690132J47480m59594l59936L22048R69945P81856k90465j358822j769258
40309A673386j912812k257262k142456n82529J903032L433325L021093J664474
$$ plain form
40371 -238004 1806354 3116386 3605375 4196493 5473553 6961977 7731494 7098357 4788296
40362 4788296 1194889 -2351961 -4342103 -4509143 -3968628 -3619229 -3003407 -1233955 1477516
40353 1477516 3895494 5124935 5288404 4928067 4317996 3525245 2782608 2506475 2918995
40344 2918995 3695312 4105456 3682388 2675909 1588601 427020 -1021591 -2186930 -1876316
40335 -1876316 67253 2021758 2355294 1513813 1378252 2683007 4072746 3877798 1925065
40326 1925065 -750710 -3141365 -4590156 -4524382 -2762776 -31187 2400896 3690132
40318 3690132 3837612 3378018 3018082 3340130 4310075 5091931 4801466 3442644 1673386
40309 1673386 -239426 -2496688 -4639144 -5221673 -3318641 114684 3135777 4800251
40301D800251P02968J07245p35597j420511j049718j3979K04959p75981j513902
40292C05735p78796O58391J071390j2810j464513k065022j629597p40198M2201
40283d613219N97665J108848J530373J350221L31016o04699j03233J693211K874724
40274D164907K069034K10266q25856o21685k17379k91605n53148o47432n10957
40265B776145j1109O73847N86662q02352k100883j263207J460672L381572K645990
40256G347337K71893j616938k160751j663881o31894K2826q11532k642672k924686
40247d810298j11771L588153M379336J546796j809252k770656j597098k72758
40239a857548K74006M18598M17509J38144j08403L35474J322451J653770M95597
$$ plain form
40301 4800251 5503219 5610464 4874867 3454356 2404638 2390659 2595618 1819637 305735
40292 305735 -473061 185330 1256720 1243910 -220603 -2285625 -3915222 -4655420 -4613219
40283 -4613219 -4015554 -2906706 -1376333 -26112 304904 -299795 -403028 1290183 4164907
40274 4164907 6233941 6444207 5618351 4996666 4779287 4487682 3934534 3287102 2776145
40265 2776145 2765036 3438883 4025545 3223193 1122310 -140897 1319775 4701347 7347337
40256 7347337 7619230 6002292 3841541 2177660 1545766 1568592 757060 -1885612 -4810298
40247 -4810298 -4922069 -1333916 3045420 4592216 2782964 12308 -1584790 -1857548
40239 -1857548 -1583542 -1164944 -747435 -609291 -717694 -382220 940231 2594001 3089598
40230C089598j336372k104081j145360M17087J195047J152599J093124J070653
40222C432295M53456m86843m40828Q86511J805049Q06858j122234j701645m92011
40213C140608N83754k9779j527512k018779r40485N04048R04107L0802j211985
40204e65221j770029j273869j51083Q13723R72663J55068j121971j866984j454819
40195f262522k71168Q41499J620457K252650K416482J512449j3958q26375o82127
40186E87387r58381k297722l005939j223092K158649M352049M033083K340106
40178E986140P68398l56254j186367j567242j427880j059459o59961j80802L46463
40169F63036Q27594J169845Q63803p04327k691271k737748n9857K473506J606404
$$ plain form
40230 3089598 1753226 -350855 -1496215 -1079128 115919 1268518 2361642 3432295
40222 3432295 3885751 3398908 2958080 3844591 5649640 6456498 5334264 3632619 3140608
40213 3140608 3724362 3694583 2167071 148292 -792193 -288145 615962 646764 -565221
40204 -565221 -2335250 -3609119 -3760202 -2946479 -1973816 -1818748 -2940719 -4807703 -6262522
40195 -6262522 -6533690 -5692191 -4071734 -1819084 597398 2109847 2095889 1269514 587387
40186 587387 -370994 -2668716 -5674655 -6897747 -4739098 -387049 3646034 5986140
40178 5986140 6754538 6398284 5211917 3644675 2216795 1157336 497375 316573 663036
40169 663036 1490630 2660475 3524278 2819951 128680 -2609068 -2668925 -195419 1410985
40160A410985j600130k997793j141789J137804J438442Q74671J149137J533722
40152A805049Q72364J63019O30091J073434j79943k057250k241810r41107l51700
40143a227853r24682r99416l3705N76759K15926J7079N02389O19421N320K2676
40133a226086J361315K504857J986835O39802J22341M38125M27929k11956q78143
40124E165019j335809j684107j587093q02273j1709P9105j272N78138J200826
40115A600825N20469j191124k025882j057058M68217J068653Q51461O71731O56232
40106A563524N62279O82430J214838J348994K24035j522210k359468j869228r67411
40097a122217k20545O53533J372432P67204j244634k643600j576406J089284K775285
$$ plain form
40160 1410985 -189145 -3186938 -4328727 -3190923 -1752481 -877810 271327 1805049
40152 1805049 2677413 2840432 3470523 4543957 4364014 2306764 64954 -876153 -1227853
40143 -1227853 -2152535 -3151951 -3185656 -2608897 -2392971 -2375892 -1873503 -1254082 -1248762 -1226086
40133 -1226086 135229 2640086 4626921 5266723 5389064 5827189 6255118 6043162 5165019
40124 5165019 3829210 2145103 558010 -244263 -255972 -176867 -178139 399999 1600825
40115 1600825 2121294 930170 -1095712 -2152770 -1684553 -615900 235561 907292 1563524
40106 1563524 2125803 2808233 4023071 5372065 5596100 4073890 1714422 -154806 -1122217
40097 -1122217 -1342762 -689229 683203 1450407 205773 -2437827 -4014233 -2924949 -149664
40088a49664K316722P99930m35044j186260j639388j565461q43159Q9001Q24722
40079a788601J383921J638970J059105m24336j797538j813080l40394J417394
40071f64559K044217J299732M33627P28504J600816J089807j096956k342555n72950
40062B519683K090753J658809j978846m536379l225247k66129R37619M40218L34869
40053b024650Q38879N90194l96052p88938l16334K48241Q92329J943981K455960
40044C443610J341920l80156q85785n70938j096099j845988o01408K095532K805439
40035D306127M37490j725286r09689J245881J825263J033103P88877R53734O983
40026G962483j655136k036912p68405M39588M97841N8559j34165k73192o41589
$$ plain form
40088 -149664 2167058 2966988 2531944 1345684 -293704 -1859165 -2702324 -2613323 -1788601
40079 -1788601 -404680 1234290 2293395 1869059 71521 -1741559 -2081953 -664559
40071 -664559 1379658 2679390 3113017 3841521 5442337 6532144 5435188 3092633 2519683
40062 2519683 4610436 6269245 4290399 -245980 -3471227 -3737356 -2799737 -2359519 -2024650
40053 -2024650 -1185771 -595577 -991629 -1780567 -2096901 -1848660 -956331 987650 3443610
40044 3443610 4785530 4405374 3519589 2948651 1852552 6564 -594844 1500688 4306127
40035 4306127 4743617 3018331 2108642 3354523 5179786 6212889 7001766 7955500 7962483
40026 7962483 6307347 4270435 3502030 3941618 4439459 4498018 4363853 4090661 3449072
40017C449072j042104j225225j001742j78416P93764P61816m61908j213829j86917
40008c05489J302948J052708o38318j392547l36497Q94178Q72490K4661q49641
39999F24493j693825k138223j193579J000117K628488K432368J229415L43585
39991C232839j27128m62671j43913J082296K015037J379318k77202j387539j455435
39982C855602j064896m59535L73330O51512m53868k062235k247274p48528N27222
39973a628670K58315n06175k01277Q82162J338057Q91332M30465J83443n84063
39964A063589j876966k377190j227391N57009J347012R88106O75798J025174J302819
39955A477960P47201k14419n70839m3619P58026J263930J487824J631948J575518
$$ plain form
40017 3449072 2406968 1181743 180001 1585 795349 1557165 1095257 -118572 -305489
40008 -305489 997459 2050167 1411849 19302 -317195 576983 1449473 1474134 624493
39999 624493 -1069332 -3207555 -4401134 -3401017 -772529 1659839 2889254 3232839
39991 3232839 3105711 2643040 2499127 3581423 5596460 6975778 6698576 5311037 3855602
39982 3855602 2790706 2331171 2704501 3356013 2902145 839910 -1407364 -2155892 -1628670
39973 -1628670 -1370355 -1876530 -2077807 -1195645 142412 1033744 1464209 1647652 1063589
39964 1063589 -813377 -3190567 -4417958 -3860949 -2513937 -1525831 -850033 175141 1477960
39955 1477960 2225161 2010742 1439903 1396284 2154310 3418240 4906064 6538012 8113530
39946H113530J022746O0207o89965o66580q0001K41657j66246q80071j281714
39937E673563j391106j526065j483297q19927J66556O03377K94989l2055M0794
39928A526829K1078m93914j063850j153954q62293m02428K95357R14448O91562
39919e27165k00781l13619R42338J908147R02509j071424j667378o39592J58169
39910e08796K5409L35842J737448K621126J477860q32353k366116k450613j667214
39901a627407n42457O12349J334218J461842J364119J120171L39420o65589p53935
39892B642731J93161O63655j51237q74473k65369M72805k42628j235454j34451
39883A068740K505364L533084J810349l11110q22205o42910j059293j126106K28847
$$ plain form
39946 8113530 9136276 9196483 8506518 7839938 7759937 8001594 7835348 6955277 5673563
39937 5673563 4282457 2756392 1273095 453168 619724 1223101 1518090 1486035 1526829
39928 1526829 1547907 1053993 -9857 -1163811 -2026104 -2428532 -2133175 -1218727 -527165
39919 -527165 -727946 -1041565 -99227 1808920 2711429 1640005 -27373 -666965 -508796
39910 -508796 -483387 -147545 1589903 4211029 5688889 4856536 2490420 39807 -1627407
39901 -1627407 -2169864 -1557515 -223297 1238545 2602664 3722835 4062255 3396666 2642731
39892 2642731 2835892 3499547 3348310 2473837 2208468 2681273 2438645 1203191 1068740
39883 1068740 3574104 7107188 8917537 8606427 7784222 7141312 6082019 4955913 5184760
39874E184760J370891q0697l267857m652655k574690Q65497K827491K766719J755991
39865D195450M52916r69289j857758j516291l87213L16380K22860J51980O42430
39856A251465J021349N59469j11585K26270J327475J415587l16820k164949j940688
39847A267573Q660J151934J28017j603189j919771o57320P58008J383488J383672
39838A901072J107652O72451K94714O8413n08876j822995k922280k106085P80000
39829b535934L464833L464356R02277j535984j556771K29549J113509l63770k379928
39820H02137j921882J168260L525532K448612m48004j400770L53479J801541P12570
39811G041475j395378k010994j332187j243874j849414j397461N80953K190454
$$ plain form
39874 5184760 6555651 6474954 3207097 -1445558 -4020248 -3154751 -327260 2439459 4195450
39865 4195450 4648366 3679077 1821319 305028 -82185 234195 457055 609035 1251465
39856 1251465 2272814 2832283 2720698 2946968 4274443 5690030 5373210 3208261 1267573
39847 1267573 1276233 2428167 2556184 952995 -966776 -1624096 -866088 517400 1901072
39838 1901072 3008724 3681175 3975889 4044302 3535426 1712431 -1209849 -3315934 -2535934
39829 -2535934 928899 4393255 5295532 3759548 2202777 2432326 3545835 3182065 802137
39820 802137 -1119745 48515 3574047 6022659 5574655 4173885 4527364 6328905 7041475
39811 7041475 5646097 3635103 2302916 1059042 -790372 -2187833 -1606880 583574
39803E83574J679388m36224k254435k406144p71601J619932K994990K150384j18893
39794C040971j657739j333026j7588R18203J041309N51487k12566n01124L18587
39785B148514J332503N82457k070940m001818l028526l28357J371722J385617
39777b608828J031213R34984N57762k0261n2664J91120k31321q89254m54862O22203
39767i19908L89627j097225j243602Q65751K354318O71858k318302k884470o09614
39758d791567J603157J828030Q32034p9814m82370j54255Q33290J305439K74031
39749A167975r94325l54994J715399K402382P34151j028927r92712j47053r0408
39740B411488n75025q45450j261796j832777j224761O99012J410774o41817k774514
$$ plain form
39803 583574 2262962 1826738 -427697 -2833841 -3605442 -1985510 1009480 3159864 3040971
39794 3040971 1383232 50206 32618 950821 1992130 2543617 2331051 1829927 2148514
39785 2148514 3481017 4063474 1992534 -2009284 -5037810 -5366167 -3994445 -2608828
39777 -2608828 -1577615 -642631 -84869 -105130 -157794 33326 -197995 -1087249 -1542111 -919908
39767 -919908 -530281 -1627506 -2871108 -2005357 348961 1020819 -1297483 -4181953 -4791567
39758 -4791567 -3188410 -1360380 -528346 -608160 -1090530 -1244785 -411495 893944 1167975
39749 1167975 173650 -181344 1534055 3936437 4670588 3641661 2648949 2501896 2411488
39740 2411488 1836463 991013 -270783 -2103560 -3328321 -2629309 -1218535 -1860352 -4634866
39731d634866j594009J590672K536907N43099q65748J28741J214213O33659K76551
39722a70781J825490L178904J794584p98113j255560K79337O21738j317307l165965
39713I92327l021093j785889q43822J04135J648764K938769K752749J271120k81850
39704C775210j045597q74289n0980O63313L60641r61041k140068k134480j142248
39695c549539j05626M03792M45165L02010J95191J67133J19772J62369P01134
39686a158599J707112K221450J371821l38770j642458k148595k276457j839473
39678d103969k76331J599136J905632M43075n52844M95656K122375J986404L28565
39669C947699n01358N00450J711079J220908p57519k286913j940430k80629Q26199
$$ plain form
39731 -4634866 -6228875 -4638203 -2101296 -1558197 -2423945 -2295204 -1080991 -447332 -170781
39722 -170781 1654709 4833613 6628197 5830084 4574524 4853861 5475599 4158292 992327
39713 992327 -2028766 -3814655 -4658477 -4554342 -2905578 33191 2785940 4057060 3775210
39704 3775210 2729613 1855324 1804344 2467657 2828298 1867257 -272811 -2407291 -3549539
39695 -3549539 -3655165 -3251373 -2806208 -2504198 -2309007 -2141874 -2022102 -1859733 -1158599
39686 -1158599 548513 2769963 4141784 3803014 2160556 11961 -2264496 -4103969
39678 -4103969 -4380300 -2781164 -875532 -432457 -985301 -489645 1632730 3619134 3947699
39669 3947699 3446341 3946791 5657870 6878778 6121259 3834346 1893916 1613287 2439486
39660B439486L45620p28086p57779K98524J004850O45712k2908l53847o12371
39651B259201q08042l93507K46408j73946j460917j623496j42657O89912n49691
39642a956735j730763o03049J225586Q96553p68621o27590J454675K554551J667542
39633B112149P59902N71543n84366k833817l434071j182823J192922J139730m1834
39624b300665J44546J447908J945288J178307K2907j009613j461762n16554J348451
39615G98813J999929O97399l76074M49104J429219L05136j867752k575942j890770
39606a030938j619161j728711q71198M23946M34966l16093L82892K472938L360844
39597A509485J930713n1146r91365j215187j094275j16093J274380J307578m82746
$$ plain form
39660 2439486 2785106 2057020 1299241 1597765 2602615 3248327 3225419 2871572 2259201
39651 2259201 1451159 1057652 1304060 1130114 -330803 -1954299 -2096956 -1407044 -1956735
39642 -1956735 -3687498 -4290547 -3064961 -2168408 -2937029 -3564619 -2109944 444607 2112149
39633 2112149 2872051 3443594 2859228 25411 -3408660 -4591483 -3398561 -2258831 -2300665
39624 -2300665 -2156119 -708211 1237077 2415384 2438291 1428678 -33084 -549638 798813
39615 798813 2798742 3496141 3120067 3569171 4998390 5303526 3435774 859832 -1030938
39606 -1030938 -2650099 -4378810 -5250008 -4826062 -4391096 -4707189 -4324297 -1851359 1509485
39597 1509485 3440198 3389052 2397687 1182500 88225 -27868 1246512 2554090 2071344
39588B071344k154542j906376k00380J359330J803722J011202l40350p74812M39193
39579A308331J733650J078201p94811j328681k28320K36282o66790r31158L46229
39570G52933J182801L14727m80069L43878J284763N64534p51421q85138l53934
39561A973074k49630K92271J954298K605937K80022k728806k510100N63982K361835
39552D542883J099363q18572j265701j011474j018585n20457P24172J034010n70024
39543B195615k438363k648770j556039m57912O35264K133525L043555J961679
39535B868554o51440k728492k922539j654488j53593O40499M89713j7353J14156
39526d014983J184580K295191K338383J225757k08254j183136j451549j072309
$$ plain form
39588 2071344 -83198 -1989574 -2189954 -830624 973098 1984300 1643950 869138 1308331
39579 1308331 3041981 4120182 3325371 1996690 1768370 2004652 1337862 406704 752933
39570 752933 1935734 2250461 1770392 2114270 3399033 3963567 3212146 2327008 1973074
39561 1973074 1723444 2015715 3970013 6575950 6855972 4127166 1617066 2181048 4542883
39552 4542883 5642246 4823674 3557973 2546499 1527914 1007457 1731629 2765639 2195615
39543 2195615 -242748 -2891518 -4447557 -4905469 -4270205 -2136680 906875 2868554
39535 2868554 2217114 -511378 -3433917 -5088405 -5241998 -4601499 -4111786 -4129139 -4014983
39526 -4014983 -2830403 -535212 1803171 3028928 2820674 1637538 185989 -886320
39518h86320j68091J030660K044292K234163J373229J71811l61669l45103r34706
39509D158266k221147k401684l66585J928104J656763p90603k189980j036850
39501a263716O33607O35544l95448o17629K64840J303027J937918J942239R74969
39492E415351m49567p68468M25770J225450P6220j623986j587344k77063p2403
39483B363960j292926j688441j25262J666056J837387Q95242K90280J21200l89996
39474C677500j177818j460053j095108p55218r22012j333584j272102j65937J663015
39465b841317K741384J735905o38814j910145p00526J499678K235503J086617
39457C208285k62940n13992j16263j34220p97809j548281j846677j496388n39914
$$ plain form
39518 -886320 -1054411 -23751 2020541 4254704 5627933 5799744 5438075 5092972 4158266
39509 4158266 1937119 -464565 -831150 1096954 2753717 1963114 -226866 -1263716
39501 -1263716 -630109 5435 -390013 -1007642 -742802 560225 2498143 4440382 5415351
39492 5415351 4965784 4197316 4623086 5848536 5924756 4300770 2713426 2436363 2363960
39483 2363960 1071034 -617407 -742669 923387 2760774 3656016 3946296 4067496 3677500
39474 3677500 2499682 1039629 -55479 -810697 -1732709 -3066293 -4338395 -4504332 -2841317
39465 -2841317 -99933 1635972 997158 -912987 -1613513 -113835 2121668 3208285
39457 3208285 2945345 2431353 2315090 2180870 1383061 -165220 -2011897 -3508285 -4048199
39448d048199P48457J847907K208011J610027M21241n35271o30499p0756L63453
39439A914371L02582R5812k6950m53161j335606j851830j165150K05197R10318
39430a404417N42726n8807k25785j00875K53849J100554J869675J116024j297597
39421A795347l048455j893877J192395L043655K302143O81677k6599l21877j306540
39412B417869k192209j309074J034263K577094K096881P78536J04543j63862q90347
39403D453694j566366r42254O91232J407991K06512j500800j682089k23537J161803
39394B006186J149488R1617p65768o07128M29021J441230J456482M88673j81625
39385E508176M63633J442707P01928j868033l641734k495607J48152R82593q81968
$$ plain form
39448 -4048199 -3299742 -1451835 756176 2366203 2787444 2252173 1621674 1550918 1914371
39439 1914371 2216953 2312765 2285815 1832654 497048 -1354782 -2519932 -2314735 -1404417
39430 -1404417 -861691 -920498 -1146283 -1247158 -993309 107245 1976920 3092944 1795347
39421 1795347 -1253108 -3146985 -1954590 1089065 3391208 4072885 4046286 3724409 2417869
39412 2417869 225660 -1083414 -49151 2527943 4624824 5403360 5507903 5344041 4453694
39403 4453694 2887328 1945074 2636306 4044297 4250809 2750009 1067920 844383 2006186
39394 2006186 3155674 3247291 2481523 1874395 2303416 3744646 5201128 5689801 5508176
39385 5508176 5971809 7414516 8116444 6248411 2606677 111070 259222 1241815 359847
39376C59847k841610k204480O53261L073952L117337J179289p26952q02702R10745
39367B718687K392340J667733p87486k397601j566736M82285J532913J103062
39359E145197L73296Q6895j84557q25018j389975j310815o75084q4661j68908
39350I66370j165738k416960k435565l57531K497877L421233J275422j862368
39342g7260k748382n21545K425471L213789J519530n78021j329396r84542o22769
39333B96875m11534O8166M75455N0578q37345q88807J38607R90057R03583O37807
39323A423442Q22350P65851l2304o16055k30244N8428q71701j934504j382257
39314a996994K57066J078734J007796J517482K432291J933052M8267q69118j2828
$$ plain form
39376 359847 -2481763 -4686243 -4032982 -959030 2158307 3337596 2610644 1807942 2718687
39367 2718687 5111027 6778760 5991274 3593673 2026937 2509222 4042135 5145197
39359 5145197 5518493 5605388 5420831 4595813 3205838 1895023 1219939 1135278 966370
39350 966370 -199368 -2616328 -5051893 -5409424 -2911547 509686 1785108 -77260
39342 -77260 -2825642 -3347187 -921716 2292073 3811603 3233582 1904186 919644 296875
39333 296875 -114659 -46493 428962 479540 -357805 -1246612 -1108005 -117948 785635 1423442
39323 1423442 2245792 3011643 2979339 2363284 2133040 2191468 1319767 -614737 -1996994
39314 -1996994 -1739928 -661194 346602 1864084 4296375 6229427 6277694 5408576 5395748
39305E395748M94183n57036j201797N7983J076827o26325l408011l633697j087157
39296c489282J074346J228823Q55444J120386J098558J97613l90474J00885N38233
39287B334532j5461n30493J97525J404166J503290L72662q25013j319362j120123
39278B001723m70187J00414o7113o56798l70803R70695J476461k00431k313873
39269D70088k050175M17613K066343J271002k23856j94329J124516K078618K026813
39260F986633J335342P3466j671462k815041k265537p34145p0176o86700j073316
39251i20936k65523O15801J98247q43821o53907J057211K465677K046226N17985
39242D216960k08679N09378J350567P65153j105156k571568k332149q68535K87774
$$ plain form
39305 5395748 5889931 5332895 4131098 4189081 5265908 4639583 1231572 -2402125 -3489282
39296 -3489282 -2414936 -1186113 -330669 789717 1888275 2085888 1695414 1796299 2334532
39287 2334532 2319071 1788578 1986103 3390269 4893559 5266221 4441208 3121846 2001723
39278 2001723 1531536 1631950 1564837 908039 537236 1507931 2984392 2783961 470088
39269 470088 -1580087 -1162474 903869 2174871 1951015 1756686 2881202 4959820 6986633
39260 6986633 8321975 8395441 6723979 3908938 1643401 909256 839080 152380 -920936
39251 -920936 -1186459 -570658 -372411 -1216232 -1870139 -812928 1652749 3698975 4216960
39242 4216960 4008281 4517659 5868226 6633379 5528223 2956655 624506 -244029 43745
39233D3745L53072j32029l67035k04747J73790P27291J210363J023912Q9500o68856
39223B249006n12034o9551l89181j235766j511781j081989p68443n93609L23342
39214c590006J812307K355842J481768P32211J138261J399679J29874j592622
39206C867314j920780j298528j437552k022543j204390P95671J546692M14863
39198a259253k07592J107878K337857J394598l43093l94013O39298J71648j966221
39189A481107l208630k214284m29877O61666J392322K259718K598531J977221
39181D517774J180036P01365j79487j684479k432073j445106M3877L65643n7103
39172A010447L68206J743275K686948K514748J734665O76742p42232k041716k523425
$$ plain form
39233 43745 396817 264788 -102247 -306994 -133204 594087 1804450 2828362 2917862 2249006
39223 2249006 1736972 1667421 1278240 42474 -1469307 -2551296 -3319739 -3913348 -3590006
39214 -3590006 -1777699 578143 2059911 2792122 3930383 5330062 5459936 3867314
39206 3867314 1946534 648006 -789546 -2812089 -4016479 -3220808 -1674116 -1259253
39198 -1259253 -1466845 -358967 1978890 3373488 3030395 2636382 3275680 3447328 1481107
39189 1481107 -1727523 -3941807 -4371684 -3710018 -2317696 -57978 2540553 4517774
39181 4517774 5697810 6399175 6219688 4535209 2103136 658030 701907 1067550 1010447
39172 1010447 1378653 3121928 5808876 8323624 10058289 10735031 9992799 7951083 5427658
39163E427658k523759k835026l005042j875857J67184J292732Q62153K08486L43655
39154a937816O93907P64799J198363K145051K254707N97008j673519k768102k319646
39145a045248j076008K11265P06152k07072j486102r53152J500844L085700K027026
39136B763405K30775k7684J42818j299898l045267k310366R3100O33008j220401
39127d040510k146380l26787K084485K773390K114558J054164n53382k066642
39119a107104j690643K91654Q90499j099259k848532j830699M18973J295628J151076
39110d528407J492305J604889K35368j244889p05923J090582J828072J353324
39102A125321R91916M63349j153882k432582j178925J569767K619903J359672
$$ plain form
39163 5427658 2903899 68873 -2936169 -4812026 -4644842 -3352110 -2489957 -2281471 -1937816
39154 -1937816 -1243909 -479110 719253 2864304 5119011 5716019 4042500 1274398 -1045248
39145 -1045248 -2121256 -1909991 -1203839 -1410911 -2897013 -3850165 -2349321 736379 2763405
39136 2763405 2994180 2966496 3109314 1809416 -1235851 -3546217 -3453117 -2820109 -4040510
39127 -4040510 -6186890 -6513677 -4429192 -1655802 458756 1512920 959538 -1107104
39119 -1107104 -2797747 -2506093 -1615594 -2714853 -5563385 -7394084 -6975111 -5679483 -4528407
39110 -4528407 -3036102 -1431213 -1195845 -2440734 -3146657 -2056075 -228003 1125321
39102 1125321 2117237 2580586 1426704 -1005878 -2184803 -615036 2004867 3364539
39094C364539N7317k39172n34785p56887L82082K042371J584279r91203k565889
39085B342652j843862j121432j837659k068431l26991J562189J673580J064297
39077e55657J215836J160032j56337j119988m4971J498392J028657p61603j342238
39068I22123m93184J9540k2049O45633J550683O10251k149493l813042k423358
39059e152896M90153K228556K183092J722674J875815K191639J614976r1336j939909
39050E122764k790785k619593k156259j485375j63769J229809J306185J68177
39042a388846k94768O52843J268108K83398q23136m02828L99333l07947j695029
39033b308872j659638o70253r66564k339602j999418R86806M052198M739504L509716
$$ plain form
39094 3364539 3421856 3182684 2647899 1891012 2273094 4315465 5899744 4908541 2342652
39085 2342652 498790 -622642 -2460301 -4528732 -4855723 -3293534 -1619954 -555657
39077 -555657 660179 1820211 1663874 543886 498915 1997307 3025964 2264361 922123
39068 922123 428939 448479 426430 1072063 2622746 3232997 1083504 -2729538 -5152896
39059 -5152896 -4662743 -2434187 -251095 1471579 3347394 5539033 7154009 7062673 5122764
39050 5122764 2331979 -287614 -2443873 -3929248 -4093017 -2863208 -1557023 -1388846
39042 -1388846 -1683614 -1030771 237337 520735 -302401 -705229 -305896 -613843 -2308872
39033 -2308872 -3968510 -4638763 -5605327 -7944929 -9944347 -8957541 -4905343 -165839 3343877
39024C343877K006363P07241m90260j082275o76739J68048O78259N90465j56707
39015E088272j325455j846103q34383O54899N68755j067451j869475n94622R67271
39006b58292P27263p47425j455169q59180L06M38583O55909P92363P39622O96958
38996G30938R48013J225468J019542L42024l80223r11495j167225q42305K99660
38987A264397J780387K487881J625956l81075k008422j981724o62001L52460K17828
38978B695687k91552l35457l30082p36822o73563O64523K023438J472040o77428
38969C810784k331708k661151k438517j566927R11553L862773M092471P10939
38961D390217k969772l578070j703274n4515M58550O91318Q19471K78428o22306
$$ plain form
39024 3343877 5350240 6057481 5567221 4484946 3808207 3976255 4654514 5244979 5088272
39015 5088272 3762817 1916714 1082331 1737230 2305985 1238534 -630941 -1225563 -258292
39006 -258292 468971 -278454 -1733623 -2592803 -2592497 -2153914 -1498005 -705642 33980 730938
38996 730938 1678951 2904419 3923961 4265985 3885762 2974267 1807042 964737 1264397
38987 1264397 3044784 5532665 7158621 6777546 4769124 2787400 2125399 2477859 2695687
38978 2695687 2404135 2068678 1738596 1001774 328211 992734 3016172 4488212 3810784
38969 3810784 1479076 -1182075 -3620592 -5187519 -4275966 -413193 3679278 4390217
38961 4390217 1420445 -2157625 -3860899 -3915414 -3456864 -2765546 -1946075 -1667647 -2289953
38952b289953r62104n88789J62947J334064K583028K641436J122847j99032K70417
38943D074861J331212P45496j232065k345529j838417j120415j114885j219765
38935b719507j005288q10635m26517P57152J990212J652511k3146q73432j73164
38926a631814J54028j122266k142441p45836J941143K932051J567802O8096P7946
38917A098709P22932N82395q7249j65757K89964J32319r57964j808199j399929
38908a592779l50168K131m93869p86071l49129K49550P03298J537733K655118
38899A575814K657922Q48171j160827j383695k70679J67541m70508p36451j82176
38890A045112j72824j262275j900053r29528L95899M31221k04867J61098J259829
$$ plain form
38952 -2289953 -3252057 -3840846 -3677899 -2343835 239193 2880629 4003476 3804444 4074861
38943 4074861 5406073 6151569 4919504 2573975 735558 -384857 -1499742 -2719507
38935 -2719507 -3724795 -4535430 -4961947 -4204795 -2214583 -562072 -585218 -1458650 -1631814
38926 -1631814 -1477786 -2600052 -4742493 -5488329 -3547186 -615135 952667 1020763 1098709
38917 1098709 1821641 2404036 2316787 2151030 2440994 2573313 1615349 -192850 -1592779
38908 -1592779 -1942947 -1940816 -2434685 -3220756 -3569885 -3320335 -2617037 -1079304 1575814
38899 1575814 4233736 5081907 3921080 2537385 2266706 2434247 1963739 1227288 1045112
38890 1045112 872288 -389987 -2290040 -3219568 -2823669 -2392448 -2597315 -2436217 -1176388
38881a176388J139635p35050k517671k509909j168761J04906R80045J951871K816774
38872a114548K681144J468366L27633J00863J67531m59095j407521j362624j45139
38863B56610P74229K93675p84986j042299m67701j16941k64011j97758K67218
38854a281964M27326J03607J84513J141910J976020J501593J13959o27348j7372
38845C522244R15405O96850q29043k315512k456772j431623m65460r8288L48471
38836b113728J277442J751654Q78017m34092m58771Q25926J650143J032712K9639
38827D438942o7425N26779R01533R02295Q12199L83950p54336k130105k729405
38818B284427k100625o53840Q39710J653250J442378O06179p9598m42267r21291
$$ plain form
38881 -1176388 -36753 -771803 -3289474 -5799383 -6968144 -6863238 -5883193 -3931322 -1114548
38872 -1114548 1566596 3034962 3362595 3463458 3630989 3171894 1764373 401749 256610
38863 256610 1030839 1324514 539528 -502771 -970472 -1087413 -1351424 -1549182 -1281964
38854 -1281964 -854638 -751031 -566518 575392 2551412 4053005 4166964 3539616 3522244
38845 3522244 4437649 5134499 4305456 1989944 -466828 -1898451 -2363911 -2462199 -2113728
38836 -2113728 -836286 915368 1793385 1359293 900522 1726448 3376591 4409303 4438942
38827 4438942 4371517 4898296 5799829 6702124 7514323 7898273 7143937 5013832 2284427
38818 2284427 183802 -470038 369672 2022922 3465300 4071479 3991881 3549614 2628323
38809B628323j373879q44571Q50725K264017J984785M68434p73512j152463j075807
38800B976052o58818K42259R81189N81329o15729j053746q2881J102334J128972
38791D600961J44211p24405q68453m86621J17120P81784J185980Q97991q0895
38782E567673j015142r12200M72162K095108K493382J443744K94234J76574M45155
38773A1060690k53434j761304k474012j662286m77317j99662n81872o27580j11499
38764B911724N41359J173190J689519J450283K590j757948k260509j206471P5127
38755B618864M24721J33956N6967K41251J04409m79225r67707r29779n46323k74450
38745C82684k61282j91734K68095Q72746R02355J70292m07689P2721J038305J100626
$$ plain form
38809 2628323 1254444 409873 1260598 3524615 5509400 5977834 5204322 4051859 2976052
38800 2976052 2317234 2559493 3540682 4122011 3506282 2452536 2369655 3471989 4600961
38791 4600961 4745172 4020767 3152314 2665693 2782813 3564597 4750577 5648568 5567673
38782 5567673 4552531 3640331 4112493 6207601 8700983 10144727 10438961 10615535 11060690
38773 11060690 10807256 9045952 6571940 4909654 4432337 4232675 3650803 3023223 2911724
38764 2911724 3453083 4626273 6315792 7766075 7768665 6010717 3750208 2543737 2618864
38755 2618864 3043585 3177541 3234508 3475759 3580168 3100943 2133236 1203457 657134 382684
38745 382684 121402 -70332 197763 1070509 1972864 2143156 1735467 1808188 2846493 3947119
38735C947119K09547j97203L70627M98349n63257j066707N20063K296410J239078
38726G254026j744863k371531P69112L765311K866882l89297j993723j204545
38718F951372m13120o72773p70620l23109n05067j380403j421895l81298J8278
38709A101365p89319r40670O28122J980276J035511j153250j996951j005198J31142
38700a008972K55588k57957p00784o86706n503R44771J084882J31429n65510J07385
38690g01377J161964J029460J58220K22390J188392J244376k62568j743356j705455
38681E92046o08178K55690M81431M52989M32043L92839K34729j58290o77915q86495
38671E10889o55388n48520q42704p38317L58656J374987R07325l80569n08089
$$ plain form
38735 3947119 4156666 3959463 4330090 4828439 4265182 3198475 3718538 6014948 7254026
38726 7254026 5509163 3137632 3906744 7672055 10538937 10149640 8155917 6951372
38718 6951372 6538252 5865479 5094859 4771750 4266683 2886280 1464385 1083087 1101365
38709 1101365 312046 -628624 -502 1979774 3015285 1862035 -134916 -1140114 -1008972
38700 -1008972 -753384 -1011341 -1712125 -2398831 -2404334 -1459563 -374681 -243252 -808762 -701377
38690 -701377 460587 1490047 1648267 1870657 3059049 4303425 4040857 2297501 592046
38681 592046 -16132 239558 720989 1173978 1606021 1998860 2233589 2075299 1397384 510889
38671 510889 -144499 -693019 -1535723 -2274040 -1915384 -540397 366928 -13641 -521730
38662e21730P66708J605248J024579J31794j30663m11313j184359j478886o20622
38653h19244M06259O69214Q21791J502232J736725O46606o47215p86607o15002
38644B914759j580821k657999j551269J318847K793842J363741q40492j273125
38636D87483j39649P47538N75719k54121j190081j562716o42953J124233J910719
38627A056172P82847o85533m64922J007302J585209O59243k14435m0765J06244
38618C791362r38905k406856k722415j762604p17091j45591N40051J649582K415664
38609b96803K048490Q37884l16236r83825j273010j138592k87808J120136K105637
38600A815873J574538m89914k633285l051361j402251O89668J377621P01337L18064
$$ plain form
38662 -521730 244978 1850226 2874805 3006599 2875936 2464623 1280264 -198622 -819244
38653 -819244 -412985 256229 1078020 2580252 4316977 4963583 4316368 3529761 2914759
38644 2914759 1333938 -1324061 -2875330 -1556483 1237359 2601100 1760608 487483
38636 487483 347834 1095372 1671091 1416970 226889 -1335827 -1978780 -854547 1056172
38627 1056172 1839019 1153486 688564 1695866 3281075 3940318 3725883 3685118 3791362
38618 3791362 2852457 445601 -2276814 -4039418 -4756509 -4902100 -4362049 -2712467 -296803
38609 -296803 1751687 2589571 2273335 1289510 16500 -1122092 -1409900 -289764 1815873
38600 1815873 3390411 2900497 267212 -2784149 -4186400 -3496732 -2119111 -1417774 -1099710
38591a099710J154810K235956K197445J057941j82458r43791j249975j162280
38583B007938r16051j008675j238898m63622J472840K522082R73838j498723j716858
38574A33871L08662J359334J00418r38420J67174J377708K42653j668965j120195
38565c7760J513885K789926J425358l74426q96055j058503j867974k491409k014718
38556c011676r68400K93J087558J971092J436402m16996j429379k90551J404150
38547b17507J559266N72798J57995M05355O7834r05329j125215M0138J536484
38538B091819J978991R80475p15890j720979j101803L18952N66518p76012j603394
38529A8677k78614J628207J410758q16335k352157j758172l69898J18305l08771
$$ plain form
38591 -1099710 55100 2291056 4488501 5546442 5363984 4420193 3170218 2007938
38583 2007938 1091887 83212 -1155686 -1619308 -146468 2375614 3349452 1850729 133871
38574 133871 442533 1801867 1902285 963865 1131039 2508747 2751400 1082435 -37760
38565 -37760 1476125 4266051 5691409 5316983 4420928 3362425 1494451 -996958 -3011676
38556 -3011676 -3980076 -3979783 -2892225 -921133 515269 98273 -1331106 -1621657 -217507
38547 -217507 1341759 1914557 2072552 2477907 2545741 1640412 515197 555335 2091819
38538 2091819 4070810 5051285 4335395 2614416 1512613 1831565 2398083 1622071 18677
38529 18677 -259937 1368270 2779028 1962693 -389464 -2147636 -2517534 -2399229 -2708000
38520b708000p22299n16840L80125J378527J330627O094q86681K17326K015626
38511D94505J791441m93385j946044r29600R54899J785539J733673J449983M74000
38502E315011j155476j829604p60757L44199j03616r62691m32811P87679P59263
38493A961197m54631j205044j032367o47750P7624J555691K451866R76354j828849
38484A854091k789905j003630R13226O88211p12182j086930r8864Q54322O95004
38475f86657l71791j202590o15254J259127K526311J518137r17040k458619k395608
38466c343984j953307j737498r97588L69746J335275J717356K360258K769729
38458E19987J188913j914287l180165r15214K082365K357476M18126p79480j91811
$$ plain form
38520 -2708000 -3430299 -3947139 -3567014 -2188487 -857860 -851766 -1738447 -1521121 494505
38511 494505 2285946 1792561 -153483 -1083083 -128184 1657355 3391028 4841011 5315011
38502 5315011 4159535 2329931 1569174 1913373 1809757 847066 414255 1201934 1961197
38493 1961197 1506566 301522 -730845 -1378595 -1300971 254720 2706586 3682940 1854091
38484 1854091 -935814 -1939444 -1026218 -338007 -1050189 -2137119 -2235983 -1381661 -686657
38475 -686657 -1058448 -2261038 -2876292 -1617165 909146 2427283 1510243 -948376 -3343984
38466 -3343984 -5297291 -7034789 -8032377 -7662631 -6327356 -4610000 -2249742 519987
38458 519987 1708900 -205387 -3385552 -4300766 -2218401 139075 557201 -222279 -414090
38449d14090J008779K094495L058000L159466J785020J42795k59911k13693j457337
38440H903524l289478l229646r68287R85206R13582k14940r28930j108368r68384
38431I4279j76386J097842J757687J187016o8112j374213k503744k891134j892728
38422d769493q7850J098516J290446J278275J274497P83265K22196O37392J562808
38413C290052J340654k1481o75155k14078m86946k062320k654084p90599J474986
38404g98971J683554O01349K92228N19526q4512p91509Q6245J713403J633787
38395D855100j08357q61608L67484J438872N99131j049739j672217j223650o44980
38386A700036j87650K21916K22098k43516m28131L6145L86608p557n72325n71154
$$ plain form
38449 -414090 594689 2689184 5747184 8906650 10691670 10834465 10574554 10360861 8903524
38440 8903524 5614046 2384400 1416113 2401319 3314901 3099961 2171031 1062663 94279
38431 94279 -82107 1015735 2773422 3960438 3892326 2518113 14369 -2876765 -4769493
38422 -4769493 -4857343 -3758827 -2468381 -1190106 84391 867656 1089852 1727244 3290052
38413 3290052 4630706 4609225 3934070 3719992 3233046 1170726 -1483358 -2273957 -798971
38404 -798971 884583 1485932 1778160 2297686 2213174 1421665 1507910 3221313 4855100
38395 4855100 4746743 3885135 4252619 5691491 6290622 5240883 3568666 2345016 1700036
38386 1700036 1512386 1734302 1956400 1712884 1284753 1320898 1707506 1699949 1127624 556470
38376E56470k95967k86884k44799K12573N08477R8361r9925J169292L060218K966695
38366G644511j12608l807438m944713l109106n53071R27781J571525K010963J723765
38357A351609K32504j240382r88590N90003J291869K41908q59860l09967J232097
38348A541191K057230J908896J724836J651689R53722l63609j370644j715016
38340F388295j957873k198489j672444k18120R98286R95051L88984L90114Q96695
38331D010499O73054n57883j264997j02162J781853J689403r78826l247993k031832
38322b8884J627625L633523K140011l47554r28855j47310j76092r78839q07386
38313C986239L28718M33991j103253k292798j466489L53186J041889J71304q14436
$$ plain form
38376 556470 260503 -26381 -271180 -58607 449870 548231 448306 1617598 4677816 7644511
38366 7644511 7531903 3724465 -1220248 -4329354 -4882425 -3954644 -2383119 -372156 1351609
38357 1351609 1584113 343731 -644859 -54856 1237013 1478921 619061 309094 1541191
38348 1541191 3598421 5507317 7232153 8883842 9837564 9473955 8103311 6388295
38340 6388295 4430422 2231933 559489 341369 1339655 2334706 2723690 3113804 4010499
38331 4010499 4683553 4125670 2860673 2758511 4540364 6229767 5250941 2002948 -28884
38322 -28884 1598741 5232264 7372275 7024721 6095866 5948556 5772464 4793625 3986239
38313 3986239 4314957 4748948 3645695 1352897 -113592 239594 1281483 1452787 638351
38304F38351o55740K63136M97449n44177j472470m82375J756625K256692j65144
38295B092347k571634j732594J087463J961589J61894j155291k01351J074072
38287G16495Q81336M72705J266238J937200P87749j110365j680692j189810j341632
38278G39224k162548k185260j009160M08850J405175J752686R61548o86935j287663
38269b064083L91338K488573K205400j34779j590774r11498J88514K14842j32229
38260F55304J86878Q21421J005026O35003k64041j628784k422332j294378J150930
38251a154973K370181J008974j390870k598484k215875j164843p6233P41475Q95968
38242c584680N65626O56983J450898K033008J802921J404915J313485P91114n97417
$$ plain form
38304 638351 -17389 245747 743196 199019 -1273451 -1755826 799 2257491 2092347
38295 2092347 -479287 -2211881 -1124418 837171 999065 -156226 -357577 716495
38287 716495 1597831 2070536 3336774 5273974 6061723 4951358 3270666 2080856 739224
38278 739224 -1423324 -3608584 -4617744 -4208894 -2803719 -1051033 -89485 -776420 -2064083
38269 -2064083 -1672745 815828 3021228 2886449 1295675 384177 572691 787533 655304
38260 655304 842182 1663603 2668629 3303632 3039591 1410807 -1011525 -2305903 -1154973
38251 -1154973 1215208 2224182 833312 -1765172 -3981047 -5145890 -5222123 -4480648 -3584680
38242 -3584680 -3019054 -2362071 -911173 1121835 2924756 4329671 5643156 6434270 5836853
38233E836853j661380j214037p6656P0131q53636j485941j069720R0566J646073
38224A282253L097306L127893Q62227k249578l525697k268240l74237M98618P32621
38215A183166J184721J491213J013385K67680J52352M64023L32545l10029p38586
38206E040470o86341o57773r78283j216521p05429O71258K201765K759288J807229
38197H235663J24529r84428j363209k029928l090220k855736l13154K468621K353992
38188B546130n59508k678006j500933J353619K735191J933905N23440n09237j430271
38179B414330k065182j548622q614J182809J323396J156994J241713R63693m6119
38170D614398q44441o40423k63977q22323j646403j151802N29529J391966L15843
$$ plain form
38233 5836853 4175473 2961436 2884780 2954911 2101275 615334 -454386 -363820 1282253
38224 1282253 4379559 7507452 8369679 6120101 2594404 326164 -48073 450545 1183166
38215 1183166 2367887 3859100 4872485 5140165 5292517 5756540 6089085 5779056 5040470
38206 5040470 4354129 3696356 2718073 1501552 796123 1467381 3669146 6428434 8235663
38197 8235663 8360192 7375764 6012555 3982627 892407 -1963329 -2276483 192138 2546130
38188 2546130 1986622 -691384 -2192317 -838698 1896493 3830398 4353838 3844601 2414330
38179 2414330 349148 -1199474 -1208088 -25279 1298117 2455111 3696824 4660517 4614398
38170 4614398 3769957 3129534 2865557 2043234 396831 -754971 -225442 1166524 1482367
38161A482367j343985j580779k24240J179814J390932N18539o80988j620871j832957
38152b712168r23791Q00087K112200K068056J282484J122770J619462J387064
38144F756164M9809p48481Q3975R34175j58148j998464j674769Q06167K234886
38135F285314J011808p36103r64719o25680r15920n18934J664284L387768K027337
38126A0615155r33384j944664q14225k94451q91953l15694J645939J998497m42366
38117H622854k722571k311237p32656m60316j044664q50611k79148n26592r44874
38108a249815l09651P29847J008661J295891K714255L869584K515591n26600k054951
38099G992812j020181L13385K7956j055909j303611n89602J76585M42980J96537
$$ plain form
38161 1482367 138382 -1442397 -1666637 -486823 904109 1422648 741660 -879211 -2712168
38152 -2712168 -3635959 -2835872 -723672 1344384 2626868 3749638 5369100 6756164
38144 6756164 6805973 6057492 6141467 7075642 6917494 4919030 3244261 4050428 6285314
38135 6285314 7297122 6561019 5596300 4970620 4054700 3535766 5200050 8587818 10615155
38126 10615155 9681771 7737107 6922882 6628431 5736478 5420784 7066723 9065220 8622854
38117 8622854 5900283 3589046 2856390 2396074 1351410 500799 221651 -304941 -1249815
38108 -1249815 -1559466 -829619 179042 1474933 4189188 8058772 10574363 10047763 7992812
38099 7992812 6972631 7286016 7313972 6258063 4954452 4364850 4541435 4984415 5180952
38090E180952k77463m08502R6742O14014K99871p02378j548288j839451j626144
38081b10647q27226L10737Q34206L35506j81271N1516J13751p68859j207081K43905
38071a305463K038982J572043m91944j051901M17811J233924L36368l30J423075
38062D172565K222465M54998j912720k175260j072113r35380j566086j038148
38054a849679O09238J502462J148829Q27602J028259Q90552J79234k74665k21985
38045C839847k99930n80855m24654J00642J19290n61290j094622q18080J90245
38036D70593J585913K708180K457467N82469j225270j046572N93933J340817K95996
38027G763526r64932r60250k75298k75972j071888j614103j146757M0312R52025
$$ plain form
38090 5180952 4903489 4494987 4591729 5205743 5505614 4803236 3254948 1415497 -210647
38081 -210647 -1037873 -727136 107070 442576 261305 312821 426572 -342287 -1549368 -1305463
38071 -1305463 733519 2305562 1813618 761717 1179528 2413452 2749820 2749490 4172565
38062 4172565 6395030 6850028 4937308 2762048 1689935 754555 -811531 -1849679
38054 -1849679 -1240441 262021 1410850 2238452 3266711 4157263 4336497 4061832 3839847
38045 3839847 3539917 2959062 2534408 2635050 2754340 2193050 1098428 280348 470593
38036 470593 2056506 4764686 7222153 7804622 6579352 5532780 6126713 7467530 7763526
38027 7763526 6798594 5838344 5563046 5287074 4215186 2601083 1454326 1494638 2446663
38018B446663Q00517r5153n10961J06518P48457L25589n29143l24663R87194J922129
38008E877147J548684L48543r55507k062732k496985j729868k27757P48137O49687
37999A699349R36p07035j305271j228584L965J422792J269645n19946j869454
37990a233603j146434R66261K611056K637294J054006j124985k170226j126546
37982D66823O29690P45213q65562j794239o76229R19668J082643K45365o4992
37973F88380K83393K93487l75243j166176j426290n88717J456570L399937L205018
37964E770359P76630j339151j041473P77322J864736J379432k26366k490642m389489
37955A081358l958243o25410K983108L670614J537998n99827j041698n14142q2861
$$ plain form
38018 2446663 3247180 3152027 2641066 2747584 3496041 3821630 3292487 2967824 3955018 5877147
38008 5877147 7425831 7774374 6818867 4756135 2259150 529282 301525 1049662 1699349
37999 1699349 1700285 993250 -312021 -1540605 -1536640 -113848 1155797 635851 -1233603
37990 -1233603 -2380037 -1413776 1197280 3834574 4888580 3763595 1593369 466823
37982 466823 1096513 1841726 976164 -818075 -1494304 -574636 508007 753372 688380
37973 688380 971773 1265260 890017 -276159 -1702449 -2291166 -834596 2565341 5770359
37964 5770359 6546989 5207838 4166365 4943687 6808423 8187855 7961489 5470847 1081358
37955 1081358 -2876885 -3502295 -519187 3151427 4689425 4089598 3047900 2533758 2450897
37946B450897K87296J041329K265966L493684L445025R05193k987198m764317
37938F137875k798869n4566k67862k602869l102455p19783J547434J592298Q02948
37929E34151R18081J395583J284510J153440J543462J518084L57765q84160r64232
37920F856684k81236J08924J07719O8347k19230r28500j455199j204807m52099
37911B600603J55902K80945j20502o07810j34603J616929K930199J768739j174415
37902G315987l059246k705339j647009j016657O6205J996852L099666K175606
37894F226065O25154K30278M43860k53197j583395j972816j038452O4722L78075
37885C120294M5159k53155p7637L23009K52803k99073l00919N67461Q21639l79050
$$ plain form
37946 2450897 2738193 3779522 6045488 9539172 12984197 13889390 10902192 6137875
37938 6137875 3339006 3284440 3016578 413709 -2688746 -3408529 -1861095 -268797 534151
37929 534151 1452232 2847815 4132325 5285765 6829227 8347311 8705076 7820916 6856684
37920 6856684 6575448 6684372 6792091 6860438 6641208 5712708 4257509 3052702 2600603
37911 2600603 2756505 3037450 2916948 2309138 2174535 3791464 6721663 8490402 7315987
37902 7315987 4256741 1551402 -95607 -1112264 -1046059 950793 4050459 6226065
37894 6226065 6851219 7081497 7525357 7272160 5688765 3715949 2677497 2742219 3120294
37885 3120294 3165453 2912298 2834661 3157670 3410473 3111400 2810481 3377942 4199581 3820531
37875C820531r24609J297456M142860L649875L77438j070253P52907K152446O76766
37866A4875417j414640j931662k089617k611955j413733J780305L308426J527430
37858A2029971J50348J892315L759875K912259J946577L398589M484362L087922
37850C3662218L276685Q169276J3242894J4330416J5638578K0822890K4367071
37843A33510028K4490205L5183270O4980059Q8204126O4159240p827153p5927282
37836C26772493r2299493o4372784l4283473k3873623k2010638j6158469j0081617
37829F3692396q913830q024338l823839j347068m042365o614375m364150j046088
37821B5516343j460921l383705k659371n15271k59347j257209j203737p44861
$$ plain form
37875 3820531 2895922 4193378 8336238 11986113 12363551 11293298 12046205 14198651 14875417
37866 14875417 13460777 11529115 9439498 6827543 5413810 7194115 10502541 12029971
37858 12029971 12180319 14072634 17832509 20744768 22691345 26089934 30574296 33662218
37850 33662218 36938903 45108179 58351073 72681489 88320067 109142957 133510028
37843 133510028 158000233 193183503 258163562 346367688 410526928 402699775 326772493
37836 326772493 234473000 170100216 135816743 111943120 89932482 73774013 63692396
37829 63692396 54778566 46754228 42930389 41583321 37540956 30926581 26562431 25516343
37821 25516343 24055422 20671717 18012346 17497075 17237728 15980519 14776782 14031921
37813A4031921j407192j933112o07790J219284J295660N6621p09247q30284j060694
37804A0055167j256309j126252j031337p20711O50887K290096K142385M96414
37796A1500340K46886K356560M239237M086897L407725L551147L448133L216982
37788C6053907O151138J3376311J9223160J6205131L821940j0469489j8447125
37781F5914973j7460516j1004678n234589m058353n982953o445604l759271q45906
37773A1123103m23581j385097j597394j335172j525016j190079M99031J740835
37765E906630O49947j370189j650375k35126Q47703R51054Q14501M67508l34131
37756F047522p85078m68823o44319j758829j624118J010847L116990J335941k290126
$$ plain form
37813 14031921 12624729 10691617 10083827 11303111 12598771 12655392 11946145 11115861 10055167
37804 10055167 8798858 7672606 6641269 5920558 6571445 8861541 11003926 11500340
37796 11500340 11747226 14103786 18343023 22429920 25837645 29388792 32836925 36053907
37788 36053907 42205045 55581356 74804516 91009647 94831587 84362098 65914973
37781 65914973 48454457 37449779 32215190 28156837 22173884 15728280 11969009 11123103
37773 11123103 10699522 9314425 7717031 6381859 4856843 3666764 4165795 5906630
37765 5906630 6556577 5186388 3536013 3300887 4148590 5099644 5914145 6381653 6047522
37756 6047522 5262444 4793621 4149302 2390473 766355 1777202 4894192 6230133 3940007
37747C940007k769084N07528L275257L070125J938263J832491J544651j81140
37739A3158098j872198j661239k9627J489266K501290L216202L248507K245129
37731B2295428P16374m92715p43772M58489K953173N495320P072036Q128852Q936833
37722E4820018P678606K642589m125427q223388q146924o515719n777967n489515
37714B6862273m543969l361807k687274k361220k246771k426606j947457L04237
37706G591406K931709K964194L33566j521069p62421K69565n99825j672134o86231
37697H848760R05059L19982j780667k433022j150294j16715j53007J59621J272044
37688E871761J705498R23906M74501J233418J734066N53756j332507k019327j291346
$$ plain form
37747 3940007 1170923 1678451 4953708 8023833 9962096 11794587 13339238 13158098
37739 13158098 11285900 9624661 9595034 11084300 13585590 16801792 20050299 22295428
37731 22295428 23011802 22519087 21775315 22233804 25186977 30682297 37754333 45883185 54820018
37722 54820018 62498624 65141213 61015786 52792398 44645474 38129755 32351788 26862273
37714 26862273 22318304 18956497 16269223 13908003 11661232 9234626 7287169 7591406
37706 7591406 10523115 13487309 13820875 12299806 11537385 11806950 11207125 9534991 8848760
37697 8848760 9753819 10073801 8293134 5860112 4709818 4593103 4440096 4599717 5871761
37688 5871761 7577259 8501165 8975666 10209084 11943150 12496906 11164399 9145072 7853726
37679G853726l63598J49720N33887O63945r8830j546167k394642j932575r39899
37670A925567k68124N53777K088167L076525J656604j420338k914390j390563
37662C307225N70691P9446j818764j872411M81641K563711K418197Q18513p25942
37653E822307j576127j291229L36253K030014J930349L34536m96327K07437P02732
37644G999945j11875r31218n79433j4816l03487o10127R1448R89102Q47325Q0453
37634G457317j89448N1196K72468O39107J350786J824585J709408J618352J836576
37625A6570347J514427J01879j668851l001440l798521l649570j945855L13101
37617D435517J020312J02464k60818N75035O41608p05420j145384M23591J516904
$$ plain form
37679 7853726 7490128 7639848 8173735 8837680 8738850 7192683 4798041 2865466 1925567
37670 1925567 1657443 2211220 4299387 7375912 9032516 7612178 4697788 3307225
37662 3307225 3877916 3957362 2138598 266187 747828 3311539 5729736 6548249 5822307
37653 5822307 4246180 2954951 3291204 5321218 7251567 7586103 7089776 7297213 7999945
37644 7999945 7888070 6956852 6377419 6362603 6059116 5448989 5540437 6529539 7376864 7457317
37634 7457317 7267869 7319065 7591533 8230640 9581426 11406011 13115419 14733771 16570347
37625 16570347 18084774 18186653 16517802 13516362 9717841 6068271 4122416 4435517
37617 4435517 5455829 5558293 5297475 5872510 6514118 5808698 4663314 5086905 6603809
37608F603809L21907j104319p82621m82040j970344k980444j056219J574284J489890
37599A613903k41087o31401m07437j757988k835543n34631K952268K773610l99909
37590E31785j375961Q71965K240061J281011J079580K600422K936424J472777
37582A1638064J259385K745380K629676N37012J81610K208328K926581J985035
37574B6111071L559408P699191R103138P293282Q269350J2561614J3599045J3606079
37566A01802178K6049266N0302403N8274446K5952669k8960155o2246001n4970067
37559A16204739l0213000j6273361j4440810j1699419o244155m949045o853321
37552B5531628n242843j079651j038165m665641m867022k37263L006723J658462
$$ plain form
37608 6603809 6925716 5821397 5038776 4556736 2586392 -394052 -1450271 124013 1613903
37599 1613903 1372816 741415 333978 -1424010 -4259553 -4794184 -1841916 931694 531785
37590 531785 -844176 27789 2267850 3548861 4628441 7228863 10165287 11638064
37582 11638064 12897449 15642829 18272505 18809517 18991127 21199455 24126036 26111071
37574 26111071 29670479 37369670 46472808 53766090 62035440 74597054 88196099 101802178
37566 101802178 127851444 178153847 236428293 262380962 233420807 171174806 116204739
37559 116204739 85991739 69718378 55277568 43578149 37333994 32384949 25531628
37552 25531628 20288785 19209134 18170969 13505328 8638306 8401043 11407766 13066228
37544A3066228m67738k33942M63665k21065p36003M2364M72038m07968j025534
37535A0952045m75255j32284p44167j087657o86203q04353j576018j126457J085068
37526E404719K736815J915598l63838k172300k999791k856708j288876J175546
37518A551165K475821J508153k80595j065290r39728q19551o07137O2363N32617
37509B417818J41812m21899j49232P40671J457430J895363K010382J021273j214554
37500G899064k928069k360844m25401M27587k84774p36398n2458L30899n72230
37491A297376j208422J75875K410381K686971N62811j331994r23117O77618J063715
37482E411214j94395j442647j462677p53826l60607n13273p16387n05247J53604
$$ plain form
37544 13066228 12598490 12364548 12828213 12607148 11871145 11913509 12385547 11977579 10952045
37535 10952045 10476790 10344506 9600339 8512682 7826479 7022126 5446108 4319651 5404719
37526 5404719 8141534 10057132 9693294 7520994 4521203 1664495 375619 1551165
37518 1551165 4026986 5535139 5254544 4189254 3249526 2429975 1822838 1885201 2417818
37509 2417818 2559630 2137731 1988499 2729170 4186600 6081963 8092345 9113618 7899064
37500 7899064 4970995 2610151 2184750 2612337 2327563 1591165 1538707 1869606 1297376
37491 1297376 88954 264829 2675210 5362181 5924992 4592998 3669881 4347499 5411214
37482 5411214 5216819 3774172 2311495 1557669 1197062 683789 -32598 -537845 -384241
37473c84241Q12933Q58699K58483j80968J35673N46281l0828j344218j899890
37464a228076r10943Q04821K050238K400066J931717Q89132l5193j30291K57943
37455F029414J36909m35096m69712j78152j077187l102268l710977j463999J357293
37446b913775J809326M31381j39834N19479O41234l8935J31438J262559J238976
37437B941849o04607j985186j262707m7011l81958j380968r24201O90945J244387
37428a709457J26281q80204l88050Q30315J297110P65481J20595J05455O68649
37419I36175J255420J430360J225862Q90860M72582K8339P6592J027967K057679
37410I401836J592303n24346k303534j908036K6936J311287Q92017l88147j317683
$$ plain form
37473 -384241 428692 1287391 1545874 1364906 1500579 2046860 2016032 671814 -1228076
37464 -1228076 -2139019 -1334198 716040 3116106 5047823 5936955 5901762 5771471 6029414
37455 6029414 6166323 5731227 5261515 5083363 4006176 903908 -2807069 -4271068 -2913775
37446 -2913775 -1104449 -673068 -812902 -293423 347811 308876 440314 1702873 2941849
37437 2941849 2337242 352056 -910651 -957662 -1339620 -2720588 -3644789 -2953844 -1709457
37428 -1709457 -1583176 -2463380 -2851430 -2021115 -724005 41476 162071 267526 936175
37419 936175 2191595 3621955 4847817 5738677 6211259 6239598 6316190 7344157 9401836
37410 9401836 10994139 10469793 8166259 6258223 6285159 7596446 8488463 8100316 6782633
37401F782633j460443r00233J7734M94427k10865j649231k246078j013549J188227
37392A002622K555452K283115J172723L71555J4241n38552j386543j711117r85542
37383B777954N7179L49980N512p892M45265M37450l40147q59504l61647L66570
37373B870720K83989j52992K32648J264548J520575N71514j91041M95476J916525
37364H811962K275019R72936p80722j540162j134103m37719j47599k07384k41428
37355G570800r2175J10072Q1560m16379j154594j313040m26120N53085J36601
37346E049810j397657j842371j24478J711970J155082j062014j996031q96030
37338E98281j46654j351711k809384k150145K43785K024824J990418R18578l6938
$$ plain form
37401 6782633 5322190 4421957 4439691 4934118 4723253 3074022 827944 -185605 1002622
37392 1002622 3558074 5841189 7013912 7385467 7399708 6861156 5474613 3763496 2777954
37383 2777954 2835133 3185113 3190625 3182733 3627998 4065448 3725301 2865797 2504150 2870720
37373 2870720 3154709 3001717 3234365 4498913 6019488 6591002 6399961 6895437 8811962
37364 8811962 11086981 12059917 11279195 9739033 8604930 8167211 8019612 7812228 7570800
37355 7570800 7478625 7588697 7670257 7253878 6099284 4786244 4360124 4913209 5049810
37346 5049810 3652153 1809782 1685304 3397274 4552356 3490342 1494311 598281
37338 598281 451627 -900084 -3709468 -5859613 -5615828 -3591004 -1600586 -682008 -718946
37329g18946m65325m98305m18909l69444j32237L81285M84085m12337j278848
37320c428981m21448J655168K276224M41578j349117o05675J644818K754567K255658
37311E222792J502600Q02128m89678j727983j477709o2716P04126K75854k97148
37302D452266o92002j665404k907338k843710j131049O28969J255320J282163
37294a620785J363713J186954O45626M44563P99163R65909O51677M69726N27388
37285E433934J19005o53347o20522L91579Q69029j44026j551948j860148j042954
37276I40602M5471Q97216J237541Q51337J70689m2027P8135j09805p6558J269725
37266E262326L015597K637757j66108k414352j940431l36523j32684j068761j227770
$$ plain form
37329 -718946 -1184271 -1682576 -2101485 -2470929 -2603166 -2221881 -1737796 -2150133 -3428981
37320 -3428981 -3850429 -2195261 80963 522541 -826576 -1432251 212567 2967134 5222792
37311 5222792 6725392 7527520 7037842 5309859 3832150 3769434 4473560 4749414 4452266
37302 4452266 3760264 2094860 -812478 -3656188 -4787237 -4158268 -2902948 -1620785
37294 -1620785 -257072 929882 1575508 2020071 2819234 3785143 4436820 4906546 5433934
37285 5433934 5552939 4899592 4279070 4670649 5539678 5395652 3843704 1983556 940602
37276 940602 986073 1883289 3120830 3972167 4142856 4100829 4178964 4069159 3992601 5262326
37266 5262326 8277923 10915680 10749572 8335220 6394789 6058266 5925582 4856821 3629051
37257C629051l04668M32711M26734J88994Q7394J72933M64047M57847n23236j772678
37247C259129j604134m4920R99460J116808K116744M070525M087146J306478n57909
37238A4749327J129791L393508K844678J720733L496187O125245O656800R486198
37230D9602467K0265732L1831182K7525230L136751k3568549l2249299k2660360
37223E3883154j0592598o404010o864818o045741m145502l423378k963782j456505
37215A1986820n82102j944803l634364l004763p35601O64301P66013R48905J327133
37206E791539O56590r46788j527992j202K223819K982701J787452m2830j055600
37197I867689r23953l54450k12321p18793j314606j322470p67284l62029n73693
$$ plain form
37257 3629051 3324383 3757094 4183828 4372822 4460216 4633149 5097196 5555043 5031807 3259129
37247 3259129 1654995 1610075 2609535 3726343 5843087 9913612 14000758 15307236 14749327
37238 14749327 15879118 19272626 22117304 23838037 27334224 33459469 40116269 49602467
37230 49602467 69868199 101699381 129224611 132361362 108792813 76543514 53883154
37223 53883154 43290556 36886546 30021728 23975987 19830485 16407107 13443325 11986820
37215 11986820 11404718 9459915 5825551 2820788 2085187 2749488 3515501 4464406 5791539
37206 5791539 6448129 5501341 3973349 3972147 6195966 9178667 10966119 10923289 9867689
37197 9867689 8943736 8589286 8376965 7658172 6343566 5021096 4253812 3891783 3318090
37188C318090r72837q27902j31155M83719P54966R98310J173649O75739m15734
37179E056845q11133L16244J834062J981038O92275o60355j415783j999154k377970
37170B616069j896328q10409k44925k25227M71710J887386K194443N08042j331023
37161C169738j200440M48949J669639J751085J289650N74175l50486p79502k62707
37152F310101J52711o91376j942099j813779m29655L60050r5124n19396j43699
37143A187734J56135j86735j70906J010845K349021K380667J227139J26693l86612
37134G693981p52920j277728j750563j969876j852138j162844J26750J270128
37126C24790J282186K57473m15345M27136K244421L261453K409815M47642r79172
$$ plain form
37188 3318090 2345253 1517351 1386196 1869915 2624881 3623191 4796840 5472579 5056845
37179 5056845 4245712 4561956 6396018 8377056 9069331 8408976 6993193 4994039 2616069
37170 2616069 719741 -90668 -335593 -560820 -89110 1798276 3992719 4500761 3169738
37161 3169738 1969298 2418247 4087886 5838971 7128621 7702796 7352310 6572808 6310101
37152 6310101 6462812 5771436 3829337 2015558 1585903 1945953 1850829 1331433 1187734
37143 1187734 1343869 1157134 986228 1997073 4346094 6726761 7953900 8080593 7693981
37134 7693981 6941061 5663333 3912770 1942894 90756 -1072088 -945338 324790
37126 324790 1606976 1864449 1449104 1876240 4120661 7382114 9791929 10239571 9260399
37117I260399j044333k30214N25875O08345j81966j574597k737146k859358k035180
37108b68175j040577j89608Q15958J769942J761549O25997l99292k64600M79864
37099C291058P76098Q07505J510722K778156L297579K119532l57972k789658l756210
37090G676810k758622r74182l33182j075770j129259R80812L581033L818330J508867
37081A1294837q42593j552409j290962j059607p23571j70666j39120r32221j590472
37072B993216j206026m1248J273383K504308L110484K059137o03443k958594l134770
37063C996447j432923L68314J211006J281547Q55438j68904j525001k263644j624869
37054F97411K530J243469R97148m14053j594320j728986j395453j303796r94811
$$ plain form
37117 9260399 8216066 7985852 8511727 9120072 8938106 7363509 4626363 1767005 -268175
37108 -268175 -1308752 -1498360 -682402 1087540 2849089 3475086 3075794 2811194 3291058
37099 3291058 4067156 4874661 6385383 9163539 12461118 14580650 14222678 11433020 7676810
37090 7676810 4918188 3944006 3610824 2535054 1405795 2386607 5967640 9785970 11294837
37081 11294837 10452244 8899835 7608873 6549266 5825695 5655029 5515909 4583688 2993216
37072 2993216 1787190 1745942 3019325 5523633 8634117 10693254 10089811 7131217 3996447
37063 3996447 2563524 2931838 4142844 5424391 6279829 6110925 4585924 2322280 697411
37054 697411 699941 1943410 2940558 2526505 932185 -796801 -2192254 -3496050 -4490861
37045d490861J97859J505105J518761M29779j32737M07191R28860Q14988R80715
37036B159660J902750K304720J008344j177795k612008k790738k082327o42160
37028a929554J126855K043158J465577L61721j60484m51435j108771j290362q9829
37019c3124J251118P29653j147211j774951k91597J224204J000474o2017l48400
37010E48149p6676l29044p30846O5876J941125K973673J869444l00149j311468
37001D650084k33498J798737L014457K729388J547422K68913q69861j864472k461582
36992H579588k440656k043343j644740j197337m75304K88298N67811L56554K90307
36983B281178P81054J389644J324424M15905o50630j136848j118175j243482j604205
$$ plain form
37045 -4490861 -4293002 -2787897 -1269136 -839357 -972094 -564903 363957 1178945 2159660
37036 2159660 4062410 6367130 7375474 6197679 3585671 794933 -1287394 -1929554
37028 -1929554 -802699 1240459 2706036 3067757 2907273 2455838 1347067 56705 -33124
37019 -33124 1217994 1947647 800436 -974515 -1266112 -41908 958566 896549 548149
37010 548149 471473 142429 -588417 -522541 1418584 4392257 6261701 5961552 4650084
37001 4650084 4416586 6215323 9229780 11959168 13506590 13775503 12905642 11041170 8579588
36992 8579588 6138932 4095589 2450849 1253512 778208 1066506 1634317 1990871 2281178
36983 2281178 3062232 4451876 5776300 6192205 5541575 4404727 3286552 2043070 438865
36974D38865j419114l21327O40812K66620q76588j110407k06404K90572k90496
36965b587467n52207M93179J436443O14517j012111j141103M19937J670354J510331
36956H51873Q50651N24050Q6835p60526j257846q52325n9345O17114J385714K110425
36946C496620J827577K62259j208823j185095j44853K47262p38459k259570k986767
36937b689849k182872j26880J906744K463069J299938k77987q61017l61359K98127
36928e32086M07279k0927m69219k48395Q76897K032506J847712K06244j294444
36919B805567j253349j77753M58227K29743j27243j75760k35888m73591n17622
36910E32331j18958N22330J149544J523273J160144j74136j619129j806345o83507
$$ plain form
36974 438865 -980249 -1301576 -660764 -394144 -1270732 -2381139 -2587543 -2296971 -2587467
36965 -2587467 -3139674 -2646495 -1210052 -595535 -1607646 -2748749 -2328812 -658458 851873
36956 851873 1702524 2226574 2313409 1552883 295037 -557288 -616633 481 1386195 3496620
36946 3496620 5324197 5586456 4377633 3192538 3047685 3294947 2556488 296918 -2689849
36937 -2689849 -4872721 -4999601 -3092857 -629788 670150 392163 -468854 -830213 -532086
36928 -532086 -124807 -145734 -614953 -863348 13549 2046055 3893767 4100011 2805567
36919 2805567 1552218 1374465 1832692 2062435 1935192 1759432 1523544 1049953 532331
36910 532331 413373 935703 2085247 3608520 4768664 4594528 2975399 1169054 485547
36901D85547J18115n76124j680069j191607R82449K749811K577636J339352P09041
36892E514151P18875K00866q71182j173536l39179K60883j45741k23782J211695
36883E153050K709657J943697o98064k454788k005123p48228k1800O07957J403871
36874E890229J099360q92652k647543k071916M0498J206675O68781l29650j022834
36865A940948j689777j939101p16997J502603K503515J205730p02714j003975
36857A100232K82038J368846J104492j34365j433929k237483k375998j923074
36849d249241j153978m01383Q9895K33189K27704M47102Q35148P04158k30742
36840c498148r27525j16174J747841K780229K098486P39924k06294r66089j773086
$$ plain form
36901 485547 603662 27538 -1652531 -2844138 -1861689 888122 3465758 4805110 5514151
36892 5514151 6233026 6433892 5562710 4389174 4049995 4310878 4165137 3941355 5153050
36883 5153050 7862707 9806404 9108340 6653552 4648429 3900201 3878401 4486358 5890229
36874 5890229 6989589 6096937 3449394 1377478 1417976 2624651 3293432 2963782 1940948
36865 1940948 251171 -1687930 -2404927 -902324 1601191 2806921 2104207 1100232
36857 1100232 1382270 2751116 3855608 3721243 2287314 49831 -2326167 -4249241
36849 -4249241 -5403219 -5804602 -5714707 -5481518 -5253814 -4806712 -3971564 -3267406 -3498148
36840 -3498148 -4425673 -4541847 -2794006 -13777 2084709 2824633 2618339 1652250 -120836
36831a20836j615472K62884K499248K922914J429411L8440J05324Q83689J075196
36822G480798M60213n22932j636593k492808k247179o29882J203398J771431J000874
36813D387320Q8236k01098k25722l77462k10952P81957K073122K507958J696191
36804A0519550L83040o04691j171533j482620j322153n23782L39978M79183K3041
36795F640013j38501K55352M37291o3229n40093k13175M54297M11194m28024j238559
36785E576566j665668k096382k513877k167800p98542O61055J181311Q49849M56883
36776e16605L70373M21841N38355Q12110J064115R22773M07887N1990K90018Q75543
36766E238400J007047J10632j403917k307677j769490l20534P77292R96582P97605
$$ plain form
36831 -120836 -1736308 -1473424 1025824 3948738 5378149 5416589 5521913 6405602 7480798
36822 7480798 7941011 7418079 5781486 3288678 1041499 411617 1615015 3386446 4387320
36813 4387320 4475556 4274458 4048736 3671274 3460322 4242279 6315401 8823359 10519550
36804 10519550 10902590 10297899 9126366 7643746 6321593 5797811 6137789 6616972 6640013
36795 6640013 6501512 6756864 7194155 7130926 6590833 6377658 6831955 7243149 6815125 5576566
36785 5576566 3910898 1814516 -699361 -2867161 -3665703 -3004648 -1823337 -973488 -516605
36776 -516605 -146232 275609 813964 1626074 2690189 3612962 4020849 4072839 4362857 5238400
36766 5238400 6245447 6356079 4952162 2644485 874995 554461 1331753 2328335 3125940
36757C125940N11508j35617j124284j676670j264351l91223K18352N57069Q32013
36748F52737P42016J01308l98482K503R67701J586768J643242J450835Q91339
36739G639967k92638j559408k029339j679674j101154m41134L06511M85896l05679
36730A023348r39223j24207J228273J016053p16763j685152q76536K70664Q16615
36721A3072J744939L195980L048427L57674k120543j503499Q36024J383094k06875
36712F748293j095344r3304P35232k64362j831681j981205p28741M63405O48122
36703B600415k5442p36660n25199P79519K021064J956969Q76092n2809o53066
36694F240883j534592k338390j953506n19672N32061O44298O61505R65290Q43419
$$ plain form
36757 3125940 3637448 3501831 2377547 700877 -563474 -954697 -736345 -179276 652737
36748 652737 1394753 1496061 1097579 1100082 2067783 3654551 5297793 6748628 7639967
36739 7639967 7347329 5787921 3758582 2078908 977754 536620 843131 1329027 1023348
36730 1023348 84125 -40082 1188191 2204244 1487481 -197671 -1074207 -803543 13072
36721 13072 1758011 4953991 8002418 8360092 6239549 4736050 5572074 6955168 6748293
36712 6748293 5652949 5559645 6294877 6030515 4198834 2217629 1488888 1952293 2600415
36703 2600415 2574973 1838313 1313114 2092633 4113697 6070666 6946758 6893949 6240883
36694 6240883 4706291 2367901 414395 -105277 426784 1071082 1732587 2697877 3541296
36685C541296J20473l03647o7063R9977r9350o7847K02831o1842o75889m67296
36675B221643M35925L85126r28134j595054n61765O34103N53263P8791L02804
36666A526702L45303o92633j519056o72842Q59174J371864J279515J738455J869807
36657F106289K16794k089006k667091j727179j461011j982016j229296Q79488
36649c953028J649768K707j360977J19802L035015L989197J961645j014490k599706
36640A829933k173703o73322N24269P35951M00445J62617j60268q52732j027147
36631a233957L49488K240640K271958J38359j628571j190240R0177j4916j262447
36622b39509j687235p74361p177m21920j183162r55793K94632J391254J395374
$$ plain form
36685 3541296 3661769 3358122 3291059 3391036 3291686 3223839 3426670 3364828 2688939 2221643
36675 2221643 2657568 3042694 2114560 519506 -42259 591844 1145107 1223898 1526702
36666 1526702 1872005 1179372 -339684 -1012526 -153352 1218512 2498027 4236482 6106289
36657 6106289 6323083 4234077 1566986 -160193 -1621204 -3603220 -4832516 -3953028
36649 -3953028 -2303260 -2300553 -3661530 -3541728 -506713 3482484 5444129 4429639 1829933
36640 1829933 -343770 -1017092 -492823 243128 643573 806190 645922 -206810 -1233957
36631 -1233957 -884469 1356171 3628129 3766488 2137917 947677 1037854 1022938 -239509
36622 -239509 -1926744 -2701105 -2708282 -3130202 -4313364 -5269157 -4974525 -3583271 -2187897
36613b187897N59686j02983K0918O23400J115296J384779J581523J521472Q82005
36604E398199j82139j115607j485440j078478P4755J291443J488945N55249k28883
36595D718044N110L37407l55350j363819j271974l53392L7458r1257L35105J035361
36585C032693O18087o95527j041227J365P13887K60822n5340N19241P34125j25025
36575C963101o09883K96227J096076K80803r15639n08942R03739J172447J2202
36566E690131r17397q23738n30745n79466m58238R2872M30146j2332r21008j427428
36556E42797q73505M76947J353844Q20825k39530j56134R19281J152382J54915
36547D151822k45640P02287J088810l45937j752961j225049o1665k83703q72530
$$ plain form
36613 -2187897 -1628211 -1731194 -1710276 -1086876 28420 1413199 2994722 4516194 5398199
36604 5398199 5216060 4100453 2615013 1536535 1611290 2902733 4391678 4946927 4718044
36595 4718044 4723154 5060561 4705211 3341392 2069418 1716026 1753484 1662227 1997332 3032693
36585 3032693 3650780 2955253 1914026 1915391 2629278 2890100 2834760 3354001 4088126 3963101
36575 3963101 3353218 3649445 4745521 5026324 4110685 3601743 4505482 5677929 5690131
36566 5690131 4772734 3948996 3418251 2838785 2380547 2473419 2903565 2891233 1970225 542797
36556 542797 -330708 146239 1500083 2320908 2081378 1925244 2844525 3996907 4151822
36547 4151822 3906182 4608469 5697279 5351342 3598381 2373332 2311667 2027964 1155434
36538A155434K75496K147670J995932O5755p78433J18839M54035o78956j261234
36529C494538n1076J342210J291156M01095k89521r82065j758252j710486o98498
36520A039101r4292o50692j368657j376641j068852n80424P04568K141767J728107
36511D73985n60881j705723J92048K772091K669498J93605j679046j676684r92152
36502c13259m46048M78315J813517K492603J934504P96341r6819n15245n29027
36493E614882l79453n07790r40537j018210m84769j83855o86733j000995O752
36484D19292J488190J511288j06942j433621j062117K27298Q61066M78745q85
36475B382314L14005J339603K051326J362613p02637k746748l253840k046742
$$ plain form
36538 1155434 1430930 3578600 5574532 5640287 4861854 4980693 5434728 4755772 3494538
36529 3494538 3443462 4785672 6076828 6477923 6188402 5206337 3448085 1737599 1039101
36520 1039101 944809 294117 -1074540 -2451181 -3520033 -4100457 -3395889 -1254122 473985
36511 473985 -86896 -1792619 -1600571 1171520 3841018 4034623 2355577 678893 -313259
36502 -313259 -759307 -280992 1532525 4025128 5959632 6755973 6659154 6143909 5614882
36493 5614882 5235429 4727639 3787102 2768892 2284123 2100268 1413535 412540 419292
36484 419292 1907482 3418770 3311828 1878207 816090 1043388 1904454 2383199 2382314
36475 2382314 2696319 4035922 6087248 7449861 6747224 4000476 746636 -1300106
36467a300106k45500R80313J274692R74783N50888J16870n80419j469862j686307
36458a384648n43645J089748J493259M41008l64218K65731J396085J592512Q79016
36449D864848M1164p69778j432141j050692N99987J793639Q94623r81697j353698
36440B606255o798R29587M87347J19033R02083J636679Q85743o73587j303352
36431E582990o17687K95296N36146J19698n57633j069803r95767l29155K31270
36422C195355n6333j017098j598621r09594Q81403K604937L029605J922273K32648
36413H284575q57062r73992n68643k08958j91440n87697j199978j544734j253114
36404H98957m74693K90342O13390L49436j66633q1456J113537K432428K034148
$$ plain form
36467 -1300106 -1545606 -565293 709399 1684182 2235070 2351940 1771521 301659 -1384648
36458 -1384648 -1928293 -838545 654714 1095722 731504 997235 2393320 3985832 4864848
36449 4864848 4906012 4136234 2704093 1653401 2253388 4047027 4941650 3959953 2606255
36440 2606255 2599457 3529044 4016391 4135424 5037507 6674186 7559929 6886342 5582990
36431 5582990 4965303 5260599 5796745 5916443 5358810 4289007 3293240 2964085 3195355
36422 3195355 3139022 2121924 523303 -386291 495112 3100049 6129654 8051927 8284575
36413 8284575 7427513 6453521 5884878 5675920 5484480 4896783 3696805 2152071 898957
36404 898957 424264 714606 1327996 1677432 1510799 1429343 2542880 4975308 7009456
36395G009456l90326k769431l028596j518953j31021J98405o4440l52341l76798
36386a424045K68384J496302K158993J471192M97480O77360J413974R96097m92641
36377G063096j380240j374072j818946k694863k087748L77396K195253J623342
36369A903218L56867N80827J349641M19012j688322k292958p43169O87319L06831
36360H79266q39462j013899k58675J69021k18781o78271l47875O92151J343019
36351b73506N16657j421770k542886j375991J145264K607126J964874N43302q075
36342A154995K22968M3858q03553j219501m01173Q65257J143631L04403k36897
36333A073988M72240J374952O85138j567448l286648k805507p93312P44998P46762
$$ plain form
36395 7009456 6619130 3849699 821103 -697850 -828871 -630466 -694906 -1047247 -1424045
36386 -1424045 -1155661 340641 2499634 3970826 4468306 5145666 6559640 7555737 7063096
36377 7063096 5682856 4308784 2489838 -205025 -2292773 -1915377 279876 1903218
36369 1903218 2260085 2840912 4190553 4609565 2921243 628285 -114884 572435 879266
36360 879266 39804 -974095 -1232770 -1063749 -1282530 -1960801 -2308676 -1616525 -273506
36351 -273506 243151 -1178619 -3721505 -5097496 -3952232 -1345106 619768 1163070 1154995
36342 1154995 1377963 1421821 618268 -601233 -1002406 -137149 1006482 1310885 1073988
36333 1073988 1546228 2921180 3606318 2038870 -1247778 -4053285 -4846597 -4101599 -3354837
36324c354837j05183m31559M18721J791828K417559J831394Q91429M83823K32746
36315D175921n96974j420193r87527M47675J291090J051376P69328O79468l38179
36306E071985k123361k468763n59497J053097P7893j794519j413557R93972K422574
36297A259824J665053L04550m50079r23270j008848l7879J055303L45869j678417
36288E32106k194243m10410J071759N61412m9637J120462K451504J641568r9127
36279D625394J00552J934467K263637K6932k244063k302848j054583n60387j070868
36270A718233j331136p00275K57900Q03207P68623M44966K25253L37128O79644
36261C203543Q53654L89485q40776k142963k198845m88064J521324J628256l59050
$$ plain form
36324 -3354837 -3460020 -3891579 -3472858 -1681030 736529 2567923 3459352 3943175 4175921
36315 4175921 3578947 2158754 1171227 1618902 2909992 3961368 4730696 5410164 5071985
36306 5071985 2948624 479861 -79636 973461 1051354 -743165 -2156722 -1162750 1259824
36297 1259824 2924877 3229427 2779348 1856078 847230 809351 1864654 2210523 532106
36288 532106 -1662137 -2072547 -1000788 -439376 -489013 631449 3082953 4724521 4625394
36279 4625394 4725946 6660413 8924050 8950982 6706919 4404071 3349488 2789101 1718233
36270 1718233 387097 -313178 -55278 747929 1516552 1961518 2186771 2523899 3203543
36261 3203543 4057197 4446682 3605906 1462943 -735902 -1223966 297358 1925614 1566564
36252A566564k241692k309164j349038r05496q35981j5586J471608K491508K679186
36243E51909K541173K126633J154192J80198J9486J51327o12716j894307k003936
36234B213959o65318M09042K42621L4325Q90632J761361J016037j033986k559320
36225B309353k461948j110275N10927J361979P21020q84745j593735j43330K404666
36216A113912L796346L140246J448961j6967q98021j343619j477742j437022j324070
36207C002024j062291o91615n45508o23997k49982Q54109J588414O84493j267401
36198A688246k203230j137927P70920J954688K076699J490182K64895j337344
36190C567129k294816j849054o48294R7938K39068M71336Q50489P59693L08104
$$ plain form
36252 1566564 -675128 -2984292 -4333330 -5238826 -6074807 -6090393 -4618785 -2127277 551909
36243 551909 3093082 5219715 6373907 6554105 6573591 6724918 6112202 4217895 2213959
36234 2213959 1548641 1957683 2200304 2234629 3125261 4886622 5902659 4868673 2309353
36225 2309353 -152595 -1262870 -751943 610036 1331056 446311 -1147424 -1290754 1113912
36216 1113912 4910258 8050504 9499465 9482498 8584477 7240858 5763116 4326094 3002024
36207 3002024 1939733 1248118 702610 78613 -171369 682740 2271154 2955647 1688246
36198 1688246 -514984 -1652911 -881991 1072697 3149396 4639578 4904473 3567129
36190 3567129 1272313 -576741 -1225035 -1127097 -888029 -416693 433796 1193489 1501593
36181A501593L56795Q03345L13706j378551k298258q29504J501321J804428p571
36172A767304j089397K930J245776N70154q56536p62465M78592Q25986L49275
36163B531619J028342K844505L148944Q08984j728924k017410r98212r13784j638373
36154C065691j370508J68691J529301J896420J584912O27676j062016k349103
36146D091064j796948m4108O73098l22704j278118p42467N58113J249887J180668
36137C568485R34153P05412M47319J89163k76697j040776j224059J17283J926868
36128E347151J741140r06807l417569l513903k024114r65274n04755L74869J459573
36119b409689J611139P84778r8978p71177j412270j397120r8774J400528J345320
$$ plain form
36181 1501593 1858388 2661733 2975439 1596888 -701370 -1530874 -29553 1774875 1767304
36172 1767304 677907 680837 1926613 2496767 1640231 877766 1356358 2182344 2531619
36163 2531619 3559961 6404466 9553410 10362394 8633470 6616060 5617848 4704064 3065691
36154 3065691 1695183 1863874 3393175 5289595 6874507 7502183 6440167 4091064
36146 4091064 2294116 2250008 2923106 2600402 1322284 579817 1137930 2387817 3568485
36137 3568485 4502638 5208050 5655369 5844532 5567835 4527059 3303000 3420283 5347151
36128 5347151 7088291 6181484 2763915 -749988 -2774102 -3739376 -4244131 -3869262 -2409689
36119 -2409689 -798550 -13772 -112750 -883927 -2296197 -3693317 -3792091 -2391563 -1046243
36110a046243M5305k59135J445529L494422L683085J667464j033055k416404j406721
36101D174247J014861K271342J000964r81938j071367L15852M85771j156669k172552
36092C880511j081289M89428R09650J176901K461095L206366J317233k038221
36084A0321674l509618k009572K02441Q01052j93908j438287k020133j783512
36076C70137j057447l99222O4675Q72480K111247K659548J629322l2499p30401
36067E487840m92926n16892q90007o30025J48443J48482p65303j128234l16339
36058A045039N12589O63472J083119K152567K273272L86935j653893j362592O85425
36049E785933J649845N09758q35321o79020K88129N60311K4023m23471m46584
$$ plain form
36110 -1046243 -1000938 -1260073 185456 3679878 7362963 9030427 7997372 5580968 4174247
36101 4174247 5189108 7460450 8461414 7479476 6408109 6723961 7209732 6053063 3880511
36092 3880511 2799222 3288650 4198300 5375201 7836296 11042662 12359895 10321674
36084 10321674 6812056 4802484 5004925 5805977 5612069 4173782 2153649 370137
36076 370137 -687310 -1086532 -1021857 -149377 1961870 4621418 6250740 6218241 5487840
36067 5487840 4994914 4478022 3588015 2957990 3106433 3254915 2489612 1361378 1045039
36058 1045039 1557628 2221100 3304219 5456786 7730058 8116993 6463100 5100508 5785933
36049 5785933 7435778 7945536 7110215 6431195 6719324 7279635 7303658 6880187 6433603
36040F433603m04475m32935l16323j31473l32135j066163j757773j590668m24523
36031b2865Q57704J148610L91411k21662L55607J642084K087919Q71045j162295
36022E947558k407211k081991q66226j15351l95967p93387j2820J728108K546141
36013C548854J141157j393202k835905k514672j672254j309121r16145K52492
36005e698796J665298K022382Q26095j069567k231264j788425j90213J107873
35997e356617J217863J000055J827375L207473L014168O62666j415401p77782
35989C379800J573608K445722P21664j431569j771232p13766j44072p30677j470332
35980A859146j307085k89192P22253R38489K98786m73812n68360N4314O60083
$$ plain form
36040 6433603 6029128 5596193 5279870 5148397 4816262 3750099 1992326 401658 -22865
36031 -22865 834839 1983449 2374860 2153198 2508805 4150889 6238808 7109853 5947558
36022 5947558 3540347 1458356 592130 476779 80812 -712575 -725395 1002713 3548854
36013 3548854 4690011 3296809 460904 -2053768 -3726022 -5035143 -5951288 -5698796
36005 -5698796 -4033498 -2011116 -1185021 -2254588 -4485852 -6274277 -6464490 -5356617
35997 -5356617 -4138754 -3138699 -1311324 1896149 4910317 5572983 4157582 3379800
35989 3379800 4953408 7399130 8120794 6689225 4917993 4204227 4060155 3329478 1859146
35980 1859146 552061 262869 985122 1923611 2222397 1748585 1180225 1234539 1894622
35971A894622N67937k76369j368655j840056q80508J223342K641711J709000p78002
35962B893022k198882j436098j51352M2144N8415J375881K869533K019431r83224
35953D488870k855551j625119P44296J419759O24425N84360J648267J842913K80738
35944G152958j213418p85354P35095J177675J62322o76082l05802L99348K76448
35935F923190m96838j080067j303836j418037j216641m99176K5100m95999j515967
35926a078271j569953m59950K89631l62396j443929j385856p2887J357212K054409
35917b671990J939269J234267L86391J1801J70769J90274j52770p9014O78136
35908A707133Q44453m59794j652724n83526J877554K487042K28606k024070j501345
$$ plain form
35971 1894622 2462559 2186190 817535 -1022521 -1903029 -679687 1962024 3671024 2893022
35962 2893022 694140 -741958 -893310 -851166 -792751 583130 3452663 5472094 4488870
35953 4488870 1633319 8200 752496 2172255 2796680 3381040 5029307 6872220 7152958
35944 7152958 5939540 5154186 5889281 7066956 7229278 6553196 6247394 6646742 6923190
35935 6923190 6426352 5346285 4042449 2624412 1407771 908595 933695 437696 -1078271
35926 -1078271 -2648224 -3108174 -2818543 -3180939 -4624868 -6010724 -6083611 -4726399 -2671990
35917 -2671990 -732721 501546 887937 899738 1070507 1260781 1108011 1028997 1707133
35908 1707133 2551586 2091792 439068 -144458 1733096 4220138 4448744 2424674 923329
35899I23329P42414J707364O81820l76351j45828L52053k33718j253134q23880
35890A574069J371270L097585K086270q69612k582168j558441R1293l8587j045832
35881B125847n87254Q59180P11288j026695j387197M85693J564921P137j505963
35872A246957k16967J925311J450004r52097j940897j168960j035880j597827
35864b290356m22821K258155K932205N56024j345451k89968J264391K62792j896572
35855A028399j867421L42233J878310J434690J19157j075154j838494j316668
35847a294948R06500K966712K473491n719j652897j541400j489448k468013k865747
35838d971469j383497O44558J366876J160414J521938K342236K158274P17090
$$ plain form
35899 923329 1665743 3373107 4054927 3678576 3532748 3884801 3651083 2397949 1574069
35890 1574069 2945339 6042924 8129194 7259582 4677414 3118973 3210266 3171679 2125847
35881 2125847 1538593 2397773 3109061 2082366 695169 1180862 2745783 2752920 1246957
35872 1246957 1029990 2955301 4405305 3453208 1512311 343351 -692529 -2290356
35864 -2290356 -2713177 -455022 2477183 3033207 1687756 1397788 2662179 2924971 1028399
35855 1028399 -839022 -496789 1381521 2816211 2935368 1860214 21720 -1294948
35847 -1294948 -388448 2578264 5051755 5046036 3393139 1851739 362291 -2105722 -4971469
35838 -4971469 -6354966 -5710408 -4343532 -3183118 -1661180 681056 2839330 3556420
35830C556420m05719j5835J033230J002660m42587j779534j496399N0775J091655
35821B594666O49786l08428k18389J096649K282572K011184K75943j584314j884194
35812D915475j35700K044341K306669M13847j226075p94617K52745o62661l144677
35803C969347m023438j733186J571283K960605K098768O82249j31129m94292q80151
35794D020056j443843k023950k133381j335388J5544R76876J173385R63946L74305
35785E87550q75699j951711j166225J418449L268459K645758J124046J051449
35777F102076J830341J124295j013791k048985j060530j30746p96115j592607
35769B413938o33390J269946J904688Q36394n40156j350839j884901k285924k214084
$$ plain form
35830 3556420 3150701 3134866 4168096 5170756 4728169 2948635 1452236 1503011 2594666
35821 2594666 3244452 2936024 2717635 3814284 6096856 8108040 8383983 6799669 4915475
35812 4915475 4779775 6824116 9130785 9544632 8318557 7523940 7776685 7114024 3969347
35803 3969347 -54091 -1787277 -215994 2744611 4843379 5525628 5394499 4900207 4020056
35794 4020056 2576213 552263 -1581118 -2916506 -2900962 -1924086 -750701 213245 587550
35785 587550 -288149 -2239860 -3406085 -1987636 1280823 3926581 5050627 6102076
35777 6102076 7932417 9056712 8042921 5993936 4933406 4802660 4006545 2413938
35769 2413938 1780548 3050494 4955182 5791576 5251420 3900581 2015680 -270244 -2484328
35760b484328j742172j282031o75939M46922J521801J564303Q53783P08854J358793
35751B69986J504487N29733l21090P3172P99153L02601j128516j754923r19583
35742f44980K14744M92496R8599k54203m95074j004326j769986k167147j453331
35733f983208M35422K316848K437097M76563j474424j089688J099033K147738
35725f34619N73970j680456k002838m97103P34342P91267P64187J534672K368854
35716A952276K107523P38287p03621j246315p55839q694J0039p23245j064059
35707C06352k40998Q46763Q47418J05065K00961J327075J722870L18128j532090
35698C901544j971866j140696m75726l80710j12769M00281K48382p33650j255839
$$ plain form
35760 -2484328 -4226500 -5508531 -6184470 -5737548 -4215747 -2651444 -1797661 -1088807 269986
35751 269986 1774473 2304206 1983116 2056288 2855441 3158042 2029526 274603 -644980
35742 -644980 -430236 62260 160859 -93344 -588418 -1592744 -3362730 -5529877 -6983208
35733 -6983208 -6547786 -4230938 -1793841 -1317278 -2791702 -3881390 -2782357 -634619
35725 -634619 -60649 -1741105 -3743943 -4241046 -3506704 -2715437 -1951250 -416578 1952276
35716 1952276 4059799 4798086 4094465 2848150 2092311 2083617 2093656 1370411 306352
35707 306352 65354 912117 1759535 1864600 2065561 3392636 5115506 5433634 3901544
35698 3901544 1929678 788982 313256 -67454 -180223 220058 468440 -265210 -1521049
35689a521049k48776J548268K412830J713392N33516K25465P96639J081061M29006
35680F970352l34061j26777O11466L60117j183662k436653k186155j390040j593471
35671a308884k390671k014207j72723J315589J007218l49835r88095j37565J579445
35662c459728K898981K659137P08897j434160j742039q7247J384512R65572m75233
35653A418692r92065l07585K34020q0966n92940o94624o22002n41980k9479R86417
35643a222512J645137J250793L96231K14962P19462O68118o41953j983005j361717
35634c14484J251759L159851J846950j660105l670999k314528L53686J512043
35626A64173J205070J193217J499604N61396j551404k661041j694017j25080O02106
$$ plain form
35689 -1521049 -1769825 -221557 2191273 3904665 4438181 4663646 5460285 6541346 6970352
35680 6970352 6636291 6509514 7120980 7481097 6297435 3860782 1674627 284587 -1308884
35671 -1308884 -3699555 -5713762 -5886485 -4570896 -3563678 -3913513 -4901608 -5039173 -3459728
35662 -3459728 -560747 2098390 2807287 1373127 -368912 -456159 928353 1893925 1418692
35653 1418692 426627 119042 353062 272096 -320844 -1015468 -1637470 -2179450 -2208929 -1222512
35643 -1222512 422625 1673418 2069649 2284611 3004073 3672191 3030238 1047233 -314484
35634 -314484 937275 4097126 5944076 4283971 612972 -1701556 -1347870 164173
35626 164173 1369243 2562460 4062064 4623460 3072056 411015 -1283002 -1408082 -805976
35617h05976J001981J719936J746116J63906j762269k121461j045541j69391j85829
35608a458528n67397r81405j272942o93454J044260K490549K135570Q57015N97538
35599B151206J063292L12953j413589j458412Q65252K558533J218652j362819
35591C935068j943932l52825J001592Q41915r6876j088137j988065k113990p19419
35582b524669J292721J952201Q36587l85757l71146K80125K88351n34065j342601
35573e08253j334924l48522J049779J845369J448946L78235l59463m17752j17872
35564A635543L66911J034501J476308J151322J57774r94316k104717k933923k605971
35555b816568o47520J602751K125496Q78821j48620J75190P52399L62113m33714
$$ plain form
35617 -805976 196005 1915941 3662057 3825963 2063694 -57767 -1103308 -1272699 -1458528
35608 -1458528 -2025925 -3007330 -4280272 -4973726 -3929466 -1438917 696653 1553668 2151206
35599 2151206 3214498 3527451 2113862 655450 1520702 4079235 5297887 3935068
35591 3935068 1991136 1638311 2639903 3481818 3384942 2296805 308740 -1805250 -2524669
35582 -2524669 -1231948 720253 1556840 1171083 799937 1080062 1368413 834348 -508253
35573 -508253 -1843177 -2191699 -1141920 703449 2152395 2530630 2171167 1753415 1635543
35564 1635543 2002454 3036955 4513263 5664585 5822359 4828043 2723326 -210597 -2816568
35555 -2816568 -3464088 -1861337 264159 1142980 994360 1169550 1921949 2284062 1850348
35546A850348n30122j41064j11697k81022L0836M39645o6081j132425r19061J423722
35536E63079M045595M112674J149500k090150k587530n43767R54093j20838k243366
35527C239290k620098r33426P30498J135693J084043J214392P31380p50689j875308
35518A955775j455143m24629l17993p37541r3958J581213K338579R69937j409767
35509B406473k824139k498938j059580N63437J844505K546994K344920Q73084
35501D196756j526601l255476k525082N04895L315114L499021J259877j177248
35493D291256k133404j642877n25935N66214J167941J037104N02234K00595K21516
35484C684644p2803j121452k292708k237156l21669K246033L168990J483210j125216
$$ plain form
35546 1850348 1320226 1179162 1067465 786443 817279 1256924 1190843 58418 -860643 563079
35536 563079 4608674 8721348 9870848 7780698 5193168 4649401 5603494 5482656 3239290
35527 3239290 619192 -314234 416264 1551957 2636000 3850392 4581772 3831083 1955775
35518 1955775 500632 76003 -241990 -979531 -1073489 507724 2846303 3816240 2406473
35509 2406473 -417666 -2916604 -3976184 -3412747 -1568242 978752 3323672 4196756
35501 4196756 2670155 -585321 -3110403 -2605508 709606 4208627 5468504 4291256
35493 4291256 2157852 514975 -10960 555254 1723195 2760299 3262533 3463128 3684644
35484 3684644 3611841 2490389 197681 -2039475 -2361144 -115111 3053879 4537089 3411873
35475C411873k272630j773813j244901j076246N2154K082517K524078J95274k096466
35466a98160j132902J865662K877471Q59488j198581j011975K69162P87338O49782
35457C767285N67882J26412r31272j425243m81314P12169N38094o08862j064997
35448A200154l73428M36473N76803K24473j85025l29994P8065Q83724J285764
35439C797009P73518j04335n45086n53560n29342m18354q5256P0355k23055l61867
35429A820027K59445J069939R74467j64338j541430k468516k560709j454463N42474
35420c523104J983146J717519N30177J27682P40557J071364M97123j83622l80594
35411B580248o07967j252886j704674j377418o25027m300N39986J156368J502334
$$ plain form
35475 3411873 1139243 -634570 -1879471 -2955717 -2903563 -821046 1703032 1898306 -198160
35466 -198160 -1331062 534600 3412071 4271559 3072978 2061003 2330165 3117503 3767285
35457 3767285 4335167 4461579 3530307 2105064 1623750 2335919 2874013 2265151 1200154
35448 1200154 826726 1263199 1840002 2064475 1879450 1549456 1627521 2511245 3797009
35439 3797009 4570527 4466192 3921106 3367546 2838204 2419850 2334594 2404949 2181894 1820027
35429 1820027 2079472 3149411 4123878 3959540 2418110 -50406 -2611115 -4065578 -3523104
35420 -3523104 -1539958 177561 707738 835420 1575977 2647341 3144464 2960842 2580248
35411 2580248 1972281 719395 -985279 -2362697 -2987724 -2992024 -2452038 -1295670 206664
35402B06664J273121P00943N6707p16465j459067j586561q95563P3608Q65089
35393a481524J529049J844372J158931l18826j149899n90945P4136n94659j786361
35384a315726j495924M15252J931083J702384N59300j41516k21059j32501K8701
35375A329994K04846P2501k05939J28884J050030J273120J25853j114825j010931
35366A853533k38870n02789j701949k008529p53119N87613P28380K57018K09381
35357a569331M11722L24468L66237J054929J608349Q54896p98246j665153j053847
35348d65976r2785o6606q31307j251160o43358N20523J102851N12036l67238J13544
35338a469476K174187L684922K481421o69187k701446j962969K3324R32962M21634
$$ plain form
35402 206664 1479785 2180728 2237435 1520970 61903 -1524658 -2420221 -2346613 -1481524
35393 -1481524 47525 1891897 3050828 2732002 1582103 991158 1065294 470635 -1315726
35384 -1315726 -2811650 -2396398 -465315 1237069 1796369 1654853 1433794 1301293 1329994
35375 1329994 1534840 1607341 1401402 1530286 2580316 3853436 3979289 2864464 1853533
35366 1853533 1614663 1111874 -590075 -2598604 -3351723 -2764110 -2035730 -1778712 -1569331
35357 -1569331 -1157609 -833141 -466904 588025 2196374 3051270 2253024 587871 -465976
35348 -465976 -558761 -625367 -1456674 -2707834 -3351192 -2830669 -1727818 -1215782 -1583020 -1469476
35338 -1469476 704711 4389633 6871054 6201867 3500421 1537452 1560776 2493738 2915372
35329B915372l54463q14050j125846r27451M73003K468730L130583J502367r51626
35320F316619k001787j240449j86552j21507q05702j380241j486766j043695R4873
35311a855207J409631J490398k10811j947282j542394N30607J718926J133062
35303G26930N71194J144662J302989k31982j810753j455127l13420o37241j607072
35294b309820o08198J888061K496090L40163j404991n84814P41131L2630j747868
35285a157616k214614j289324l91467K43043J011299J299798P51860O71019J748223
35276F72221J947278n59514l682917l777121q39894J804642K381248J905794R74680
35267H26417r55015k787588k044614J044990L000820J955023M3687m95953n16291
$$ plain form
35329 2915372 2560909 1746859 621013 -306438 166565 2635295 5765878 7268245 6316619
35320 6316619 4314832 3074383 2887831 2766324 1960622 580381 -906385 -1950080 -1855207
35311 -1855207 -445576 1044822 834011 -1113271 -2655665 -2125058 -406132 726930
35303 726930 1298124 2442786 3745775 3513793 1703040 247913 -65507 -702748 -2309820
35294 -2309820 -2918018 -1029957 1466133 1806296 401305 -183509 557622 590252 -1157616
35285 -1157616 -3372230 -4661554 -5053021 -4809978 -3798679 -2498881 -1747021 -1076002 672221
35276 672221 2619499 2059985 -1622932 -5400053 -6239947 -4435305 -2054057 -148263 826417
35267 826417 -128598 -2916186 -4960800 -3915810 -914990 1040033 1083720 587767 71476
35258G1476j277586j503584K02169K194359J958139J1031j092938o37664m3709
35249a18307q803J44479N72854O02376K67611K85572N28388J93149n76348q21425
35239A069546m39518j82499o7136O27837J726284K057809J204077n276q97014
35230E094110j532317j741094r96081L79078J124631O25318m10737j113754j277526
35221A51628q72218O3691P46799J17956j503622k367672j493480Q5513Q82965
35212d188440P71871N30968N31757P69584J426705K338992K364981M53783k580838
35203B419363m239366k799480O44062L043282K480064J15879j374044j035732
35195g45972k71179j30985L62932K049014L362192K338542n2263j123768o66397
$$ plain form
35258 71476 -1206110 -2709694 -2507525 -313166 1644973 1656004 563066 -74598 -118307
35249 -118307 -127110 17369 590223 1192599 1460210 1745782 2274170 2467319 1890971 1069546
35239 1069546 630028 447529 380393 1008230 2734514 4792323 5996400 5991124 5094110
35230 5094110 3561793 1820699 824618 1203696 2328327 2953645 2542908 1429154 151628
35221 151628 -720590 -656899 89900 207856 -1295766 -3663438 -5156918 -5071405 -4188440
35212 -4188440 -3416569 -2885601 -2353844 -1584260 -157555 2181437 4546418 5000201 2419363
35203 2419363 -1820003 -4619483 -3975421 -932139 1547925 1663804 289760 -745972
35195 -745972 -1017151 -1148136 -785204 1263810 4626002 6964544 6912281 5788513 5122116
35186E122116j033383k718459l018936m47548K398737K512775P67494L987N24886
35177D111669L48302j021013j965861j633154q93058l40914M30958J295102J299263
35168A631294L35390n31618p09890n79248k42247O23186J549985J596811J022803
$$ plain form
35186 5122116 4088733 1370274 -1648662 -2096210 302527 2815302 3582796 3586783 4111669
35177 4111669 4459971 3438958 1473097 -160057 -1053115 -1394029 -963071 332031 1631294
35168 1631294 1966684 1435066 725176 145928 -96319 526867 2076852 3673663 4696466
$$ [...]
##END NTUPLES=NMR SPECTRUM
##END=
