##TITLE=31Pdec_B3F1701
 CDCl3, 24 sc
 17.1.2025
##JCAMPDX= 6.0         $$ Bruker NMR JCAMP-DX V2.0
##DATA TYPE= NMR SPECTRUM
##DATA CLASS= NTUPLES
##ORIGIN= UXNMR, Bruker Analytische Messtechnik GmbH
##OWNER= root
$$ XWIN-NMR		Version 3.5
$$ Fri Jan 17 16:36:38 2025 Russian Standard Time (UT+4h)  she@DPX200
##.OBSERVE FREQUENCY= 81.013821
##.OBSERVE NUCLEUS= ^31P
##.ACQUISITION MODE= SIMULTANEOUS
##.ACQUISITION SCHEME= undefined
##.AVERAGES= 40
##.DIGITISER RES= 17
##SPECTROMETER/DATA SYSTEM= spect
##.PULSE SEQUENCE= zgpg30
##.SOLVENT NAME= CDCl3
##.SHIFT REFERENCE= (INTERNAL, CDCl3, 0, 198.062)
##AUDIT TRAIL= $$ (NUMBER, WHEN, WHO, WHERE, WHAT)
$$ ##TITLE= Audit trail, XWIN-NMR		Version 3.5
$$ ##JCAMPDX= 5.01
$$ ##ORIGIN= Bruker BioSpin GmbH
$$ ##OWNER= she
$$ F:/spectra/data/she/nmr/P31/2/pdata/1/auditp.txt
$$ ##AUDIT TRAIL=  $$ (NUMBER, WHEN, WHO, WHERE, WHAT)
(   1,<2025-01-17 16:35:38.82 +0400>,<she>,<DPX200>,
      <created by zg, POWCHK disabled, PULCHK disabled
       configuration hash MD5:
       00 E9 B6 7A A2 85 ED C7 34 08 36 98 17 FE 4E 26
       data hash MD5: 32K
       80 D5 ED 09 81 38 8A 84 6C B0 97 00 D8 22 3A 08>)
(   2,<2025-01-17 16:35:41.17 +0400>,<she>,<DPX200>,
      <Start of raw data processing
       efp BC_mod = 2 LB = 1.5 FT_mod = 6 PKNL = 1 PHC0 = 1738.419 PHC1 = 135.6864 SI = 64K 
       data hash MD5: 64K
       8F C0 E4 F9 92 B4 F3 3C 9D 07 1D 16 EC A7 39 72>)
(   3,<2025-01-17 16:36:01.37 +0400>,<she>,<DPX200>,
      <pk PHC0 = 19.12369 PHC1 = -48.2 
       data hash MD5: 64K
       1A 19 DB 20 A3 A1 03 92 2B 61 2D 8E 27 BB DC 54>)
(   4,<2025-01-17 16:36:06.09 +0400>,<she>,<DPX200>,
      <abs ABSG = 5 
       data hash MD5: 64K
       AE CB CC 03 EA D3 8B 24 DD AE 77 B1 63 F7 4A 0F>)
$$ ##END=
$$ 
$$ hash MD5
$$ 8F 65 6C 05 B6 C0 AD 2D D4 3F 32 0E 04 8C F8 A2
##$RELAX= 
##$RELAX= 
##$RELAX= 
##$RELAX= 
##$RELAX= 
##$RELAX= 
##$RELAX= 
##$RELAX= 
$$ Bruker specific parameters
$$ --------------------------
##$DU= <F:/spectra>
##$EXPNO= 2
##$NAME= <P31>
##$PROCNO= 1
##$TYPE= <nmr>
##$USER= <she>
##$AMP= (0..31)
100 100 100 100 100 100 100 100 100 100 100 100 100 100 100 100 100 100 
100 100 100 100 100 100 100 100 100 100 100 100 100 100 
##$AQSEQ= 0
##$AQ_mod= 1
##$AUNM= <au_zg>
##$AUTOPOS= <>
##$BF1= 81.014009
##$BF2= 200.13
##$BF3= 200.13
##$BF4= 200.13
##$BF5= 200.13
##$BF6= 200.13
##$BF7= 200.13
##$BF8= 200.13
##$BYTORDA= 1
##$CFDGTYP= 0
##$CFRGTYP= 5
##$CHEMSTR= <none>
##$CNST= (0..31)
1 1 145 1 1 1 1 1 1 1 1 1 1 1 1 1 1 1 1 1 1 1 1 1 1 1 1 1 1 1 1 1 
##$CPDPRG= <waltz16>
##$CPDPRG1= <>
##$CPDPRG2= <waltz16>
##$CPDPRG3= <>
##$CPDPRG4= <mlev>
##$CPDPRG5= <mlev>
##$CPDPRG6= <mlev>
##$CPDPRG7= <mlev>
##$CPDPRG8= <mlev>
##$CPDPRGB= <>
##$CPDPRGT= <>
##$D= (0..31)
0 1 0 0 0 0 0 0 0 0.06 0 0.03 2e-05 3e-06 0 0 0.0002 0 0 0 0 0 0 0 0 0 
0 0 0 0 0 0 
##$DATE= 1737117338
##$DBL= (0..7)
120 120 120 11 120 120 24 19 
##$DBP= (0..7)
150 150 150 150 150 150 150 150 
##$DBP07= 0
##$DBPNAM0= <>
##$DBPNAM1= <>
$$ [...]
##$SUBNAM3= <"">
##$SUBNAM4= <"">
##$SUBNAM5= <"">
##$SUBNAM6= <"">
##$SUBNAM7= <"">
##$SUBNAM8= <"">
##$SUBNAM9= <"">
##$SW= 400.765351723535
##$SWIBOX= (0..15)
0 1 3 0 0 0 0 0 0 0 0 0 0 0 0 0 
##$SW_h= 32467.5324675325
##$TD= 32768
##$TD0= 1
##$TE= 0
##$TE2= 300
##$TE3= 300
##$TEG= 300
##$TL= (0..7)
0 120 53 12 22 120 120 120 
##$TP= (0..7)
150 150 150 150 150 150 150 150 
##$TP07= 0
##$TPNAME0= <>
##$TPNAME1= <>
##$TPNAME2= <>
##$TPNAME3= <>
##$TPNAME4= <>
##$TPNAME5= <>
##$TPNAME6= <>
##$TPNAME7= <>
##$TPOAL= (0..7)
0.5 0.5 0.5 0.5 0.5 0.5 0.5 0.5 
##$TPOFFS= (0..7)
0 0 0 0 0 0 0 0 
##$TUNHIN= 0
##$TUNHOUT= 0
##$TUNXOUT= 0
##$USERA1= <user>
##$USERA2= <user>
##$USERA3= <user>
##$USERA4= <user>
##$USERA5= <user>
##$V9= 5
##$VALIST= <valist>
##$VCLIST= <CCCCCCCCCCCCCCC>
##$VD= 0
##$VDLIST= <DDDDDDDDDDDDDDD>
##$VPLIST= <PPPPPPPPPPPPPPP>
##$VTLIST= <TTTTTTTTTTTTTTT>
##$WBST= 1024
##$WBSW= 4
##$XGAIN= (0..3)
0 0 0 0 
##$XL= 0
##$YL= 0
##$YMAX_a= 12728
##$YMIN_a= -8022
##$ZGOPTNS= <>
##$ZL1= 120
##$ZL2= 120
##$ZL3= 120
##$ZL4= 120
##$ABSF1= 198.0616
##$ABSF2= -202.7028
##$ABSG= 5
##$ABSL= 3
##$ALPHA= 0
##$AQORDER= 0
##$ASSFAC= 0
##$ASSFACI= 0
##$ASSFACX= 0
##$ASSWID= 0
##$AUNMP= <proc_1d>
##$AZFE= 0.1
##$AZFW= 0.5
##$BCFW= 0
##$BC_mod= 2
##$BYTORDP= 0
##$COROFFS= 0
##$CY= -3
##$DATMOD= 1
##$DC= 0
##$DFILT= <>
##$DTYPP= 0
##$F1P= 0
##$F2P= 0
##$FCOR= 1
##$FTSIZE= 65536
##$FT_mod= 6
##$GAMMA= 0
##$GB= 0
##$INTBC= 1
##$INTSCL= 9.790993e-09
##$ISEN= 30
##$LB= 1.5
##$LEV0= 0
##$LPBIN= 0
##$MAXI= 10000
##$MC2= 0
##$MEAN= 0
##$ME_mod= 0
##$MI= 50
##$NCOEF= 0
##$NC_proc= -6
##$NLEV= 6
##$NOISF1= 182.463
##$NOISF2= 159.3651
##$NSP= 0
##$NTH_PI= 0
##$NZP= 0
##$OFFSET= 198.0616
##$PC= 4
##$PHC0= 1757.543
##$PHC1= 87.4864
##$PH_mod= 1
##$PKNL= yes
##$PPARMOD= 0
##$PSCAL= 0
##$PSIGN= 0
##$REVERSE= no
##$SF= 81.0140089999434
##$SI= 65536
##$SIGF1= 159.3651
##$SIGF2= -187.1042
##$SINO= 113.3802
##$SIOLD= 16384
##$SREGLST= <1H.CDCl3>
##$SSB= 0
##$STSI= 65536
##$STSR= 0
##$SW_p= 32467.5324675325
##$SYMM= 0
##$S_DEV= 0
##$TDeff= 32768
##$TDoff= 0
##$TI= <>
##$TILT= no
##$TM1= 0
##$TM2= 0
##$TOPLEV= 0
##$USERP1= <user>
##$USERP2= <user>
##$USERP3= <user>
##$USERP4= <user>
##$USERP5= <user>
##$WDW= 1
##$XDIM= 65536
##$YMAX_p= 323247175
##$YMIN_p= -27726752
$$ End of Bruker specific parameters
$$ ---------------------------------
##NTUPLES= NMR SPECTRUM
##VAR_NAME=  FREQUENCY,     SPECTRUM/REAL,   SPECTRUM/IMAG
##SYMBOL=    X,             R,               I
##VAR_TYPE=  INDEPENDENT,   DEPENDENT,       DEPENDENT
##VAR_FORM=  AFFN,          ASDF,            ASDF
##VAR_DIM=   65536,         65536,           65536
##UNITS=     HZ,            ARBITRARY UNITS, ARBITRARY UNITS
##FACTOR=    0.49542278885378, 1,            1
##FIRST=     16045.7642231865, 0,            0
##LAST=      -16421.768244346, 0,            0
##MIN=       -16421.768244346, -27726752,    0
##MAX=       16045.7642231865, 323247175,    0
$$ Real data points
##PAGE= N=1
##DATA TABLE= (X++(R..R)), XYDATA
$$ [...]
38006b50993N94648K21957k45689m32807l87273j14177M30009Q90450Q21269M27799
37996A955193K82258L85941K97500P0111J44285L64724J18448m89513o59260k62753
37986B206934r1377m39434n65428m7966M07080J81384k05097o3952K61710P0549
37976A714403m61650o54058m66813l72309m10940k36002J11810K65760K34197
37967b75602L30410N04485M09786P3281j15358m8390K4306J9606P8469J36751
37957A137744j9659k76213k84618m9810P2541j9825p0293O273j0698j88698l39951
37946d3207m47397o72710q34217m57261M20169J042522Q84928L38936M8745l470
37936B77038k20032n16152l86508K19675P02999O29700K71140J15138K14010K96779
$$ plain form
38006 -250993 343655 565612 319923 -112884 -500157 -614334 -184325 706125 1527394 1955193
37996 1955193 2237451 2623392 2920892 2991003 3135288 3500012 3618460 3128947 2469687 2206934
37986 2206934 2115557 1676123 1110695 1062729 1469809 1651193 1446096 1382144 1643854 1714403
37976 1714403 1252753 598695 131882 -240427 -651367 -887369 -775559 -509799 -275602
37967 -275602 54808 559293 969079 1042360 927002 878612 902918 922524 1000993 1137744
37957 1137744 1118085 841872 557254 507444 579985 560160 489867 496140 485442 296744 -43207
37946 -43207 -490604 -1163314 -1997531 -2454792 -2034623 -992101 -107173 231763 280508 277038
37936 277038 57006 -459146 -845654 -625979 77020 706720 977860 1092998 1307008 1603787
37926A603787K48122J47664J2870j54814j74681J00545M17188L60930J0214p7492
37916B494333L05305O31318L81992k03769n35357n11715m38809l27639R0091O82409
37906B568159Q98847N71175J83048J41748K75973K86046J98370P1107k69813p91835
37896D132825r66287m30104L31222N00553Q772m12732k75944K3495j88683q77771
37886A845346j224745o08805N18138J062004O68266K27347O01361J289388J132283
37877E510583J23234n07206j26765M62604M42827J81670L13778N39767K71512
37868G212004k14480k70096j8848k1338k05744j11099J58106K19195L22336R05644
37858G975680J507650J279602M47566R8907N44861J036535J120150J119627J212728
$$ plain form
37926 1603787 1851909 1999573 2012443 1857629 1682948 1783493 2200681 2561611 2571825 2494333
37916 2494333 2799638 3430956 3812948 3609179 3073822 2562107 2123298 1795659 1885750 2568159
37906 2568159 3467006 4038181 4221229 4362977 4638950 4924996 5123366 5194473 4924660 4132825
37896 4132825 3166538 2736434 3067656 3568209 3576981 3164249 2888305 2911800 2723117 1845346
37886 1845346 620601 11796 529934 1591938 2260204 2487551 3088912 4378300 5510583
37877 5510583 5633817 5126611 4999846 5462450 5905277 6086947 6400725 6940492 7212004
37868 7212004 6997524 6727428 6708580 6687242 6481498 6370399 6528505 6747700 7070036 7975680
37858 7975680 9483330 10762932 11210498 11309405 11854266 12890801 14010951 15130578 16343306
37849A6343306J200159J303881K028823L116811L810996M206188N066342O346916
37841D3423422P390653Q491637J0464591J2869101J5095688J8964025K6252809
37834A42951926L2331119K7070904O460930j9331612l4523196l3653384k4817188
37827I6489499j7798229j4381470j1515385q457830o811153o439265n538635l855964
37819B1691568k781982k646974k355038j525409r27910q08604n77523k33554m65419
37810I369155j144567j223311m72955L1938l62212q83987o79153j38723j02184
37801D394001m74812n12942q1790K18502J03914O5485N46458J111033Q75525k91413
37791E953961j410633j466036n68882L17394O13438N39475L77780O1087l07773
$$ plain form
37849 16343306 17543465 18847346 20876169 23992980 27803976 32010164 37076506 43423422
37841 43423422 50814075 59305712 69770303 82639404 97735092 116699117 142951926
37834 142951926 175283045 202353949 208814879 189483267 154960071 121306687 96489499
37827 96489499 78691270 64309800 52794415 44336585 37525432 31086167 25547532 21691568
37819 21691568 18909586 16262612 13907574 12382165 11454255 10645651 10068128 9834574 9369155
37810 9369155 8224588 7001277 6528322 6560260 6198048 5314061 4634908 4496185 4394001
37801 4394001 3919189 3406247 3324457 3542959 3646873 3712358 4258816 5369849 6245374 5953961
37791 5953961 4543328 3077292 2508410 2825804 3439242 3978717 4356497 4417584 4109811
37782D109811k69154K45194O13508M57512K59186M79867P00109L72712j37746
37773F830999j55357J19275K5798k50747J11098J132004J875228J834507J513666
37764A3036471J434669J468658J415104J417716J491041J366726J086196J010671
37756B3727252R81628K89660j150350k409059k792393k686440k607979k248075
37748A1104244j254641k84598k86883j091283j634643j428492r75260p78544p16820
37739B653080n18801k48480j05448j18992j79575j54457J0931J27643j10269n70954
37729G84678n69348K27170J047808Q25363l22203j114039p40828J54465M27518
37720G20584j33712p42361o88731o2834N10912N55375J37346k61894k48155P8213
$$ plain form
37782 4109811 3840657 4085851 4699359 5156871 5416057 5895924 6596033 6968745 6830999
37773 6830999 6675642 6794917 6820715 6569968 6681066 7813070 9688298 11522805 13036471
37764 13036471 14471140 15939798 17354902 18772618 20263659 21630385 22716581 23727252
37756 23727252 24708880 24998540 23848190 21439131 18646738 15960298 13352319 11104244
37748 11104244 9849603 9565005 9278122 8186839 6552196 5123704 4148444 3369900 2653080
37739 2653080 2134279 1885799 1780351 1661359 1481784 1327327 1338258 1465901 1355632 784678
37729 784678 215330 442500 1490308 2315671 1993468 879429 138601 293066 720584
37720 720584 586872 -155489 -844220 -907054 -396142 159233 296579 34685 -213470 -135257
37710a35257K64930N7238l24124m99752l74133j44969J8362J37065K82728M27838
37700b90074M90424M27582K15123j62691n74013o87630l04172K59899M21921P9838
37690a23793k17491o6348J86957L1696l28632k60728K77243O46660M96125J89401
37680H31090J04885R4349q8476l16206l62636k59843j15150N8853J24850j30979
37670e9263n02138m07233K66351Q56139Q01933L31839q6678m14730o93696o10199
37660e17675k7300N23459N30916K72335K49937L05675L9878l05792k46316j6813
37650H08304k06401o32918n61021K5793L51657J06164j66147r5647j1114j66865
37640e48195k54717k8776K63423M01416N32684O89051N44444j6003n76875p24501
$$ plain form
37710 -135257 129673 186911 -137213 -636965 -1011098 -1156067 -1137705 -1000640 -717912 -290074
37700 -290074 200350 627932 843055 680364 106351 -581279 -885451 -625552 -203631 -123793
37690 -123793 -341284 -407632 -220675 -188979 -517611 -778339 -501096 145564 641689 831090
37680 831090 935975 1030324 941848 625642 263006 3163 -111987 -53134 71716 -59263
37670 -59263 -561401 -968634 -702283 153856 955789 1287628 1200950 786220 92524 -517675
37660 -517675 -544975 -21516 509400 781735 1031672 1337347 1377225 1071433 825117 808304
37650 808304 601903 -31015 -592036 -566243 -214586 -108422 -274569 -370216 -381330 -548195
37640 -548195 -802912 -831688 -568265 -166849 365835 1054886 1599330 1583327 1006452 281951
37630B81951m76546k3215M74026P02585L82153k02668m10226j45791J0677k77068
37620C15878o74755q23756p45523m22706K85050J048057J155607N57152Q7459
37611G82463K50435M94254J66152m85066p86832n52494l6070M90314P09787L76926
37601A409869j74980k50284J83547M16630K23091K21699N93069N52735k10451
37592B964925p02125j59506O32112O64345L66011O42411J113617Q10922L3770
37583F366482j1337R77146K358510L825148N096901M803930J732099k702592n219829
37574A7226458m493125k565491j825850k174891k109449j211450l01444L4409
37566B579167p2000l10804m20244k07465J67528L08673K15668K18335J72276l98822
$$ plain form
37630 281951 -194595 -217810 256216 958801 1340954 1138286 728060 582269 592946 315878
37620 315878 -358877 -1182633 -1928156 -2350862 -2065812 -1017755 137852 695004 782463
37611 782463 1032898 1527152 1693304 1208238 421406 -131088 -167158 323156 1032943 1409869
37601 1409869 1234889 984605 1168152 1584782 1807873 2029572 2622641 3175376 2964925
37592 2964925 2262800 2103294 2735406 3399751 3765762 4408173 5521790 6332712 6366482
37583 6366482 6355145 7332291 9690801 13515949 18612850 23416780 25148879 22446287 17226458
37574 17226458 12733333 10167842 8341992 6167101 4057652 2846202 2544758 2579167
37566 2579167 2507167 2196363 1776119 1568654 1736182 2044855 2260523 2478858 2651134 2252312
37556B252312j148333r98458J54671R76252O10606o5944O032L53562l0656q41743
37546A268301r70695l40405R5183o1788k66331j38837R6425K69426M40340M29548
37536H21167K8587l40892l8747P01149R49611M49741l8430M4969L03473J74834
37526C055462k02265l40803j52329N6626K9325k81226p45328j048382q86953l47576
37516h63449R9023J13996j35850j90772K04795Q06781J027988N34349k53184n38894
37506H04783j76972R4232k72409q18432q36522m59230k75045k25926K03626Q45184
37496a116711Q88679J85222m15263l17216O1203J76083K15955N03095O95682L21004
37486A197733l02494m27701J8314L70179K30024o6377r8867K2403n8789l60911
$$ plain form
37556 2252312 1103979 105521 260192 1236444 1847050 1781106 1787138 2140700 2110044 1268301
37546 1268301 297606 -42799 52384 -9404 -275735 -414572 -318147 -48721 391619 821167
37536 821167 849754 508862 470115 1171264 2120875 2570616 2532186 2577155 2880628 3055462
37526 3055462 2853197 2512394 2360065 2416691 2446016 2164790 1419462 371080 -515873 -863449
37516 -863449 -764426 -650430 -786280 -977052 -772257 34524 1062512 1596861 1343677 804783
37506 804783 627811 722043 449634 -368798 -1205320 -1664550 -1939595 -2165521 -1961895 -1116711
37496 -1116711 -228032 -42810 -458073 -775289 -714086 -538003 -322048 181047 876729 1197733
37486 1197733 895239 467538 485852 856031 1086055 1019678 920811 943214 884425 523514
37476E23514n58054m28986p2455K98610N69604O68409M83558K5592m21319n55035
37466E33438m49092m10606m28112j55740M09762P12376M33426M9972J02110L20854
37456A118388J60478j39352Q4988O30053N38997l11227p78779j09374Q77627R74357
37446C046156K64486k30167j06105J38627J33098L6233n5347k81543n00225l15912
37436B129301J96953M42925J95665o6204K4724J77294O4828r2414m3299o6321
37426B963452m05127n98777j35314N30618M93833j74252m67483l1011K87059j36540
37416B326458o64308m74486J01336K24700r282J60395P11873P74048N4468o82899
37406B522303p98328n38598l07597l5277K91120K68547j84723m28284p1165K69699
$$ plain form
37476 523514 -34540 -463526 -535981 -237371 332233 1000642 1484200 1509792 1088473 533438
37466 533438 84346 -326260 -754372 -910112 -500350 212026 645452 695424 797534 1118388
37456 1118388 1278866 1139514 1224502 1854555 2393552 2082325 1303546 1194172 2071799 3046156
37446 3046156 3310642 3080475 2974370 3112997 3246095 3282328 3226981 2945438 2445213 2129301
37436 2129301 2326254 2769179 2964844 2898640 2923364 3100658 3165486 3073072 3029773 2963452
37426 2963452 2558325 1959548 1824234 2354852 2848685 2674433 2206950 2175939 2462998 2326458
37416 2326458 1662150 1187664 1289000 1513700 1504418 1664813 2376686 3150734 3205202 2522303
37406 2522303 1723975 1185377 877780 842503 1133623 1402170 1217447 789163 717998 987697
37396I87697j07497q33181j018472n61088q7995J08258K48833L81006L33532K63136
37386b85771M69290P12765M68478j65699n56611n17256m22667l38673Q6288P13761
37376A63905Q07546J62964m64500m72914k25284k72088m38393k71434J27646L24794
37366e57758K32438M7261j63293l51227k96751K4504K20130Q0749L2792M52968
37356b78187Q73471N49489l50400q28989l75304M10049O75455L27823q4890j84306
37346G34211j22122k11449m60963n90412m23476r0337K11557M54306O03742M38365
37336E43422j08610n83655m54165J25137M76519L40131J08120N3342m1587k72178
37326A86476k70207J52787N49479M42781l5283m68337o81123o04016j25648N05175
$$ plain form
37396 987697 880200 47019 -971453 -1532541 -1620536 -1512278 -1263445 -882439 -548907 -285771
37386 -285771 183519 896284 1364762 1199063 642452 125196 -297471 -636144 -549856 163905
37376 163905 971451 1134415 669915 197001 -28283 -300371 -738764 -1010198 -882552 -557758
37366 -557758 -325320 -278059 -441352 -792579 -1089330 -1064826 -844696 -763947 -731155 -278187
37356 -278187 595284 1144773 794373 -34616 -409920 129 675584 1003407 918517 734211
37346 734211 612089 400640 -60323 -650735 -1074211 -1164548 -952991 -498685 105057 543422
37336 543422 434812 -148843 -603008 -477871 -1352 338779 446899 500241 458654 186476
37326 186476 -83731 69056 618535 1061316 1026033 557696 -123427 -727443 -853091 -347916
37316c47916O58706J96031j60306J19209M94263K27980l65306m13228R8349L42254
37306H50036j9151m04807k87404J52379M90546N71512M01855K5439l64290n55652
37296H60463n79889n21615k20609M03105R21025Q47408L78507R6089O5628j16396
37286B133716m62391n04781j04734L19987M57067M01551K95197K91805Q01309
37277C628726J946663K760132J918730m06097k347491k484084j424735p15883
37269B875961q72882j196487j044164n11284l0738J28909N680j10180K4114K41064
37259d90007J76532q6806n5917L44542N60122L00142K0588R8241J47611k48882
37249G66166o59931l87885L92269Q04250M30703l06313q04843p73858j94917O31568
$$ plain form
37316 -347916 310790 506821 346515 465724 959987 1187967 822661 409433 507782 850036
37306 850036 830885 426078 138674 291053 781599 1353111 1754966 1780405 1416115 860463
37296 860463 280574 -241041 -461650 -58545 862480 1709888 2088395 2184484 2250112 2133716
37286 2133716 1671325 1166544 1061810 1381797 1838864 2240415 2535612 2827417 3628726
37277 3628726 5575389 8335521 10254251 9848154 7500663 5016579 3591844 2875961
37269 2875961 2003079 806592 -237572 -748856 -779594 -650685 -645005 -755185 -731071 -490007
37259 -490007 -313475 -400281 -456198 -111656 448466 748608 769196 867437 1015048 766166
37249 766166 106235 -281650 110619 914869 1345572 1039259 234416 -539442 -734359 -102791
37239a02791J058602O60539j52680n48158k96257N6721L4769k22426l37624j98997
37229d8302N0970K18599J52027j13444k70665p0899K67861L10657P0407J4906
37219E82117L00088M37044Q705o27455p70094l35496P3482O3068o0484Q8602K76334
37208C5911K6763n00794n98481m6590M95966M08826o3070k96461j90561p4261
37198h02752m3265K0368O395k16278l39427l6244L29378J81026k22026j27661
37188a250486L54919L15319l71229o66121q089P72180Q10508M59745L89445L76336
37178A182527l3897m41137k59389J24010j8090m18292k76792K60435K94594k73539
37168A40430n62495j68863K45573O8938m01821n07633l7356O76066J027812N70951
$$ plain form
37239 -102791 955811 1616350 1463670 915512 619255 675976 710745 488319 150695 -48302
37229 -48302 2668 221267 373294 259850 -10815 -81714 186147 496804 567211 582117
37219 582117 882205 1319249 1327954 700499 -69595 -405091 -331609 -268541 -329025 -240423 35911
37208 35911 62674 -438120 -1036601 -1083191 -587225 -178399 -241469 -537930 -728491 -802752
37198 -802752 -846017 -825649 -819254 -1035532 -1374959 -1411203 -1081825 -900799 -1122825 -1250486
37188 -1250486 -895567 -580248 -951477 -1617598 -1625687 -853507 -42999 416746 806191 1182527
37178 1182527 1148630 707493 448104 572114 554024 135732 -141060 119375 413969 140430
37168 140430 -422065 -590928 -345355 -276417 -678238 -1185871 -1223227 -547161 480651 1051602
37158A051602l66568p54019j32144N86745L88106k48286j28044O40579P98171
37149A836142L5882n52995l65310j47166m41433n75626R573O13563M12913j82714
37139F42829k81143J18184M24755N09891N54106L65782k43205p85832o44927k5840
37129F34600L37335J78395j90491m68897n19346k58862Q8114J5837m87341o72945
37119a343601r8955N90386O20986K53001J84664L37071J99545l8678K05651P01463
37109A611533O18603p1803m56886o8502N07924O03459K40492k65143p37848r53656
37099A028173o87435j84611o88j81402j72800K80067P21156O74523K28401k56896
37089A448488n47064n06201j60530J00547j10810n32404n06700M6844N10369N05760
$$ plain form
37158 1051602 685034 -68985 -201129 385616 773722 525436 397392 1037971 1836142
37149 1836142 1872024 1319029 953719 806553 365120 -210506 -200933 412630 825543 642829
37139 642829 361686 479870 904625 1414516 1968622 2334404 2091199 1305367 660440 634600
37129 634600 971935 1150330 959839 490942 -28404 -287266 -199152 -183315 -670656 -1343601
37119 -1343601 -1442556 -852170 -231184 21817 206481 543552 743097 704419 910070 1611533
37109 1611533 2230136 2158333 1701447 1632945 2140869 2744328 2984820 2719677 1981829 1028173
37099 1028173 340738 156127 155439 -25963 -198763 81304 802460 1476983 1705384 1448488
37089 1448488 901424 395223 234693 335240 224430 -307974 -814674 -767830 -257461 248299
37079B48299K99945J47963m2676j76126J30453P51832Q94289K05130n92224o86152
37069A180733k30178J29688K42719L52081M37263K99900J7926k25016m83032p51028
37059I71056o91856k04179J14103k71249q93728q35030m7075O01105N48360J18442
37049e90051j72178k30341j63539o94J56701J35297J7416R9393L92380N34781
37039A79165L39092O3800k0738M75n9015j63123j91137j66127j50330r2562N8443
37028b02057K31233L30111L15191J31835k42944o13132o43853k48524K74620N81666
37018h5854N85945L66983J6681l01971l69171j51930J29452L08334M54538O06201
37008A559208N53725J43462l62084n24602k79751J1856O4369j6308J8533J69170
$$ plain form
37079 248299 548244 696207 653531 477405 607858 1359690 2253979 2459109 1866885 1180733
37069 1180733 950555 1080243 1322962 1675043 2112306 2412206 2430132 2205116 1722084 971056
37059 971056 279200 75021 189124 -82125 -975853 -1810883 -1857958 -1256853 -708493 -590051
37049 -590051 -762229 -992570 -1156109 -1156803 -1000102 -864805 -847389 -747996 -355616 179165
37039 179165 518257 582057 561319 561794 502779 339656 148519 -17608 -167938 -260500 -202057
37028 -202057 29176 359287 674478 806313 563369 -49763 -693616 -942140 -667520 -85854
37018 -85854 500091 867074 883755 581784 212613 60683 190135 498469 953007 1559208
37008 1559208 2112933 2256395 1894311 1369709 1089958 1101814 1166183 1149875 1168408 1337578
36998A337578J75134j37911n70301o76696k62125K86720L54589j52670o32956
36989b78638n26707n871L53176L92280M39714O06362N36487N7884l61985j94869
36979A017833L56559N62579Q8287o41379j000965p91768k74744J48853K03370
36970c31375q7113l71258k72190J92652O17764O76635M26873J20203p5223p1368
36960H25600J94501O28551R29332Q43944M17491r8432m86918o49186n95081m58818
36950A550984m04858m34415m10059l09830k59676k62296j57935M5543J10841p538
36940e39239k6606J57032K04368q9222l29479q6384L84626N08796K48925L0365
36930D63182j7858j25572k70287j58152J53903K35821j8499k34981j99243r4672
$$ plain form
36998 1337578 1512712 1374801 804500 127804 -134321 152399 506988 354318 -278638
36989 -278638 -805345 -811216 -458040 -65760 373954 980316 1516803 1574687 1212702 1017833
36979 1017833 1374392 1936971 2025258 1383879 382914 -408854 -683598 -534745 -331375
36970 -331375 -418488 -789746 -1061936 -869284 -251520 425115 851988 972191 896968 825600
36960 825600 1020101 1648652 2577984 3421928 3839419 3740987 3254069 2604883 2009802 1550984
36950 1550984 1146126 711711 301652 -8178 -267854 -530150 -688085 -642542 -531701 -539239
36940 -539239 -565845 -408813 -204445 -293667 -623146 -709530 -324904 183892 432817 463182
36930 463182 445324 319752 49465 -108687 45216 281037 262538 27557 -171686 -266358
36920b66358o544K08351M16714K12447l57553o96924n39417k84814j83384Q2669
36910a414813N89857P09967Q1360n96512m79447J95052N52876L62812Q9929l2138
36900E8943j77889l48292l57484k94100l30951k26602K82114P58055N47075r1045
36890a80176k18562L48002P48057M44821p759J2007J92828o7951n78131o11763
36880H1373l255O20362O52735J45887l77874m87158j70929K58213N12247N17459
36870A749060K65071k69953q55577r57725m00420J61248O797n44529n02883K94274
36860a054637Q49988M33209m07917p10571l67746L1962J85154K54827L09074J91361
36850b85296o3962j25144K35381Q28334J159070Q15010j22202j021133j265061
$$ plain form
36920 -266358 -272902 -64551 352163 564610 207057 -489867 -1029284 -1314098 -1497482 -1414813
36910 -1414813 -824956 -114989 -33629 -630141 -1109588 -914536 -361660 1152 91081 58943
36900 58943 -118946 -467238 -824722 -1118822 -1449773 -1676375 -1394261 -636206 -89131 -180176
36890 -180176 -398738 -50736 697321 1142142 1134383 1146390 1339218 1271267 693136 81373
36880 81373 78118 698480 1351215 1497102 1119228 632070 461141 719354 1231601 1749060
36870 1749060 2014131 1744178 888601 -69124 -469544 -308296 -301499 -846028 -1348911 -1054637
36860 -1054637 -204649 228560 -179357 -889928 -1257674 -1225712 -1040558 -785731 -476657 -285296
36850 -285296 -349258 -474402 -239021 589313 1748383 2563393 2441191 1420058 154997
36841A54997q86063l82953N999L88890O26602L48295k42401l15399M00339J036894
36831A135200P64725k0370l70605j65735j4923j14923j02693P3955K5405k63849
36821I46187k81986J33415M38206K03922k42042l44207p9947J55632J36423m6681
36811A018922k39320l51067l25628j78230k0886M9294N0479P5771J96726L79030
36801F55091M39349J81296l17705o71493n90918k28096K4955l8432l43175o76779
36791a565907p64013m22178J47989M79855M81349O08852J055317J197238M49042
36782A667544o54272j006359m46291R8351L8756j68378j0892K13054M0549k87782
36772e15720k60400K0656N7501j83612k80242j24769o9651k53593l34001p5571
$$ plain form
36841 154997 -731066 -1114019 -1108020 -719130 -92528 255767 13366 -302033 98306 1135200
36831 1135200 1899925 1879555 1508950 1343215 1328292 1213369 1110676 1184631 1210036 946187
36821 946187 664201 797616 1235822 1439744 1197702 853495 773548 929180 1065603 1018922
36811 1018922 779602 428535 102907 -75323 -96209 -46915 3564 79335 276061 655091
36801 655091 1094440 1275736 958031 286538 -304380 -532476 -507521 -545953 -889128 -1565907
36791 -1565907 -2329920 -2752098 -2604109 -2124254 -1642905 -1034053 21264 1218502 1667544
36782 1667544 1013272 6913 -439378 -341027 -302271 -470649 -481541 -268487 -227938 -515720
36772 -515720 -776120 -755464 -697963 -881575 -1161817 -1286586 -1356237 -1609830 -1943831 -2019402
36762b019402K35529K43111P0960Q3840K82486L15910P3343j02439P0364L68638
36752c77660L80189R1236j31715o4801J72047M07553N77211N54265J87489l63946
36742A431868o63737n27973k20720N263J82080K76462N2536m01225m98410L8236
36732c25620O23726N89401J22124j69566k43225m43544o35501l78892J56336L35766
36722c68995J36606J94674O36131P47617J34973n68845o07028j11807K44632J53870
36712E91828j86935m76340n05449k32523J11827K49023K47566L40537L89540P5588
36702F04662l80715l87066K5138J48546k25522l94088J17158P74507Q77102M81672
36692A641394m726m62492p57154n12322J83881N10483L4492n31303m08888N4966
$$ plain form
36762 -2019402 -1783873 -1540762 -1469802 -1385962 -1103476 -787566 -714223 -816662 -746298 -377660
36752 -377660 2529 93765 -37950 -102751 69296 476849 1054060 1608325 1795814 1431868
36742 1431868 768131 240158 19438 24701 206781 483243 535779 134554 -363856 -325620
36732 -325620 298106 887507 1009631 840065 596840 153296 -482205 -861097 -704761 -368995
36722 -368995 -232389 -37715 598416 1346033 1481006 912161 305133 193326 437958 591828
36712 591828 404893 -71447 -576896 -809419 -697592 -448569 -201003 139534 529074 604662
36702 604662 223947 -163119 -137981 10565 -214957 -609045 -491887 282620 1159722 1641394
36692 1641394 1636668 1174176 417022 -95300 88581 599064 633556 102253 -306635 -251669
36682b51669J07794j11817L1315M40654M74079O3867k90372l97937l65468j7778
36672c17332P07370J078167L79522p40244q72997J69477J058619P70740k86274
36663A947048j145583j336618q54782J4128N77884K83213l86882l83201L60084
36654i24709P77083L26446k34194j78779Q9008p6021m31388l93311p5868J3071
36644a108662j14577l0038L69655P71110Q76317N63329p8715o02121n07007M4506
36634A83797L31707J48783J10714N17544O98215J04419o61812p23763k80310j86558
36624B42736n61602p30213l62420J73395N22794O67434N61498J22047l90835n62452
36614c17618m15866l21007l51152k37118P4127L23077L85654L49495J83039j94328
$$ plain form
36682 -251669 -143875 -255692 -224377 216277 690356 754223 463851 65914 -299554 -317332
36672 -317332 390038 1468205 1847727 1107483 234486 403963 1462582 2233322 1947048
36663 1947048 801465 -535153 -1389935 -1375807 -797923 -514710 -901592 -1284793 -924709
36654 -924709 -147626 178820 -55374 -234153 -145145 -221166 -652554 -1045865 -1121733 -1108662
36644 -1108662 -1223239 -1253277 -883622 -112512 763805 1327134 1248419 646298 139291 183797
36634 183797 515504 664287 775001 1292545 1990760 2095179 1433367 709604 429294 242736
36624 242736 -318866 -1049079 -1411499 -1238104 -715310 -47876 513622 635669 244834 -317618
36614 -317618 -733484 -1054491 -1405643 -1642761 -1568634 -1245557 -859903 -510408 -327369 -521697
36604e21697n50932n41485k54505r7152j62431j84497q0520j5750N6052L52546
36594b000371P15087O81658K40587m1504J52197M38960L73265Q4304l6744O7837
36584F75276J68323J37948L361k20086m99745o99371o73881l74720J48342O74555
36574f59998P90408K77666m29618n73029j9874N00520L65551j13827k30998M8119
36564d5080J13862k60170n27106k26908K47450J98379l03422m58019J10531P79582
36554c70901P95474K92786k0599O7688J11725j42679l59118k11272J26527L13182
36544F02813K50140m0863n18023q81202o99459n0921M29663M31024L66012N46182
36534D35366N81822J31881l59235l61579j58052k52198l70092J1061N31465M22229
$$ plain form
36604 -521697 -1072629 -1614114 -1868619 -1965771 -2128202 -2312699 -2393219 -2408969 -2352917 -2000371
36594 -2000371 -1285284 -603626 -363039 -404543 -252346 186614 559879 644183 607439 675276
36584 675276 843599 981547 984908 764822 265077 -434294 -1108175 -1482895 -1334553 -659998
36574 -659998 130410 408076 -21542 -594571 -614445 -113925 251626 137799 -93199 -45080
36564 -45080 68782 -191388 -718494 -945402 -697952 -499573 -802995 -1261014 -1150483 -370901
36554 -370901 424573 717359 696760 764448 876173 733494 374376 163104 289631 602813
36544 602813 852953 812090 294067 -587135 -1286594 -1337515 -907852 -476828 -110816 435366
36534 435366 1017188 1149069 789834 428255 270203 18005 -352087 -341026 190439 612668
36524F12668j22065k05177K01834J89551m38221o98036l8873P11289O28021k5216
36514H15775m80945o18237o78709n25314p054M39208L37754l5747r4317J62834
36504f84752L24292L02684K57159Q8934l26344o54326m99758q3329R6735P0389
36494a108316K22637N05014N07976K06326n0020k14280n11994p64522n00514J63093
36484a544600M99413K47126P617K46342N54576L81661l1707o7805K37639K49188
36474G79450k36495o22747l80676J45362J86112l64396p60563m28463K21121L96249
36464a065046J01557R4115O19683R16740L86806l68880l83994J98827L65427j69164
36454F96071n44943j64534L53217J65189m79732o46780j36184K66130j0022n09907
$$ plain form
36524 612668 490603 285426 487260 676811 238590 -459446 -498319 212970 840991 815775
36514 815775 334830 -283407 -962116 -1487430 -1494484 -1055276 -717522 -753269 -847586 -684752
36504 -684752 -360460 -57776 199383 288317 -38027 -692353 -1192111 -1275440 -1178705 -1108316
36494 -1108316 -885679 -380665 127311 333637 283617 69337 -442657 -1207179 -1707693 -1544600
36484 -1544600 -1045187 -798061 -790444 -544102 10474 392135 360428 292623 530262 779450
36474 779450 542955 -79792 -460468 -315106 -128994 -493390 -1253953 -1682416 -1461295 -1065046
36464 -1065046 -963489 -869374 -249691 667049 1053855 684975 300981 499808 865235 696071
36454 696071 151128 -13406 339811 505000 25268 -621512 -757696 -491566 -501588 -1011495
36444a011495m47926J78181N96651L00734l05410m56091N251M84322M32304j601
36434b25080k45221l8643L04312K98483j92800p98087r23809l03459O48172J156443
36424c19689Q71204K02587k04956j27215K26981N65887O31660K38250m58125r11670
36414G14914p72134l69661k50311l89903l15446R9375M72056N42210M61367L79174
36404E71641K24319L4149M0369K22044J91253k13647n79178m74202q8729K5309
36394d6672k87533n90664m10755J88806O50165N35907P0579r9508K33253N22595
36384G66173K92974p8871M7024M54662L03576n33856j184863j037128n22234k87781
36374a780324k95412k18655j17687j53813j33007J09522L25306L82871O62563
$$ plain form
36444 -1011495 -1459421 -1281240 -684589 -383855 -689265 -1145356 -1140105 -655783 -223479 -225080
36434 -225080 -470301 -508944 -204632 93851 -98949 -897036 -1820845 -2124304 -1476132 -319689
36424 -319689 551515 754102 549146 421931 648912 1214799 1846459 2084709 1626584 714914
36414 714914 -57220 -426881 -677192 -1067095 -1382541 -1283166 -811110 -268900 192467 571641
36404 571641 795960 830109 870478 1092522 1283775 1070128 490950 16748 -71981 -46672
36394 -46672 -334205 -924869 -1335624 -1146818 -496653 39254 109833 10325 243578 766173
36384 766173 1059147 980276 1027300 1481962 1785538 1251682 66819 -970309 -1492543 -1780324
36374 -1780324 -2075736 -2294391 -2412078 -2565891 -2698898 -2589376 -2264070 -1881199 -1218636
36365a218636J296917J568660Q79934j33210m07174n0637p1986o56761q92672
36356C14435l42839K59877K89716J82746N13205R27340P28555j5783o42943q10787
36346A403522o67464m08610j85993j96983l97131l76617M9833M31593L27841L2778
36336A2769P6329K88230Q5042m29768m59532K44318Q50670N31135m13459r51236
36326a65502n73295K58957P92152P24735K46251l43390q29702j010371p18991
36317a619156o9375M88694N92951L79260K30235K13566J38445J03169M26556R17058
36307A801403Q65156J19501m62670j99103L41248J86167n46834r01125n83423
36298F20320k42278k84506l92235l53930m27608n96219l59327L30618P50459N03268
$$ plain form
36365 -1218636 78281 1646941 2526875 2393665 1986491 1935854 1863868 1207107 314435
36356 314435 -28404 231473 521189 703935 1217140 2144480 2873035 2857252 2214309 1403522
36346 1403522 736058 327448 141455 -55528 -452659 -829276 -779443 -347850 -20009 12769
36336 12769 89098 377328 462370 32602 -426930 -182612 668058 1199193 785734 -165502
36326 -165502 -738797 -479840 312312 1037047 1283298 939908 110206 -900165 -1619156
36317 -1619156 -1688531 -1199837 -606886 -227626 2609 216175 354620 457789 884345 1801403
36307 1801403 2666559 2786060 2323390 2124287 2465535 2651702 2104868 1203743 620320
36298 620320 378042 93536 -298699 -652629 -1080237 -1676456 -2035783 -1705165 -954706 -451438
36288d51438J55907K32648L38476l2730n14445n03416k07190j76297k54122N5056
36278a357551N08825M34344n6679j78380K21292M52727K04200J6395K60600M96304
36268A002077K59957j92178l79779l02080k20491j68191o7711j443m0597p7202
36258a87638m6068k6671K0087K60379N88672O19849K57464j24433k46734k68165
36248H46742l73414m34088l04786q1230J40398M03266O35481O37197M29860J95533
36238B094959j64161q38702j430194j206382k31129N40313N85567L98924L89915
36229A39110J84050l66737m90758K60639R30198M51296n91777p39729J79016R14284
36219H69592O77409k9659n03846o81708p13461n94670m37024m03144k81085K15949
$$ plain form
36288 -451438 -295531 -62883 275593 242863 -271582 -774998 -982188 -1158485 -1412607 -1357551
36278 -1357551 -848726 -414382 -471061 -649441 -428149 24578 228778 245173 505773 1002077
36268 1002077 1262034 1069856 690077 387997 167506 -685 -68396 -69839 -110436 -187638
36258 -187638 -233706 -260377 -240290 20089 608761 1228610 1486074 1361641 1114907 846742
36248 846742 473328 39240 -265546 -346776 -206378 196888 832369 1469566 1899426 2094959
36238 2094959 1930798 1092096 -338098 -1544480 -1775609 -1235296 -649729 -250805 139110
36229 139110 323160 -43577 -534335 -273696 656502 1107798 516021 -223708 -44692 869592
36219 869592 1547001 1517342 1013496 331788 -381673 -976343 -1413367 -1816511 -2097596 -1881647
36209a881647P57894P36490K35412j15353j54206j89303j16797M13947R83066
36200F69503P32403j40969m58118P8441L84769j45373n97915j35044N63223M75825
36190A426745j11484k83327p8633j78435n04206l54444K79038O36310L98639M9961
36180A280164j3625M0473k1002j60864l17737m88815n43051l69621j59836j59133
36170i13047k60860k17736o5997M6632J98528M30350M50879J04957j91098m8873
36160d66265K04104J01418n0142L26614Q99688P22751k90571j118302j014873
36151f85578l15336L45877P93158R71420O45999o6981m85603k05695L05643M40987
36141A743891L30391M32487O13842L25531m12792q72107o09358j05630r0698n18550
$$ plain form
36209 -1881647 -1123753 -387263 -151851 -267204 -421410 -610713 -727510 -313563 669503
36200 669503 1401906 1260937 802819 881260 1266029 1120656 522741 387697 950920 1426745
36190 1426745 1315261 1031934 953301 774866 270660 -83784 195254 831564 1230203 1280164
36180 1280164 1266539 1307012 1286010 1125146 807409 318594 -224457 -594078 -753914 -913047
36170 -913047 -1173907 -1391643 -1457640 -1411008 -1212480 -782130 -331251 -226294 -417392 -466265
36160 -466265 -262161 -160743 -210885 115729 1015417 1738168 1447597 329295 -685578
36151 -685578 -1000914 -655037 138121 1109541 1755540 1688559 1202956 997261 1302904 1743891
36141 1743891 2074282 2506769 3120611 3446142 3033350 2161243 1551885 1446255 1355557 837007
36131H37007o45281j08235N07407M48502j52100m68489j50223K51254J55535k85017
36121C90360n79045n58829k77016K77162Q77937R33280K51699m39048l95053O3185
36111E44632J03444l01059m69887k16797J1421J21726M72961R10773P65116O1034
36101B003364l06275L417J91776k91616p60116m39461K29269L38410o7916k83128
36091F17724j88300k18020l48107j21749L59399L89676k42342q45865p60023j51315
36081a508922L49021L89895Q9892j94875j41445K63125O49875O78459M76965M03999
36071A455989M56125K85210k05155o73156q07703o29389k60205K24799N92521
36062D39036M91528o7294n74433o28796m24544l40716k97557M7523N73126O81774
$$ plain form
36131 837007 191726 83491 590898 1039400 887300 418811 268588 519842 675377 390360
36121 390360 -188685 -747514 -1024530 -747368 130569 1063849 1315548 876500 481447 544632
36111 544632 648076 347017 -122870 -339667 -328246 -206520 266441 1177214 1942330 2003364
36101 2003364 1697089 1700506 1892282 1600666 840550 401089 630358 968768 900852 617724
36091 617724 429424 211404 -136703 -258452 100947 490623 248281 -597584 -1357607 -1508922
36081 -1508922 -1159901 -770006 -680114 -874989 -1016434 -753309 -103434 575025 1051990 1455989
36071 1455989 1912114 2197324 1992169 1319013 511310 -118079 -378284 -153485 439036
36062 439036 930564 863270 288837 -339959 -764503 -1105219 -1402776 -1355253 -782127 -100353
36052a00353J46725m67931n29934j65622K9570r9621j46691J08782L65536L46859
36042e12680J94399Q5703p5556k73740j61066L33972O20857K43205l13077k88034
36032a46017J79251L44593J19777J07758M13365M38870N0242q2673K86471L94132
36022B105769k69465r58985p43986M5632L29072j52178o15308m11516K85310Q81281
36012D95626R07305K60799o42665j086046p83091j89148K02623M61688P17495
36003C44586O12307p2100o97799n13126J71513M06579J7138l04679k46307k55729
35993e37617n48906o40543j89907M02465O17960M88385L07076J43847k5635q3649
35983f6524M0129K05344K67344K24025J09592N778J08131M29787N41726P6359
$$ plain form
36052 -100353 46372 -421559 -951493 -1117115 -1087545 -1187166 -1333857 -1225075 -859539 -512680
36042 -512680 -318281 -232578 -308134 -581874 -742940 -408968 211889 455094 142017 -146017
36032 -146017 33234 377827 497604 605362 1018727 1457597 1507839 1425166 1711637 2105769
36022 2105769 1836304 877319 133333 178965 508037 355859 -259449 -670965 -385655 495626
36012 495626 1402931 1663730 1021065 -64981 -848072 -1037220 -834597 -372909 344586
36003 344586 956893 884793 186994 -326132 -154619 251960 269098 -35581 -281888 -537617
35993 -537617 -1086523 -1727066 -1916973 -1514508 -896548 -408163 -101087 42760 17125 -66524
35983 -66524 -26395 178949 446293 670318 779910 785688 893819 1323606 1865332 1941691
35973A941691n94966p46895l30083l176j14881l12021k49727j4498K97502P20949
35963E93895R59466N41751k80916n72355m1573M31605J13921m74609m37725J30689
35953I64149M32786J88568j99808m21340m79961l39391M153K29176N0539k44894
35943A83977j61299K24193L64081L1384m74019q01695p61971k06265P53212J469880
35933F21478J272150L02432n90535q22235n41465j61389J20195K70954K78111
35924G49696J50253j52888p12612j321373j385936n99013M57370Q92518N91121
35915a330864J88373O3291q400j89224k45159l4556K50423N00620P94183R42414
35905I31101N72850r9032k70651K86444P17638K61180o38142j026619p82306n11866
$$ plain form
35973 1941691 1346725 599830 269747 266571 151690 -160331 -410058 -424556 -127054 593895
35963 593895 1553361 2095112 1814196 1241841 1200268 1631873 1745794 1271185 833460 964149
35953 964149 1396935 1585503 1385695 964355 484394 145003 149156 378332 428871 183977
35943 183977 22678 246871 610952 642336 168317 -633378 -1395349 -1601614 -848402 621478
35933 621478 1893628 2196060 1605525 783290 241825 80436 200631 471585 749696
35924 749696 899949 747061 34449 -1286924 -2672860 -3271873 -2814503 -1921985 -1330864
35915 -1330864 -1142491 -1079200 -1087600 -1276824 -1521983 -1556539 -1306116 -805496 -11313 931101
35905 931101 1503951 1404919 1134268 1420712 2138350 2399530 1761388 734769 -47537 -559403
35895e59403m26441j57293L81641P31066O08093K69609m538k43021m07812k22921
35885c1020L16445O96182N15727O1877j18700J4491N2019j84221m26772m19575
35875D76453k37314p5784j198j8853j62963l61694l72663l6046M77092Q10090
35865D97120P72880M47426J9421l37771m55446k59422O7117J78942m9749l37819
35855E42699l16039K5271L28250K82386n6955l62002l65902j00312J50435J46986
35845B74817k5878m0861K57584O11214O22859K00305l84367p85705p88538l45899
35835d04469L21555P07244M30365k40199n63747j97498L59536M18641j5169l29407
35825D86852j68498J59011K03464r072r7567Q7264K56483J07008k21241k87901
$$ plain form
35895 -559403 -985844 -1143137 -761496 -30430 577663 847272 842734 599713 191901 -31020
35885 -31020 285425 981607 1497334 1559211 1440511 1455002 1507021 1322800 896028 476453
35875 476453 239139 163355 162157 143304 -19659 -381353 -754016 -790062 -312970 497120
35865 497120 1270000 1717426 1736847 1399076 943630 684208 751325 930267 880518 542699
35855 542699 226660 251931 580181 862567 805612 443610 77708 -22604 127831 274817
35845 274817 248939 208078 465662 1076876 1699735 1900040 1515673 729968 -58570 -404469
35835 -404469 -82914 624330 1054695 814496 250749 53251 412787 831428 816259 486852
35825 486852 318354 477365 680829 671757 574190 661454 917937 1024945 803704 515803
35815E15803N4801M02185K78887k37946o16387n62760l26876k46249l01543l06534
35805a346619k42910j31630J66292O59096R44108O61738J02954j29495p275n6844
35795F19415m11127n38890j75143J15433k18973p98189q37363k95519J42325J06123
35785b291908n7544M0897L05790M70378N38256O87667R51085J135406R64693L30711
35775C075431m59457q20569n23564n5651l4907m05894n98873l63552R238K17630
35765C9832K13051o323l36313l56736J97161P64888M93640m67563j015555o45227
35755a119145p4559L7156L2577L15978M21718q0662n28238j07174O88157P22915
35745C08723K1970l28190M3293L69227K10771J12234M13134N09683q3746p87004
$$ plain form
35815 515803 570604 972789 1251676 1013730 397343 -165417 -492293 -738542 -1040085 -1346619
35805 -1346619 -1589529 -1721159 -1554867 -895771 48337 710075 813029 683534 676259 619415
35795 619415 208288 -330602 -505745 -390312 -609285 -1407474 -2244837 -2540356 -2398031 -2291908
35785 -2291908 -2349452 -2308555 -2002765 -1532387 -994131 -306464 644621 1780027 2744720 3075431
35775 3075431 2615974 1795405 1271841 1216190 1181283 775389 176516 -187036 -177798 39832
35765 39832 252883 246560 -89753 -446489 -249328 515560 1009200 541637 -473918 -1119145
35755 -1119145 -1193704 -1156548 -1123971 -807993 -386275 -466937 -995175 -1102349 -414192 308723
35745 308723 330693 2503 45796 415023 625794 738028 1151162 1660845 1577099 790095
35735G90095p83056k19132R7572j65627o14051p67797m93991M7692N54680P81982
35725g71633P66017O99014N52089J34852m30430p15076n86990l87076l60186l46394
35715a445813k02513o9633j1376J62767M77031O23739M58434K48081K05145J98204
35705F44066J30774J49593K62123K25081K2876n3165R749j23275m10458l41668
35695E15696J32096L47203Q145k93069j50191p3388m76944q01416m93854n5748
35685a341470j16048k10108L37519R50854N99713l53977n87681O4059M26161o403
35675b37381l62314k8073M03168L67003K79148N41820O51020J25589n06405n18775
35665G14800j50176j02128l52816l23786N5984K47699j6268l71920l79613l2294
$$ plain form
35735 790095 7039 -212093 -114521 -280148 -894199 -1661996 -2155987 -2108295 -1553615 -771633
35725 -771633 -5616 693398 1245487 1380339 949909 234833 -352157 -739233 -1099419 -1445813
35715 -1445813 -1648326 -1717959 -1729335 -1566568 -1089537 -465798 -7364 240717 445862 644066
35705 644066 774840 924433 1186556 1411637 1434513 1381348 1391097 1267822 857364 515696
35695 515696 647792 994995 1003140 710071 559880 486492 9548 -791868 -1285722 -1341470
35685 -1341470 -1457518 -1667626 -1330107 -379253 220460 -133517 -721198 -657139 -230978 -237381
35675 -237381 -599695 -627768 -224600 142403 421551 963371 1614391 1739980 1233575 714800
35665 714800 564624 462496 109680 -214106 -158122 89577 73309 -298611 -678224 -710518
35655g10518L28517L73477Q6423j95167j58950O2522J09688m321N5156K64328
35645B11155J77876k77347n41628k71031J13237J34947M400J37516L66744K32813
35635B88682k15410n04544m61449l17502j82640P0559L94723M93514K64461j547
35625a71153R032K47285L77368J46346l51168p41309p21236l30940J72437O01201
35615g62137Q26270O33509m6328p91374r85957n53674l1542J71675J95192K90009
35605a054357M08329M46855N00926O03247N35446J71866k54229m58723m44869
35596D54491l63148k82042k25915j76607K4221M42498P11768L89155k95319n99096
35586H0006l00977L2924j709j16729l9832k2848k01748j52073L44181P14151M37663
$$ plain form
35655 -710518 -382001 -8524 77899 -117268 -276218 -213696 -104008 -108329 -53173 211155
35645 211155 389031 111684 -429944 -700975 -587738 -452791 -448391 -310875 55869 288682
35635 288682 73272 -431272 -892721 -1210223 -1392863 -1322304 -927581 -434067 -169606 -171153
35625 -171153 -162121 85164 462532 608878 257710 -483599 -1204835 -1535775 -1363338 -762137
35615 -762137 64133 697642 651314 -140060 -1126017 -1679691 -1711233 -1539558 -1344366 -1054357
35605 -1054357 -646028 -199173 301753 905000 1440446 1612312 1358083 899360 454491
35596 454491 91343 -190699 -416614 -593221 -569000 -126502 585266 974421 679102 80006
35586 80006 -220971 -188047 -189756 -306485 -346317 -369165 -570913 -722986 -378805 335346 773009
35575G73009n7646n8676L12464L85699K4914l09160l56439k56795j25218o558
35565C25594p4930l61322n03012k49013P1665Q1514k733J85884M69071N01532
35555D44250M45415N58138N00373j26509q68648r23413l43441J11336J31712J6975
35545e3812j11945l19859k44377M96746J332149J219222J75185o70686o67872
35536A154751k92343n6907J69366M50534L91895j05447n15364m94737k87333o2138
35526C52277L33049P06834N31709n4954k16652K15165L54960k37613p30956m04950
35516H48869J45705R3043k09090N4881O79255P85815K56090k15145k65214j57086
35506B017123p8333M9579J38183k2548l37963n29857n44404m42688j83636P2224
$$ plain form
35575 773009 715363 656687 969151 1354850 1379764 1070604 714165 457370 332152 325594
35565 325594 250664 -110658 -613670 -862683 -791018 -709504 -712237 -526353 -57282 444250
35555 444250 889665 1447803 1948176 1821667 953019 29606 -313835 -202499 -70787 -53812
35545 -53812 -165757 -485616 -729993 -233247 1098902 2318124 2493309 1822623 1154751
35536 1154751 862408 805501 974867 1425401 1817296 1711849 1196485 701748 414415 352277
35526 352277 685326 1392160 1923869 1868915 1652263 1867428 2222388 1984775 1253819 848869
35516 848869 994574 1087617 878527 933408 1612663 2398478 2654568 2439423 2174209 2017123
35506 2017123 1938790 1988369 2126552 2104004 1766041 1236184 691780 249092 65456 137680
35496A37680j16034p22800r34833k37393O66586P90134K62265o9543k3132o6716
35486c13786k14911m8758K63420Q6520m64611n02900K15384Q45604P51126L35715
35476I52803J74743J58728K2199OL38088O84426N79174J79743m1330l1671r4508
35465B922401k92072l71469k10573p366l1157l36973o78328o90611l19373m578
35455b0099j41518m37505k72800K96014N08378O1694l60942j34422L33376K83637
35445A15813j69333k57413J82165M64815J65657k42015j75725J66532J88624j40086
35435B99034k68812K9938K81671M5395l90284m43616j33899k4460k99131m55570
35425a359734j25441L03769K84796m1052j01210K12545M48281L30045Q2250j2155
$$ plain form
35496 137680 21646 -701154 -1635987 -1873380 -1206794 -416660 -154395 -223938 -247070 -313786
35486 -313786 -528697 -577455 -314035 -227515 -692126 -1195026 -979642 -134038 617088 952803
35476 952803 1127546 1286274 1308473 1308479 1646567 2330993 2910167 3089910 3048580 3016909 2922401
35465 2922401 2630329 2258860 2048287 2040921 2009764 1672791 994463 303852 -15521 -20099
35455 -20099 -161617 -599122 -871922 -575908 -67530 -5836 -366778 -501200 -167824 115813
35445 115813 -53520 -310933 -128768 336047 501704 259689 83964 250496 439120 299034
35435 299034 30222 60160 341831 387226 -3058 -446674 -580573 -605033 -904164 -1359734
35425 -1359734 -1485175 -1181406 -896610 -937662 -1038872 -826327 -378046 -48001 34249 22094
35415B2094O8402K62923N04974N50611J64240m08649n96703l03308j06189l97997
35405b39602p51653n26524J99286P46095P26017L96039J51786M8674o9253k21969
35395D58896k65377j39382R652K2769j9049J09858L86622M45947P0401l92186
35385F88151m03723M4925M29027M08128J92466J05002J25053N6765j05745k04189
35375A335860j62201m2554M4795J820j85808l81423m04458k23951L8354K33838
35365B54272K09408j24379n37635n22470O2004O07696M90453q514j07869K90508
35355F13474N59458M47435L47656L44064k3061o72959o87601K48351J030110O31455
35345B838382l41464o30030k43669j78263n80592n56020J78152P35806M81176
$$ plain form
35415 22094 90496 353419 858393 1409004 1573244 1164595 567892 264584 158395 -239602
35405 -239602 -991255 -1517779 -1318493 -572398 153619 549658 701444 750118 680865 458896
35395 458896 193519 54137 63789 86558 67509 177367 563989 1009936 1080337 688151
35385 688151 284428 329353 758380 1166508 1358974 1463976 1589029 1645794 1540049 1335860
35375 1335860 1173659 1131105 1175900 1177720 991912 610489 206031 -17920 20434 254272
35365 254272 463680 339301 -198334 -720804 -658800 -51104 439349 430835 322966 613474
35355 613474 1172932 1620367 1968023 2312087 2289026 1616067 928466 1176817 2206927 2838382
35345 2838382 2496918 1866888 1623219 1444956 864364 308344 486496 1222302 1703478
35336A703478o5022j99864l7308k671n2196K6626R1452k6033j01095Q2351K84501
35325A704219K08112o902j06452j81173l49799l19177K14184R33650J170476P00743
35315C967881r6793p39224r52581o70725j24812J78641n8707n31246o98154m18080
35305a43800N3848M91642P66084O86472J97020l89708p30791q69916r41938p19098
35295a600185K772P68949R01482N11676L54707O20708O44073L2613o77875q81466
35285F77454p33805o26698m25569J46277P98896J010820P90264N04803K10683
35276B353125k22117n30522l04714K59253N21749L21511J01185P8303k5143k81122
35266B271508k87119Q9112L18696J572m50430m23847k6683J36911j18597l98117
$$ plain form
35336 1703478 1638456 1438592 1401284 1398613 1346417 1373043 1464495 1438462 1337367 1419718 1704219
35325 1704219 1912331 1905429 1798977 1617804 1268005 948828 1163012 2096662 3267138 3967881
35315 3967881 3871088 3131864 2179283 1508558 1383746 1562387 1503680 972434 274280 -143800
35305 -143800 -89952 401690 1167774 1854246 2051266 1661558 930767 60851 -881087 -1600185
35295 -1600185 -1597413 -828464 73018 584694 939401 1560109 2204182 2236795 1558920 677454
35285 677454 -56351 -683049 -1108618 -962341 -163445 847375 1637639 2142442 2353125
35276 2353125 2131008 1600486 1295772 1555025 2076774 2398285 2499470 2577773 2552630 2271508
35266 2271508 1984389 2073501 2392197 2393769 1943339 1519492 1492809 1629720 1511123 1113006
35256A113006l74899j38297R1012K21090K45600K18726K64169L86226L51783J5468
35246B393884l46484l53008j00033n4229l59420o29306n25388k00781j2108o4494
35236b51367k17203l14713k33349R8686N21409O40428K34618m06115p36023n11925
35226a175554K3906M44830M90230K02897j02504n3959L95918Q02150O53509K9777
35216A711200l81405q5992N59634P48743K37203l44546l11250K02399M56122P2806
35206B864914n45960q17708o65476m04053j80874J33796N49010P76975N79210
35197B289834R2724l36891n24683n04432l28320k3582K62960L03717P5496j50384
35187A156439j32908N2531K04361L19324M71932M84915J09529m31716n21412K3178
$$ plain form
35256 1113006 738107 599810 690822 911912 1157512 1376238 1640407 2026633 2378416 2393884
35246 2393884 2047400 1694392 1594359 1540130 1180710 551404 26016 -174765 -186873 -251367
35236 -251367 -468570 -783283 -1016632 -917946 -396537 243891 478509 72394 -663629 -1175554
35226 -1175554 -1151648 -706818 -216588 -13691 -116195 -170154 225764 1027914 1681423 1711200
35216 1711200 1329795 1243803 1803437 2552180 2789383 2444837 2133587 2335986 2792108 2864914
35206 2864914 2318954 1501246 835770 431717 250843 384639 933649 1710624 2289834
35197 2289834 2382558 2045667 1520984 1016552 688232 664650 927610 1231327 1306823 1156439
35187 1156439 1023531 1076062 1280423 1599747 2071679 2556594 2666123 2234407 1712995 1736173
35177A736173N84009N31687N9950j79599j4787J84370K21842K71685L64559K58263
35167D018152m4380j57402R4877L71357L43043J66180J68032L60554N34134O16700
35157F471247P04512Q65489J042206J065025Q06645M90831O68182J554395K607544
35148A6276076L221887L579566M193417M918520N298708N651164O708586Q338346
35140E8186270R910200J1797214J4898749J8863421K3113280K9548220M0170712
35133B06488066M9886889M6050056K0822164j6797587m6415475n4943553m6642863
35126A58447697l4331446k5487347j9568931j4596004j0916177r042061p908750
35119C6596981o429031m778738l481851k582755k055942j919269j785432j267818
$$ plain form
35177 1736173 2320182 2851869 2911819 2732220 2717433 2901803 3123645 3395330 3759889 4018152
35167 4018152 3973772 3816370 3911247 4282604 4625647 4791827 4959859 5320413 5854547 6471247
35157 6471247 7175759 8041248 9083454 10148479 10955124 11445955 12114137 13668532 16276076
35148 16276076 19497963 23077529 27270946 32189466 37488174 43139338 49847924 58186270
35140 58186270 68096470 79893684 94792433 113655854 136769134 166317354 206488066
35133 206488066 256374955 302425011 323247175 306449588 260034113 205090560 158447697
35126 158447697 124116251 98628904 79059973 64463969 53547792 44505731 36596981
35119 36596981 30167950 25389212 21907361 19324606 17268664 15349395 13563963 12296145
35111A2296145q05542j090249j743507j636217n68882M00645M66703j1463l31146
35102F976487l60815l25457l18227l51646m75556o27898o42913m72688k10047
35093C191240J164p4812n72192j062118p88039K43304R79581O78272m9572k28745
35083B318083N6833P7201k50308m53087m61383m79039k90694K58355M91877k08845
35073A058993j078479q38358L08283R35968N70711J41913J96652K00980r7030
35064A399633j36229J54217j0898p20300q73303j3594P09905L70689k09258R3374
35054G64236Q15651P77740K2527m72072m69661n47178q08122p36397k19007K92242
35044e80041N70715P19651O13425P2314m92970m31527J54750M98749K73602o4202
$$ plain form
35111 12296145 11490603 10400354 8656847 7020630 6451748 6852393 7319096 7307633 6976487
35102 6976487 6615672 6290215 5971988 5620342 5144786 4516888 3873975 3401287 3191240
35093 3191240 3192404 3117592 2545400 1483282 695243 938547 1918128 2596400 2546828 2318083
35083 2318083 2374916 2452117 2201809 1748722 1287339 808300 517606 775961 1267838 1058993
35073 1058993 -19486 -857844 -549561 386407 957118 1099031 1295683 1496663 1399633
35064 1399633 1263404 1417621 1406723 686423 -186880 -200474 509431 880120 670862 764236
35054 764236 1579887 2357627 2380154 1908082 1438421 891243 83121 -653276 -872283 -580041
35044 -580041 -9326 710325 1323750 1396064 903094 471567 626317 1125066 1398668 1334466
35034A334466j05981m1951k06726n26130o22842k69187L19924N91490K34076k97160
35024D09979k29067M26403P86673L92373j15288j10877k6360m81912j003049o44000
35014e95125M44267J133015R01982L30981p124k06403m23578m65173k82227k20339
35004F10276m56208o71404n35571j21504L16304O07017O16378L09154p3961k45999
34994C54482k74116l81055m25959p2361N44163Q56344O57118L53225K93155K97930
34984B202926N8358l58230o14704n08553j48296J53364J77833Q1961K06964M92737
34974A744360M52333p546k45810J31914M65439l3577r39022j129510m63009O8947
34964D4519j25460n33319n37531k09936J67610N38036P00535K98224m43912p02005
$$ plain form
35034 1334466 1228485 1186534 979808 453678 -169164 -438351 -118427 473063 707139 409979
35024 409979 180912 607315 1393988 1786361 1671073 1560196 1533836 1051924 48875 -595125
35014 -595125 -150858 982157 1884139 2215120 2207996 2001593 1578015 1112842 830615 610276
35004 610276 154068 -517336 -1052907 -1174411 -858107 -251090 365288 674442 600481 354482
34994 354482 80366 -300689 -726648 -799009 -254846 601498 1258616 1611841 1904996 2202926
34984 2202926 2261284 1903054 1288350 779797 631501 784865 962698 1044659 1251623 1744360
34974 1744360 2196693 2189147 1943337 2075251 2540690 2507113 1568091 438581 -24428 44519
34964 44519 -80941 -614260 -1151791 -1361727 -1194117 -656081 44454 342678 -101234 -803239
34954h03239j91397L62263L19576J1964L3537K99714L98032L26190K67415R5862
34944A119917k78744m72591j52815L20123L61400j468l07292l99898m25760l47564
34934e84692n9849J93228J13029p0389Q9293M33728L27723l31016q33358o11954
34924a334257p577K33972n7312l44732j44960L80624O94045N68126K71013O8122
34914C27064j29604l96495m11487O7705N54942L28995m20349o83916p9800N49130
34904b93815L99992j32748j78949K92555O27264N80464M79623M83428M05880K02110
34894B865804j0630l49647r49041j395951j084801k05999L17380Q2187k57856
34885i88554l1420M64727N08472O2087k57359j47336K8224o5558j69441J32819
$$ plain form
34954 -803239 -994636 -632373 -312797 -300833 -267296 32418 430450 756640 1024055 1119917
34944 1119917 841173 368582 215767 535890 897290 895822 588530 188632 -237128 -584692
34934 -584692 -644541 -451313 -338284 -408673 -319380 114348 442071 111055 -722303 -1334257
34924 -1334257 -1341834 -1107862 -1165174 -1509906 -1654866 -1274242 -580197 -12071 258942 327064
34914 327064 197460 -199035 -610522 -542817 12125 341120 -79229 -763145 -842945 -293815
34904 -293815 106177 -26571 -205520 87035 714299 1294763 1774386 2257814 2663694 2865804
34894 2865804 2855174 2505527 1556486 160535 -924266 -1130265 -812885 -730698 -988554
34885 -988554 -1019974 -555247 -46775 15312 -242047 -389383 -361159 -426717 -596158 -463339
34875d63339O67040P88264K88912k07283n2529M81998N48271l8105m68699q1364
34865A463166O69023Q20049J75127n46202p16283m66454k92348l78269m95463
34856B32346l94452j34525P13q5326q8322K80091P24239O23546l7934n01216k93010
34845C26150M7597j79235o62781m91686M04671R94793M97591n78774j064745m76266
34835a182685N43549R89382N26456k27711m41559m2893K64759J3338l91855l26703
34825b75922J42532M67440M52632L30013J78055j26069m32305l97305q5508M8152
34815C01715j41159l05859k25473j21869k07781l48700l29863j04155L08022P95055
34805c80067J003794O59507Q4141r2668J87653L52447J16695j39786j15227q4701
$$ plain form
34875 -463339 203701 991965 1280877 1073594 1021065 1503063 2051334 2013229 1544530 1463166
34865 1463166 2132189 2952238 3127365 2581163 1864880 1398426 1106078 727809 232346
34856 232346 -162106 -296631 -295918 -381244 -469566 -189475 534764 1158310 1120376 619160 326150
34845 326150 373747 194512 -468269 -959955 -555284 439509 937100 358326 -706419 -1182685
34835 -1182685 -639136 350246 876702 648991 207432 164539 429298 442636 50781 -275922
34825 -275922 -133390 334050 786682 1116695 1294750 1168681 736376 339071 253563 301715
34815 301715 160556 -145303 -370776 -492645 -700426 -1049126 -1378989 -1483144 -1175122 -380067
34805 -380067 623727 1283234 1367375 1274707 1462360 1814807 1931502 1791716 1676489 1591788
34795A591788l27421o12066o51350n87181o00411m77077k4680M55826N85268M72096
34785a75208M10923L38660Q5536j26804n24K28353P8369l76870n59838k41910
34775c39313J59191K07022n2317l18737m11502k91952j700K89709L80454K76679
34765a02466J86048K30307L10998K77871Q6478k14262n04455o00340l90999q024
34755g28844K42784J67806j22213l06902j57415K08023M14017K74573O2359J30407
34745A84595L53985K81320j63221n31362n11073l14314k08493q1926K17032M64683
34735c08774L55694l6538m06920n83319m82398l1530N43622P25982M05726J84072
34725C65617M84649P75549L48916m56606o53743r3045L44253J11007l24837m22189
$$ plain form
34795 1591788 1264367 652301 951 -586230 -1186641 -1663718 -1688398 -1232572 -647304 -175208
34785 -175208 235715 574375 659911 533107 532583 760936 839305 462435 -97403 -339313
34775 -339313 -180122 26900 -25417 -344154 -755656 -1047608 -1049308 -759599 -379145 -102466
34765 -102466 83582 313889 624887 902758 989236 774974 270519 -329821 -720820 -728844
34755 -728844 -486060 -318254 -440467 -747369 -904784 -696761 -282744 -8171 54188 184595
34745 184595 538580 819900 656679 125317 -385756 -700070 -908563 -990489 -773457 -308774
34735 -308774 46920 10382 -396538 -979857 -1462255 -1493785 -950163 -224181 181545 365617
34725 365617 850266 1625815 1974731 1518125 864382 771337 1115590 1226597 901760 479571
34715D79571l74879n22184o09349k37290L59181N82481L28777P4247J63424L89210
34705F33189L19985j66894p26407q73012m98672j3078J64027J27986K33463M47575
34695c51838M08461J06681l5372J20783J98035P955r5656Q6374J24713l15494
34685B54642p82370o97684l11738k59746m30825j38849O12465R24773L20721m81411
34675i90022n55384R986M05965K72118r116n3424M1064M0559m919Q0920K44105
34664e18148K63100J11121K3146J37594K56651J27656j54006k66619j55135r8614
34654b73254k10492k17712M3085K43781N7527k11420j738N79003P64224J81591
34644I54595o03807q45508n06898p8808J59644K93583L84299L52315K05846O1609
$$ plain form
34715 479571 104692 -417492 -1026841 -1264131 -904950 -322469 6308 80555 243979 633189
34705 633189 953174 786280 59873 -813139 -1311811 -1324889 -1160862 -1032876 -799413 -351838
34695 -351838 56623 163304 127932 248715 446750 454705 359049 445423 570136 254642
34685 254642 -527728 -1225412 -1537150 -1796896 -2227721 -2366570 -1754105 -829332 -508611 -990022
34675 -990022 -1545406 -1535420 -1129455 -857337 -866453 -919877 -878813 -838254 -843173 -762253 -518148
34664 -518148 -255048 -143927 -120781 16813 273464 401120 247114 -19505 -174640 -273254
34654 -273254 -483746 -701458 -658373 -414592 -357065 -568485 -570223 8780 773004 954595
34644 954595 350788 -494720 -1001618 -1080426 -920782 -627199 -242900 109415 315261 376870
34634C76870n9298k10833l33565l32106k93053l50470l70622j04994L11713L98060
34624i68298K5980k64045M3429O53645P68281J44227n39226n31507M1424L85501
34614b40589J21187k11828O4633P37038Q78866Q6475r09530j145720o02367m5967
34604a267802R6186J27464L28752M21204P7823m52469o24814k76797K93865P50871
34594e25717R24223P51316L18581j14499l41531l56520j65312K71352P07043O14577
34584B083513q2908o40762l88109K80401M39818l3886m05217k82295o2235o8780
34574H39540o9081O9470O005l77455n73574k29156K41589L19873J29935J1843
34564C68989j16538l78652m27144K517M47570L45176o2251j88985j12297k85587
$$ plain form
34634 376870 317572 106739 -226826 -558932 -851985 -1202455 -1573077 -1678071 -1366358 -968298
34624 -968298 -942318 -1206363 -1162934 -509289 258992 403219 -136007 -667514 -626090 -240589
34614 -240589 -119402 -331230 -266597 470441 1349307 1435782 526252 -619468 -1221835 -1267802
34604 -1267802 -1171616 -1044152 -715400 -294196 -216373 -668842 -1293656 -1570453 -1276588 -525717
34594 -525717 398506 1149822 1468403 1353904 1012373 655853 490541 761893 1468936 2083513
34584 2083513 2000605 1359843 971734 1252135 1691953 1658067 1252850 970555 908320 839540
34574 839540 770459 839929 845934 468479 -105095 -334251 -92662 227211 357146 368989
34564 368989 252451 -126201 -553345 -550828 -103258 241918 179667 -9318 -121615 -407202
34554d07202n55211m03410J9117R4094j25244j5332L82660L55574j11241j57823
34544i24018M04468N97467o6200n98439r0319P37917O33969k65221p93252n65279
34534i28907k30297j55765l5217K09054K11604J515J06255N77745P64168L70121
34524H90276k8934O1576K74096O4020l68721m46610j61151l7854k77505m69410
34514e00217k34371K19046L74475Q7353k27471j40576K07060K95840o757k27482
34504a53100j7842K83838K05392p7368o5157J78816J43305j95776k90894K6226
34494C7440K45564P5934o7194J45780L24730L1971m35789n11996k08467O2157
34484b99870J71779K29327J68562l4908m1249L24189N15575j5391p75094p70591
$$ plain form
34554 -407202 -962413 -1365823 -1346706 -1252612 -1377856 -1393188 -1010528 -654954 -766195 -924018
34544 -924018 -519550 77917 11717 -586722 -677041 60876 694845 429624 -363628 -928907
34534 -928907 -1159204 -1314969 -1350186 -1141132 -929528 -928013 -821758 -244013 520155 890276
34524 890276 861342 922918 1197014 1261034 892313 445703 284552 246698 -30807 -500217
34514 -500217 -734588 -515542 -141067 -53714 -281185 -421761 -214701 81139 74382 -153100
34504 -153100 -170942 112896 318288 240920 175763 354579 497884 302108 11214 37440
34494 37440 283004 358938 291744 437524 762254 794225 358436 -153560 -362027 -299870
34484 -299870 -128091 101236 269798 234890 193641 517830 1033405 1018014 242920 -527671
34474e27671j3786M67569K21665k7503K82945N85682J83073n42122p08787k40954
34464c19889K00314K75858J98139Q5685j72392m47870m24492j52897L872K85J28128
34453f25259L73290L52958J5997j89483n1140Q1190k0766k9752K86645N04875
34443F98555J80335l34691l36085J54949L78221j00300q22421j056325o22979
34434a860741L7873M01148L35753J45961J59816K82421J38023k79316m22306R4762
34424i66606Q94317J286067J059897M65972k78785r50982j070326l73740N60459
34415F26273Q46388M32206K7052r2853l62108q53417q65988o0196P83941P87371
34405A268669J68490k47043k35599j75825j91483o1927J64186J54967j20254l25649
$$ plain form
34474 -527671 -541457 -73888 147777 120274 403219 988901 1171974 629852 -78935 -319889
34464 -319889 -119575 156283 354422 440107 267715 -180155 -604647 -757544 -753672 -753387 -625259
34453 -625259 -251969 100989 116986 -72497 -123637 -42447 -63213 -92965 193680 698555
34443 698555 878890 544199 208114 363063 741284 640984 -181437 -1237762 -1860741
34434 -1860741 -1822868 -1421720 -1085967 -940006 -780190 -497769 -359746 -639062 -1061368 -966606
34424 -966606 -72289 1213778 2273675 2739647 2460862 1509880 439554 65814 626273
34415 626273 1472661 1904867 1931919 1839066 1476958 623541 -242447 -302643 481298 1268669
34405 1268669 1437159 1190116 954517 778692 587209 525282 689468 844435 724181 398532
34395C98532k71609p1741J54211L53073M06527K71082J07389l2761l75273r06824
34385C2606j069110n18806J62149K07121j58546p8544N56799R65904P12368K32818
34375A044759O48m9474o6826J9341J22584k0185k90588k62788P573j2740l73923
34364A18381m92963j93459m014q9367J29316P75814R70488K42880m53297j25470
34354H78309O27303N15093m50462j086890q81220m94210m60050m71023j25243
34345a948393M61702R68039J133569O92496k83590j011981p35248J52380N16416
34336e4610Q3876k34850J80417P53450O82347P4683l94775m14252j38860K17236
34326G54662M53632L60663j3493k99897k45555J3891K29685K80410P1596m02499
$$ plain form
34395 398532 126923 55182 209393 562466 968993 1240075 1347464 1314703 939430 32606
34385 32606 -1036504 -1555310 -1393161 -1186040 -1344586 -1423130 -866331 99573 811941 1044759
34375 1044759 1045407 995933 929107 948448 1071032 1050847 760259 497471 505044 492304 118381
34364 118381 -374582 -568041 -572055 -661422 -532106 243708 1214196 1457076 1003779 878309
34354 878309 1505612 2020705 1570243 483353 -397867 -892077 -1352127 -1823150 -1948393
34345 -1948393 -1486691 -518652 614917 1307413 1023823 11842 -723406 -571026 -54610
34336 -54610 29266 -205584 -25167 728283 1410630 1485313 1090538 676286 537426 754662
34326 754662 1208294 1568957 1555464 1255567 1010012 1023903 1253588 1533998 1605594 1203095
34316A203095q01605o84519j37155K82769L28543K97283L75165L29935M9534j94641
34306A048404k64155l61722m85227l05021J25024K32467j02611j74076M09910
34297A22993R19546N42926l49381p69326m95588q6215J42302L13766L92488J89291
34287I22802j36494k62420k63800l61953l29876J26710N99723M27860j81168l59520
34277A81864P3002L69566J02668k46563k30639j28898k67116l49688L756N64463
34267G2415Q20602O19791J25437m73416q77434p31661j44374K38639O2529k14256
34257e01728l9908L60279L38526k04104p10052p01215k08168M25126P98866O32176
34247A89798L8783m48544m31604j24335M035j01018j32547j5557J81j61947k41735
$$ plain form
34316 1203095 401490 -283029 -420184 -137415 191128 488411 863576 1193511 1243045 1048404
34306 1048404 784249 422527 -62700 -367721 -242697 -10230 -112841 -286917 122993
34297 122993 1042539 1585465 1236084 466758 -28830 -115045 27257 341023 733511 922802
34287 922802 786308 523888 260088 -101865 -431741 -305031 294692 722552 541384 181864
34277 181864 254866 624432 727100 480537 249898 121000 -146116 -495804 -492048 72415
34267 72415 893017 1512808 1638245 1164829 287395 -444266 -588640 -350001 -287472 -501728
34257 -501728 -541636 -181357 157169 -46935 -756987 -1458202 -1666370 -1241244 -442378 189798
34247 189798 228581 -219963 -651567 -775902 -771867 -872885 -1005432 -1020989 -1020808 -1182755 -1424490
34236a424490q0881J23603J59749J20052J95827L50259L92382K60376O0378j06993
34226E0262k05957j89003k1275J86351J99940q4241m70091o45652n04809j85874
34216a870349J57105M43418N38142K94394j69934m77653m40980k83653k32087
34207b041597j59114Q4156K64490J03358j88750j80544J19978L63278M84450O61054
34197d89241P32336L38890l23305o10601m36648m12946p32539p37332o5673N59568
34187b177491L91661j11735L3926Q26494J318175R97142L14384j51441l33226
34178A107889l78348l04680j30196M9764K09486L17660J63206l80720r84088j151112
34168a481139q39448m09479m9709L01268N39040M25667P3458q1622J26661M29218
$$ plain form
34236 -1424490 -1505371 -1381768 -1222019 -1101967 -906140 -555881 -163499 96877 157255 50262
34226 50262 -155695 -344698 -365973 -179622 20318 -63923 -534014 -1179666 -1684475 -1870349
34216 -1870349 -1713244 -1269826 -731684 -437290 -607224 -1084877 -1525857 -1809510 -2041597
34207 -2041597 -2200711 -2116555 -1852065 -1748707 -1937457 -2118001 -1998023 -1634745 -1150295 -489241
34197 -489241 243095 581985 258680 -351921 -788569 -1201515 -1934054 -2671386 -2737059 -2177491
34187 -2177491 -1785830 -1897565 -1863639 -1037145 281030 1278172 1592556 1441115 1107889
34178 1107889 729541 424861 294665 344429 553915 871575 1034781 654061 -330027 -1481139
34168 -1481139 -2320587 -2730066 -2779775 -2478507 -1939467 -1513800 -1440342 -1521964 -1395303 -966085
34158i66085N85854O01042M55199Q6502k78681k40624J81706M71913K81708j69285
34148A009249m80668n26327m09862k69734k20492k32072o8809L65325P05420N30643
34138D02673l327l79587m50445m25974k80595J38347M83321K12954m10676n15428
34128a228737J5312L24255L1627j45919K39612M65484n6349n29446M8717J143537
34118C08093J376571N70994j67857k58045k44405m84444m56806J79503Q00459
34109A624063O95058Q4267l10495k81409k04052l65096o45646p50267m92445M5991
34099f00031M99411M94010L9010m66259o38697m11506R170L15994L06855R6463
34089c55580J0066J18295J14498j37016k94656j40370o2799l84599o05144p7421
$$ plain form
34158 -966085 -380231 220811 676010 762512 483831 243207 424913 896826 1178534 1009249
34148 1009249 528581 2254 -407608 -677342 -897834 -1129906 -1198715 -833390 -127970 402673
34138 402673 399346 19759 -430686 -856660 -1137255 -998908 -515587 -302633 -713309 -1228737
34128 -1228737 -1213425 -889170 -857543 -1003462 -763850 -298366 -354715 -884161 -835444 308093
34118 308093 1684664 2255658 2087801 1829756 1585351 1100907 644101 823604 1624063
34109 1624063 2319121 2403388 2092893 1811484 1607432 1242336 596690 -153577 -646022 -600031
34099 -600031 -100620 393390 432400 -33859 -672556 -1084062 -1074892 -758898 -452043 -355580
34089 -355580 -345514 -227219 -112721 -249737 -544393 -684763 -747562 -1132161 -1737305 -1814726
34079a814726Q16269J046546M12593k55574l81970k04424M6472N15173R93788
34070A174147Q41244P9082l72353r0598J39327l35062r04949p57543k39254j42611
34060f08570k87690M2228O93166Q53907M47314J72142K41865J67315j79948l31627
34050A210102j77371j76817m20627m04862P453K87783J96413J58874L41818K44410
34040A267176l23604p12212m61969q7723j62811l24640K0130N60081N08537j78998
34030A03967p91127q25504l27528M46336J067075R61617J09483n79423l21802
34021a56906L91841N20556N3145j33696J50342J41558m15680o91911j26294N93293
34011C26248N35044j92559p89702q51459n12493K7950N27226O00400J60216k92369
$$ plain form
34079 -1814726 -998457 48089 460682 205108 -176862 -381286 -334814 180359 1174147
34070 1174147 2015391 2094473 1722120 1631522 1770849 1435787 530838 -226705 -465959 -608570
34060 -608570 -896260 -854032 -160866 693041 1140355 1312497 1554362 1721677 1541729 1210102
34050 1210102 1032731 855914 435287 30425 37878 325661 522074 680948 1022766 1267176
34040 1267176 943572 231360 -230609 -318332 -481143 -805783 -785653 -225572 282965 103967
34030 103967 -687160 -1512664 -1840192 -1393856 -326781 634836 744319 164896 -156906
34021 -156906 234935 755491 808636 674940 825282 966840 551160 -140751 -267045 326248
34011 326248 861292 668733 -120969 -972428 -1484921 -1456971 -929745 -329345 -169129 -461498
34001d61498k57350J39074M54099N15180L43265p8519n25590m78768J31828N79342
33991C61063L13783j87925k19729P487j17019l75818r3210M98252M68022k02339
33981D52567m36007K29599Q92129P23899J38085j09059q4785k08497l60278k64026
33971I73627j63684l11779l02371K44478P80212N27204k31310n08669r6047K54089
33961A165750R6199j69944j48514j3413m276n2117j38767m00277o47254m13433
33951g26046K36057N56312J42163m55412n49298k54220j06127j55365m1458K49247
33941a104147L14437K2618k30066j02400J80063J34758k73741m86430l2856P54131
33931h23633J006466M14791k86064k53474L37869O30175L56908Q8238J76042K19453
$$ plain form
34001 -461498 -718848 -579774 -125675 389505 732770 654251 128661 -350107 -218279 361063
33991 361063 674846 486921 267192 274679 157660 -218158 -311368 186884 654906 452567
33981 452567 16560 246159 1138288 1862187 2000272 1891213 1806428 1597931 1237653 973627
33971 973627 809943 498164 195793 440271 1220483 1747687 1516377 1007708 911661 1165750
33961 1165750 1261949 1092005 943491 930078 925802 873685 734918 334641 -312613 -726046
33951 -726046 -489989 66323 208486 -246926 -796224 -1050444 -1156571 -1311936 -1353394 -1104147
33941 -1104147 -789710 -767092 -997158 -1099558 -919495 -784737 -1058478 -1544908 -1577764 -823633
33931 -823633 182833 597624 311560 58086 395955 1026130 1383038 1471276 1647318 1866771
33921A866771j28222m95642l95548K4089L19625M09551L81920M5857p16438j418264
33911a06301j406381o97285J25928O69299Q65199O08733m3309m35732J14471J209345
33901I03967J592975P48665l88585o78359j54113L03407K00776k13617n38064
33892A777052o10923m37427j63088n0417j43133p7338M14309R57989R41592L73546
33882B982162j66298m22602p17557j152101j188067m55685M93247Q09992M56466
33873F39557R8696N6129K4203j46192j07795K88217N68130L27214j08023j84456
33863A455680N5747J67423N3827k4817k8578j63732m12243n72059p09983j008428
33853a187163j184203p06613K98032R98598R30641N34127L69239L82828K97951
$$ plain form
33921 1866771 1738549 1242907 847359 871448 1191073 1600624 1982544 2028401 1311963 -106301
33911 -106301 -1512682 -2209967 -2084039 -1414740 -549541 59192 15883 -419849 -305378 903967
33901 903967 2496942 3245607 2857022 2178663 2024550 2327957 2528733 2315116 1777052
33892 1777052 1166129 728702 565614 515197 372064 294726 709035 1667024 2608616 2982162
33882 2982162 2815864 2393262 1675705 523604 -664463 -1120148 -626901 183091 639557
33873 639557 738253 794382 818585 672393 564598 852815 1420945 1748159 1640136 1455680
33863 1455680 1511427 1678850 1732677 1707860 1679282 1515550 1103307 531248 -178735 -1187163
33853 -1187163 -2371366 -3077979 -2779947 -1781349 -850708 -316581 52658 435486 733437
33844G33437J78331J62917Q6912j85540m24864m22972l24035k07537J67164P48496
33834E12309Q73959J81609o43410p52868l56263k63427n56451o19917k73397P8615
33824a819241L21954O78842Q90380L92109n45114q88886l63543J03828j20923
33815a350594m25355j00136M65084N41148K96133L49019N75222L21050m15697
33806B55874q90957o68544q5237L47534M44468K33916j64509m95938n56785m17771
33796a997949k09939J36861O12868Q32232M87785o8440k11000R1585L06565J74704
33786A55272j9848m3877n6971k27770m24629m42405k38886J27634N15498O47562
33776h420L63102p1108k22005m2909J67680K79644L73989L45032N671l91720l44903
$$ plain form
33844 733437 911768 1074685 1161597 976057 551193 128221 -195814 -403351 -236187 512309
33834 512309 1386268 1567877 924467 171599 -184664 -448091 -1004542 -1624459 -1897856 -1819241
33824 -1819241 -1497287 -818445 71935 464044 -81070 -969956 -1333499 -1229671 -1350594
33815 -1350594 -1775949 -1876085 -1411001 -869853 -573720 -224701 350521 671571 255874
33806 255874 -635083 -1303627 -1388864 -1041330 -596862 -362946 -527455 -1023393 -1580178 -1997949
33796 -1997949 -2207888 -2071027 -1458159 -625927 -138142 -206582 -417582 -325997 -19432 155272
33786 155272 135424 91547 34576 -193194 -617823 -1060228 -1299114 -1171480 -655982 -8420
33776 -8420 354682 283574 61569 18660 186340 465984 839973 1185005 1190676 798956 454053
33765D54053O9920K01356j26628k63784J74224N61373K38166l41929k76982L22975
33755A012744M98376p665l51847J2234M53063K27180k81756j81223M64115O82275
33745B527496P0581o29916o91029l97799l93379n74173l50214K53766N44547K47065
33735F06945p1381Q5564M10827L74223N6385j06822q4495j90845m38313n04233
33725A37855k95451n5266Q5149J92891J67112j91360o47769o15154o379M77451
33715g50921K55770l15889m49385K7305N73844P47559O51640N53961M46939J68326
33705A909149k31261m50562k90200L9905Q9200k81130o38696m80999P4319M08159
33695A47884K30614p8513j07020m429j39947m63862o00784m15576j04141J88171
$$ plain form
33765 454053 523973 725329 598701 334917 509141 1070514 1308680 966751 689769 1012744
33755 1012744 1511120 1503455 1151608 1163842 1616905 1844085 1562329 1381106 1845221 2527496
33745 2527496 2598077 1968161 1277132 879333 485954 -88219 -438433 -184667 359880 606945
33735 606945 535564 621128 1031955 1406178 1462563 1355741 1271246 1080401 642088 137855
33725 137855 -157596 -212862 -127713 65178 232290 40930 -606839 -1221993 -1228372 -750921
33715 -750921 -495151 -811040 -1260425 -1233120 -659276 88283 739923 1293884 1740823 1909149
33705 1909149 1677888 1227326 937126 977031 1066231 785101 146405 -334594 -260275 147884
33695 147884 378498 299985 192965 188536 48589 -415273 -1016057 -1431633 -1535774 -1347603
33685a347603M60715N97944L93857q6946m63032m51499j23089K97142O39285P30889
33675F47663M09078k17604o86397n79912J5096N69541O35866K62044j04489r8398
33665H52488J85739L24360P2357l54282n60357m20933j32376Q0501J40771O7924
33655B56192o4678j32997o1698J05106L24332O16610Q50747O75016m152o24884
33645A939594n23269J19006M04874n5221n95156m96256m2925l8364n71800r12146
33635g71663n78896P1837M54394M63239L42054K05125M345k09820k82625j74514
33625d76524j8762M2412J4156N0266K75925N48566M95237k3162n70790n77331
33615b40007j35607L6377l99100q35271n23110L48710Q63991N73809j7719k35689
$$ plain form
33685 -1347603 -886888 -288944 104913 17967 -445065 -896564 -1019653 -722511 -83226 647663
33675 647663 1056741 839137 152740 -427172 -412076 157465 793331 1055375 950886 852488
33665 852488 1038227 1362587 1434944 1080662 520305 99372 -33004 47497 188268 256192
33655 256192 191514 58517 -3181 101925 426257 1042867 1893614 2568630 2564478 1939594
33645 1939594 1416325 1535331 1940205 1884984 1289828 793572 750647 712283 140483 -771663
33635 -771663 -1350559 -1278722 -824328 -361089 -19035 186090 190435 -19385 -302010 -476524
33625 -476524 -495286 -452874 -438718 -388452 -112527 436039 931276 908114 337324 -240007
33615 -240007 -375614 -339237 -738337 -1573608 -2096718 -1748008 -884017 -310208 -327927 -563616
33605e63616m8749J29483J17830J01293K21876L54719L16967J00536j64925l64237
33595B01177m49663m16187l02029j96626j73223j78864n5948K35042M54842L12652
33585e68827j06219l35587q6082L70324N76278M83324L75451L22087J22235j89475
33575I63509k47754L3261J72075k03941o97357o25441l6018K80645j13273o49528
33565a123822m91064L36131R36659O58745j18239m86613j07713M77501O03747
33556F85332K16038k93115o51326p67526m62439L24782J067929R81158N1457p52772
33546C99518o69680j15903J1643l46554m51160J7992N11319N13437K61956K28136
33536C60704L53664K65588j8808j07758R4623J91027q9687m14607k97590J17841
$$ plain form
33605 -563616 -612365 -482882 -365052 -263759 -41883 312836 629803 730339 565414 201177
33595 201177 -248486 -664673 -966702 -1163328 -1336551 -1515415 -1571363 -1336321 -881479 -568827
33585 -568827 -675046 -1010633 -1096715 -726391 -150113 333211 708662 1030749 1152984 963509
33575 963509 715755 749016 921091 717150 19793 -605648 -641666 -361021 -474294 -1123822
33565 -1123822 -1614886 -1278755 -342096 316649 198410 -288203 -395916 81585 685332
33556 685332 901370 608255 -43071 -810597 -1273036 -948254 119675 1100833 1152290 399518
33546 399518 -270162 -386065 -374422 -720976 -1172136 -1154144 -642825 -129388 132568 360704
33536 360704 714368 979956 961148 853390 948013 1139040 1049353 634746 337156 454997
33526D54997J35360n11779j129574q98670l3253M56273J86302o8249M06965J115566
33516A13938J041061J25164o80591p25250l07554K6942J62777K02083J54681J10230
33506B23481K61833N04175M23116p0181n01029m77295j68374J15647L68768N75817
33496A255958M18752k27151q50613q73706m33428j21484j49260k56508k80641
33487a518081k88451k12617J26339N96561P79934N07959O6324j76824r6129K07200
33477g785M79923M28198L2921l11339k52189K5361P1617j86445m55973o10895
33467g86606p47947p62426m00460J84111M32717J38622k05396m7455N40621J025412
33457f28807J011454N20988j00537m30712l17397m3734M6359L6641K33194N36816
$$ plain form
33526 454997 590357 78578 -1050996 -1949666 -1982919 -1526646 -1340344 -1408593 -1001628 113938
33516 113938 1154999 1280163 599572 -125678 -433232 -406290 -243513 -41430 113251 223481
33506 223481 485314 989489 1412605 1342424 841395 364100 195726 311373 680141 1255958
33496 1255958 1674710 1447559 596946 -276760 -710188 -831672 -980932 -1237440 -1518081
33487 -1518081 -1806532 -2019149 -1892810 -1296249 -516315 -8356 57968 -118856 -214985 -7785
33477 -7785 472138 900336 933257 621918 369729 395090 466707 280262 -175711 -786606
33467 -786606 -1534553 -2296979 -2697439 -2513328 -2080611 -1941989 -2147385 -2194840 -1654219 -628807
33457 -628807 382647 903635 803098 372386 54989 11255 57614 94255 327449 864265
33447H64265N03104R2457j71167J5942L04835L22711K36613L02827K95954j11369
33437B656172o97688r33889p01433l24396k7701K10186L71878L76702K77719J45193
33427A352743j29850n62369p71880m11446K16316M87275L44910K83954M20734
33418A230387K59805l74471q39047n80260l3995O407l84919l87970K76310Q93166
33408F5413P87591K19592j35106j62241k43282m50863m22472n5442K45576K28382
33398G7148K06357M47651N63617N0431p90999j119114p16222k41666j70498j31006
33388a824301L26219Q59055Q17643K65584j20404m3442J26059O7354n1225n92
33378D21950J08689R8755O5978J88882L97948M45851J90841k81336o78024o37956
$$ plain form
33447 864265 1367369 1459826 1288659 1304601 1609436 1932147 2168760 2471587 2767541 2656172
33437 2656172 1958484 1024595 323162 -1234 -28935 181251 553129 929831 1207550 1352743
33427 1352743 1222893 660524 -111356 -522802 -306486 180789 525699 809653 1230387
33418 1230387 1490192 1115721 276674 -303586 -337581 -331174 -716093 -1104063 -827753 65413
33408 65413 853004 1072596 937490 775249 531967 81104 -341368 -396810 -151234 77148
33398 77148 283505 731156 1294773 1345204 554205 -564909 -1281131 -1522797 -1693295 -1824301
33388 -1824301 -1498082 -639027 178616 444200 323796 280354 406413 473767 422542 421950
33378 421950 530639 629394 695372 884254 1282202 1728053 1918894 1637558 959534 321578
33368C21578r9152M47117M03694j40671m52547j56638K47322J86677j18112j11470
33358E27798J14646J486m21418m40505K00526P54645M78812l06931o79118l27963
33348i8022K11708L95368K16290p6775l43133m99875m42306j89463Q1030K38447
33338e06731K76175J63058j45593m82847n06963j01840M29458O76083M86570N544
33328B92914m36591m54152N6303O11442N20666k57541r77599j020141n53940l5826
33318b254465M52747R16131R80090M16141j75129j8324O11751O70628r9505p76921
33308G23144o68089k38973j73832k77622l834M74445N17222O8534k81892k11068
33298g1965k3775o5354k48882k72216j6587L30649M22026J16961k21384q7110
$$ plain form
33368 321578 222426 669543 1073237 932566 480019 323381 570703 757380 639268 527798
33358 527798 642444 643930 222512 -217993 -17467 737178 1215990 909059 229941 -98022
33348 -98022 113686 509054 725344 648569 305436 -194439 -636745 -826208 -745178 -506731
33338 -506731 -230556 -67498 -213091 -695938 -1202901 -1304741 -875283 -199200 287370 292914
33328 292914 -143677 -597829 -541526 69916 590582 333041 -644558 -1664699 -2218639 -2254465
33318 -2254465 -1801718 -885587 94503 510644 335515 317191 928942 1599570 1500065 723144
33308 723144 55055 -183918 -357750 -635372 -639206 -164761 352461 420995 139103 -71965
33298 -71965 -95740 -161094 -409976 -682192 -698779 -368130 53896 170857 -50527 -137637
33288a37637L75053M02601k58509q30093o40162k12791m15483r64710q29917N3804
33278c457844O33708M12370J34336M29146Q18659O75780K83605J92571K31908
33269C54239j3210k92313j35709J94308J08729k14672q4265M64537O37382J72282
33259A191308k53087j66998j8425l07282p02875o20612j77036Q2776R4844K30843
33249f46544M70533L15526l38932q19421n02606L02635O91744K64906m56138p29958
33239a448255m13691O2401L08383K95296J47880o3856k34952j88197O9604K15782
33229a249605j1240l69598l18509K92966R69234J118276P04190J99601k1233m5423
33219A268659j43050k95715j96605K63935P09994O68239J75074k44286k36865
$$ plain form
33288 -137637 237416 640017 381508 -448585 -1088747 -1301538 -1717021 -2681731 -3511648 -3457844
33278 -3457844 -2824136 -2411766 -2277430 -1848284 -1029625 -353845 -70240 122331 354239
33269 354239 341029 48716 -86993 107315 216044 1372 -82893 381644 1019026 1191308
33259 1191308 938221 771223 752798 445516 -257359 -877971 -1055007 -972231 -877387 -646544
33249 -646544 -176011 139515 -199417 -1018838 -1521444 -1218809 -527065 -262159 -718297 -1448255
33239 -1448255 -1861946 -1799545 -1491162 -1195866 -1047986 -1111842 -1346794 -1534991 -1465387 -1249605
33229 -1249605 -1260845 -1630443 -1948952 -1655986 -686752 431524 1135714 1335315 1314082 1268659
33219 1268659 1125609 829894 633289 897224 1607218 2275457 2450531 2206245 1969380
33210A969380j0632N4600p5537j90023k31798k69606k04549R5897L89703K23980
33200A751415l63714p14204l81028K24766L82328L2523k44840j53506p5149l78988
33190G9603p60524o40515k3665M64099M08186R9512K6001J66105J17736j87302
33180b50764k94837J28244P53050R35284M72484k18806o25926o08678l44098m9065
33170a03112J28946J13912m0517j55014j04005M1039J26466J22826J19167J52310
33160D02018J65681J41081J48640K18178K62079K07521J31732J49670J95819O4138
33150B086557k80150n52951m49976n3955K05756M6743l19477m23571p6796M13779
33140E95959N73089K51325k27786m02928j63992J11035l5132n84157r92039p73090
$$ plain form
33210 1969380 1958748 2013348 1937811 1747788 1515990 1246384 1041835 1137732 1527435 1751415
33200 1751415 1387701 673497 292469 517235 899563 932086 687246 533740 458591 79603
33190 79603 -680921 -1321436 -1345101 -881002 -472816 -373304 -347303 -181198 -63462 -250764
33180 -250764 -545601 -417357 335693 1270977 1743461 1524655 898729 290051 -54047 -103112
33170 -103112 25834 139746 99229 -55785 -159790 -118751 7715 130541 249708 402018
33160 402018 567699 708780 857420 1075598 1337677 1545198 1676930 1826600 2022419 2086557
33150 2086557 1806407 1253456 803480 749525 955281 1002024 682547 258976 182180 595959
33140 595959 1169048 1420373 1192587 789659 625667 736702 701570 117413 -874626 -1647716
33130a647716n9686N47088O47837L96840J63353N8725l8336j46462j49693p9318
33120c07368j28625k85286k39221J21647L83317J39872l02988k50904L38806O89048
33110A58298K90836l68586n67396l76257l32520m21600j61088L85519N30746R2314
33100g69734j93170J94139O85734M97306j31367l17129J09227M07717Q0566m69284
33090I4005o00543k36382K21003M05484K04013k63756o94504q09703o09167k74670
33080b564220J17721N16480O24751J70687n06474o48863n7803N78788O10377K39271
33070i19285M7126J10678R5331l7076M589K46453L64747K50123J93373L67810
33060G23869N11290L37566j1097j63566j5189J85785J73760o7663l51068m95345
$$ plain form
33130 -1647716 -1707402 -1160314 -512477 -115637 47716 106441 68105 -78357 -228050 -307368
33120 -307368 -435993 -721279 -960500 -838853 -455536 -315664 -618652 -869556 -530750 158298
33110 158298 449134 80548 -486848 -863105 -1195625 -1617225 -1778313 -1392794 -862048 -769734
33100 -769734 -962904 -768765 -83031 414275 282908 -34221 75006 482723 563289 94005
33090 94005 -506538 -742920 -521917 -116433 87580 -176176 -870680 -1680383 -2289550 -2564220
33080 -2564220 -2446499 -1930019 -1305268 -1134581 -1641055 -2289918 -2347721 -1768933 -1158556 -919285
33070 -919285 -872159 -761481 -666150 -703226 -698637 -452184 -87437 162686 356059 723869
33060 723869 1235159 1572725 1561628 1398062 1382873 1568658 1742418 1674755 1323687 828342
33050H28342m71756l60247j84461J23298N26622P65317O02281J53876k10151l09131
33040A463990l18234m49460o35810o29184l07054J96337N91159O37776L67911
33031I17431J37988L04263P42823Q48598K08881p88185j257992q05933k1620J92682
33021D78936l06984p72377n58627M7147K73802n3835l51137k18812j3261j65806
33011a640954l90306j15356N36840Q43121N21352N0439j62862k94889m97260m01605
33001a551480K42319Q75519P33001n8497o04633m08305J52562N25548O03325N15747
32991A025106L10131P2620j1309N8197N8344n1872m6767Q0520k0085m36946o79983
32980C57956l73687J19988K45776Q6175Q4630K07401O1793k74801k87888N9652
$$ plain form
33050 828342 356586 -3661 -188122 -64824 461798 1227115 1829396 1983272 1773121 1463990
33040 1463990 1145756 696296 60486 -568698 -875752 -679415 -88256 549520 917431
33031 917431 1055419 1359682 2102505 2951103 3159984 2371799 1113807 307874 286254 478936
33021 478936 171952 -600425 -1159052 -1111905 -838103 -891938 -1243075 -1461887 -1475148 -1640954
33011 -1640954 -2031260 -2146616 -1609776 -766655 -245303 -194864 -357726 -652615 -1149875 -1551480
33001 -1551480 -1309161 -433642 299359 240862 -363771 -772076 -619514 -93966 509359 1025106
32991 1025106 1335237 1407857 1396548 1454745 1513089 1461217 1414450 1494970 1474885 1037939 357956
32980 357956 -15731 104257 350033 436208 520838 728239 790032 515231 227343 286995
32970B86995J76010j88985n01398l12641L6322M9018q6814J21918N72409O58859
32960H11693J54785n08103q24121o80100k55263J85937L78180K21093r3996k87647
32950h97542k69410p9144K67820O52210P64664M46364k7780k72870k28959l6611
32940C18742K27814L71415L2930o93176r87197l46189M53183L11224n06261p06111
32930a523626K2642N50016J48408m35122l72238j01555l65859p82953m95005L09378
32920c045914O61993L33541M4994K46325N84870O11152K81824k45221o96217o50036
32910a872689l6101M99237L81707K9398K11427P51437Q29308L92976J46377J65792
32900A498869k04612q87505q54209J34023Q45556L78635m89925o42631k80991
$$ plain form
32970 286995 463005 274020 -227378 -540019 -503697 -454679 -541493 -419575 152834 811693
32960 811693 966478 458375 -365746 -1045846 -1301109 -1115172 -736992 -515899 -609895 -897542
32950 -897542 -1166952 -1246096 -978276 -326066 438598 884962 857182 584312 355353 318742
32940 318742 546556 917971 950901 257725 -729472 -1075661 -622478 -311254 -817515 -1523626
32930 -1523626 -1500984 -950968 -802560 -1237682 -1609920 -1711475 -2077334 -2860287 -3355292 -3045914
32920 -3045914 -2383921 -2050380 -2005386 -1759061 -1174191 -563039 -281215 -526436 -1222653 -1872689
32910 -1872689 -1908790 -1409553 -1027846 -998448 -787021 -35584 793724 1186700 1333077 1498869
32900 1498869 1294257 406752 -447457 -313434 532122 910757 420832 -221799 -502790
32891e02790j90778k34522J74790P19790O10923Q238k43290p8061j72523n41171
32881d49394m36609K36974O18543K93802q1213L6313K54174J09538j26692j03942
32871C51494r2393l73349n63349k46055K27974K88871R7213K08176N60794N64730
32861A024106J02676k60016j43744J35240R8835k48647n13154m17807o6603J95396
32851i3718J38306r4570j51169P5617L35750M30951M52438M43353J73075m18495
32841A291538q51396o40899k6110L25774K42940J43424K16978J16705l38907o97951
32831b17904m87313N8225K96679K0567l82182n14845l69200j43151L9245J57645
32821a542234K45306L61754M72377L81690O231l04961o5265O02062Q80496K56039
$$ plain form
32891 -502790 -693568 -928090 -753300 -33510 577413 585651 342361 264300 91777 -449394
32881 -449394 -886003 -649029 -30486 263316 182103 218416 472590 582128 455436 351494
32871 351494 259101 -114248 -677597 -923652 -695678 -406807 -309594 -101418 459376 1024106
32861 1024106 1126782 866766 723022 858262 957097 708450 195296 -222511 -289114 -93718
32851 -93718 44588 -49982 -201151 -125534 210216 641167 1093605 1536958 1710033 1291538
32841 1291538 440142 -200757 -226867 98907 341847 485271 702249 818954 480047 -217904
32831 -217904 -705217 -646992 -350313 -329746 -711928 -1226773 -1595973 -1739124 -1699879 -1542234
32821 -1542234 -1296928 -935174 -462797 -81107 -74876 -379837 -445102 156960 1037456 1293495
32811A293495o71286q50877j57813M49769K50367l28312m43341k1775K97622J53632
32801b8519j63044k70832j48133K9403J17620N825k78672m27491j53583L15853
32791a001573M10617l0665n26906n73823j65252L80342P37035O31517L8262n24480
32781f24926l75726M02823Q99121N46294j17254k79982J7587J51141m4223j53083
32771D21772N4370L37229M30889K92100p2617n82128r10264p53675k58871J69606
32761h71589M09993N91096O33709L08036k58325n91378m64163j27714Q4994Q0298
32751b05043m9716j12354P3244L73115L44861j09031m01853q2010L47736J34169
32741C13118m78095n88250j02586J54231j36649l09467N1805M06350K37666j54137
$$ plain form
32811 1293495 622209 -228668 -386481 63288 313655 -14657 -457998 -479773 -182151 -28519
32801 -28519 -191563 -462395 -610528 -581125 -463505 -457680 -736352 -1163843 -1317426 -1001573
32791 -1001573 -590956 -621621 -1148527 -1722350 -1887602 -1507260 -770225 -138708 -100446 -624926
32781 -624926 -1000652 -597829 301292 847586 730332 450350 467937 619078 574855 421772
32771 421772 476142 813371 1244260 1536360 1463743 881615 -28649 -782324 -1041195 -871589
32761 -871589 -461596 129500 763209 1071245 812920 221542 -242621 -370335 -285341 -205043
32751 -205043 -254759 -367113 -293869 79246 424107 315076 -86777 -168787 178949 313118
32741 313118 -164977 -753227 -855813 -701582 -838231 -1147698 -1095893 -689543 -451877 -606014
32731f06014l55671m93010o24364l33418M02914P65974K96627k32361l0096L85610
32721h23809J44322l61047j15403O70430P73715n7883p18070n29230j49042k65376
32711a431393m85353j56642N21186Q88599P88444N42783L36733J13807j47491
32702I70673l87034n29144m63972j94583l293j15782k54587k1631L37124K17216
32692d45013k61383k67627M12187R01434N40907q8989q0510M59545O97025L10883
32682B178459k50420n37917n33732m23383l74838m41383m14949k4906M86081M29572
32672I2584l07607q22365l47047O05904R58223N79940K66965L85252M26762j4017
32662A824594o12388q94452q35726o24368l17062J4474J80417J39706P6575Q0045
$$ plain form
32731 -606014 -961685 -1454695 -2079059 -2412477 -2009563 -1243589 -946962 -1179323 -1209419 -823809
32721 -823809 -679487 -1040534 -1155937 -485507 288208 230325 -487745 -1016975 -1166017 -1431393
32711 -1431393 -1916746 -2073388 -1552202 -663603 124841 667624 1004357 1118164 970673
32702 970673 583639 54495 -409477 -604060 -607353 -723135 -977722 -999353 -662229 -445013
32692 -445013 -706396 -974023 -561836 339598 880505 791516 711006 1170551 1867576 2178459
32682 2178459 1928039 1390122 856390 433007 58169 -383214 -798163 -823069 -336988 92584
32672 92584 -215023 -1037388 -1384435 -778531 179692 759632 1026597 1411849 1838611 1824594
32662 1824594 1212206 317754 -517972 -1142340 -1459402 -1444928 -1264511 -1124805 -1048230 -968185
32652i68185L7999o8316p0366J19602M23793P65482R96014P55544j06428j004646
32642H80493j101603m13787J55193M6229l19967l94207l02516l41771k77942K12481
32632a857397Q01789Q87333M90623J73730J98985L33100L77415L23170M0980n78965
32622A190763j137755r90709j81648M18045J80674m93557p76006m40473O8958
32613b161708L45108L83469L38994K79223K19436J82572J62507J28807P9970M9848
32603H226J03618L23463O56774P64415K80031o24119j186461q62481l3680M13450
32593a56764J48221l02134l13704J23048N66306O99655N48136K96240Q1222r5671
32583A594555l24945n84906o28748k89230J35875J54838j76169k02353L94514
$$ plain form
32652 -968185 -930186 -998502 -1068868 -949266 -525473 240009 1236023 1991567 1885139 880493
32642 880493 -221110 -634897 -479704 -433475 -753442 -1147649 -1450165 -1791936 -2069878 -1857397
32632 -1857397 -1055608 -168275 322348 496078 695063 1028163 1405578 1728748 1769728 1190763
32622 1190763 53008 -937701 -1119349 -701304 -520630 -1014187 -1790193 -2230666 -2161708
32613 -2161708 -1816600 -1433131 -1094137 -814914 -595478 -412906 -250399 -121592 -41622 8226
32603 8226 111844 435307 1092081 1856496 2136527 1512408 325947 -536534 -570214 -156764
32593 -156764 -8543 -310677 -624381 -501333 64973 764628 1312764 1609004 1690226 1594555
32583 1594555 1269610 684704 55956 -233274 -97399 57439 -118730 -321083 73431
32574G3431J022853R50462L19908j29141j34614q6163j93538j77554M9554M2884
32564A738082m70075j018968r70209l73487J90078L85475L40512K40516J26910
32555A88834N5597R9587J79785J58882Q8196J11933J65501N4908j69630k29608
32545G03985p0847l344k42572n44248n04047r4852L00969L58848J35363j05302
32535f6047k31974k82677k41256q123L22545L89507K4029l51476j45436N73493
32525a7415J048608P64806N6280m13958m45041k84397j24556j097q220k05978
32515C69032l76422k23733J88667M72977L77596L557l72199m85633k19202K06949
32505e8411L12578r1809n73058o11148l06613j53634k35719j47282K77817O57299
$$ plain form
32574 73431 1096284 2046746 2366654 2237513 2102899 2016736 1823198 1645644 1695198 1738082
32564 1738082 1268007 249039 -721170 -1094657 -904579 -519104 -178592 61924 188834
32555 188834 244431 344018 523803 682685 770881 882814 1048315 1103223 933593 703985
32545 703985 633138 629794 387222 -157026 -661073 -755925 -454956 -96108 39255 -66047
32535 -66047 -298021 -580698 -821954 -830077 -507532 -118025 -93996 -445472 -590908 -17415
32525 -17415 1031193 1795999 1852279 1438321 993280 708883 584327 583230 575010 369032
32515 369032 -7390 -231123 -42456 430521 808117 811674 439475 -46158 -265360 -58411
32505 -58411 254167 162358 -410700 -1021848 -1328461 -1482095 -1717814 -1865096 -1587279 -929980
32495i29980O21298L00243Q0822J39895L42180M06705J46089k76332m03835l9224
32485C87861M07806M49807K00838Q7889J00031p3435l01095j39989L01763M15672
32475A837148J01862r3994l0817k43386q10760r15351j35948O80270O10005j0065
32465I88964l08543k97898n40017q57167n29964L81056R80537Q20227L19085j16355
32455H39925m78776o01928j77469M55898M64605k01444n48630J932P13725O67977
32445A135815P5299k52655j70932j34069k31914j28532J80948L04813J40756j6309
32435I03220r2764l40135o91636o31068j951N61232M38704q8013k52914Q5864
32425a09461L13967M9326k96640k04531J36301J35858k84684n75737l35381K31671
$$ plain form
32495 -929980 -308682 -8439 72383 212278 554458 961163 1107252 830920 427085 387861
32485 387861 795667 1245474 1446312 1534201 1634232 1560797 1259702 1119713 1421476 1837148
32475 1837148 1939010 1845016 1814199 1570813 760053 -155298 -291246 389024 999029 988964
32465 988964 680421 382523 -157494 -1014661 -1544625 -1163569 -183032 637195 956280 839925
32455 839925 361149 -240779 -418248 37650 502255 300811 -247819 -245887 467838 1135815
32445 1135815 1211114 958459 787527 653458 421544 293012 473960 778773 919529 903220
32435 903220 810456 470321 -221315 -852383 -854334 -293102 145602 57589 -195325 -109461
32425 -109461 204506 253832 -42808 -247339 -111038 24820 -259864 -835601 -1170982 -939311
32415i39311P06347Q99497P60522K57862l80315o51222l43729J29386K80773J63830
32405H83640P7354m6790m42075q75219q17884k50206K47287K82844N5312j21557
32395a007294k02454j64354J29722N62853O78759K80416k04320k61206P3947M10923
32385B96992N75306O27900N01092L5967o13637r47783o44377J2754L83043J81756
32375D09013j57400j1611N51958P68767K46840l61809k28800M28160O74183K66097
32365B585398r3876K174O3826l08373o55395m67471j06022k13484o63363q13119
32355f69705m77264K1401M76647P91776O30515j47146q74182p23075Q6363N34911
32345c49759K75512m431J64012L27785M0044l25372k62137j5772j27956n14891
$$ plain form
32415 -939311 -232964 666533 1427055 1684917 1304602 653380 309651 439037 719810 883640
32405 883640 960994 914204 472129 -403090 -1220974 -1471180 -1223893 -941049 -885737 -1007294
32395 -1007294 -1209748 -1374102 -1244380 -681527 -2768 277648 73328 -187878 -113931 296992
32385 296992 872298 1500198 2001290 2037257 1423620 475837 -168540 -155786 227257 409013
32375 409013 251613 240002 791960 1560727 1807567 1445758 1216958 1645118 2319301 2585398
32365 2585398 2491522 2493696 2557522 2249149 1593754 1126283 1020261 806777 143414 -669705
32355 -669705 -1146969 -1125568 -648921 142855 773370 626224 -247958 -971033 -884670 -349759
32345 -349759 -74247 -78678 85334 413119 453163 127791 -134346 -150118 -278074 -792965
32335g92965o39433l39690Q5699M27443O66106O63248K80091k45323n00904m53524
32325h49252l77131k77966J13826P25343J016999O79255O9572k77578k69096j46447
32315D07525m3714N1442R0080K6885p304J30002L13880K83042K0469k23138k75394
32304G73775j93549o3806J21414L26836M14683L14623J10785j01672k95218l92273
32294A015598k59560O9783L31959L20558J09561j13932k79836l76206l45751k13202
32284B58972j45976j97998j73181L4636J76582L3249j31385P5959M68800M20112
32274H19770k32655q78594q99102l84606J05246K02224m3570l48228m13721j50311
32264b223547J90640K84940J81547K13651M27810M80541K32124K2996J15832K50464
$$ plain form
32335 -792965 -1432398 -1772088 -1686389 -1258946 -592840 70408 350499 105176 -395728 -849252
32325 -849252 -1226383 -1504349 -1390523 -665180 351819 1031074 1100646 823068 553972 407525
32315 407525 363811 415253 505333 532218 524914 654916 968796 1251838 1272307 1049169 773775
32304 773775 580226 516420 637834 964670 1379353 1693976 1804761 1703089 1407871 1015598
32294 1015598 756038 825821 1157780 1478338 1587899 1473967 1194131 817925 472174 258972
32284 258972 112996 -85002 -258183 -223547 -46965 -13716 -145101 -69142 399658 819770
32274 819770 587115 -291479 -1190581 -1575187 -1469941 -1267717 -1311287 -1659515 -2073236 -2223547
32264 -2223547 -2032907 -1747967 -1566420 -1352769 -924959 -444418 -212294 -189298 -73466 176998
32254A76998P8962k72448m27662k99938p9448R9509J83026J12696j8289J3391
32244d33203J43239n236m22949m84664R4063N75232J88215n92904o51881R4400
32234a495688O12587L59337n5460p0916m6855l97428o75552k73636M87069P51362
32224h05180L47312r1309j03769J21513K54585K55556J69158o8984l85336m20029
$$ plain form
32254 176998 255960 -16488 -444150 -744088 -823536 -724027 -541001 -428305 -446594 -433203
32244 -433203 -289964 -295200 -718149 -1202813 -1108750 -533518 -345303 -938207 -1590088 -1495688
32234 -1495688 -883101 -523764 -579224 -650140 -696995 -1094423 -1769975 -2043611 -1556542 -805180
32224 -805180 -457868 -549177 -652946 -531433 -276848 -21292 147866 78882 -306454 -726483
$$ [...]
##END NTUPLES=NMR SPECTRUM
##END=
