##TITLE=31Pdec_LR-585-RM2
 , 24 sc
 28.9.2016
##JCAMPDX= 6.0         $$ Bruker NMR JCAMP-DX V2.0
##DATA TYPE= NMR SPECTRUM
##DATA CLASS= NTUPLES
##ORIGIN= UXNMR, Bruker Analytische Messtechnik GmbH
##OWNER= root
$$ XWIN-NMR		Version 3.5
$$ Wed Oct 25 13:57:42 2023 Russian Standard Time (UT+4h)  she@DPX200
##.OBSERVE FREQUENCY= 81.013821
##.OBSERVE NUCLEUS= ^31P
##.ACQUISITION MODE= SIMULTANEOUS
##.ACQUISITION SCHEME= undefined
##.AVERAGES= 24
##.DIGITISER RES= 17
##SPECTROMETER/DATA SYSTEM= spect
##.PULSE SEQUENCE= zgpg30
##.SOLVENT NAME= DMSO
##.SHIFT REFERENCE= (INTERNAL, DMSO, 0, 182.463)
##AUDIT TRAIL= $$ (NUMBER, WHEN, WHO, WHERE, WHAT)
$$ ##TITLE= Audit trail, XWIN-NMR		Version 3.5
$$ ##JCAMPDX= 5.01
$$ ##ORIGIN= Bruker BioSpin GmbH
$$ ##OWNER= she
$$ F:/spectra/data/she/nmr/P31/2/pdata/1/auditp.txt
$$ ##AUDIT TRAIL=  $$ (NUMBER, WHEN, WHO, WHERE, WHAT)
(   1,<2023-10-25 13:55:36.56 +0400>,<she>,<DPX200>,
      <created by zg, POWCHK disabled, PULCHK disabled
       configuration hash MD5:
       00 E9 B6 7A A2 85 ED C7 34 08 36 98 17 FE 4E 26
       data hash MD5: 32K
       E9 B0 C3 BC 05 01 B9 7B E1 38 85 B9 64 DC 42 D2>)
(   2,<2023-10-25 13:55:39.07 +0400>,<she>,<DPX200>,
      <Start of raw data processing
       efp BC_mod = 2 LB = 1.5 FT_mod = 6 PKNL = 1 PHC0 = 3156.188 PHC1 = -263.9138 SI = 64K 
       data hash MD5: 64K
       6C 30 5E FC 8C B7 B8 CE 9C E7 FE AE AA 9A 0C DE>)
(   3,<2023-10-25 13:56:00.00 +0400>,<she>,<DPX200>,
      <pk PHC0 = -280.3495 PHC1 = 250.1999 
       data hash MD5: 64K
       16 A1 73 18 22 BA 1E B0 72 1C 28 7B 33 90 A5 C6>)
(   4,<2023-10-25 13:56:03.54 +0400>,<she>,<DPX200>,
      <abs ABSG = 5 
       data hash MD5: 64K
       3D E5 E2 AE 76 EA E1 A1 09 C3 52 CC 09 E1 F1 10>)
$$ ##END=
$$ 
$$ hash MD5
$$ D5 2C EE CC D8 16 87 5A C8 9F E2 18 4B A5 6E 97
##$RELAX= 
##$RELAX= 
##$RELAX= 
##$RELAX= 
##$RELAX= 
##$RELAX= 
##$RELAX= 
##$RELAX= 
$$ Bruker specific parameters
$$ --------------------------
##$DU= <F:/spectra>
##$EXPNO= 2
##$NAME= <P31>
##$PROCNO= 1
##$TYPE= <nmr>
##$USER= <she>
##$AMP= (0..31)
100 100 100 100 100 100 100 100 100 100 100 100 100 100 100 100 100 100 
100 100 100 100 100 100 100 100 100 100 100 100 100 100 
##$AQSEQ= 0
##$AQ_mod= 1
##$AUNM= <au_zg>
##$AUTOPOS= <>
##$BF1= 81.014009
##$BF2= 200.13
##$BF3= 200.13
##$BF4= 200.13
##$BF5= 200.13
##$BF6= 200.13
##$BF7= 200.13
##$BF8= 200.13
##$BYTORDA= 1
##$CFDGTYP= 0
##$CFRGTYP= 5
##$CHEMSTR= <none>
##$CNST= (0..31)
1 1 145 1 1 1 1 1 1 1 1 1 1 1 1 1 1 1 1 1 1 1 1 1 1 1 1 1 1 1 1 1 
##$CPDPRG= <waltz16>
##$CPDPRG1= <>
##$CPDPRG2= <waltz16>
##$CPDPRG3= <>
##$CPDPRG4= <mlev>
##$CPDPRG5= <mlev>
##$CPDPRG6= <mlev>
##$CPDPRG7= <mlev>
##$CPDPRG8= <mlev>
##$CPDPRGB= <>
##$CPDPRGT= <>
##$D= (0..31)
0 1 0 0 0 0 0 0 0 0 0 0.03 2e-05 3e-06 0 0 0 0 0 0 0 0 0 0 0 0 0 0 0 0 
0 0 
##$DATE= 1698227736
##$DBL= (0..7)
120 120 120 11 120 120 24 19 
##$DBP= (0..7)
150 150 150 150 150 150 150 150 
##$DBP07= 0
##$DBPNAM0= <>
##$DBPNAM1= <>
##$DBPNAM2= <>
$$ [...]
##$SUBNAM3= <"">
##$SUBNAM4= <"">
##$SUBNAM5= <"">
##$SUBNAM6= <"">
##$SUBNAM7= <"">
##$SUBNAM8= <"">
##$SUBNAM9= <"">
##$SW= 369.568048894756
##$SWIBOX= (0..15)
0 1 3 0 0 0 0 0 0 0 0 0 0 0 0 0 
##$SW_h= 29940.119760479
##$TD= 32768
##$TD0= 1
##$TE= 0
##$TE2= 300
##$TE3= 300
##$TEG= 300
##$TL= (0..7)
0 120 53 12 22 120 120 120 
##$TP= (0..7)
150 150 150 150 150 150 150 150 
##$TP07= 0
##$TPNAME0= <>
##$TPNAME1= <>
##$TPNAME2= <>
##$TPNAME3= <>
##$TPNAME4= <>
##$TPNAME5= <>
##$TPNAME6= <>
##$TPNAME7= <>
##$TPOAL= (0..7)
0.5 0.5 0.5 0.5 0.5 0.5 0.5 0.5 
##$TPOFFS= (0..7)
0 0 0 0 0 0 0 0 
##$TUNHIN= 0
##$TUNHOUT= 0
##$TUNXOUT= 0
##$USERA1= <user>
##$USERA2= <user>
##$USERA3= <user>
##$USERA4= <user>
##$USERA5= <user>
##$V9= 5
##$VALIST= <valist>
##$VCLIST= <CCCCCCCCCCCCCCC>
##$VD= 0
##$VDLIST= <DDDDDDDDDDDDDDD>
##$VPLIST= <PPPPPPPPPPPPPPP>
##$VTLIST= <TTTTTTTTTTTTTTT>
##$WBST= 1024
##$WBSW= 4
##$XGAIN= (0..3)
0 0 0 0 
##$XL= 0
##$YL= 0
##$YMAX_a= 18157
##$YMIN_a= -17786
##$ZGOPTNS= <>
##$ZL1= 120
##$ZL2= 120
##$ZL3= 120
##$ZL4= 120
##$ABSF1= 182.463
##$ABSF2= -187.1042
##$ABSG= 5
##$ABSL= 3
##$ALPHA= 0
##$AQORDER= 0
##$ASSFAC= 0
##$ASSFACI= 0
##$ASSFACX= 0
##$ASSWID= 0
##$AUNMP= <proc_1d>
##$AZFE= 0.1
##$AZFW= 0.5
##$BCFW= 0
##$BC_mod= 2
##$BYTORDP= 0
##$COROFFS= 0
##$CY= -3
##$DATMOD= 1
##$DC= 0
##$DFILT= <>
##$DTYPP= 0
##$F1P= 0
##$F2P= 0
##$FCOR= 1
##$FTSIZE= 65536
##$FT_mod= 6
##$GAMMA= 0
##$GB= 0
##$INTBC= 1
##$INTSCL= 9.790993e-09
##$ISEN= 30
##$LB= 1.5
##$LEV0= 0
##$LPBIN= 0
##$MAXI= 10000
##$MC2= 0
##$MEAN= 0
##$ME_mod= 0
##$MI= 50
##$NCOEF= 0
##$NC_proc= -5
##$NLEV= 6
##$NOISF1= 182.463
##$NOISF2= 159.3651
##$NSP= 0
##$NTH_PI= 0
##$NZP= 0
##$OFFSET= 182.463
##$PC= 4
##$PHC0= 2875.838
##$PHC1= -13.71388
##$PH_mod= 1
##$PKNL= yes
##$PPARMOD= 0
##$PSCAL= 0
##$PSIGN= 0
##$REVERSE= no
##$SF= 81.0140089999434
##$SI= 65536
##$SIGF1= 159.3651
##$SIGF2= -187.1042
##$SINO= 113.3802
##$SIOLD= 16384
##$SREGLST= <1H.CDCl3>
##$SSB= 0
##$STSI= 65536
##$STSR= 0
##$SW_p= 29940.119760479
##$SYMM= 0
##$S_DEV= 0
##$TDeff= 32768
##$TDoff= 0
##$TI= <>
##$TILT= no
##$TM1= 0
##$TM2= 0
##$TOPLEV= 0
##$USERP1= <user>
##$USERP2= <user>
##$USERP3= <user>
##$USERP4= <user>
##$USERP5= <user>
##$WDW= 1
##$XDIM= 65536
##$YMAX_p= 539590031
##$YMIN_p= -3348808
$$ End of Bruker specific parameters
$$ ---------------------------------
##NTUPLES= NMR SPECTRUM
##VAR_NAME=  FREQUENCY,     SPECTRUM/REAL,   SPECTRUM/IMAG
##SYMBOL=    X,             R,               I
##VAR_TYPE=  INDEPENDENT,   DEPENDENT,       DEPENDENT
##VAR_FORM=  AFFN,          ASDF,            ASDF
##VAR_DIM=   65536,         65536,           65536
##UNITS=     HZ,            ARBITRARY UNITS, ARBITRARY UNITS
##FACTOR=    0.456856943014862, 1,           1
##FIRST=     14782.0589164792, 0,            0
##LAST=      -15158.0608439998, 0,           0
##MIN=       -15158.0608439998, -3348808,    0
##MAX=       14782.0589164792, 539590031,    0
$$ Real data points
##PAGE= N=1
##DATA TABLE= (X++(R..R)), XYDATA
$$ [...]
40743f18299l55031j24599M0350R3458J57789K20433J21854j64666m17262l97528
40733a443501j25101J46081K09378J08028K8685L3707n960j67877k66624l8078
40723a521262M49837P25826L94605l41597p82139m43238L61835P86194L74331
40714D392l74372n57851K4489O04691M43299j95359m34991m702M40914L01334
40704B51844j67757l32744r6328R7346l186j60675q7566J72772L92648M47253
40694E13607L55776J94913N5155r684k9165o1872j22053k12532l44168m41036
40684a01059l53909r6385P7477P315j07317M731K64967L72347K45291N7789p6881
40673B94366j63052j45547J143P5441j05056l11607j53472K97091N55950M28361
$$ y = [-618299, -973330, -1097929, -1057579, -964121, -806332, -585899, -464045, -628711, -1045973, -1443501, -1568602, -1422521, -1213143, -1105115, -1076430, -1042723, -1048683, -1216560, -1483184, -1521262, -1071425, -345599, 49006, -292591, -1074730, -1517968, -1156133, -369939, 4392, -369980, -927831, -903342, -298651, 144648, -50711, -485702, -490404, -49490, 251844, 84087, -248657, -344985, -247639, -250825, -411500, -499066, -326294, 66354, 513607, 869383, 1064296, 1119451, 1109767, 1080602, 1018730, 896677, 684145, 339977, -101059, -454968, -551353, -473876, -466561, -573878, -569147, -304180, 68167, 313458, 371247, 294366, 131314, -14233, -13090, 62351, -42705, -354312, -507784, -210693, 345257, 773618]
40663G73618K03652Q0618r8695l76639m45245j58365J50577J73884P6722J14187
40653D94314J58466j4424k56735k64849n9039R8160Q8940l6474k15776k96288
40643c03705o8765L35868M04956m5630m62559l03663J34313J89954j29267k41349
40633d89847K7336K49969J88501J03115J55723J12171j56599l88644l74123k52157
40623h24555j63205k3861J45762R7095j87849l10019k9080L21033L25532J02655
40613e46492N6606K35831L26563J78198j8967p3388l9979p0309j67914j68632
40603b88483N0817L59106M44945J94911j15677j88779j28599k15040l72113k74786
40593e33698M4555J82207L2474l9123J37754K23751J28j94575m5207J73933Q2838
$$ y = [773618, 977270, 1057888, 959193, 582554, 137309, -21056, 129521, 303405, 380127, 494314, 652780, 638356, 381621, 116772, 57733, 155893, 244833, 208359, -7417, -303705, -372470, -36602, 368354, 322724, -139835, -443498, -309185, -119231, -248498, -489847, -462511, -212542, -24041, 79074, 234797, 346968, 190369, -198275, -572398, -824555, -987760, -1011621, -865859, -768764, -956613, -1266632, -1295712, -974679, -649147, -546492, -489886, -254055, 72508, 250706, 231739, 158351, 118372, 48063, -119851, -288483, -237666, 121440, 566385, 761296, 645619, 456840, 328241, 113201, -258912, -533698, -489143, -306936, -274462, -313585, -175831, 47920, 48048, -146527, -191734, -17801, 65037]
40582F5037j32788o5037J90995K17659j9691k07386k82445m27806n45494l16279
40572a523235J91634N04049M05354J54930k2191j83531l15840k25416M7238J42485
40562h24523q1782l06524k40214M923K09352L53346M26870L05896N5179p320J90851
40551H6054K74875J2626k63698j85634N0721M5280j37306j49477L488K6736j00688
40540c37023j44122j16653k37074m02707k46099K13350M96106L80135K02005K47949
40530E5867L18493J74069j3643j0103K1485j98677n59997p10321n44420k15933
40520a683180J68169N22582O12681L01756j09903j69361J33512L88776L45689
40511E10721J22775j20083l18078l01514R2306O03491O86296K43051j92363k33521
$$ y = [65037, -67751, -132788, 58207, 275866, 256175, 48789, -233656, -661462, -1206956, -1523235, -1331601, -827552, -422198, -267268, -289459, -472990, -788830, -1014246, -967008, -824523, -906305, -1212829, -1453043, -1448120, -1238768, -885422, -458552, -152656, -97477, -104797, 86054, 360929, 373555, 109857, -75777, -25056, 20224, -117082, -266559, -263071, -236335, -337023, -481145, -597798, -834872, -1237579, -1483678, -1270328, -774222, -394087, -192082, 55867, 374360, 548429, 534786, 524683, 546168, 347491, -212506, -922827, -1467247, -1683180, -1515011, -992429, -379748, -77992, -187895, -357256, -223744, 165032, 510721, 633496, 513413, 195335, -106179, -13873, 589618, 1275914, 1518965, 1326602, 1093081]
40501A093081j72826l96480o78252n49717r9021J70283J55794K42872N50736O68075
40491I84545L31911j09600k11747o0612m9023k63353m38231l91537j96290J7308
40481c86629J71338J86672M4911j13091j39487r7790j38490k02553q9564J72599
40471e92084K85562R6209j57488j48970J31378L97473L95227J14342k38023m00505
40461a16879k80165n5019N2845J01721L11519N81381M68538j26192n86491l13480
40451C7778L71891N87956J10694l57021k79663m9228k64910p38605q03715l63911
40441a748734O649j9040j05869Q9548L59528L33660P5243n0343R6268L34153M78593
40430a50344M91829L85060J93883K8698j3398L6868J08027K16291L69470M23009
$$ y = [1093081, 920255, 523775, -154477, -704194, -803215, -632932, -477138, -234266, 316470, 984545, 1316456, 1206856, 995109, 934497, 885474, 622121, 183890, -207647, -403937, -386629, -215291, -28619, 16292, -96799, -236286, -334076, -472566, -675119, -764683, -592084, -306522, -210313, -367801, -516771, -385393, 12080, 407307, 521649, 283626, -116879, -397044, -452063, -399218, -297497, 14022, 595403, 1063941, 937749, 351258, 37778, 409669, 997625, 1108319, 751298, 471635, 422407, 157497, -581108, -1384823, -1748734, -1742085, -1761125, -1866994, -1777446, -1417918, -1084258, -1009015, -1059358, -963090, -628937, -150344, 341485, 726545, 920428, 949126, 935728, 972596, 1080623, 1296914, 1666384, 2089393]
40420B089393K12109j95965n35583o29651n31850l99918l30824l05245k17250
40411h44784K129K34932K50197K1957j57585l6179K46743L58150K17675K2353
40401C15588q6633j18491n3651J23825K21521K289l82920m63317q7049L20750
40391b08088L31414N7672j24855j46972k07445l28386l15670j20999P9416J84759
40381g99154K66508L20585J96369j17191l58489k98765l2314J76917K19815J76572
40371b49147J27058Q2265N2202M1262L665p4187q2118P4393K52907J72150k08480
40360A91970n64857n69829k62330N5301J72240Q3782j22923k92541k05838J68145
40350a346880M57720K52696k63149m10231P5581N86374M20793k50368o22562l23714
$$ y = [2089393, 2301502, 2105537, 1569954, 940303, 408453, 8535, -322289, -627534, -844784, -842655, -607723, -357526, -335569, -493154, -529333, -282590, 75560, 293235, 315588, 228955, 110464, 56813, 180638, 402159, 404448, 21528, -441789, -528838, -208088, 123326, 180998, 56143, -90829, -298274, -626660, -942330, -1063329, -983913, -799154, -532646, -212061, -15692, -132883, -491372, -790137, -822451, -645534, -425719, -249147, -122089, -39824, 12378, 53640, 57305, -16882, -99000, -24607, 228300, 400450, 191970, -372887, -942716, -1205046, -1149745, -977505, -893723, -1016646, -1309187, -1515025, -1346880, -889160, -636464, -899613, -1309844, -1234263, -647889, -227096, -477464, -1100026, -1423740]
40340a423740K17501M57645L37576Q5541j68110l54407l41586j11498J14804J39283
40330a046991L9697l841J6741J3841J5495J03283K33595K95433K70126J89694
40320A27073L1749j92379l41941l02497j53192k4860J05998L01331M45410L77575
40310C74267J89721J49239L17661M55857L40973J823l85447o59275o97007m65491
40300c77679j26540O0777L7381K3899K07962M55996M59083J21718k99567m53568
40290A09462k44628P9908J82646j3757k39934j76249J72611M52448L33739j16387
40280E39859m75128l99816q482K41716R4724j83878j55221K03623M81264L96261
40270G34922R9316j71099m08743n98807m79920O0850N50965L83321l08759p05894
$$ y = [-1423740, -1206239, -748594, -411018, -325477, -493587, -847994, -1189580, -1301078, -1186274, -1046991, -1007294, -1011135, -994394, -980553, -965058, -861775, -628180, -332747, -62621, 127073, 158822, -33557, -375498, -677995, -831187, -856047, -750049, -448718, -3308, 374267, 563988, 713227, 1030888, 1486745, 1827718, 1829541, 1444094, 784819, 87812, -377679, -504219, -443442, -406061, -382162, -174200, 281796, 740879, 862597, 563030, 109462, -135166, -55258, 127388, 113631, -126303, -302552, -129941, 322507, 656246, 539859, 64731, -335085, -343567, -101851, -7127, -191005, -346226, -142603, 338661, 734922, 834238, 663139, 254396, -344411, -824331, -763481, -212516, 170805, -137954, -843848]
40260h43848l52048K82479N05876K79417M3201l4434j64125l90095m13978p6533
40250a164088L30812M39546K76941J50689J90786K38721J59042M2084L2964J05885
40240H03382J09003l7106k58389l90047k77658Q8032M61175M87121J06104k86467
40230H05150k83165k247P5522k02917m52951l27675J7949K39922L02713L76953
40220E49254M45353L47194J03202j25930l26527n51745o23954l08788J94122L45845
40210D8026j3407m02635l57315l3455J11272j0674j01001o866P5307n1536k79592
40199a021876l31283q8151K65925L84608O7057m99903q34228n87224R9762P05636
40189a839677Q01524M08043p7833k70453j10155J88055M37996O20229P07244N63506
$$ y = [-843848, -1195896, -913417, -407541, -128124, -84923, -119357, -283482, -673577, -1087555, -1164088, -833276, -393730, -116789, 33900, 224686, 463407, 622449, 664533, 697497, 803382, 912385, 875279, 616890, 226843, -50815, 37217, 498392, 985513, 1091617, 805150, 521985, 519738, 595260, 392343, -60608, -388283, -370334, -130412, 172301, 549254, 994607, 1341801, 1445003, 1319073, 992546, 440801, -183153, -491941, -297819, 48026, 34619, -368016, -725331, -758786, -647514, -658188, -759189, -766055, -690748, -742284, -1021876, -1353159, -1441310, -1175385, -790777, -723720, -1223623, -2057851, -2645075, -2545313, -1839677, -1038153, -630110, -707943, -978396, -1088551, -900496, -462500, 157729, 864973, 1428479]
40179A428479J98108o1801M5182K49904N7935m67323o76495k57266K57706K34068
40169A008497j79176l65264j97586j26187l62382n43168l54851k8664M9912r8442
40159a197311j70886m3575J84082M45462O97725P49576M29568o1469k67122m0450
40149G25600K48719K06010r5969l03916k90224k11948j46145K2106K88970L80177
40139H23380P8623m51580q27738q27267m76395Q8817O42208Q57579N58608q299
40129D57936l76161l67569k00324o5790J17240L96810N10158J93096l53383o04948
40119b92935l45550P3179J99281L7754l0315J78991L82688K44933r6059j71929
40109A80038J38013L73743J29950l16377l46134J41740N94188N51941J62740j67201
$$ y = [1428479, 1626587, 1564786, 1609968, 1859872, 1917807, 1450484, 773989, 516723, 774429, 1008497, 829321, 464057, 266471, 140284, -222098, -765266, -1120117, -1148781, -1098869, -1197311, -1368197, -1411772, -1227690, -782228, -84503, 665073, 1094641, 1033172, 766050, 725600, 974319, 1180329, 1084360, 780444, 490220, 278272, 132127, 154233, 443203, 823380, 902003, 450423, -377315, -1204582, -1680977, -1592160, -949952, -92373, 466235, 457936, 81775, -285794, -486118, -551908, -434668, -37858, 472300, 665396, 312013, -292935, -638485, -565306, -366025, -328271, -358586, -179595, 203093, 448026, 351967, 180038, 318051, 691794, 821744, 505367, 159233, 300973, 895161, 1447102, 1609842, 1442641]
40099A442641k84810k56858j37658m0800j89128n67515p17522k63839M44762O33590
40089F2863Q4026n50306n55510M134M80582M83558K44977J73561L03719L25907
40079A057511N8420k96589m15271k43990j4690O2177j7828j34648j49164M8976
40069d5096M05738O18405M23279M27j89666n6171k5410l52287o48223m39517Q6074
40058b22447L36407J58815n3996n3587l3261j51527k19682q1032M7071j13104
40048c86343m60083o43659n07213j92932J00754K77376L06098J95412K4479q7511
40038a373622p9564j707N0943Q5772K57290O28604Q78177N12520m31646j152366
40028f25599r15366J0704O70589O14918K85049J62992J22151r6797k79511q5858
$$ y = [1442641, 1157831, 900973, 763315, 722515, 533387, -34128, -751650, -1015489, -570727, 62863, 146889, -403417, -958927, -954793, -474211, 9347, 254324, 427885, 731604, 1057511, 1115931, 819342, 404071, 160081, 145391, 207568, 189740, 55092, -94072, -45096, 360642, 979047, 1402326, 1402753, 1213087, 1156916, 1131506, 779219, 130996, -308521, -222447, 113960, 272775, 218779, 165192, 131931, -19596, -239278, -320310, -273239, -386343, -846426, -1490085, -1997298, -2190230, -2089476, -1812100, -1506002, -1310590, -1286111, -1373622, -1453186, -1454893, -1403950, -1318178, -1060888, -432284, 445893, 958413, 526767, -625599, -1540965, -1530261, -859672, -244754, 40295, 203287, 325438, 228641, -50870, -136728]
40018a36728L03857M00467J23810j51946k13012k25564l09665l01449p9354J77569
40008d12015K36766J23003L0664O1123J66065K48988K32840J09666j8768l1891
39998G46441M5415O5187l6594j72992k64833l13966k74231m0341L15780M76627
39988E46493K44664j35220k47187m7106J18287M8259m0280Q8413K71211J86770
39978A034304j21687k73931r4967J64514K33569J81604K08599K89903K64345J42484
39968B028737O7592K9354j24603l89532n57135n15042l78038k52781q5200J43875
39958c2773K64696J31460j33975k83277k54869j90007j78102j38913K7205K75579
39948e12976M42941M04482K00419Q870l7670Q1l2451j54013k34580k24681k36812
$$ y = [-136728, 167129, 567596, 691406, 539460, 326448, 100884, -208781, -510230, -589584, -412015, -175249, -52246, -21582, 39541, 205606, 454594, 687434, 797100, 778332, 746441, 791856, 857043, 820449, 647457, 382624, 68658, -205573, -245914, 69866, 546493, 791157, 655937, 408750, 361644, 479931, 528190, 487910, 576323, 847534, 1034304, 912617, 638686, 543719, 708233, 941802, 1123406, 1332005, 1621908, 1886253, 2028737, 2096329, 2125683, 2001080, 1611548, 1054413, 539371, 161333, -91448, -176648, -32773, 231923, 363383, 229408, -53869, -308738, -498745, -676847, -815760, -788555, -512976, -70035, 334447, 534866, 543736, 506066, 506147, 473696, 319683, 85103, -139578, -376390]
39937c76390l17277k97864l4812L01971L71468Q5595k62167l30296r5593J57858
39927g97507J63241n6943k39710j87893J2447J28318Q8191L7769Q9968J70376
39917e91743J67905R2286j1837j66477l42764l65434j14147K45938M16449L27665
39907c42159J82077J31532P9088j26342m09503m96034k24091K22002M48929K65376
39897b69125r0119k24116n5166J43759J58168O6729J794o2817j21746Q528L77231
39886f6880O32215M04309j36655m52817l30019n8636P7452J23671J88012K14754
39876E95406J88420K51209M07135L78865R345m17425n40513m31137m18252n23994
39866e00941m47875j17804J19419J5739j51512N9421N84305Q41444M61702j88870
$$ y = [-376390, -693667, -991531, -1026343, -724372, -352904, -267309, -529476, -859772, -955365, -797507, -634266, -691209, -930919, -1118812, -1106365, -978047, -889856, -852087, -762119, -591743, -423838, -331552, -343389, -509866, -852630, -1218064, -1332211, -1086273, -669824, -342159, -160082, -28550, 50538, -75804, -485307, -981341, -1205432, -983430, -534501, -269125, -359244, -583360, -638526, -494767, -336599, -269870, -268076, -330893, -452639, -444111, -66880, 565335, 969644, 832989, 380172, 50153, -8483, 68969, 192640, 380652, 595406, 783826, 1035035, 1442170, 1821035, 1830380, 1412955, 872442, 441305, 23053, -500941, -948816, -1066620, -947201, -931462, -1082974, -1023553, -439248, 402196, 863898, 675028]
39856F75028m27713j25209J25500j77159p17659p58557j51176M46390M39204J1277
39846f60074k42633r6602K06334M20741M88895L57497j0021m10171n10446k65781
39836g22261K3336J29150J23117J19241P3153k9664m3988R1511J89960R6765m2721
39825G599j3411J17168J11686p0697k47822k92303k38142j66991j61562k89678
39815a244153m54272l76731L8951M45989M49374J62576K2263J12694J01539j29347
39805h71117k67317j28501L1313J2498M3269L15118N36272L83547Q6543N7719
39795A99344J74299L090l84828m52736p6252K30824J24996r5331q2858P944o9561
39784d21069j24322J15628M00407K42889k95056n93348l03681J98085L33072L1091
$$ y = [675028, 247315, 122106, 247606, 70447, -647212, -1405769, -1556945, -1110555, -671351, -660074, -902707, -999309, -792975, -372234, 116661, 474158, 464137, 53966, -456480, -722261, -698925, -569775, -446658, -327417, -254264, -283928, -327916, -236405, -46445, 50320, 7599, -5812, 111356, 223042, 152345, -95477, -387780, -625922, -792913, -954475, -1244153, -1698425, -2075156, -2036205, -1590216, -1140842, -978266, -956003, -843309, -741770, -871117, -1138434, -1266935, -1235622, -1223124, -1179855, -864737, -328465, 55082, 141625, 199344, 373643, 376733, -8095, -460831, -537083, -306259, -181263, -276594, -359452, -351508, -421069, -545391, -429763, -29356, 213533, -81523, -674871, -978552, -780467, -447395, -416304]
39774d16304k61560j62377K21391M54988K96391k8760j37283O518Q5671p6747
39764a8072k85170l28226k82171k61721j41306J78039M39303L36810K4099p8851
39754d17266P7290J44478o255r1575L8788R5719j59152m57742l92332k5144K13541
39743i79650J34673k2903j879J55775K66570K75594K52517K27920J54577J3841
39733D77035j19160j57232j27403j48553k45342k61492o5707K06150K79066J20123
39723d2515Q316J44769L60258L47894O9638k27129l32407k63361j63141j39480
39713b37158j93129k08692m0411K97715N61439N04557J55230k33202m56815m55679
39703c06145k09739K19262N22021L07734l83870r40177q04046j50724L28138K84706
$$ y = [-416304, -677864, -840241, -618850, -163862, 132529, 103769, -33514, -26996, 58675, -18072, -303242, -631468, -913639, -1175360, -1316666, -1138627, -699324, -362514, -338415, -417266, -339976, -195498, -201753, -293328, -254540, -158821, -317973, -775715, -1168047, -1193191, -979650, -844977, -867880, -869759, -713984, -447414, -171820, 80697, 308617, 463194, 477035, 357875, 200643, 73240, -75313, -320655, -582147, -647854, -441704, -162638, -42515, -34199, 110570, 470828, 818722, 888360, 661231, 328824, 65463, -97678, -237158, -430287, -638979, -679390, -381675, 179764, 684321, 839551, 606349, 149534, -306145, -515884, -296622, 225399, 533133, 149263, -790914, -1594960, -1745684, -1417546, -1132840]
39693a132840N8057Q5110K83024K63581k6323k13748n0396K26421K09202j61669
39683d59581n39319n66056k20320K07264M05085L02733Q7060j3781N8836J98047
39673e40032K81752K55985J17609q7339k59827l28223l21392k92345k23772j14522
39663a512106p2342j39186j02351K48150O83923O94585J81414l36504m03513k08764
39653i66694k03147l89564l76520j8964L79259N03595L60372J33084l7021p0095
39643f85695M5383J98433K46403J79168Q3239p291q2892p0997L0081K4974k22329
39632b61523m79101l83543L4106L75102M19750L33219K91249K43615J49660J24702
39622H47236K00372K13700Q7246l3304o3253j31797k86545l28072j58523l1912
$$ y = [-1132840, -1074783, -989673, -706649, -443068, -469391, -683139, -733535, -507114, -297912, -459581, -998900, -1564956, -1785276, -1578012, -1172927, -870194, -783134, -796915, -738079, -540032, -258280, -2295, 115314, 27975, -231852, -560075, -881467, -1173812, -1397584, -1512106, -1584448, -1723634, -1825985, -1577835, -893912, -199327, -17913, -354417, -757930, -966694, -1169841, -1559405, -1935925, -1954889, -1575630, -1072035, -711663, -578579, -615600, -685695, -640312, -441879, -195476, -16308, 66931, 59640, -23252, -94249, -64168, -39194, -261523, -740624, -1124167, -1090061, -714959, -295209, 38010, 329259, 572874, 722534, 847236, 1047608, 1261308, 1348554, 1315250, 1251997, 1120200, 833655, 505583, 347060, 315148]
39612C15148j79405l92568k94901R3112L64618K61119m8657k24813j15536J48396
39602g3487L14679K74420J84600K26775K60849l4121n94846q64602m78827J96269
39592e88291N11031L27373L1855r8711j42565j74394p0440K06358M22258L54442
39582G78916R1439j05234j52477k22495m65421p31778o65900j46077M46551N93167
39572e79309K82750M2227K16573M96647L95046l5002k83705q6242K77562L84447
39562A110994J32748k16260l11600m6393K83425K56924j31197l99410k20955J09422
39552E67698J30464j05505j98742p2230j1603j15092j82978j53178j76447k13735
39542e31348l4183K90665L70346J23223n2884O4524J83849Q9552P5855L83804
$$ y = [315148, 135743, -256825, -551726, -458614, -93996, 167123, 118466, -106347, -221883, -73487, 241192, 515612, 700212, 926987, 1187836, 1153715, 558869, -305733, -784560, -588291, -77260, 250113, 281968, 183257, 40692, -133702, -204142, 2216, 424474, 778916, 870355, 765121, 612644, 390149, -75272, -807050, -1472950, -1619027, -1172476, -579309, -296559, -254332, -37759, 458888, 853934, 818932, 535227, 448985, 726547, 1110994, 1243742, 1027482, 715882, 669489, 952914, 1209838, 1078641, 679231, 458276, 567698, 698162, 592657, 393915, 321685, 310082, 194990, 12012, -141166, -317613, -531348, -565531, -274866, 95480, 218703, 165819, 230343, 414192, 503744, 579599, 963403]
39532I63403O29842L20375l41914p16317o32327m93555n25250m62623q6410L88536
39522i56240O49686O78720O09274M59853K31226P7691J36340K74854K23445n4984
39512B329865k91649k47798j3712J05014m5053l04262m25803l66252k51814j18375
39502C70161J31316M63609N86868K47771m11611r30439r48458m71696K16608P72147
39492B6276R31255O10186j2100n43885o30134k43423K61710M42252J63134l10731
39482F94540o10619n71067k41741K14041N05636L18802k80578o84846l72508L27322
39472g01018N32954l8247o74142o39729r4248L21510M18403M68698N36252M00105
39462E30538R9146j4765J32641J73925j01669l94616l67386j33906j1683m6148
$$ y = [963403, 1593245, 1913620, 1571706, 855389, 223062, -270493, -795743, -1258366, -1344776, -956240, -306554, 372166, 981440, 1441293, 1672519, 1750210, 1886550, 2161404, 2384849, 2329865, 2038216, 1790418, 1776706, 1881720, 1836667, 1532405, 1106602, 740350, 488536, 370161, 501477, 965086, 1551954, 1799725, 1388114, 457675, -490783, -962479, -745871, 26276, 957531, 1567717, 1555617, 1011732, 381598, 138175, 399885, 842137, 1005271, 694540, 83921, -487146, -728887, -514846, -9210, 309592, 29014, -655832, -1028340, -701018, -168064, -206311, -880453, -1520182, -1614430, -1292920, -874517, -405819, 130433, 530538, 629684, 614919, 747560, 921485, 819816, 425200, 57814, -76092, -87775, -133923]
39452a33923o7167l4903m2425p4448q601J85352M09063N34348M27100J3171n23208
39441F84359p75227n76226k80477k98390m75434l13020K20832N53986L28313o3734
39431i95018o2337K57137L80529J79561N3245K28440L86743J88701j86041l24860
39421A06100j80924m2000j6252Q2356L19980M51830K75245o7525k97600l30576
39411C00634k40580o2573J57716K32371Q262l38262m20491j20590K30471K59235
39401F193J3530j16101J03087M48816M92520J00764l82863n05282k20329P2728
39391A3063M2551j66431j78219P5441K94719K76641J69034J54583J28447r0588
39381G19241l84250m45649k21809J7238P5844M5604L1620q1356l85913o43611
$$ y = [-133923, -201090, -235993, -278418, -352866, -361467, -176115, 232948, 767296, 1194396, 1207567, 684359, -90868, -667094, -947571, -1245961, -1721395, -2034415, -1813583, -1259597, -931284, -995018, -1057355, -800218, -419689, -240128, -186883, 41557, 428300, 617001, 430960, 106100, -74824, -116824, -133076, -50720, 269260, 721090, 996335, 928810, 631210, 300634, 60054, -2519, 155197, 387568, 395830, 57568, -362923, -483513, -253042, 6193, 19723, -96378, 6709, 455525, 948045, 1048809, 665946, 160664, -59665, 13063, 55614, -110817, -289036, -213595, 81124, 357765, 526799, 681382, 809829, 719241, 334991, -110658, -332467, -315229, -239385, -193781, -162161, -243517, -629430, -1273041]
39371a273041m96713L5667N11252N71757L20697J12787J16427K15928K57547K32285
39361F04593K09238K01244J56911N5314l6978k8669P3654J43409P8232o4016j45130
39350A247802j39840j42044j74334j31928K2130J43210J01969q519j0885O9723
39340I77284K1833k43132n31877n69185k92165Q2291K56394J34800o4829l8404
39330b66990K28067M02116K10051k06823m80169m68522l31874k02662k4032K36295
39320i04543M27938L99415K05242Q084j36690k73537l71165k88849L8568M42591
39310d52946O24162M43953O5926k44643m08725m96088m61533j72478K45593L97393
39300d59386J46461j19502l4852J85753J23174j12706l4725L95349O40920L86289
$$ y = [-1273041, -1769754, -1734087, -1222835, -651078, -330381, -217594, -101167, 114761, 372308, 604593, 813831, 1015075, 1171986, 1227300, 1190322, 1161653, 1235307, 1378716, 1456948, 1392932, 1247802, 1107962, 965918, 791584, 659656, 681786, 824996, 926965, 918446, 907561, 977284, 999117, 755985, 224108, -345077, -637242, -554951, -298557, -163757, -228586, -266990, -38923, 363193, 573244, 366421, -113748, -582270, -914144, -1116806, -1140838, -904543, -476605, -77190, 128052, 136136, -554, -274091, -645256, -934105, -895537, -452946, 171216, 615169, 681095, 436452, 27727, -468361, -929894, -1102372, -856779, -459386, -312925, -432427, -467279, -281526, -158352, -271058, -305783, 89566, 730486, 1116775]
39290A116775l7934k02586j10666L7756J90791K81350J06820k98029n05880k79246
39280B99151r829j67534n57479n89048j38180L26178M30508K89786J88412K22970
39270B94935L28671L92824K85173k2807l50531m78637l85893j75412J04240L61505
39260C54068L61799L0063k80431j79393J78396K78521j7453l13586k85200o2232
39250F4552P9892P6667Q829l7531N2471L27492N77949N00627J17832k35749l85485
39239A147546m62310n23561m10563j30398k575j86526l73650k31313Q8471J86894
39229h97985K606j40789p369K64248L49456R6418k91885m16368j07972L27857
39219h21783M51998K39068M4679N2361Q4541P030o0279o1914j43046k74883j44734
$$ y = [1116775, 1078841, 876255, 765589, 803345, 994136, 1275486, 1382306, 1084277, 578397, 299151, 289322, 121788, -435691, -1024739, -1162919, -836741, -406233, -116447, 71965, 294935, 623606, 1016430, 1301603, 1278796, 928265, 449628, 63735, -111677, -7437, 354068, 715867, 745930, 465499, 286106, 464502, 743023, 725570, 411984, 126784, 64552, 144444, 221111, 229940, 192409, 244880, 572372, 1150321, 1650948, 1768780, 1533031, 1147546, 685236, 161675, -248888, -379286, -381861, -568387, -942037, -1173350, -1084879, -897985, -895379, -1036168, -1043537, -779289, -429833, -333415, -625300, -1041668, -1149640, -821783, -369785, -130717, -86038, -33677, 50864, 57894, -2385, -64299, -207345, -482228, -626962]
39208f26962L04427O05499L95555j3407j02602Q1310P8407k42355n55805n95233
39198f71166l76282J0525M19839N29789J32260m53036o44216l03161J58219L56921
39188h40308K63325j6524l55595m83587j98776K22292K74511q798k1708M92169
39178f72999R79402Q54560L09919n7275r4996j08460k29007k55699q2662J07528
39168G50311J18905m4163k49779l42232k20905J3697Q6199r9151k66933j60147
39158d14198M5043K7273j19360k4985K93174L60560n5295n66427o75985l69564
39148a499764R268K32431L19201L69982M61791N87127N79072K59425k37464n03949
39138E77120l54945m8341J41441K74788M37514M06769N661m54040n38311l43075
$$ y = [-626962, -322535, 282964, 678519, 665112, 562510, 643820, 722227, 479872, -75933, -671166, -1047448, -1036923, -617084, -87295, 44965, -408071, -1052287, -1355448, -1197229, -840308, -576983, -593507, -949102, -1432689, -1631465, -1409173, -1134662, -1143460, -1165168, -672999, 306403, 1160963, 1470882, 1413607, 1318611, 1210151, 981144, 725445, 642783, 750311, 869216, 825053, 575274, 233042, 12137, 25834, 112033, 12882, -254051, -414198, -369155, -341882, -461242, -486227, -193053, 167507, 112212, -454215, -1130200, -1499764, -1490496, -1258065, -938864, -568882, -107091, 480036, 1059108, 1318533, 1081069, 577120, 222175, 173834, 315275, 590063, 1027577, 1434346, 1440007, 985967, 447656, 104581]
39128A04581k90950l77647j92049K82196M91385J45134l02651l20330j9385J52285
39118c27431Q8899k36l1262n0331J3403K08840L22141J50305j04883r1790J36858
39107C14513K07512L304k24493k96375k81362k34774j26202m5598j17690j89993
39097i91158N999L39964L59533q334k76294j11223J91251K20414O3408N1164J75743
39086B0467J60445m6184k12734j91963n2481J11718K56000L00355J81906k3423
39076E04106j91851l21807m62845n35841m01336r2071J70258K09314O7478n3432
39066a108027M876J79589K26052K3380k01944j33119J73560L26050J42943j06991
39056d73631j20290M8980J69513J73249J41537J48357K64409N10314O82537M85447
$$ y = [104581, -186369, -564016, -756065, -473869, 17516, 162650, -140001, -460331, -479716, -327431, -238532, -238768, -270030, -320361, -306958, -98118, 224023, 374328, 269445, 177655, 314513, 522025, 525329, 300836, 4461, -276901, -511675, -637877, -683475, -801165, -991158, -985159, -645195, -285662, -293996, -570290, -681513, -490262, -269848, -206440, -155276, 20467, 180912, 134728, -78006, -269969, -322450, -210732, 45268, 345623, 527529, 504106, 312255, -9552, -472397, -1008238, -1409574, -1501645, -1331387, -1122073, -1054595, -1108027, -1103151, -923562, -697510, -674130, -876074, -1009193, -835633, -509583, -366640, -473631, -593921, -544941, -375428, -202179, -60642, 87715, 352124, 862438, 1544975, 2030422]
39046B030422j8435l88322m08034l62431m84217n27928k47323Q3972R2220n8581
39036b88657L0206K74380K52467n8120k43111j05081J42720L06050L60589K14587
39026H86030j84493n27422m38316r3193j4659k33848k44247J21189L88129K16606
39016a24224r8311j74506p8916j6334M7423J28661K2178l09243n28626m26760
39006a558658k46463j97575p5811K68707N21726M12213K26791L08483M09974J36214
38996B05601k66147k31822J81293L61403J08538j39259j08303p1878k36470l17662
38986e14706n3909K74619K23889j48277l35341k5251N29736P82961M53902j61399
38976A026224m59778j84381K69077L43139J2106k51993j45523J32917K44456J22398
$$ y = [2030422, 2011987, 1623665, 1215631, 853200, 368983, -158945, -406268, -322296, -230076, -288657, -258451, 15929, 268396, 210276, -32835, -137916, 4804, 310854, 671443, 886030, 701537, 174115, -264201, -357394, -372053, -605901, -850148, -728959, -340830, -124224, -222535, -397041, -475957, -492291, -444868, -316207, -294029, -603272, -1131898, -1558658, -1805121, -2002696, -2078507, -1809800, -1288074, -875861, -649070, -340587, 69387, 205601, -60546, -292368, -111075, 250328, 358866, 219607, 111304, 39426, -197044, -514706, -568615, -293996, -70107, -218384, -553725, -578976, -49240, 733721, 1187623, 1026224, 566446, 382065, 651142, 994281, 1006387, 754394, 608871, 741788, 986244, 1108642]
38966A108642p7540k20404k67967k59217k92225m08279m77789l50111j12844q218
38956a365952o9964n8043J74554M41600M59340J99950q0500j06289J46299L93472
38946A34467L14669n2359l14147k36865n7200o0777r9557R6924L45063K68199
38936C38417K4376J33515N32938N13625j55985p34575n70997n8120N9374j60487
38926g7919j16143K37911L52221N6460j91516j16988j0228r7515j30368Q6921
38916g164K45667K839m19354m96925r9930L77870M89878J42103l65363n68558
38906f98937k54067K48920L74736J9706l10400j92184J72841L45029K87642K72400
38896B65686L43874K85941N4037j35705j69125j80757k85025l97925l81947k01587
$$ y = [1108642, 1031102, 810698, 542731, 283514, -8711, -416990, -894779, -1244890, -1357734, -1365952, -1435916, -1493959, -1319405, -877805, -418465, -218515, -299015, -405304, -259005, 134467, 449136, 396777, 82630, -154235, -211435, -272212, -371769, -274845, 70218, 338417, 362793, 496308, 1029246, 1542871, 1386886, 652311, 81314, 23194, 82568, -77919, -194062, 43849, 396070, 452530, 261014, 144026, 133798, 36283, -94085, -7164, 238503, 241342, -178012, -674937, -774867, -396997, 92881, 234984, -130379, -698937, -953004, -704084, -329348, -309642, -620042, -812226, -639385, -294356, -6714, 265686, 609560, 895501, 949538, 813833, 644708, 463951, 178926, -218999, -600946, -802533]
38886h02533O7549K43755J34645j78110k73796J00162N59022M92557q2171m98720
38876b37640l36657Q3898K56256J36673K020r054P0317K09296L20635K43715K8025
38865G67484M969L17172O10805M96574R7752j97081l20520m68896o16421n41697
38855A50141k87115j52744k08868k09214m3077R5821P2128j672k8633n2207k6325
38844f91765J92516M93786N07079J38427k09394j82461M7934J18365K1215j381
38834D34321P7261O1599r2902k20348k42924k55032k78658j66286J64798N46090
38824B7919P01726N26763J78259r0728j73383j74181k19382k65839j96320n6004
38814B58830l0570j81942l70215m58762m22156k35724J12234M35444M33172R2117
$$ y = [-802533, -734984, -491229, -356584, -534694, -808490, -708328, -149306, 343251, 261080, -237640, -574297, -490399, -234143, -97470, -95450, -104504, -34187, 175109, 495744, 739459, 767484, 772453, 1089625, 1700430, 2197004, 2294756, 2097675, 1777155, 1308259, 691838, 150141, -136974, -289718, -498586, -707800, -750877, -655056, -582928, -584600, -613233, -665440, -691765, -499249, -5463, 501616, 640043, 430649, 248188, 296122, 414487, 435702, 434321, 511582, 573181, 480279, 259931, 17007, -238025, -516683, -682969, -518171, 27919, 729645, 1256408, 1434667, 1343939, 1170556, 996375, 776993, 511154, 314834, 258830, 228260, 46318, -323897, -782659, -1204815, -1440539, -1328305, -892861, -459689, -367572]
38804c67572k21527k27460p1264k0978n0298L0112K02143K83594K41214J97699
38794d337J82581J10857k0360j18546j63199k12950k57161k05007j5921K51369
38784d52674M76794N09190K75855n3201j65359R985J86699J32467r232k625Q4870
38773I92769L3391j47829k72149k83483k46842j63438o3754j22776l65873m30640
38763a070624j5035N63313O96968L12929q7495j81527j23558o0716J15883L86549
38753E36687M56850K15980o6028k01763l36097n17190m68142r0702K29797J97142
38743d3466R1402K50206M34570K58668l7249R3954N38067N80680J6153m73693
38733A709292l17797J22085J39020k98887o08724m79408k06725j51965k77327
$$ y = [-367572, -589099, -816559, -887823, -908801, -959099, -928987, -726844, -443250, -202036, -4337, 178244, 289101, 268741, 150195, -13004, -225954, -483115, -688122, -704043, -452674, 24120, 533310, 809165, 755964, 590605, 600590, 787289, 919756, 910524, 907899, 992769, 1026160, 878331, 606182, 322699, 75857, -87581, -151335, -274111, -639984, -1070624, -1085659, -522346, 174622, 487551, 400056, 218529, 94971, 34255, 150138, 536687, 993537, 1209517, 1143489, 941726, 605629, 88439, -379703, -470405, -240608, -43466, 47936, 298142, 732712, 991380, 954131, 1048085, 1586152, 2166832, 2182985, 1709292, 1391495, 1513580, 1652600, 1353713, 744989, 265581, 58856, -93109, -370436]
38724c70436l35772k27434m205K74010N07820N26319K78035k7571j42151p4494
38714D04121J2211J11737L18423M85608K87415k56740o41823m93816p5251J07969
38704B59854m561p6460L7633J60499K02649K85081L93525K94842o1834l75345
38694A115883l94065k39649j67637k15779k46937j72131n547J61104J83048L5380
38684E3670l8343J87937M87272L90972j02447m60965m10283l04940m37832m92534
38674a127493j33432K99896K87028J8648J15549N84342P53474L08132k45587l45625
38664E14932q6006R8172N4291p2430j61758j80471r9954M7714J60085K11218K48454
38653G34247K04033m5784l69933m26658j45695J23941J14373J435N6288K04812
$$ y = [-370436, -706208, -933642, -937847, -663837, -156017, 370302, 648337, 620766, 478615, 404121, 416332, 528069, 846492, 1332100, 1619515, 1362775, 720952, 227136, 151885, 259854, 255293, 178833, 216466, 376965, 579614, 864695, 1258220, 1553062, 1491228, 1115883, 721818, 482169, 314532, 98753, -148184, -320315, -325862, -164758, 18290, 53670, 15327, 203264, 690536, 1081508, 979061, 518096, 107813, -197127, -634959, -1127493, -1260925, -961029, -674001, -655353, -539804, 44538, 798012, 1106144, 860557, 514932, 428926, 527098, 581389, 508959, 347201, 166730, 66776, 114490, 274575, 485793, 734247, 938280, 892496, 522563, 95905, -49790, 74151, 188524, 189959, 246247, 451059]
38643D51059K06010O2404l8619n2048p1640r9247o3052Q690M0062N2976P4647
38632E71242P073k10865m22633m47667l41659k43352j03189J56463L41861K04234
38622d88492r9432j42845J39670L19845P5294l81058o03895m06756N7817M80639
38612a049213N65034K52803j16780j09131K53813N03415L69806Q8400p8531k33285
38602D46331m82918n59930k11918K83298M44138K79165K10063L85466N24201M36326
38592A754222K62981J30160l7756k40113k88630j33673j4951j21449l29424m14960
38582E66407l19693r6419J96026M36290M81550L51906J73934q9520n64373j056809
38572G9299j086326n13206J85647M97253M50114L71814L53904K71955J27640L4646
$$ y = [451059, 657069, 719473, 680854, 628806, 557166, 457919, 394867, 403557, 443619, 496595, 571242, 578315, 367450, -55183, -502850, -844509, -1087861, -1191050, -1034587, -692726, -488492, -587924, -730769, -591099, -271254, -195960, -577018, -1180913, -1587669, -1529852, -1049213, -484179, -231376, -348156, -457287, -203474, 299941, 669747, 758147, 679616, 446331, -36587, -596517, -808435, -525137, -80999, 198166, 408229, 793695, 1317896, 1754222, 2017203, 2147363, 2109607, 1869494, 1580864, 1447191, 1432240, 1310791, 981367, 566407, 246714, 150295, 346321, 782611, 1264161, 1616067, 1790001, 1700481, 1136108, 79299, -1007027, -1520233, -1334586, -837333, -387219, -15405, 338499, 610454, 738094, 772740]
38562G72740k0443j26144k43519k73786k31677j83170j46450j88730m03605o31105
38552a675889m93825L9437M34608K72089j33770j90569J38291M01093L70283K11830
38542f26422P2786k0593N9796L88836O60704M84263k2083l76302m19234l71745
38532a69994k67054R6505N97932P78740N20947K11978R1400l4811k61043l25984
38522A238616j45492p6080l26077n63544m52246j67400k8141O641J12451K06008
38512a95264J45933M3514L9501M1015j5898O0477L55483N55715L74534N402k05157
38501A205255k80301m31351n84477m97119j97553N5444J47305J55039J39755J25854
38491a62149J41152J05159r7700k87699q2433M66807P56905M63524L6644l6051
$$ y = [772740, 752297, 626153, 382634, 108848, -122829, -305999, -452449, -641179, -1044784, -1675889, -2169714, -2130277, -1695669, -1423580, -1557350, -1747919, -1609628, -1208535, -838252, -626422, -553636, -574229, -514433, -125597, 535107, 1019370, 997287, 620985, 201751, -169994, -437048, -340543, 257389, 1036129, 1557076, 1769054, 1860454, 1825643, 1564600, 1238616, 1093124, 1017044, 690967, 127423, -324823, -492223, -520364, -513723, -401272, -195264, -49331, -5817, 33684, 74699, 58801, 119278, 474761, 1030476, 1405010, 1410412, 1205255, 924954, 493603, -90874, -587993, -785546, -730102, -582797, -427758, -288003, -162149, -20997, 84162, -13538, -301237, -383670, 83137, 840042, 1303566, 1340210, 1304159]
38481A304159K3225j89064m38958k61380J42408J81836j36275k68541r0191j4638
38471B52581j57302j55732O2580P5681k50697m46373j91038K01392L67372M14506
38461A72970M86945L19846k80287q64644p89839r4236N14583N24388J42848p9568
38451E3006Q2790L50226L41219L7379k38366k70070j81665j46104j11479j6391
38441i9455k3818k30439l61779j41907K10845K93921J72614K15943L90606L09761
38431G36292k5890j73025l4236n8780m33687o87465m44143m7061j0742k63629
38421a442366l75479k19386K1576K52602M50858M49904J62148j04108N2268N44124
38411b07859Q54795O92880L19706J66299L10084M21126J64866l93015q21692q01479
$$ y = [1304159, 1327384, 1138320, 699362, 437982, 580390, 762226, 625951, 357410, 267219, 252581, 95279, -60453, 2127, 77808, -172889, -619262, -810300, -608908, -241536, 172970, 659915, 979761, 699474, -165170, -955009, -1049245, -534662, -10274, 132574, 53006, 135796, 486022, 827241, 864620, 626254, 356184, 174519, 28415, -83064, -99455, -123273, -353712, -715491, -857398, -646553, -352632, -180018, 35925, 426531, 736292, 710402, 537377, 503141, 444361, 10674, -676791, -1120934, -1167995, -1178737, -1442366, -1817845, -2037231, -2015655, -1763053, -1312195, -862291, -700143, -804251, -751983, -207859, 646936, 1339816, 1659522, 1825821, 2135905, 2557031, 2721897, 2328882, 1507190, 705711]
38401G05711m78213k15975j12142j238J44119J64753P4130Q2285J72436N1079
38391E86945l07757m62711j27924L24428L23520j55422o39124p94223o81307m53365
38381b386940j38135K31280N04453N48554M10512K67239K12865J34385j18565
38372c34352m19746l90822J04355O44531O86633K28536k41458l85425k84960j16829
38362e09537N8267J44953K3104j92951k23382m2448P2716j0415r5366l624J97134
38351e81549L80210M67131L13296j47625n90386n38494k6678L74518L21769R0905
38341F3097O8910K50197L97267L42695J3067m81787p29907m28015O2157J10393
38331c31926j99243j70513L02257M65103l9041n01998k79325J83650J50221k25377
$$ y = [705711, 227498, 11523, -100619, -101857, 42262, 207015, 281145, 363430, 535866, 586945, 279188, -183523, -311447, 12981, 336501, 181079, -458045, -1252268, -1933575, -2386940, -2525075, -2293795, -1789342, -1240788, -830276, -563037, -350172, -215787, -334352, -754098, -1144920, -1040565, -396034, 290599, 519135, 277677, -107748, -392708, -509537, -451270, -306317, -283213, -476164, -699546, -741994, -669278, -679693, -775059, -778683, -581549, -201339, 265792, 579088, 431463, -158923, -697417, -724095, -349577, -27808, 63097, 132007, 382204, 779471, 1122166, 1135233, 653446, -76461, -504476, -442319, -331926, -531169, -701682, -399425, 65678, 26637, -475361, -754686, -571036, -420815, -646192]
38321f46192l07301p6091K0578k7265J27789L98763L28213j27279n23480n90995
38311a423260m31774j51798J85130L56641K45725J75293M69886Q26178O59554
38302I11575k6924o43733p97778n80012j81473K52219M53167K37934j25877j88222
38292f89124Q8261L67316M44062L29895L0197l22680l34748J51693O32950N37862
38282A235684K6134l53557n22101p15815p39970k12368N47756P42902K69037j35914
38272A41788l6720J78541J17226j8769M6610J64450J11170m8066k03810l74464
38262G7956m53200k36049J41926K66709Q4336o196J62750K71736J19172m5828
38252C83312k2892J924j23705k03312o2345J40999K00268J28120j489j36588j11062
$$ y = [-646192, -953493, -1029584, -1009006, -1036271, -908482, -509719, -181506, -308785, -832265, -1423260, -1855034, -2006832, -1821702, -1465061, -1219336, -1044043, -574157, 252021, 911575, 884651, 240918, -556860, -1136872, -1318345, -1066126, -612959, -375025, -500902, -689124, -600863, -233547, 210515, 540410, 570607, 247927, -86821, 64872, 697822, 1235684, 1261818, 908261, 386160, -329655, -1069625, -1281993, -734237, 8665, 277702, 141788, 105068, 283609, 400835, 382066, 428676, 593126, 704296, 656230, 452420, 77956, -375244, -611293, -469367, -202658, -118322, -124518, 38232, 309968, 429140, 383312, 360420, 362344, 238639, 35327, -27018, 113981, 314249, 442369, 440880, 304292, 193230]
38241A93230J62148L41593K2928n01469m80630J55246N86362L11505j29317o6870
38231E94726K85863K97761o8944l28001k76751j66942j86592k23316j26232Q5662
38221a12766K66586K55741K6692k14418k36308j09506j01602k37717k50994m053
38211g18345L28873N21342M61978J23050l04203l65906J21694O28545N36882P0292
38201A404202p0453J15793l0617n76731p48493k09320L44744L18819J05439K64290
38191I17673N48792M21355k7714l41361m33103m58463l38370J3128L08835K53427
38181H64199J0915j09683j19889j34271o1504J12952J31732p8581j77927R542
38171D47485J70773J21410J81612M87581N37546k758o06480o39965l03610j50217
$$ y = [193230, 355378, 696971, 719899, 218430, -262200, -106954, 479408, 790913, 661596, 594726, 880589, 1178350, 1109406, 781405, 504654, 337712, 151120, -72196, -198428, -112766, 153820, 409561, 436253, 221835, -14473, -123979, -225581, -463298, -714292, -718345, -389472, 131870, 593848, 716898, 412695, 46789, 168483, 797028, 1333910, 1404202, 1333749, 1449542, 1418925, 842194, 93701, -115619, 229125, 547944, 653383, 917673, 1466465, 1887820, 1860106, 1518745, 1085642, 627179, 288809, 301937, 610772, 864199, 875114, 765431, 645542, 511271, 449767, 562719, 694451, 615870, 437943, 447485, 618258, 739668, 921280, 1408861, 1946407, 1943649, 1337169, 697204, 393594, 243377]
38161B43377j52182J7749K07841P7046j70764j11759J15345Q8289j03982q6426
38151A24534L3933j06540l38719j77204L09157N83810M84595K71867j9544n12955
38141F52934q75091n83684J63153N55305K78515j49105k31796n2794J32268K69243
38131A58948L29191K46298J34425J55030J69144n6097l65919m18145k67922k30845
38121a45892k69410r5838J97862K39479O8420Q7682L24788L89800K03205R6898
38111A096994J05188j55567p15381j002485o44836n053L53636L12748R3604r8466
38101f59618j19572Q7976L48585L99001K49170J26654Q3950m059j01225n6760
38091C54102N2917L1083m7845K4346J42927M9698j42337j00501J10493J15889
$$ y = [243377, 91195, 108944, 316785, 393831, 223067, 111308, 226653, 314942, 210960, 124534, 158467, 51927, -286792, -463996, -154839, 428971, 913566, 1185433, 1165889, 652934, -222157, -805841, -642688, -87383, 191132, 42027, -189769, -242563, -110295, 158948, 488139, 734437, 868862, 1023892, 1193036, 1136939, 771020, 352875, 84953, -145892, -415302, -511140, -313278, -73799, -5379, 82303, 407091, 796891, 1000096, 1096994, 1202182, 1046615, 331234, -671251, -1316087, -1321140, -967504, -654756, -561152, -659618, -779190, -691214, -342629, 56372, 305542, 432196, 516146, 512087, 410862, 354102, 407019, 438102, 390257, 414603, 557530, 607228, 464891, 364390, 474883, 590772]
38081E90772q8867j20234J08651K54695J53400J5401m8617j62781k78073j65348
38071B58999J01298J73611J9523l1705R4070Q9235j42358k82822j26716J37734
38061B90869K75601K38717L1656k62715l82454k18568q2593j75566r7063M59093
38051G6977Q79721M20286m40089n48636R9718L49403j71842m56021R1035N83146
38041H83698J54825n82424n59236J04598M99586L90459K68043K99572J74331j48693
38031A484759l22357k19693q3299p7834j16725r4590J1327J77829K71722J40660
38021A171799p4443j6735L16798M51929J23914k89847l11408N632K74461K97079
38011A949179J30117p7958j10317J44662L92711J87986l67329o28349k94700J90832
$$ y = [590772, 501905, 381671, 490322, 745017, 898417, 913818, 865201, 702420, 424347, 258999, 360297, 533908, 553431, 521726, 615796, 705031, 562673, 279851, 153135, 290869, 566470, 805187, 836843, 574128, 191674, -26894, -109487, -285053, -382116, 76977, 956698, 1376984, 936895, 388259, 487977, 837380, 665538, 209517, 300552, 883698, 1038523, 456099, -103137, 1461, 501047, 891506, 1159549, 1459121, 1633452, 1484759, 1162402, 942709, 859410, 781576, 664851, 570261, 581588, 759417, 1031139, 1171799, 1097356, 1080621, 1397419, 1849348, 1973262, 1683415, 1372007, 1377639, 1652100, 1949179, 2079296, 2001338, 1891021, 2035683, 2428394, 2616380, 2249051, 1620702, 1326002, 1516834]
38001A516834L45687K34681Q9396j23944m04917m70226k00523N8292M98j89085
37991H56693k02402o5044O8717K21081M12143N15848N28449O29749P90449P27264
37981D482947M45372L81595P66831J262395J485542J537260J770380K278688K699857
37972A7110867K333686O80239j708991l260791k983166j763054j195542j423072
37964G790176j300643n30628j49118o60133j166160r02615l37497r2809M5180
37955B695753L43975M54940K22513J16416K21704p7059p56327p62146K45405J060664
37945C765838P89395K27572L08321N13927J31986j86188L64862J091350R75288
37936G982351N38273Q65471J662529K051771K446195L596031M382116K833624
$$ y = [1516834, 1862521, 2097202, 2186598, 2062654, 1657737, 1187511, 986988, 1045280, 1045778, 856693, 654291, 589247, 657964, 879045, 1291188, 1807036, 2335485, 2965234, 3755683, 4482947, 4928319, 5309914, 6076745, 7339140, 8824682, 10361942, 12132322, 14411010, 17110867, 19444553, 20124792, 18415801, 15155010, 12171844, 10408790, 9213248, 7790176, 6489533, 5958905, 5809787, 5149654, 3983494, 3080879, 2743382, 2650573, 2695753, 3039728, 3494668, 3717181, 3833597, 4055301, 3978242, 3221915, 2459769, 2705174, 3765838, 4555233, 4782805, 5091126, 5605053, 5737039, 5550851, 5915713, 7007063, 7982351, 8520624, 9386095, 11048624, 13100395, 15546590, 19142621, 23524737, 26358361]
37928B6358361p37640l703108m412347l699084k869741k039628j031990l23949
37920G540874k61270m07812l24211j71919j42271p1146Q5837J19451P6062K06777
37910F650372L75002K40060l3415l2829P5256j46990m27080q8076P40557J201816
37900H554673R75811N29765J57669k71365o34368n77627k44487j40763l21913
37891H027395m85693o62616r65197r62968k99270L76454J83530n50620p67131
37882C893884l41609o0863j32309O425M67893P34805O75107O04140M18915k02971
37872F063417q70997q89613m38049k17260j84319J50631M94723J97207l74786
37863C930954l06235K46452L37088r2047k64002o7158l3353q0636K28665M99743
$$ y = [26358361, 25620721, 21917613, 17505266, 13806182, 10936441, 8896813, 7864823, 7540874, 7279604, 6871792, 6547581, 6375662, 6233391, 6162245, 6248082, 6367533, 6443595, 6650372, 7025374, 7265434, 7232019, 7199190, 7274446, 7127456, 6700376, 6612300, 7352857, 8554673, 9530484, 10060249, 10217918, 9946553, 9312185, 8734558, 8490071, 8349308, 8027395, 7541702, 6879086, 5913889, 4950921, 4651651, 5028105, 5211635, 4661015, 3893884, 3552275, 3491412, 3359103, 3365528, 3833421, 4568226, 5243333, 5847473, 6266388, 6063417, 5192420, 4302807, 3864758, 3647498, 3463179, 3613810, 4108533, 4305740, 3930954, 3624719, 3871171, 4208259, 4116212, 3852210, 3785052, 3751699, 3671063, 3899728, 4399471]
37853D399471J24449l18940O4966P06374M63915k27036r7922N64435M52081k64631
37843E867162k73278L90189N54689K84329N81720J082642O36112j94741N5292
37834H984116Q91400P51043K12075J015866K416671K189132Q74451J010535K421782
37825B0767071K634031J788093K371883M130683M464907L912067N410734P995255
37817E3474724P918920O467922Q905849J4678493J7612919J7529230K1132563
37810A47720620K8772707L3626254L9135270N9707848R0887376R5679820M4060136
37803E39590031m0566521r8675866r9488684o7669093m2486548l3580170k7939657
37796A29183492k0098996j5868235j5818533j3557438q214014n381853o273626
$$ y = [4399471, 4523920, 4204980, 4269946, 4976320, 5440235, 5213199, 5115277, 5679712, 6131793, 5867162, 5593884, 5984073, 6538762, 6823091, 7404811, 8487453, 9123565, 8928824, 8984116, 9875516, 10626559, 10838634, 11854500, 14271171, 16460303, 17334754, 18345289, 20767071, 23401102, 25189195, 27561078, 31691761, 36156668, 40068735, 45479469, 53474724, 61393644, 67861566, 76767415, 91445908, 109058827, 126588057, 147720620, 176493327, 210119581, 249254851, 308962699, 399850075, 495529895, 539590031, 499023510, 400347644, 300858960, 233189867, 190703319, 157123149, 129183492, 109084496, 93216261, 77397728, 63840290, 55626276, 50244423, 43970797]
37789D3970797o232365l769997k370714l170861l329616k046809j703501k582438
37781A8764496k225084m85371J8647j066815j206368J69030P67025n3413k34661
37772A4447486P71629Q35262q39474k202699j922291j197025j014176o25342K23958
37763H477328L32318o21189j212606o90644p7245j01517j29539J87375K11431
37754F375712j47879j16416K56199j3369q73289j077255l66492J13126o7178l7654
37744D045505M40924M55999j62266l64789J45596L29753k30087n99028k98950
37735C762657o9735k20339J1858P95169J125865O26358K57873N19200N90321N0805
37725G450032j88445M42874J112184J131410J123798J678311K200422K123070
$$ y = [43970797, 37738432, 33968435, 31597721, 28426860, 25097244, 23050435, 21346934, 18764496, 16539412, 16054041, 16072688, 15005873, 13799505, 13968535, 14735560, 14682147, 14447486, 15219115, 16054377, 15214903, 13012204, 11089913, 9892888, 8878712, 8253370, 8477328, 8809646, 8188457, 6975851, 6285207, 6207962, 6106445, 5976906, 6164281, 6375712, 6227833, 6111417, 6367616, 6354247, 5480958, 4403703, 4037211, 4150337, 4083159, 4045505, 4486429, 4942428, 4780162, 4415373, 4560969, 4890722, 4660635, 4061607, 3762657, 3692922, 3472583, 3484441, 4279610, 5405475, 6031833, 6289706, 6808906, 7399227, 7450032, 7261587, 7704461, 8816645, 9948055, 11071853, 12750164, 14950586, 17073656]
37717A7073656K036579K610879L505797M268130N163700O117841N900989L506304
37709E0183875l69904m051489o381459o949979n864943m086086l048867l115890
37701A6315258l174352k388682j378026r62332q46630m83914k38332o05810j090812
37692E146368r62632m89498l81092n52102m35249n9729J27823J35792K53867L37778
37682C121326O1113l96097n96392n05159l24367k1822M00338N49614J48828m36790
37672B000592o98143o42748m89087j64509L43487N85071K13556l89382o08702
37663A50135m05943j52784J321J19300J63385J31574J92408L31913K50993p2572
37653G09730k08416k400Q8692j93832l84334r4359K68820K06201L396K12522P03179
$$ y = [17073656, 19110235, 21721114, 25226911, 29495041, 34658741, 40776582, 46677571, 50183875, 49813971, 45762482, 39381023, 32431044, 26566101, 22480015, 19431148, 16315258, 13140906, 10752224, 9374198, 8411866, 7565236, 7081322, 6842990, 6237180, 5146368, 4183736, 3694238, 3313146, 2761044, 2325795, 2266066, 2393889, 2529681, 2783548, 3121326, 3182439, 2786342, 2189950, 1684791, 1360424, 1338602, 1738940, 2288554, 2437382, 2000592, 1302449, 659701, 170614, 6105, 349592, 934663, 1148219, 758837, 150135, -255808, -408592, -407271, -287971, -124586, 6988, 199396, 531309, 782302, 709730, 501314, 498914, 587606, 393774, 9440, -84919, 183901, 390102, 393498, 606020, 1309199]
37642A309199R31170Q02083O03873L84011L3093k65064k67902j56677k64300n19799
37632B589687o15806n10825l69943k59093k35713m17915o49625n10842N300L11333
37622f63442Q8166k23959k12697j35921k53129j98064K96369O80789L99513j25930
37612c48305j81838N6107l7813l26600j70922L40461M70097P8625j78813M2200
37602b56801L37570L40094J85616N0630j17799k71205k28551p6931r5288k38914
37592c71579k00552J1314O7836j01744k19765j40699M0479L01729O36178P71231
37582G94428M58854m2787k90722l23072m37710m86273r7946M83303N74389J23799
37572G56263j52148J38855N35048N02210J19586k63795n02373n37405l11648l0193
$$ y = [1309199, 2240369, 3042452, 3646325, 4030336, 4063429, 3798365, 3530463, 3373786, 3109486, 2589687, 1973881, 1463056, 1093113, 834020, 598307, 180392, -469233, -980075, -974775, -663442, -575276, -799235, -1011932, -1147853, -1400982, -1599046, -1302677, -621888, -222375, -348305, -530143, -474036, -511849, -838449, -1009371, -668910, -198813, -120188, -299001, -256801, 80769, 420863, 606479, 657109, 539310, 268105, 39554, -37377, -132665, -371579, -572131, -560817, -492981, -594725, -814490, -955189, -914710, -612981, 23197, 794428, 1253282, 1210495, 919773, 596701, 158991, -327282, -425228, 58075, 632464, 756263, 604115, 742970, 1278018, 1780228, 1899814, 1636019, 1133646, 596241, 284593, 254400]
37562B54400l8293k50675j93185K01400L80375J5906m59511n00409j80693Q8788
37552f81897J89373K50029K76162K13030J74523K72214L62178K33301o7650l00770
37542I20493l05589o9584L13764O14935N71765J82987k38949m28584m28880l87582
37532G44776k90786q3421Q5141k8405m03186o71168m91801K4735L89247L10536
37522d14332Q0604J66444M91994M95561k3381n42627n34429j42828J88194L80586
37512A45786N70711O12771K78301k36991n34241o08434p18130p85717m82017J35099
37502a622862N94443O31773L89798N1763k55873k79828J04170M96217L80437j02325
37492C87713l46436j92359k0602K1751J56718K92388J5047n35079n83347J31751
$$ y = [254400, 216107, -34568, -227753, -26353, 354022, 369928, -89583, -589992, -770685, -681897, -492524, -242495, 33667, 246697, 421220, 693434, 1055612, 1288913, 1221263, 920493, 614904, 545320, 859084, 1474019, 2045784, 2228771, 1989822, 1561238, 1132358, 744776, 453990, 370569, 455710, 427305, 24119, -647049, -1138850, -1114115, -724868, -414332, -333728, -167284, 324710, 820271, 796890, 254263, -280166, -422994, -234800, 145786, 716497, 1329268, 1607569, 1370578, 836337, 227903, -490227, -1275944, -1757961, -1622862, -1028419, -396646, -6848, 44915, -210958, -490786, -386616, 109601, 490038, 387713, 41277, -151082, -171684, -149933, 6785, 299173, 314220, -220859, -804206, -672455]
37482f72455Q40589P98018K38990j71712k77953l15057l27225k30490j21601q8364
37472c27260m813J63038K10656J43889L10495P27498P91163J31480p10647r90592
37462D44907p27754m16472j90450P7969J97042q7941m55302l37367J97334N29713
37452g68321L97755J19429l3179p3869M6490L84429N71512J10171p55686j105858
37442a107127n29501L07543N78873K89974L824j827J23775K22739K65859K13945
37432C68077P1991j3027M2334O8715j00334k95879j98940J98450N58535O11638
37422A311560M07644J60539K4212L4160J08367Q3498j01265k43013q2683K65140
37412A968159L07120k21241q90851r89991l80304L24413N05694K08198j03914
$$ y = [-672455, 168134, 966152, 1205142, 1033430, 755477, 440420, 113195, -117295, -238896, -327260, -332073, -169035, 41621, 185510, 496005, 1223503, 2014666, 2146146, 1435499, 444907, -282847, -699319, -889769, -811800, -614758, -702699, -1158001, -1495368, -1298034, -768321, -370566, -251137, -284316, -358185, -311695, 72734, 644246, 754417, -1269, -1107127, -1636628, -1329085, -750212, -460238, -456414, -458241, -334466, -111727, 154132, 368077, 440068, 427041, 469375, 538090, 437756, 141877, -57063, 141387, 699922, 1311560, 1719204, 1879743, 1903955, 1938115, 2046482, 2129980, 2028715, 1785702, 1703019, 1968159, 2275279, 2054038, 1163187, 173196, -207108, 117305, 622999, 831197, 727283]
37403G27283k18360k97037m30479m27652j32077K98683N54529M67384P8700m17850
37393B03124p20994n94474j33727K67361L40126K13748J47573J38048r979k90657
37383d39851l98760q3103N11037R23952Q00679K33392l14856m63776k86400j66112
37373C16202l05868n01132m30676m8879L80949N50134L34547j45023n98748p54811
37363a203305n56786j83134J28513K47526J83505N0684n889O1877J59632K06730
37353i10647K67987L88304L78749J3477n51103q16881n06259J13354N69149O59784
37343c94086M81003J81883j06522k23814q5464J68524K73064J26578p4772l4229
37333C12165K86432N26944K74325l82655q20076n88145J900K78948P7057j77699
$$ y = [727283, 508923, 211886, -218593, -646245, -778322, -479639, 74890, 542274, 620974, 203124, -517870, -1112344, -1246071, -978710, -638584, -424836, -277263, -139215, -149194, -439851, -838611, -921714, -410677, 513275, 1313954, 1547346, 1232490, 768714, 482314, 316202, 10334, -490798, -921474, -970353, -589404, -39270, 295277, 150254, -448494, -1203305, -1760091, -1943225, -1814712, -1567186, -1383681, -1332997, -1338886, -1277009, -1117377, -910647, -642660, -254356, 124393, 137870, -413233, -1230114, -1736373, -1623019, -1053870, -394086, 86917, 268800, 162278, -61536, -147000, 21524, 294588, 421166, 346394, 312165, 598597, 1125541, 1399866, 1017211, 197135, -391010, -389110, -110162, -33105, -210804]
37323b10804j95598j61131k32455j90782J19343L82577K40670j12618j86271P2633
37313d74436K19371R767k19612m7737L89707N29983J33575l44665l12529J60122
37303D3546M14946J24239k50047j75039J40936J21868k39311m30880l21488l10224
37293h81454m80210l32772L14374Q12422N50561j48054n27596m13990j76075J1076
37283a271718K38836L75023J40568l19235m74137j14207L88233O12903N47242
37274A23508M09896L10021K17009Q9565o5383j81165j79577r2977n7424j15930
37264D57543j72675k15616l48971m74081k52011L62152Q49808P40485K48013q4175
37254A110472j46695k28741l94491m07499k27513j02270j32762j50463o3981L1275
$$ y = [-210804, -406402, -567533, -799988, -990770, -871427, -488850, -248180, -360798, -547069, -474436, -255065, -245298, -464910, -512647, -122940, 407043, 540618, 195953, -116576, 43546, 458492, 582731, 332684, 157645, 298581, 420449, 181138, -249742, -571230, -881454, -1361664, -1694436, -1380062, -567640, -17079, -165133, -692729, -1106719, -1282794, -1271718, -1032882, -657859, -517291, -836526, -1310663, -1424870, -1036637, -423734, 123508, 533404, 843425, 1060434, 1149999, 1084616, 903451, 723874, 630897, 573473, 457543, 284868, 69252, -279719, -753800, -1005811, -643659, 206149, 946634, 1194647, 1110472, 963777, 735036, 340545, -66954, -294467, -396737, -529499, -679962, -743943, -712668]
37244g12668J04421K01065K15751L1825j22393J06529N69921O68262J75462m03484
37234H34691n09469k14905J3673l8094j96825k45937j67943j00205j61874k79630
37224a066518k03794J61534N01519M17543R602j79085J11350M90572M51615K4735
37214G19073l31451l36100j39582k4711p0713j67551k30883k70975k55658o4765
37204a173316K81105M73998K72998m1424M8143M82622N68671j2382o20162n28263
37194b48010J7421K12149r6312l06089r8999J23545l0177l60379m52126k18548
37184a457525J29513L45920K72405j0711j27853J80051O19210O96490M30116K18987
37174A296603Q2458l16647q40334q19631r9851N47774M69021k87j74531j8661
$$ y = [-712668, -608247, -407182, -191431, -159606, -281999, -175470, 394451, 1062713, 1238175, 834691, 325222, 110317, 123990, 85896, -110929, -356866, -524809, -625014, -786888, -1066518, -1270312, -1108778, -607259, -189716, -180114, -359199, -247849, 242723, 694338, 719073, 387622, 51522, -88060, -112771, -183484, -351035, -581918, -852893, -1108551, -1173316, -892211, -418213, -145215, -186639, -138496, 344126, 912797, 900415, 280253, -248010, -230589, -18440, -114752, -420841, -519840, -396295, -426472, -786851, -1238977, -1457525, -1328012, -982092, -709687, -720398, -848251, -668200, -48990, 647500, 1077616, 1296603, 1379061, 1062414, 222080, -597551, -697402, -149628, 319393, 319106, 144575, 125914]
37164A25914M8433m3584k6620J08952R5679j04660k20628q2076K00172M22479
37154E24061M22888J27554l11637n29684k97552K29856P16762R20377O95752M2440
37144B540817o88022r66979p07255l99789m04262m68951k57530M4210Q2084k6873
37134a252550Q2064L61742M33851K35826J13210K69056N01147N18690K55012j20833
37124A397215l14144j34403K02233J99313k61280o48682m83928l0608J25810o2464
37114a0938j69310n0121J8355r7180k03301j86344j45191q2005J10957L14663
37104e00415K56753j3528j26993N0280K44759K33342R4408o8269k45190k68928
37094c43781J12689P29801R78338N77280m484j63338Q3637K65855J55965m0787
$$ y = [125914, 174347, 130763, 104143, 213095, 308774, 204114, -16514, -98590, 101582, 524061, 946949, 1074503, 762866, 233182, -64370, 165486, 882248, 1802625, 2498377, 2540817, 1852795, 885816, 178561, -221228, -625490, -1094441, -1351971, -1307761, -1225677, -1252550, -1170486, -808744, -374893, -139067, -25857, 243199, 744346, 1263036, 1518048, 1397215, 1083071, 948668, 1150901, 1350214, 1088934, 440252, -43676, -74284, 51526, -10938, -180248, -230369, -212014, -309194, -512495, -698839, -844030, -926035, -815078, -500415, -243662, -257190, -384183, -333903, -89144, 144198, 238606, 170337, -74853, -343781, -231092, 498709, 1477047, 2054327, 2049843, 1886505, 1970142, 2235997, 2391962, 2351175]
37084B351175q6036O86M7772m6671k04324k15541K9079L19161K87192j21881n07801
37073A852811m85539j68506k16j67547l74188k38925K02833N03450L12028k06144
37063A230057n51366m58461j40024N4651K9439r4908j85215j02310K68548P51217
37053H01628Q57580L62967k60314l76289m4907J07249j50065l42539q4324L16649
37043A187635L45729J6381k36558j77621N1686K43160L01519J80972p9571k66011
37033A567321j67302J35256L73604N43091R92560J836060K422559J804945p2894
37024I435200j957619k456293j546430m90201k24257l87226k04854K40293K32883
37015B641496l79935r23630q38084l20340R5172J63682n541j72678j32465Q7404
$$ y = [2351175, 2265139, 2265825, 2313597, 2266926, 2062602, 1847061, 1876140, 2195301, 2482493, 2360612, 1852811, 1367272, 1198766, 1198550, 1031003, 656815, 417890, 620723, 1124173, 1436201, 1230057, 678691, 220230, 80206, 134857, 164296, 69388, -115827, -218137, 50411, 801628, 1659208, 2022175, 1761861, 1385572, 1340665, 1447914, 1297849, 955310, 870986, 1187635, 1533364, 1549745, 1313187, 1135566, 1187252, 1430412, 1731931, 1912903, 1833332, 1567321, 1400019, 1535275, 1908879, 2451970, 3444530, 5280590, 7703149, 9508094, 9435200, 7477581, 5021288, 3474858, 2984657, 2760400, 2373174, 2168320, 2408613, 2641496, 2261561, 1337931, 499847, 179507, 274679, 438361, 432820, 260142, 127677, 215081]
37005B15081J67413r1995l63140j78117L32287N70064L50246R7542O4709l8084
36995A126006l89952o18945l96096m64J29881L3047l234L4657J1280m220P0889
36984g151N6344j63248l04691j22783Q5501q3139m20130l88923J437J95123n2427
36973a204087l64334l57832q7449K30899N02957O24180M50641Q0536j33825k0877
36963b79191J90001J98447j4949k41743k74289n5114K39323L12425J28858L6410
36953B40178K23608K72088k68782j006264j054931l05306L57108L21111M2532
36944a178658J69197N19012N29816K43078J22290J80393L7325k66743k59360J01743
36934A98093K35570j74492o56620o23483j54455K27474K64286J25292N2733J18114
$$ y = [215081, 382494, 290499, -72641, -250758, 81529, 651593, 1001839, 1099381, 1164090, 1126006, 736054, 117109, -278987, -279451, -149570, -116523, -119757, -85100, -73820, -78040, -7151, 49193, -114055, -418746, -541529, -456028, -539167, -959297, -1348220, -1346783, -1151660, -1204087, -1568421, -1926253, -2013702, -1782803, -1279846, -655666, -205025, -124489, -258314, -279191, -89190, 109257, 94308, -147435, -421724, -476838, -237515, 74910, 203768, 240178, 463786, 735874, 467092, -539172, -1594103, -1899409, -1542301, -1221190, -1178658, -1009461, -490449, 39367, 282445, 404735, 585128, 622453, 355710, 96350, 198093, 433663, 259171, -397449, -1020932, -1175387, -947913, -683627, -558335, -505602, -387488]
36924c87488K18438J48883j82179n10997m23888O0376M08349K89168N6998J88184
36914a34156N24613N32823J39738k10955k88175l18819m22279l30181R2001M75753
36904F0363M32002J02722j02663r4453q1685j26494q5964N9541J50238J35586
36894D49193J51893K57820L02842J41840j53947l74051l91518k77341k14546k79814
36884c87629l26533j84616M4745R8247r496N4773L93453O07014L58739o3833j43886
36873D40978R9691K02280J7252j12180J4707J30840k7174l02696l86281k25192
36863a47775K0734K11522K59453J22605r9224k14327j54500P144K23491M19223
36853F48346L45325j20653n36979k70975N47264R78831M74571l75268o91257m48067
$$ y = [-387488, -169050, -20167, -202346, -713343, -1137231, -1076855, -668506, -379338, -322340, -134156, 390457, 923280, 1063018, 852063, 563888, 245069, -177210, -507391, -415390, 60363, 492365, 595087, 492424, 397971, 316286, 189792, 103828, 163369, 313607, 449193, 601086, 858906, 1161748, 1303588, 1149641, 775590, 384072, 106731, -107815, -387629, -714162, -898778, -854033, -755786, -765282, -710509, -317056, 289958, 648697, 584864, 440978, 540669, 742949, 760201, 648021, 662728, 793568, 766394, 463698, 77417, -147775, -127041, 84481, 343934, 466539, 367315, 152988, -1512, 5632, 229123, 648346, 993671, 873018, 336039, 65064, 612328, 1591159, 2065730, 1690462, 999205, 551138]
36843E51138k24932j71998O7307N06338O02266O7860o22181q16250m61205l5082
36833e36739R2218j5908r2170j6136J03400J16269K4339n0472l9171M0258J90559
36822a83553M05970N34023L97677J09888m620R3863O3043k32662l94378q1364
36812G07887L70564L66943q8934m31013l48835j05377k0251p5872j46498k41401
36802a2787l40173k60905J05693N79098Q38081P02326K35753l11386o48188o45872
36792B41640m04849p3961K80873N34250M49836J7864l37160k12169K20656M42941
36782A159921K73907k6445k36282l35262k46952J00656M23066K77354k66127o03922
36772E19914m14564n8089M0520k8825K0770J59394J89081J23362Q6669N0107m7643
$$ y = [551138, 326206, 154208, 221515, 727853, 1330119, 1397979, 775798, -40452, -501657, -536739, -444521, -460429, -552599, -568735, -465335, -349066, -324727, -375199, -414370, -374112, -183553, 222417, 756440, 1154117, 1264005, 1259385, 1353248, 1416291, 1183629, 789251, 707887, 1078451, 1445394, 1356460, 925447, 576612, 471235, 450984, 375112, 228614, -12787, -352960, -613865, -508172, 70926, 909007, 1611333, 1847086, 1535700, 887512, 241640, -163209, -237170, 43703, 577953, 1027789, 1045653, 708493, 496324, 716980, 1159921, 1433828, 1407383, 1171101, 835839, 588887, 689543, 1112609, 1389963, 1123836, 519914, 105350, 47261, 87781, 58956, 79726, 239120, 428201, 551563, 638232, 688339, 640696]
36761F40696j17605j09148j56942k88575k46108R2924L71152K06113k06869l58088
36751a72450j52797N8843J06540J83826L68484M13419J83398o1547n9559L0144
36741H98301j22562m76723o09948k61587L13189O22810M71210R7230j78665k91140
36731D62115l45758l50415k25723l3719L1897o9687j42681l2298J77156L19573
36721b09540L42791K66201J08017n2054r6798m4658l2990o5602k63J27078N5003
36710C97185k57254m34139j90973K18198L59744K06345L0875q2879k26293l00518
36700b79709j05537K39398L74025K20172O1690O4408P2550m8206k02127k87758
36690A08906l19208k39003O3459M34422M92543J49093k09905k44394p6635J3143
$$ y = [640696, 523091, 413943, 257001, -31574, -277682, -184758, 186394, 392507, 185638, -172450, -325247, -266404, -159864, 23962, 392446, 805865, 989263, 927716, 868157, 898301, 775739, 299016, -310932, -572519, -259330, 363480, 834690, 931920, 753255, 462115, 116357, -234058, -459781, -493500, -461603, -531290, -673971, -706269, -529113, -209540, 133251, 399452, 507469, 455415, 358617, 313959, 280969, 215367, 215104, 342182, 397185, 139931, -294208, -485181, -266983, 92761, 299106, 329981, 247102, 20809, -279709, -385246, -145848, 228177, 448349, 510039, 574447, 646997, 598791, 396664, 108906, -210302, -449305, -385846, 48576, 541119, 690212, 480307, 235913, 159278, 172421]
36680A72421J5741N6810Q1019k3001j57668j72065j47019k38904l52343k63910
36670a028919J576K04393K52066K51470K34733J26868r195M579J37024J30523
36660C05118q7212k31080n3082K90351M37378K49416j07025l89092m52907l11519
36650c49654j52093j92734l96312m48453j69592J91035K83882J59927J55022L22185
36640e96787L26262r905l75744l88970j06738J29889K03882K82565M30379M60136
36630C54969K32969j04350k77475j55941J76873M90288N09098J25689l96568n88912
36620C66640k85916J42027K16505o8463k64731l9656M40584P25605N53886O1812
36610A848293l96126n76811n25086m48419m37669l83582j98700O961J00561J66838
$$ y = [172421, 188162, 244972, 325991, 302990, 145322, -26743, -173762, -412666, -765009, -1028919, -1027343, -822950, -570884, -319414, -84681, 42187, 32992, 37571, 174595, 305118, 217906, -13174, -66256, 224095, 661473, 910889, 803864, 414772, -38135, -349654, -501747, -694481, -1090793, -1539246, -1708838, -1517803, -1233921, -1073994, -918972, -596787, -270525, -280430, -656174, -1045144, -1151882, -1021993, -818111, -535546, -105167, 354969, 587938, 483588, 206113, 50172, 227045, 717333, 1226431, 1352120, 955552, 366640, 80724, 222751, 439256, 370793, 106062, 66406, 506990, 1232595, 1786481, 1848293, 1452167, 875356, 350270, -98149, -535818, -919400, -1118100, -1111139, -1010578, -843740]
36600h43740L60782N68075M87314J03006k07789j88328n6846j16407k47987j36729
36590b78649J42998J91784q2114l29995l48973l49909m32559k53512L84659R61696
36580c94574P91429q453o25652n90033j87420J81707M83370P08462N98543P8668
36570A036047m14949m32235q0198K32397L55375L45316J29660l13860o20339l89550
36560a52336J73822M35536J59400k60590m26701l74154k95919k30564j71684j61785
36550a304975j33413O0932L47129M40528K61915N4218j1435l5040q9375o3226
36540d72742N5077P6828m2574r8880l9631q2206k29372j11523L72635O91813L89946
36529E09371j94486m05916j91667j6132n6336n5288R7589J85563R6844j0561k8192
$$ y = [-843740, -482958, 85117, 572431, 675437, 467648, 279320, 222474, 106067, -141920, -278649, -135651, 56133, -25981, -355976, -704949, -1054858, -1487417, -1740929, -1356270, -394574, 396855, 388402, -237250, -827283, -1014703, -832996, -349626, 358836, 957379, 1036047, 621098, 188863, 108665, 341062, 696437, 1041753, 1171413, 857553, 237214, -152336, 21486, 457022, 616422, 355832, -70869, -445023, -740942, -971506, -1143190, -1304975, -1438388, -1377456, -1030327, -589799, -327884, -273666, -285101, -320141, -409516, -472742, -417665, -340837, -383411, -482291, -521922, -604128, -833500, -945023, -572388, 119425, 509371, 314885, -91031, -282698, -298830, -355166, -410454, -312865, -127302, -30458, -41019, -69211]
36518f9211n534Q0479K96261M77652L53411l2145l64764n20506o08836n87148
36508i80341k87513J37455K80034R4867j9116J12971J90410M8286n662K30305
36498a98304M31192K98254Q7753J13930J21246k62315p33368o53105p0644K73630
36488e91731K3728l39852l06413l3322O5502k4345o3096l6276o4759l5925K46748
36477a159741O33422P46428N19582K56048J19615n2863l23727m30194k26504k4929
36467E7137j56513m16665l41036R4586M68331N54938N24656M62481J79507l08821
36457A118601n66339l13531J16261K37636M6492j64915l44654n82772o87206l87697
36447a528124J15315L27177J91280J39070L40769M26851J38196k20883k58205
$$ y = [-69211, -74745, 5734, 301995, 779647, 1133058, 1100913, 736149, 215643, -393193, -980341, -1267854, -1130399, -850365, -755498, -774614, -661643, -471233, -422947, -428609, -198304, 232888, 531142, 618895, 732825, 854071, 591756, -141612, -794717, -865361, -591731, -568003, -907855, -1214268, -1247590, -1182088, -1206433, -1269529, -1305805, -1370564, -1406489, -1159741, -526319, 220109, 739691, 995739, 1115354, 1062491, 738764, 308570, 82066, 57137, -99376, -516041, -857077, -762491, -294160, 260778, 785434, 1247915, 1427422, 1118601, 552262, 238731, 354992, 592628, 639120, 474205, 129551, -453221, -1140427, -1528124, -1412809, -1085632, -894352, -755282, -414513, 12338, 150534, -70349, -328554]
36438c28554m7947R4608R2873N3239k5850j69251k28111o9451J64335K47762K07155
36427i192K16354K70864K26182Q7110J1448N9208J38913J68342J20026l4899k61174
36416I93182m07100l82902l01868k64992j32273K29215N60191M19218j78600o51445
36406a17374n27193j659L56611K90778L3465j05391q5244l9929l3159l4488l9566
36395c03149o5021n0863Q3553K72768L54641L31546L78550M76637K95769k85713
36385A488718p60707n21244K50780O95363L69018k29593m32529k62422j75767
36376D21617k95077l53813k29135p7676J5557J41922L06598L76254L25085K65679
36366H97011K01707Q015k87455m43422l18459n7564J16469J36512M2817j38303
$$ y = [-328554, -376501, -281893, -189020, -135781, -161631, -330882, -558993, -628444, -464109, -216347, -9192, 207162, 478026, 704208, 791318, 802766, 861974, 1000887, 1169229, 1289255, 1254356, 993182, 586082, 203180, -98688, -363680, -495953, -266738, 293453, 712671, 534071, -117374, -644567, -646226, -289615, 1163, 34628, -70763, -156007, -195936, -229095, -263583, -303149, -368170, -419033, -335480, -62712, 291929, 623475, 1002025, 1478662, 1774431, 1488718, 728011, 206767, 457547, 1152910, 1521928, 1292335, 859806, 597384, 421617, 126540, -227273, -456408, -534084, -518527, -376605, -70007, 306247, 631332, 897011, 1098718, 1106733, 819278, 375856, 57397, -167, 116302, 252814, 295631, 157328]
36356A57328l60639n08371m82026k92198k9287K11051L58464L84911L16436K07345
36346c6986J14468R3706J43939J37895n6145l18383l16954N1586M22363L74691
36336F10180k7203l40074l07514o1033J94450L90907M55973K62194j38061m31495
36326F08324l66427n0982J84778J36439j50934n03266p37796p12948l92017R7691
36316a887138N18285O93175O46615N45213M80405L71454J52291m3324n5768M268
36306A425476j05547l11542k37755K06067N72109M42118j5802l31850l52692k69526
36296A021056k13470j55751r1584l0714P7768J66513j817m15339o08033k71661
36286e23032J96703K56040O8172J54251M11298K57540k85652n21703k33601n1026
$$ y = [157328, -203311, -711682, -1193708, -1485906, -1515193, -1304142, -945678, -560767, -244331, -36986, 77482, 171188, 315127, 453022, 396877, 78494, -238460, -186874, 235489, 610180, 582977, 242903, -64611, -125644, 68806, 459713, 915686, 1177880, 1039819, 608324, 241897, 190915, 375693, 512132, 361198, -142068, -879864, -1592812, -1984829, -1887138, -1368853, -675678, -29063, 516150, 996555, 1368009, 1520300, 1476976, 1421208, 1425476, 1319929, 1008387, 770632, 976699, 1548808, 1990926, 1975124, 1643274, 1290582, 1021056, 807586, 651835, 560251, 529537, 607305, 773818, 772001, 356662, -251371, -523032, -326329, -70289, -2117, 152134, 563432, 820972, 535320, 13617, -219984, -271010]
36276b71010l53375o27757l88226L414K5898j19648J4659K77850K64903J00721
36266a072571J42692K24130l6790m08173l25847J18626K69719l3471k71672j82227
36256a575584j03632k08852j45497K51773N51953M26273K00350K65639M07423
36247F9846K18432j68226k87678p8314Q4339M419j01986L49K48247M04776L20780
36236G14984N5065j69177j67220j250J09221Q9112L1803p3370l21953n31658l13487
36225e77930K73657N66206J67939l90682l61890J31270L25729k168k76620j04768
36215b49257J59259J06045m2079J28301M75324M95444Q6238l34336m26459k78639
36205A19841j38407r5156j03594r7747K452K32861M66670M96472K90645K8456
$$ y = [-271010, -624385, -1252142, -1640368, -1636954, -1611056, -1730704, -1716045, -1438195, -1173292, -1072571, -929879, -705749, -742539, -1150712, -1476559, -1357933, -1088214, -1121685, -1393357, -1575584, -1679216, -1888068, -2033565, -1781792, -1229839, -803566, -603216, -337577, 69846, 288278, 120052, -167626, -245940, -161601, -157182, -259168, -258819, -10572, 394204, 714984, 770049, 600872, 433652, 432402, 541623, 630735, 662538, 589168, 267215, -264443, -577930, -304273, 261933, 429872, 39190, -322700, -191430, 134299, 132131, -144489, -249257, -89998, 16047, -26032, 102269, 577593, 1073037, 1159275, 824939, 398480, 119841, -18566, -113722, -217316, -315063, -312611, -79750, 386920, 883392, 1174037, 1202493]
36195A202493j72900l92693o54647p15734l39124K72275N72436K99316j67664
36186i6242k39158J77622N83713M96724j5654m74328n24325k21277J26081K60368
36176G3524J47191m5175j29965j18130k01364m46265o03088l84210J21881N30385
36166a055216O57102O86615P63658O88197K37991l80423o87771n02929j26851
36157B80373N6658l1214k15508l24981l01140j68337j2362N1280k7101j60430
36147h52762j85235j7790K36653L53310K24363J9239J0413K17156L59870K44131
36137F09348L3749n019J05239J24447k6510j92031k59517k82429l09381k94274
36127d96378k12579r6123O1585K55696L31238J21018k42376l86288j48053K32119
$$ y = [1202493, 1029593, 636900, -17747, -733481, -1072605, -800330, -227894, 71422, -96242, -335400, -157778, 425935, 922659, 907005, 432677, -91648, -312925, -186844, 73524, 220715, 175540, 45575, -72555, -273919, -720184, -1323272, -1707482, -1585601, -1055216, -398114, 288501, 1052159, 1740356, 1978347, 1597924, 910153, 407224, 280373, 337031, 305817, 90309, -234672, -535812, -704149, -716511, -665231, -692332, -852762, -1037997, -1055787, -819134, -465824, -241461, -222222, -211809, 5347, 365217, 609348, 643097, 638078, 743317, 867764, 841254, 649223, 389706, 107277, -202104, -496378, -708957, -805080, -743495, -487799, -156561, -35543, -277919, -664207, -812260, -580141]
36117e80141M32049L62647J15939j63950k81709j09802J88658K84325J16056m9396
36107C14676o1718o7840j34973p8158J28786J65068j15143l40595j74876J15846
36097b48927P8187k15789l38588j75691N3969K59657M58279M53528Q2347l25897
36087H1075l01151K8748J39439p610M2597L34797L39444j11709m44569k34485
36077a33424J46399J82743k3147r5961l0584j2718K0984J70756K46646J00088
36067E71782k6879Q0916J72100k3340k41955j26351Q9177l8013l21660j96097
36057f0320L10003N82501M18285K83017M30121M66178R0759l34743l64117j54228
36047A667456j37257l37948m57771m13057l63949l36950k07842j1552O3526j0572
$$ y = [-580141, -148092, 214555, 330494, 166544, -115165, -224967, -36309, 248016, 364072, 314676, 252958, 185118, 50145, -28013, 100773, 265841, 150698, -189897, -364773, -248927, -170740, -386529, -725117, -900808, -846839, -587182, -128903, 324625, 406972, 81075, -220076, -191328, -51889, -59499, -16902, 317895, 657339, 545630, 101061, -133424, 12975, 195718, 172571, 76610, 46026, 33308, 54292, 225048, 471694, 571782, 544903, 625819, 797919, 774579, 532624, 406273, 495450, 457437, 135777, -60320, 249683, 832184, 1250469, 1533486, 1963607, 2429785, 2520544, 2185801, 1821684, 1667456, 1530199, 1192251, 734480, 321423, -42526, -379476, -587318, -598870, -535344, -545916]
36037e45916p1754o8604j27942k61501k53752J2552K90538K26378j76678n30227
36027a506906n08944j78880J67799L50986L63027K35953N1859R870K31809N03308
36017b80119M77262J86874N4461K55510L93560O4573n18300q07579o56119l80920
36007a210797j74005J19709N61084Q27995N89051j7786m74402l96605J24550O43392
35997E92186P69605M84944P5077k16158l70319m42523m21044l32866k92351k93649
35987d47098j48578J79840L89943K39782n6037j27045J9044R5399K1044o9972
35977I6322j78782l69299m29724r9791L66605L93371o2920l66266j02355L49550
35967d03289M12676O2523l36955n87203o80367n47915j67844K46643M80183N82593
$$ y = [-545916, -617670, -686274, -814216, -1075717, -1329469, -1316917, -1026379, -800001, -976679, -1506906, -2015850, -2194730, -2026931, -1675945, -1312918, -1076965, -1025106, -1015236, -783427, -280119, 197143, 384017, 438478, 693988, 1087548, 1152121, 633821, -173758, -829877, -1210797, -1384802, -1265093, -704009, 123986, 713037, 695251, 220849, -175756, -51206, 592186, 1361791, 1846735, 1921812, 1705654, 1335335, 892812, 471768, 138902, -153449, -447098, -595676, -415836, -25893, 213889, 157852, 30807, 49851, 145250, 166294, 96322, -82460, -451759, -881483, -981274, -614669, -221298, -284218, -650484, -752839, -403289, 9387, 71910, -265045, -852248, -1532615, -2080530, -2248374, -2001731, -1521548, -938955]
35957i38955O40796N04124P9811k91903j91953K22561L56939Q294l54007k75477
35947b39770P3922K25056R0204j7488N0284N7277j72546l87481k45755J31996
35937d34301K88655J08454P40K54829N57696M51577J0490l18039l65411l05493
35927B49197j84752J05681L93915L01395j19919l29645r2452J47362j5233l01235
35917A54314k45669R309m9891m43690o03915j75586M98505Q25780O22987J73589
35907G65733k01459m39822o20274p02659n41601j71657J21112J69685J85217L87401
35897a048324N52169L22671j30934k61836K8043K50505J26868m8391m1349p1988
35887c22566k46576j99791K27230M99137J63877l39615l17183J06487K83383J36802
$$ y = [-938955, -298159, 205965, 285776, -6127, -198080, 24481, 381420, 389714, 35707, -239770, -165848, 59208, 149412, 131924, 182208, 239485, 66939, -320542, -566297, -434301, -145646, -37192, -36452, 218377, 776073, 1227650, 1238140, 920101, 554690, 249197, 64445, 170126, 564041, 865436, 745517, 415872, 323420, 470782, 455549, 154314, -91355, -82046, -131937, -575627, -1179542, -1355128, -856623, -30843, 592144, 765733, 564274, 124452, -495822, -1198481, -1740082, -1911739, -1790627, -1620942, -1435725, -1048324, -496155, -173484, -304418, -566254, -538211, -287706, -160838, -209229, -250578, -322566, -569142, -768933, -541703, -42566, 121311, -218304, -535487, -429000, -145617, -8815]
35877h815J51947M02565M19978O9308k19290k31563k61478m13780l07331J96110
35867b02349N68977L47073j71824l83493j85542P2041J72392J78687J76500J98024
35857G70486K79496L57267K54270l1462k15572j22416J4240r1327l01081k53625
35847F60276N8425K39223L0187l58073n29840l56796n3793J25094J76899K89430
35837B81032M92000M92317L7527o06333q09771l32491L07865M38848O7716j68333
35827B00377J17673N26457M09650k17985o34081l64340J29842N4500n72854q71483
35817a222244k99734N73502Q32543L84642r4226j55663J2277J10427J36938J69108
35807D47570J43887J5691j31871k24241k34204r0663J92195L48926J61154j24329
$$ y = [-8815, 143132, 545697, 965675, 1034983, 815693, 584130, 322652, -91128, -398459, -202349, 366628, 713701, 541877, 158384, -27158, 44883, 217275, 395962, 572462, 770486, 1049982, 1407249, 1661519, 1630057, 1414485, 1292069, 1306309, 1214982, 913901, 660276, 718701, 957924, 988111, 630038, 100198, -256598, -310391, -185297, -8398, 281032, 773032, 1265349, 1302876, 696543, -113228, -445719, -137854, 300994, 368710, 200377, 318050, 844507, 1254157, 1036172, 402091, 37751, 167593, 222093, -350761, -1222244, -1521978, -948476, -115933, 268709, 174483, 18820, 31097, 141524, 278462, 447570, 591457, 607148, 475277, 251036, 16832, -73831, 118364, 467290, 628444, 504115]
35797E04115p4352K50251L50694O3661k23552k40491j89104k39288j98261K7780
35787C1453J29899q6990l05964j97393O5139J77786K14471L25062K96145o7168
35777E82440m27436l59696q2636j30536m39871m22825O3312M72906M17089J67483
35767a59770J01859J52999J03155K1448O0695J04301k8392k00168j18322J91392
35757B29197L64050J69168k01290l81540k41275K9167J72428J08131p6475k79567
35747a08006m33272m42377k27210J18061L31323K43948k9392k33765k47235j57877
35737a185802j29985k27819l12700j40028L19532P07837O47950K66273M5382J12555
35727A03195N6889l75697q03775p40789k86275R3759K32997K92322L03488J50237
$$ y = [504115, 429763, 680014, 1030708, 1094369, 870817, 630326, 441222, 201934, 3673, 31453, 161352, 74362, -231602, -428995, -363856, -186070, 28401, 353463, 649608, 582440, 155004, -204692, -287328, -417864, -857735, -1280560, -1217248, -744342, -327253, -159770, -57911, 95088, 198243, 219691, 280386, 384687, 356295, 156127, 37805, 229197, 593247, 762415, 561125, 179585, -61690, -32523, 139905, 248036, 171561, -108006, -541278, -983655, -1210865, -1092804, -761481, -517533, -546925, -780690, -1027925, -1185802, -1315787, -1543606, -1856306, -1996334, -1676802, -968965, -321015, -54742, -9360, 103195, 160084, -215613, -1019388, -1760177, -2046452, -1952693, -1719696, -1427374, -1123886, -973649]
35717i73649o8002q8983J00712K73823L56406M40974M44188J87900j50922j38462
35707C83985K41813M53369J54811k97399l63990l7124K60201K67177P1222j59751
35697I74314l39466m05121l19492j37287M4742J73349K16427J56708Q5084J65171
35687F14429L83724M65290J97337k50344n06967m51261l01544k60466k49292p1359
35677d30453K72271N40139N03153J75253k08862m03478l36992j40737k6342r9553
35667a55601k60240l15912k07019l7931J44409M31256P71900Q19376L67060j84213
35657A373085k27111J73868K98367j74859o46746m81614L5538J41655k84967o26132
35647d18916m44475L5468L90455M84894L99133K30855Q6404K9815o842p6422n4014
$$ y = [-973649, -1041651, -1130634, -1029922, -756099, -399693, 41281, 485469, 673369, 522447, 383985, 625798, 1079167, 1233978, 936579, 572589, 535465, 795666, 1062843, 1134065, 974314, 634848, 229727, -89765, -227052, -182310, -8961, 207466, 364174, 449258, 614429, 998153, 1463443, 1660780, 1410436, 903469, 452208, 150664, -109802, -359094, -430453, -158182, 381957, 885110, 1060363, 851501, 448023, 111031, -29706, -56048, -155601, -415841, -731753, -938772, -976703, -832294, -401038, 370862, 1190238, 1557298, 1373085, 1145974, 1319842, 1618209, 1443350, 796604, 314990, 350528, 492183, 207216, -418916, -863391, -827923, -437468, 47426, 446559, 677414, 763818, 793633, 786791, 710369, 656355]
35636F56355J29618K18939n1681m68135n64593k92489l7692N159J3245P4423M4079
35625b72772n1004L5177K67441K69696m2564k51259j04408O9886o7228l05725
35615d52760k75371m8796N3622P177K8192J42768J69407L9337j34052k25912j65419
35604h61807L8670K07097J17948j48264k35760k3617J84336J48969L8391M9753
35594d84284L7744j68892l82222l30526p8102J45100K93489L78332K51789j33209
35584d70781m72069m60486k00731L3492J88433K92432K36586M0797P927K23152
35574e81248K70247q7530l48855N104N96404O73031K68369L9766J29804O5091
35564A030183k49746l44524j01383J1128j59964j51967K00120L56828K375l65798
$$ y = [656355, 785973, 1004912, 953231, 485096, -79497, -371986, -409678, -404519, -391274, -316851, -272772, -323776, -288599, -21158, 248538, 205974, -45285, -149693, -79807, -147035, -452760, -728131, -776927, -723305, -716128, -687936, -545168, -375761, -336424, -470476, -696388, -861807, -823137, -616040, -498092, -646356, -882116, -905733, -721397, -572428, -534037, -484284, -446540, -615432, -997654, -1328180, -1406282, -1261182, -967693, -589361, -337572, -470781, -942850, -1403336, -1604067, -1570575, -1382142, -1089710, -853124, -812327, -804400, -581248, -311001, -398531, -747386, -742282, -145878, 527153, 795522, 835288, 965092, 1030183, 780437, 435913, 334530, 345658, 185694, 33727, 233847, 590675, 593050, 227252]
35554B27252k88626j03780k39783l55002P5546P40805Q56058L26691j78928k28945
35544H31288m6016O3509R1991M9861j78425n20110o38999l63217P3495L49817
35534b86806L91052K77506M1016k82709n22901m61671o7649M05034N97209L86568
35524D76649M0280p8084M7393R5054j14753l71117l98348k00940O3505L29011
35514a11350N43524N56493L25228P2737M244J7324p0098j73236j08407L7481L4017
35503A127957q6416q6676N3780J08808k986j12743j15314q8724n3918Q2914K60960
35492A087642K25227j03079m44757n01821l04710r4275j5847n0182j02367m3103
35482c47272K02862M97643N56928L00453N017l9321Q9379Q7486j23640l02390
$$ y = [227252, -61374, -165154, -404937, -759939, -684393, 56412, 912470, 1239161, 1060233, 831288, 785272, 848781, 940772, 990633, 812208, 292098, -346901, -710118, -636623, -286806, 104246, 381752, 422768, 140059, -382842, -844513, -912162, -507128, 90081, 476649, 516929, 438845, 486238, 581292, 466539, 95422, -302926, -503866, -440361, -111350, 432174, 988667, 1313895, 1386632, 1390876, 1408200, 1338102, 1164866, 1056459, 1093940, 1127957, 1041541, 954865, 1008645, 1117453, 1114467, 1001724, 886410, 797686, 743768, 826682, 1087642, 1312869, 1209790, 765033, 263212, -41498, -135773, -151620, -201802, -304169, -347272, -144410, 353233, 910161, 1210614, 1215631, 1176310, 1265689, 1353175, 1229535, 927145]
35472I27145k55143j04456q4637j88287j74394P8191L63690L73918N8124l35151
35462F59000n32631m45833j46967K01584L78432K46252n6315k16107j20000L1712
35452h73O4993N9671Q6751j7250l33060n33166k64887K43140L90151L9525k72501
35441e37506r0515L62412N43027K64352k06628n10776m40429o246N06886O80920
35431E65497L83061l7082j42596Q7700L18778L18560J47488n7531k63927m68224
35421H51724n88580n10768k12327J66546L88461L29492J34805N9945J46746K06139
35411I72183J41588P2355O1043k1465k09808k94583j80635j22335k96638m00311
35401b78606q4605L98941M82421J25446j52000q2542N7697O1625J01436K06483
$$ y = [927145, 672002, 567546, 482909, 294622, 120228, 198419, 562109, 936027, 994151, 659000, 126369, -319464, -466431, -264847, 113585, 359837, 303522, 87415, -32585, -873, 64120, 123791, 210542, 193292, -139768, -672934, -937821, -694681, -304530, -265005, -537506, -628021, -265609, 277418, 541770, 335142, -175634, -616063, -622309, -115423, 565497, 948558, 911476, 768880, 856580, 1175358, 1493918, 1641406, 1583875, 1319948, 851724, 263144, -247624, -459951, -293405, 95056, 424548, 559353, 619298, 766044, 972183, 1113771, 1186126, 1247169, 1225704, 1015896, 721313, 540678, 418343, 121705, -278606, -363211, 35730, 518151, 643597, 491597, 409055, 466752, 528377, 629813, 836296]
35391H36296L1046m73112o90754j80854N33223O26115J31245k28985j81786j16963
35381B85471j86343l29N54548R14471O53607J40158q2628j07691l25627o39278
35371A206359o33564l30720j54788k06530j71713Q743k7429l79075n69241k40334
35361a498292K50828L34147M6521q4122J62607M47616M21564J57760o7891j49897
35351B0841j41162n3241J30402L10754L19977J36058n3599n5519J11868K54462
35341I80841K30573Q0280o9911j47457j37978l9336R1008J06868o9294k78859
35331G46735k70465l0355J87590K07770J32640R9657K3577k31575n43737o28166
35321c06329m11702j02430J22088K86342M19061L95520J31963j87311k61691k9432
$$ y = [836296, 867342, 394230, -296524, -477378, 55845, 681960, 813205, 584220, 402434, 285471, 99128, 98799, 653347, 1567818, 2221425, 2361583, 2278955, 2171264, 1845637, 1206359, 572795, 242075, 87287, -119243, -290956, -282213, -309642, -688717, -1257958, -1498292, -1247464, -913317, -866796, -950918, -788311, -340695, 80869, 238629, 170738, 20841, -120321, -173562, -43160, 267594, 587571, 723629, 670030, 614511, 726379, 980841, 1211414, 1291694, 1221783, 1074326, 936348, 897012, 988020, 1094888, 1025594, 746735, 476270, 445915, 633505, 841275, 973915, 1073572, 1097149, 865574, 321837, -306329, -718031, -820461, -698373, -412031, 7030, 402550, 534513, 347202, 85511, 56079]
35311E6079K64709L62154K41381N7682n9678q9173p1467o6286j21087k05473j99867
35300A68974l9734J39863J29205m9834j08603J23317M04422L65753K9929j96110
35290I67182q2763J14984M7605k36761m09169l47221k44743k55925k85498k04724
35280i37033o6372K8191J23222K95838M36004L39551J8789k63512l27557k78845
35270f31724k66349j96657R6718M74659N68635K94923J5592J7350Q0443j43770
35260C09820n02291m95421m9584K92033J08016l21912m27696q5755L42307N30419
35250c00064M46407K06425k3780m4507J69287L11655R0934k91682l39335L5857
35240B61197L67192L05485P2647K9182J16416N1434j54389k55832k38206l24904
$$ y = [56079, 320788, 682942, 924323, 982005, 922327, 833154, 761687, 695401, 574314, 368841, 168974, 129240, 269103, 398308, 348474, 239871, 363188, 767610, 1133363, 1163292, 967182, 884419, 999403, 1047008, 810247, 401078, 53857, -190886, -446811, -732309, -937033, -1003405, -975214, -851992, -556154, -120150, 219401, 238190, -25322, -352879, -631724, -898073, -1094730, -998012, -523353, 45282, 340205, 355797, 373147, 453590, 309820, -192471, -687892, -737476, -445443, -337427, -659339, -1087035, -1172790, -830483, -300064, 146343, 352768, 328988, 284481, 453768, 765423, 856357, 564675, 225340, 261197, 628389, 933874, 1006521, 1035703, 1152119, 1203553, 1049164, 793332, 555126, 230222]
35230B30222n22823n36531k40171Q2587J48436P9431J71317M20222N31253L26860
35220F90803p7036m69288p01459o51459k71165K44128N31026M37285J91566P5730
35210A31P8046L8284j3260P6394K42319K32736K0199j10079n306Q9621p9679l36571
35198B32835l09481j886J87100K4273k46886k52817M6687L68155M55403K93196
35188G96579L0161j98579l56410m46311m02546j25527L05697N50562L16466k48227
35178B21865o53019o14006l34016j45880o4553J18697M23271O19626N77211M26336
35168E75532K85111L9308m15086q34357p94236k26780M20278O73844N35680L44968
35158F04262K68870J66287o2436k54823k34330r9078q6446k29680l16800j88285
$$ y = [230222, -292601, -829132, -1069303, -986716, -838280, -758849, -587532, -167310, 363943, 690803, 613767, 144479, -556980, -1208439, -1479604, -1235476, -704450, -267165, -75599, 131, 78177, 116461, 103201, 179595, 421914, 654650, 674849, 564770, 559464, 649085, 569406, 232835, -76646, -78532, 108568, 132841, -114045, -366862, -320175, 47980, 503383, 796579, 826740, 628161, 271751, -174560, -577106, -702633, -396936, 153626, 470092, 221865, -431154, -1045160, -1379176, -1525056, -1589609, -1470912, -1047641, -428015, 149196, 575532, 860643, 899951, 484865, -349492, -1143728, -1370508, -950230, -276386, 259294, 604262, 873132, 1039419, 976983, 722160, 487830, 388752, 302306, 72626, -244174, -432459]
35148d32459M4193J21840n1557k56442j68946K20299M83613K25791l51760o12388
35138g77816k87889J56109J49707k32585m45242k29060J58500M12447N09022N00429
35128h6378L09845q0411m25580m17560n8990K81524K35250j46964l97306j57219
35118i43789L36877N10636K20073o3401J3556J68507L5164j59039o897K63991
35108C75678P8699m76180o69514k32948K68212L74544L33171M22766L60055j12488
35098G21995n91886n54570j41662J48572K13990K42254J75811j02992l03613r1531
35088b83632K51236J87132j68226j91212K11238M16511O4465m21052n11910k45380
35078f90830L6689J79745K04075J58199J75289L56637M95996K95974p2539j09394
$$ y = [-432459, -388266, -266426, -317983, -574425, -743371, -523072, -39459, 186332, -165428, -777816, -1065705, -909596, -759889, -992474, -1437716, -1666776, -1508276, -1095829, -586807, -86378, 223467, 143056, -282524, -700084, -759074, -477550, -242300, -389264, -786570, -943789, -606912, -96276, 123797, 60396, 73952, 242459, 277623, 118584, 111687, 375678, 454377, -21803, -691317, -924265, -656053, -281509, 51662, 474428, 834483, 721995, 130109, -424461, -566123, -417551, -203561, 38693, 214504, 111512, -192101, -283632, -32396, 154736, -13490, -204702, 6536, 423047, 487512, 66460, -445450, -690830, -654141, -474396, -270321, -112122, 63167, 419804, 915800, 1211774, 1139235, 1029841]
35068A029841J90011K13435l02671p49917n02683J65587N05501K87526j11988
35059G24642l52009l67724j71038J17575J82127j05522l48547j14766L56739M29407
35049C50884Q56l57969k61003j1521n4452l14168l62401k8385M21914O40498N58786
35038E83039L89706L31606L16550J32280k11277m34948m14894m12062o46371q60237
35028a226608o43717o0829M16966N31158M21833K50490N6963n227K48061O11953
35018F01043O02268J62119j60462J4392L38504K75102j27014l95221l48568k27476
35008G34687k10079k03108j30736j10159k51781m76904n94224m50370l0049M71395
34998a251328P27347N72207J76231j68055l30835l03768o0748L04974M57772J59373
$$ y = [1029841, 1219852, 1433287, 1130616, 380699, -121984, 43603, 549104, 836630, 724642, 372633, 4909, -166129, -48554, 133573, 28051, -320496, -435262, -78523, 350884, 351740, -6229, -267232, -278753, -333205, -647373, -1009774, -1038159, -616245, 24253, 583039, 972745, 1304351, 1620901, 1753181, 1541904, 1106956, 692062, 280000, -366371, -1226608, -1870325, -1931154, -1514188, -983030, -561197, -310707, -253744, -258971, -10910, 601043, 1203311, 1365430, 1204968, 1219360, 1557864, 1832966, 1705952, 1310731, 962163, 734687, 524608, 321500, 190764, 80605, -171176, -648080, -1242304, -1692674, -1722723, -1251328, -523981, 48226, 224457, 56402, -274433, -578201, -638949, -333975, 123797, 283170]
34988B83170l22554m71287j87311J22664J53311M8611M0345Q9914Q5441R4786
34978f2910J65743J13849j92327n03055m64143j32164R2001J0221j75289k11749
34968a359823p1254J61295M14620N60089M44261J18036j38120j34598K3542J39738
34958A57786J62206J07311o1810l08337m35474l35056j90601j95647j89767J08705
34948a180684N51698O29503J98808k19880j25609K56244L13232n2896l08220j16701
34938e4505J54284K1825l41757l50867R8354M51938L11029j8936o5784P2110m4112
34927B33579m15947n72945l16056L735Q8200J09164K76205M16059L44347K87289
34917D53630M64346N40374P6392o23763p69137k15298K86666J48378l22233n26951
$$ y = [283170, -39384, -510671, -697982, -575318, -422007, -373396, -333051, -243137, -157696, -62910, 102833, 216682, 24355, -478700, -942843, -1075007, -983006, -972785, -1148074, -1359823, -1431077, -1269782, -855162, -295073, 149188, 267224, 129104, -5494, 18048, 157786, 319992, 427303, 365493, 57156, -378318, -713374, -903975, -1099622, -1289389, -1180684, -628986, 517, 199325, -20555, -146164, 110080, 423312, 370416, 62196, -54505, 99779, 121604, -220153, -571020, -472666, -20728, 290301, 271365, 205581, 277691, 233579, -182368, -755313, -1071369, -1067634, -979434, -870270, -594065, -178006, 166341, 453630, 917976, 1458350, 1534742, 910979, 141842, -73456, 213210, 361588, 39355, -487596]
34907d87596m03728k56994j68980l8496O1682O703p9181k2290P3368O3777J28998
34896a122737M68662P99927O63190J60110j34952k6406N6408k05135n12418m23350
34886b76701J3177L61965L25843k4469l74203m05727r5350J81531P0512k32121
34876d55543k07533J84723L78852N0748l72807l73264r4334J771q8384j2572K25885
34865g62458K31599r1404l09919p5290L90435O09366M12553K3543k59835l14609
34855a46019k04750n4190Q6222K37692L64636L61067K32468J43961J67678J52209
$$ y = [-487596, -891324, -1148318, -1317298, -1355794, -1294112, -1287409, -1366590, -1388880, -1315512, -1251735, -1122737, -654075, 145852, 809042, 969152, 834200, 807794, 864202, 659067, 146649, -276701, -263524, 98441, 424284, 399815, 25612, -380115, -475465, -293934, -223422, -455543, -663076, -478353, -99501, -48753, -421560, -794824, -889158, -887387, -975771, -988343, -762458, -530859, -622263, -932182, -1007472, -617037, -7671, 404882, 428425, 168590, -146019, -350769, -404959, -318737, -81045, 283591, 644658, 877126, 1021087, 1188765, 1340974]
$$ [...]
##END NTUPLES=NMR SPECTRUM
##END=
