##TITLE=31Pdec_B3C2301
 CDCl3, 24 sc
 24.1.2025
##JCAMPDX= 6.0         $$ Bruker NMR JCAMP-DX V2.0
##DATA TYPE= NMR SPECTRUM
##DATA CLASS= NTUPLES
##ORIGIN= UXNMR, Bruker Analytische Messtechnik GmbH
##OWNER= root
$$ XWIN-NMR		Version 3.5
$$ Fri Jan 24 14:00:42 2025 Russian Standard Time (UT+4h)  she@DPX200
##.OBSERVE FREQUENCY= 81.013821
##.OBSERVE NUCLEUS= ^31P
##.ACQUISITION MODE= SIMULTANEOUS
##.ACQUISITION SCHEME= undefined
##.AVERAGES= 24
##.DIGITISER RES= 17
##SPECTROMETER/DATA SYSTEM= spect
##.PULSE SEQUENCE= zgpg30
##.SOLVENT NAME= CDCl3
##.SHIFT REFERENCE= (INTERNAL, CDCl3, 0, 198.062)
##AUDIT TRAIL= $$ (NUMBER, WHEN, WHO, WHERE, WHAT)
$$ ##TITLE= Audit trail, XWIN-NMR		Version 3.5
$$ ##JCAMPDX= 5.01
$$ ##ORIGIN= Bruker BioSpin GmbH
$$ ##OWNER= she
$$ F:/spectra/data/she/nmr/P31/2/pdata/1/auditp.txt
$$ ##AUDIT TRAIL=  $$ (NUMBER, WHEN, WHO, WHERE, WHAT)
(   1,<2025-01-24 13:59:39.32 +0400>,<she>,<DPX200>,
      <created by zg, POWCHK disabled, PULCHK disabled
       configuration hash MD5:
       00 E9 B6 7A A2 85 ED C7 34 08 36 98 17 FE 4E 26
       data hash MD5: 32K
       47 5F 03 A0 A3 C2 9E 1E 60 42 60 21 8C 69 25 61>)
(   2,<2025-01-24 13:59:41.92 +0400>,<she>,<DPX200>,
      <Start of raw data processing
       efp BC_mod = 2 LB = 1.5 FT_mod = 6 PKNL = 1 PHC0 = 2098.706 PHC1 = 96.0871 SI = 64K 
       data hash MD5: 64K
       1E 41 F2 8E CD A6 45 74 80 2A F2 3D A2 D6 84 31>)
(   3,<2025-01-24 14:00:06.42 +0400>,<she>,<DPX200>,
      <pk PHC0 = 118.2825 PHC1 = -217 
       data hash MD5: 64K
       A4 5A 8A B1 E0 E3 9D CA 8E 62 08 2D 1C 01 F4 7D>)
(   4,<2025-01-24 14:00:10.10 +0400>,<she>,<DPX200>,
      <abs ABSG = 5 
       data hash MD5: 64K
       FF 02 2E 6B 6B 35 BC A4 9D 61 24 2D 3C AC E9 2A>)
$$ ##END=
$$ 
$$ hash MD5
$$ 66 F3 1E F0 B0 A9 65 1A 31 B8 E8 CA 64 70 DE F9
##$RELAX= 
##$RELAX= 
##$RELAX= 
##$RELAX= 
##$RELAX= 
##$RELAX= 
##$RELAX= 
##$RELAX= 
$$ Bruker specific parameters
$$ --------------------------
##$DU= <F:/spectra>
##$EXPNO= 2
##$NAME= <P31>
##$PROCNO= 1
##$TYPE= <nmr>
##$USER= <she>
##$AMP= (0..31)
100 100 100 100 100 100 100 100 100 100 100 100 100 100 100 100 100 100 
100 100 100 100 100 100 100 100 100 100 100 100 100 100 
##$AQSEQ= 0
##$AQ_mod= 1
##$AUNM= <au_zg>
##$AUTOPOS= <>
##$BF1= 81.014009
##$BF2= 200.13
##$BF3= 200.13
##$BF4= 200.13
##$BF5= 200.13
##$BF6= 200.13
##$BF7= 200.13
##$BF8= 200.13
##$BYTORDA= 1
##$CFDGTYP= 0
##$CFRGTYP= 5
##$CHEMSTR= <none>
##$CNST= (0..31)
1 1 145 1 1 1 1 1 1 1 1 1 1 1 1 1 1 1 1 1 1 1 1 1 1 1 1 1 1 1 1 1 
##$CPDPRG= <waltz16>
##$CPDPRG1= <>
##$CPDPRG2= <waltz16>
##$CPDPRG3= <>
##$CPDPRG4= <mlev>
##$CPDPRG5= <mlev>
##$CPDPRG6= <mlev>
##$CPDPRG7= <mlev>
##$CPDPRG8= <mlev>
##$CPDPRGB= <>
##$CPDPRGT= <>
##$D= (0..31)
0 1 0 0 0 0 0 0 0 0.06 0 0.03 2e-05 3e-06 0 0 0.0002 0 0 0 0 0 0 0 0 0 
0 0 0 0 0 0 
##$DATE= 1737712778
##$DBL= (0..7)
120 120 120 11 120 120 24 19 
##$DBP= (0..7)
150 150 150 150 150 150 150 150 
##$DBP07= 0
##$DBPNAM0= <>
##$DBPNAM1= <>
$$ [...]
##$SUBNAM3= <"">
##$SUBNAM4= <"">
##$SUBNAM5= <"">
##$SUBNAM6= <"">
##$SUBNAM7= <"">
##$SUBNAM8= <"">
##$SUBNAM9= <"">
##$SW= 400.765351723535
##$SWIBOX= (0..15)
0 1 3 0 0 0 0 0 0 0 0 0 0 0 0 0 
##$SW_h= 32467.5324675325
##$TD= 32768
##$TD0= 1
##$TE= 0
##$TE2= 300
##$TE3= 300
##$TEG= 300
##$TL= (0..7)
0 120 53 12 22 120 120 120 
##$TP= (0..7)
150 150 150 150 150 150 150 150 
##$TP07= 0
##$TPNAME0= <>
##$TPNAME1= <>
##$TPNAME2= <>
##$TPNAME3= <>
##$TPNAME4= <>
##$TPNAME5= <>
##$TPNAME6= <>
##$TPNAME7= <>
##$TPOAL= (0..7)
0.5 0.5 0.5 0.5 0.5 0.5 0.5 0.5 
##$TPOFFS= (0..7)
0 0 0 0 0 0 0 0 
##$TUNHIN= 0
##$TUNHOUT= 0
##$TUNXOUT= 0
##$USERA1= <user>
##$USERA2= <user>
##$USERA3= <user>
##$USERA4= <user>
##$USERA5= <user>
##$V9= 5
##$VALIST= <valist>
##$VCLIST= <CCCCCCCCCCCCCCC>
##$VD= 0
##$VDLIST= <DDDDDDDDDDDDDDD>
##$VPLIST= <PPPPPPPPPPPPPPP>
##$VTLIST= <TTTTTTTTTTTTTTT>
##$WBST= 1024
##$WBSW= 4
##$XGAIN= (0..3)
0 0 0 0 
##$XL= 0
##$YL= 0
##$YMAX_a= 11065
##$YMIN_a= -16855
##$ZGOPTNS= <>
##$ZL1= 120
##$ZL2= 120
##$ZL3= 120
##$ZL4= 120
##$ABSF1= 198.0616
##$ABSF2= -202.7028
##$ABSG= 5
##$ABSL= 3
##$ALPHA= 0
##$AQORDER= 0
##$ASSFAC= 0
##$ASSFACI= 0
##$ASSFACX= 0
##$ASSWID= 0
##$AUNMP= <proc_1d>
##$AZFE= 0.1
##$AZFW= 0.5
##$BCFW= 0
##$BC_mod= 2
##$BYTORDP= 0
##$COROFFS= 0
##$CY= -3
##$DATMOD= 1
##$DC= 0
##$DFILT= <>
##$DTYPP= 0
##$F1P= 0
##$F2P= 0
##$FCOR= 1
##$FTSIZE= 65536
##$FT_mod= 6
##$GAMMA= 0
##$GB= 0
##$INTBC= 1
##$INTSCL= 9.790993e-09
##$ISEN= 30
##$LB= 1.5
##$LEV0= 0
##$LPBIN= 0
##$MAXI= 10000
##$MC2= 0
##$MEAN= 0
##$ME_mod= 0
##$MI= 50
##$NCOEF= 0
##$NC_proc= -5
##$NLEV= 6
##$NOISF1= 182.463
##$NOISF2= 159.3651
##$NSP= 0
##$NTH_PI= 0
##$NZP= 0
##$OFFSET= 198.0616
##$PC= 4
##$PHC0= 2216.989
##$PHC1= -120.9129
##$PH_mod= 1
##$PKNL= yes
##$PPARMOD= 0
##$PSCAL= 0
##$PSIGN= 0
##$REVERSE= no
##$SF= 81.0140089999434
##$SI= 65536
##$SIGF1= 159.3651
##$SIGF2= -187.1042
##$SINO= 113.3802
##$SIOLD= 16384
##$SREGLST= <1H.CDCl3>
##$SSB= 0
##$STSI= 65536
##$STSR= 0
##$SW_p= 32467.5324675325
##$SYMM= 0
##$S_DEV= 0
##$TDeff= 32768
##$TDoff= 0
##$TI= <>
##$TILT= no
##$TM1= 0
##$TM2= 0
##$TOPLEV= 0
##$USERP1= <user>
##$USERP2= <user>
##$USERP3= <user>
##$USERP4= <user>
##$USERP5= <user>
##$WDW= 1
##$XDIM= 65536
##$YMAX_p= 347383235
##$YMIN_p= -6360574
$$ End of Bruker specific parameters
$$ ---------------------------------
##NTUPLES= NMR SPECTRUM
##VAR_NAME=  FREQUENCY,     SPECTRUM/REAL,   SPECTRUM/IMAG
##SYMBOL=    X,             R,               I
##VAR_TYPE=  INDEPENDENT,   DEPENDENT,       DEPENDENT
##VAR_FORM=  AFFN,          ASDF,            ASDF
##VAR_DIM=   65536,         65536,           65536
##UNITS=     HZ,            ARBITRARY UNITS, ARBITRARY UNITS
##FACTOR=    0.49542278885378, 1,            1
##FIRST=     16045.7642231865, 0,            0
##LAST=      -16421.768244346, 0,            0
##MIN=       -16421.768244346, -6360574,     0
##MAX=       16045.7642231865, 347383235,    0
$$ Real data points
##PAGE= N=1
##DATA TABLE= (X++(R..R)), XYDATA
$$ [...]
40882d95472o4580J15115K52661K39169J25659M0687M47q1442j84841j48679O4943
40871a36333K26105J19248j33544k31878j22531l0125o3523o2393P0569J46540
40861b17865j0783k41878k67039r8436J6749j0289l5476K3241P4496O3781O4679
40850f38820J06057J07603M6317Q406K5840L5251L4013Q6068J43836Q7584j8432
40839B3723K7728J89231J58966j56192m20171l41013q4682L1919J0815M1891J13747
40828d04038Q7843J1461K5947P3977J5681o8617j9887N8687l1151j53732J464
40817d02365L41561M03445N7313k52799j53845J43578K24381O2172o0380k7039
40807C36022J5148n1005j61450j95519j05291O3325J93154J75142J8709j59721
$$ y = [-495472, -560052, -444937, -192276, 46893, 172552, 213239, 213686, 132244, -52597, -201276, -136333, 89772, 209020, 75476, -156402, -278933, -309058, -372581, -434974, -364405, -217865, -228648, -470526, -737565, -836001, -819252, -829541, -865017, -841776, -767280, -703499, -638820, -532763, -425160, -378843, -370437, -344597, -309346, -275333, -189265, -45429, 42155, 23723, 51451, 240682, 399648, 243456, -176715, -517728, -602410, -570491, -559676, -517785, -404038, -316195, -304734, -278787, -204810, -189129, -257746, -277633, -218946, -250097, -403829, -402365, -60804, 342641, 399954, 147155, -6690, 136888, 361269, 423441, 363061, 336022, 351170, 300165, 138715, -56804, -162095, -98770, 94384, 269526, 288235, 128514]
40797A28514k65252k65228j30589J18289L12341K62082K4152j30879o4425Q4307
40787G3312J43367J12695N6347k4027j13655j38451q1306j3298L8911J08358J50752
40776C13005Q3582j4198L0368J77344J93736M4922k1361J14300K47210K00841
40766A369749P0300m8034k42550m91155n19785k35558J5078n1431j91234m9131
40756c73751K29281K45364P910j29116o4416j3218m6103k8469J2455q0114j94908
40745d35085n0764K72517L70330J57687L323R1825J34406p4326k67235j66857
40735C5821M0971K9125j66598k88249k60467j51074N0119L05081L83193J66166
40725A44088p4392l3263J47127J06359j41256k38370p0770P6527L384j22281r3507
$$ y = [128514, -136738, -401966, -532555, -414266, -101925, 160157, 184309, 53430, -10995, 73312, 216679, 329374, 385721, 361694, 248039, 109588, 28282, 14984, 53895, 162253, 313005, 396587, 382389, 412757, 590101, 783837, 828759, 807398, 921698, 1168908, 1369749, 1440049, 1392015, 1149465, 658310, 138525, -97033, -81955, -133386, -324620, -373751, -144470, 100894, 108804, -20312, -84728, -97946, -144049, -172518, -160063, -240177, -435085, -485849, -213332, 156998, 314685, 318008, 409833, 544239, 469913, 202678, 35821, 76792, 105917, -60681, -348930, -609397, -760471, -710352, -405271, -22078, 144088, 69696, 36433, 183560, 289919, 148663, -89707, -160477, -83950, -80566, -202847, -296354]
40714b96354J2754J7509n9419o9244J2929P2324M4578J667M6905J77519K65388
40703B26556J88363p030j28271p3084K8804J716j20341j58411o1406M8503R3059
40692C8458J26308J68913J17477r2075l39390m34042l19985j02628Q2849J77341
40682e76774J98962J79748J13642r123j15433q1128Q6947J92018Q6215j07194
40672c2120j58725n6107K2356J4244K4703P2640M2989n3398m3378P4084L5252
40661e7460k62231m97135l45615L5990K44199J92949J17978J18245N9170q2861
40651d76771j40544p5972n5286j16163p2565J27726K54591J67585N1503Q3698
40641b52198J40155P2763J7337J23379K02101R994k71759k47085P4390K76202
$$ y = [-296354, -283600, -266091, -325510, -394754, -381825, -309501, -264923, -263256, -216351, -38832, 226556, 414919, 407889, 279618, 206534, 235338, 237054, 116713, -41698, -103104, -54601, 38458, 164766, 333679, 451156, 359081, 19691, -414351, -734336, -836964, -754115, -576774, -377812, -198064, -84422, -93545, -208978, -290106, -203159, -11141, 75074, -32120, -190845, -246952, -224596, -210352, -185649, -113009, -70020, -123418, -166796, -92712, -57460, -319691, -816826, -1162441, -1126451, -882252, -689303, -571325, -453080, -393910, -476771, -617315, -693287, -748573, -864736, -937301, -809575, -554984, -387399, -335896, -252198, -112043, -39280, -21943, 101436, 303537, 313531, 41772, -205313, -130923, 145279]
40631A45279J61662j7276l1057J1324l6603q4594l6596j1343j01334j50853k5969
40620a77360R9858J5646j30147k6391K85062M21570K01713j18209k30245j54792
40610A86705j02111j29879j10203L4965K07665K43673Q0631j82541l61301l34396
40600d66792j48319K8095O5987r204o8307l2636M1428M9019o624l717J19080K41901
40588a90089K08901N1132n3808l5291j0450q5134k01826k40670j66423j9770J39188
40577f04240K26999J78364M7991k2785J9033J01160J79038K69877L04567J54664
40567H54668j09811k17532q6128J8580j00758k40354j43891L2696m4082l19850
40557c56462m11754j95143N0523J14968J13896J73941J89082N6076r9258j12271
$$ y = [145279, 306941, 289665, 258608, 269932, 233329, 148735, 112139, 100796, -538, -151391, -177360, -77502, -61856, -192003, -218394, 66668, 488238, 689951, 571742, 341497, 186705, 84594, -45285, -155488, -120523, 87142, 330815, 411446, 228905, -132396, -466792, -615111, -587016, -521029, -530233, -598540, -631176, -589748, -540729, -547353, -551070, -431990, -190089, 18812, 69944, 16136, -19155, -29605, -114739, -316565, -557235, -723658, -743428, -604240, -377241, -198877, -150886, -173671, -154638, -53478, 125560, 395437, 700004, 854668, 744857, 527325, 441197, 459777, 359019, 118665, -25226, 7470, -36612, -356462, -768216, -963359, -912836, -797868, -683972, -510031, -320949, -264873, -364131, -476402]
40547d76402j6487O2627J01204J30516J27982P6109K4507L412k1332m8591k1568
40536e8023M4251N5255O424q478O439n7916j65232j12422J29398K92604J89504
40525C21804j6088j00218j10511j67431j55647O6898L05421K39306o6156k22989
40515I4389j03763m206j38550l07199k42847k7680O3760k4115j03871n1040O9001
40504g76121J58140K06617K39807K55456K43691K08741J60088J15569R0951N0474
40494I53413p8814k73417l53598j80059J07513J96535j3820k74276l14889j78950
40484d10362q8061q2132o242J66494K34056O6610j77178k61033j65152l5166N1068
40473g07098J06927J03904p283j57956j91379n0005J56995K69513J99759r715
$$ y = [-476402, -492889, -430262, -329058, -198542, -70560, 5549, 30056, 33468, 12136, -36455, -58023, -13772, 41483, 47907, 39429, 45868, -12048, -177280, -289702, -160304, 132300, 321804, 305716, 205498, 94987, -72444, -228091, -161193, 144228, 383534, 317378, 94389, -9374, -13580, -152130, -459329, -702176, -729856, -666096, -690211, -794082, -845122, -776121, -617981, -411364, -171557, 83899, 327590, 536331, 696419, 811988, 902939, 953413, 874599, 601182, 247584, 67525, 175038, 371573, 357753, 83477, -231412, -410362, -498423, -580555, -586797, -420303, -186247, -119637, -296815, -557848, -723000, -758166, -707098, -600171, -496267, -503550, -661506, -852885, -902890, -745895, -476382, -276623, -286338]
40463b86338j78746j20531J24826K88688K22700J09938J50677K01229J2310k83334
40453B41419k92277L5382L08655K85062J75079J93458J81407m4895k70851j73559
40443F38880J40346K59660O0500j70747k07670j57877j83628k14479j04132Q3622
40433A44475J36424K657j15202k7386J71846K08407k825k24637k09301k2305R0310
40422A52463O0923K0316J2974n2212j55063j37476M678O2282m2574r9455N6516
40411a16628K76343L25169J79068n6025l03767m32411k58900J42483L70136J91137
40401C16605j07226j40271J7212L2655j13657j57659m3381K1550l2174n7015j5644
40390b79005l4488j07536q1223L2004N4139m835O2386K49163K75196O0607r3704
$$ y = [-286338, -465084, -585615, -460789, -172101, 50599, 160537, 311214, 512443, 524753, 241419, -50858, -15476, 293179, 578241, 753320, 946778, 1128185, 1083290, 812439, 638880, 779226, 1038886, 1099386, 928639, 720969, 563092, 379464, 164985, 60853, 144475, 280899, 283556, 168354, 140968, 312814, 521221, 518396, 293759, 84458, 62153, 152463, 213386, 233702, 246676, 194464, 39401, -98075, -93397, -31115, -73689, -173144, -116628, 159715, 484884, 663952, 607927, 304160, -128251, -387151, -244668, 125468, 316605, 209379, 69108, 86320, 118975, 5318, -152341, -195722, -174172, -206346, -263361, -279005, -313493, -421029, -502252, -470248, -416109, -420944, -358558, -109395, 165801, 226408, 132704]
40379A32704J4140J45233N358k77912l48475j36377R4209J37647N6140J0472N4627
40368a12234J26498J48609J07296N3239K5884P543j0254J8918R0018Q2108n7244
40357D80381j52242k7184J71021J37571j16210k43961p5562J38314J15170p2005
40347C55293j62145p7748M1595N8429m4174j81649k27069j29946L415N3676P7913
40336b32410J80030K44402O9949k32765l08356r0989P6677o497r1819O2076K65686
40325f4016K30293M4476k1132K7809K889p3370l4363P0285M2213q7686r3396M6373
40313I0375J13593L9341N283Q8745J11239l1126j44700k4499K14677K81218Q2709
40302H26855j98385l49360l11997j43634P7390K58500K80205Q0195k19641l49582
$$ y = [132704, 146844, 292077, 297435, 19523, -328952, -465329, -371120, -233473, -177333, -166861, -112234, 14264, 162873, 270169, 323408, 349292, 356835, 346581, 365499, 455517, 537625, 480381, 328139, 300955, 471976, 609547, 493337, 249376, 173814, 312128, 427298, 355293, 193148, 115400, 156995, 215424, 171250, -10399, -237468, -367414, -363999, -310323, -232410, -52380, 192022, 261971, 29206, -279150, -370139, -293462, -299959, -391778, -329702, -64016, 166277, 210753, 189621, 217430, 220319, 146949, 112586, 182871, 225084, 137398, 44002, 90375, 203968, 243309, 248592, 337337, 448576, 417450, 272750, 248251, 462928, 744146, 826855, 628470, 279110, -32887, -176521, -99131, 159369, 439574, 519769, 300128, -49454]
40292d9454j57824J77260L14516J46387r2467j52989p3082o2045j92233l23898
40282d65829k87909o1450K06554L13957K06705O2525P6634J82760J48186n5011
40272C27122j93921j38488l3118m711L6712J48150J68636L739j39866o2606Q9371
40261B01020P3639m9343p9494o7429j76986k82987j18705K14057K97245P959k91376
40250b72400k73774m3205J13667J02938J3237n6010k9006J17291K68153K61793
40240B02684J11702j8300p2560j40044k18981j80323j7347J00052R0434N8523
40230h4160O1110J5100p1420k9697J71357K86920J26181j62499l03454k38893
40220b29455j08794k1445R808J1214M4166J48464K20634J03301j34131k07108
$$ y = [-49454, -207278, -30018, 284498, 430885, 338418, 185429, 112347, 50302, -141931, -465829, -753738, -815188, -608634, -294677, -87972, -25447, 51187, 233947, 382133, 327122, 133201, -5287, -38405, -43116, -6404, 141746, 310382, 314121, 174255, 111649, 201020, 274659, 225316, 145822, 78393, -98593, -381580, -500285, -286228, 11017, 18976, -272400, -546174, -589379, -475712, -372774, -359537, -415547, -444553, -327262, -59109, 202684, 314386, 296086, 223526, 83482, -135499, -315822, -333169, -233117, -142683, -84160, -23050, -7950, -79370, -109067, 62290, 349210, 475391, 312892, 9438, -229455, -338249, -359694, -349886, -338672, -294506, -146042, 74592, 177893, 43762, -163346]
40210a63346j8501J70596J27164j8524k9412N1535L3047n7621l5100R3424J25099
40199B78361k120j18360r4324k870L2850q077q3405j50695j60926r3403j1594
40188d14563L785l0947m3083k9775l7858m5981J0621J09783J59801J45948J36460
40177c5809J32717M6445j28463k40217j61742J9692R4494J695q0910L0767K51947
40166f9384K92876L4063k74537l10198r9042M0037m2274j38707k8597J99529L05096
40155i1138K19020N6363p4248j21977o1710L5611M121j80977k74678o6474K71267
40144b84820L65466J31601j48107k28137j51051o3023o98M9805N0501k3115j12255
40133d13833j38211o6491R9526K88472L37321J42594j53917k83836j79150k1124
$$ y = [-163346, -181847, -11251, 115913, 97389, 67977, 119512, 152559, 94938, 59838, 153262, 278361, 276241, 157881, 63557, 60687, 93537, 85460, 2055, -148640, -309566, -402969, -414563, -410778, -441725, -484808, -514583, -552441, -598422, -587801, -478018, -318217, -172269, -35809, 96908, 143353, 14890, -225327, -387069, -367377, -272883, -271188, -352098, -321331, -69384, 223492, 257555, -16982, -327180, -426222, -386185, -428459, -567166, -595763, -396234, -91138, 127882, 184245, 109997, -11980, -73690, -38079, -33958, -214935, -489613, -556087, -284820, 80646, 212247, 64140, -163997, -315048, -378071, -378769, -328964, -278463, -301578, -413833, -552044, -618535, -519009, -230537, 106784, 249378, 95461, -188375, -367525, -388649]
40123c88649N5956J08152J68696J19369q5279k54615k06080l8422K4529m6600
40113e42943j19605j60164k26207k45124n4175K91067M75038L03384l0206j89008
40103d97943r8005L7806N7846K9332Q6264K08083K45499J30252k7287q2529m6199
40092D3119n2051j37349j60123j0904J72219J40400j20235l29454k60821k2490
40082g37689J17208Q8164M7625R1119J19485M3453l8268J2796J38172J40694l5600
40071a2841k12706k02718l6024R2488N5072q8742j80264j21356M5092J74138J40284
40060c47577m0280j98183j57391Q0056L17480L62871K28077Q6821M7912M5938
40050D25724j4908r4196p9073L2450J21701J16642O2056P704o3333j53459j99825
$$ y = [-388649, -332693, -224541, -55845, 63524, -21755, -276370, -482450, -520872, -496343, -542943, -662548, -822712, -1048919, -1294043, -1348218, -1057151, -582113, -278729, -308935, -497943, -595948, -558142, -500296, -470964, -384700, -176617, 68882, 199134, 171847, 89318, 43119, -8932, -146281, -306404, -317308, -145089, -4689, -124924, -454378, -715199, -737689, -620481, -532317, -484692, -393573, -274088, -230635, -268903, -256107, -117935, 22759, -12841, -225547, -428265, -464289, -371801, -316729, -405471, -585735, -707091, -661999, -487861, -347577, -387857, -586040, -743431, -663375, -345895, 16976, 245053, 331874, 379786, 425724, 410816, 316620, 237547, 269997, 391698, 508340, 570396, 578100, 514767, 361308, 161483]
40039A61483j62943p8587K8549J74469K92856K20130o9603l30521l11770q0146
40029a56083R6645J20133J07490J06877J5623j73379k69371j34058J20225K76752
40019A10854K38535M7538j81222k84751j63816N7619J39446O0589N7005K26973
40009C08770L28923J54860j05860j34520L2046Q0811q7150k50311k46524j69722
39999h8677j32142q9385m653K8893l7972q1110J2646J56956J97833J38198R6857
39988A97444J10206J06264M6368j8007k9459O520L9419K1187n0130j08966p6381
39977B44465L8338J30994J25024N2739j5352o1703r6572j03101p2129m7084o9507
39966A26112j15765j43454j51144j26377m290K10605L37446J96041j07640k48146
$$ y = [161483, -1460, -80047, -51498, 122971, 415827, 635957, 566354, 235833, -75937, -156083, -59438, 60695, 168185, 275062, 290685, 117306, -152065, -286123, -165898, 110854, 349389, 396927, 215705, -69046, -232862, -175243, -35797, 24792, 81797, 308770, 637693, 792553, 686693, 552173, 584219, 665030, 577880, 327569, 81045, -88677, -220819, -310204, -314857, -285964, -323936, -405046, -392400, -235444, -37611, 100587, 197444, 307650, 413914, 460282, 442275, 412816, 419336, 458755, 479942, 429812, 320846, 244465, 282803, 413797, 538821, 591560, 576208, 514505, 417933, 314832, 242703, 195619, 126112, 10347, -133107, -284251, -410628, -414918, -204313, 133133, 329174, 221534, -26612]
39956b6612r3041J15939J03158o7593j24445J4414J78286K29660J93432J02909
39946F26107n4558j92087j55935J479J0941k07986l57542j81302J34218K40951
39936a35714J37198P1980P4956k6060j73072j06981J19127J11071k19608m15808
39926e62911j50177K45645K87256N7899j6980J04755Q8849j23226j85626N6278
39916a98238K88765K21684P510n2781L7878O0880m5144j40280j32472p3453k9054
39905e4705K684L5650M6690M647q0104j42906j18815l0872J9801J165J5192J20459
39893a81114J74864J7267k43630l22091j39258Q5922J62384J40481J34467J31985
39883c8723Q9517N2837O2673P2973O2400Q6607J23410L4518j85873k98041j34226
$$ y = [-26612, -119653, -3714, 99444, 31851, -92594, -78180, 100106, 329766, 523198, 626107, 571549, 379462, 223527, 225006, 235947, 27961, -329581, -510883, -376665, -135714, 1484, 73464, 148420, 122360, -50712, -157693, -38566, 72505, -147103, -562911, -713088, -467443, -180187, -122288, -139268, -34513, 54336, -68890, -254516, -198238, 90527, 312211, 319721, 266940, 304818, 365698, 320554, 180274, 47802, -25651, -54705, -52021, -16371, 30319, 34966, -45138, -188044, -306859, -337731, -317930, -316765, -301573, -181114, -6250, 11017, -232613, -554704, -693962, -608040, -445656, -305175, -170708, -38723, 50794, 103631, 166304, 239277, 301677, 388284, 511694, 546212, 360339, 62298, -71928]
39872g1928J18415J69309M3580m39R7736J37184L0366m4315L9021J25703L7274
39861F81906j17311j00302O8060J08552j09823l52789l20958n4950J15179O993
39851g5443j85750j74538L1700J59226N6122j16852j26891L0383J65903J53481
39841h2659M2815n1455p3630l3515L8312J11199J56836J49420P1394o0267j77701
39830I0749k17256k00914k04234k19210j25928J33886M14126M88720L03507K5091
39820D88537j58544k09871k02566j90541j69909j31862q9297m3284L5382J57210
39810e14745K57259K33100P0044r8855j10552M7805K24152K79223K25571J58260
39800G71262J04443J5285j11109j86683j48827n9877l1599p9033j18441j01932
$$ y = [-71928, 46487, 215796, 259376, 258937, 356673, 493857, 524223, 479908, 518929, 644632, 681906, 564595, 464293, 532353, 640905, 531082, 178293, -142665, -197615, -82436, -75443, -261193, -435731, -404031, -244805, -188683, -305535, -432426, -402043, -236140, -82659, -39844, -91299, -164929, -198444, -160132, -48933, 107903, 257323, 328717, 268450, 90749, -126507, -327421, -531655, -750865, -876793, -742907, -328781, 159939, 463446, 488537, 329993, 120122, -82444, -272985, -442894, -574756, -664053, -707337, -671955, -514745, -257486, -24386, 45658, -53197, -163749, -115944, 108208, 387431, 613002, 771262, 875705, 890990, 779881, 593198, 444371, 384494, 352895, 273862, 155421, 53489]
39790E3489o8829m3236J5839R4693O3079j35823l10091k18258P7756K68090K29337
39779B6046J65651K21436K10226o5379m23100n06385k76139k3433N8434M5715
39769e66928M0079K4809Q967P2652J91851K20366J20880K8630J8729L920n9796
39758A04159p0246J2983N5542k2215q0202K0020J73965J77171j1k20789l59072
39747b08695l41394j35588J51581K74877J12542j52426k56312j70564m7769M2345
39737g31403J35662K09468K05145J85236K65798L85729L33740N5308k20472k42305
39727E81906l5692J32264M9651k19894m09616l39802j16984P595l9405q3402K2643
39716d50736J95426K73015K35732J63004Q6206J3949RM4212K1451j35019k67614
$$ y = [53489, -15340, -58576, -42737, 51956, 115035, -20788, -330879, -549137, -471381, -203291, 26046, 191697, 413133, 623359, 557980, 134880, -371505, -647644, -671077, -612643, -566928, -526849, -502040, -493073, -420421, -228570, -8204, 112676, 141306, 160035, 163955, 104159, 33913, 46896, 102438, 80223, 21, 20041, 194006, 371177, 371166, 150377, -208695, -550089, -685677, -534096, -259219, -146677, -299103, -555415, -725979, -773748, -731403, -595741, -386273, -181128, 4108, 269906, 655635, 989375, 1044683, 824211, 581906, 546214, 678478, 728129, 508235, 98619, -241183, -358167, -350572, -389977, -473379, -450736, -255310, 17705, 253437, 416441, 502647, 516596, 516605, 560817, 582268, 447249, 179635]
39705A79635j88346K7762J32511N0572n3305m4471K2259L2256m5153j62285k27151
39694b75716j39171Q8673K62244J94912m8012k24701k15432j00228L7814K04149
39684b15468L65429M05926K78046P4617r8675k16909k70970k27368j03337J3056
39674D347O5282P8838Q5683P2511K3897m6933j15402j40883p4767N3561J06015
39663A12149o499j76034k22016j26574k2617J3377J4965L703k9263l2250N7453
39652d13606J72016J75931P9329L7590J22345K34381K57750J66385k1299k49508
39642E61314l90901l55864k28660j44586o6969J24149L57489M23048K98563J67599
39632G45182Q6402q5781l52682m70481l08735o9390J3439k8043n5144o3572q6328
$$ y = [179635, -8711, 19051, 151562, 202134, 148829, 104358, 126617, 158873, 113720, -48565, -275716, -414887, -326214, -63970, 130942, 82930, -141771, -357203, -457431, -419617, -215468, 149961, 555887, 833933, 908550, 809875, 592966, 321996, 94628, -8709, 4347, 69629, 148467, 234150, 306661, 330558, 283625, 168223, 27340, -47427, 6134, 112149, 105650, -70384, -292400, -418974, -441591, -428214, -413249, -409546, -438809, -471059, -413606, -241590, -65659, 13670, 51260, 173605, 407986, 665736, 832121, 810822, 561314, 170413, -185451, -414111, -558697, -625666, -501517, -144028, 279020, 577583, 745182, 831584, 745803, 393121, -77360, -386095, -455485, -442046, -470089, -525233, -588805, -675133]
39621f75133n7535L4244M2822q4274j35665N1388K73810K27238k7345j44497J0668
39610d84279K11446K09933Q734k23553l29050k36201r864J59125J34882L659m3552
39599e98720L5339J13617R7835K7903q584L4869J32999J73601M0572k04973l28070
39588d83612k17123n5196l9835o6605Q1453L25064L54749R8924j50816j46898
39578b99895J6781J15661J03481P2154M6984j6738r7249j03778j1386P8948M3948
39567e1089j08976k14118j16740J21769K63054J75146j7631j32413j50962j31985
39557c63945m3285J26167J97402J347k93232l27418n1722J92784J67960M8488
39547c45454J00775K83594L61840K52665N4734j50053l18150l46687j66976Q4406
$$ y = [-675133, -732668, -698424, -655602, -739876, -875541, -824153, -550343, -323105, -350450, -494947, -484279, -272833, -62900, -54166, -277719, -606769, -842970, -852834, -693709, -558827, -555168, -598720, -563381, -449764, -351929, -324026, -332610, -297741, -164742, 8859, 49431, -155542, -483612, -700735, -755931, -795766, -862371, -780918, -455854, -101105, -2181, -152997, -299895, -283114, -167453, -63972, 8182, 55166, 38428, -58821, -162599, -173985, -95037, -51089, -160065, -374183, -490923, -369154, -106100, 69046, 51415, -80998, -231960, -363945, -407230, -281063, -83661, -82314, -375546, -702964, -754686, -561902, -393942, -345454, -244679, 38915, 400755, 653420, 708154, 558101, 239951, -106736, -273712, -189306]
39537a89306J73268O4018m0304J4642J35438J27552m4771k15609k09796m2235
39527b27103Q5823J0630j79370k26901m0364J57417J18052q2123j46938J5554
39517e15323J73809J24456k8391o5681K2373P3225K7282j8324k925K6412M5019
39506a38068Q5857J12252K3235j48794k10633q0880O2047L8792o4859o4835R951
39495c75935j42o2181K4464K64659L81575J84699j67792l81184l50282j73068
39485f55187K6196J70137K17488J82204J13870K6324p2525q8837N9414K32313
39475B11397J65047j43484l54046k28966N4828J99505J90519J90542K04984J22849
39465F13175j5811o5593l7048o7681j62817j90139j12130j8524M5323Q3935L4927
$$ y = [-189306, -16038, 47980, 7676, 22318, 157756, 285308, 240537, 24928, -184868, -227103, -141280, -130650, -310020, -536921, -577285, -419868, -301816, -383939, -530877, -515323, -341514, -217058, -245449, -311130, -288757, -215532, -188250, -206574, -209499, -183087, -138068, -52211, 60041, 83276, -65518, -276151, -357031, -294984, -256192, -321051, -385886, -375935, -376077, -438258, -413794, -149135, 232440, 417139, 249347, -131837, -482119, -655187, -628991, -458854, -241366, -59162, 54708, 81032, 8507, -80330, -20916, 211397, 376444, 232960, -121086, -350052, -295224, -95719, 94800, 285342, 490326, 613175, 597364, 531771, 494723, 427042, 264225, 74086, -38044, -56568, -11245, 72690, 107617]
39454A07617j29984k37854j04645J40083J99428O4609N560Q4423M3706k10798
39444c7855l80070k26535N2780J59098J32840J68120K06297O5997j53229j68478
39434a81035K2507J27387M1520N187J62842K72573P7514k40601k61414R3189M42193
39423E61862M35792J44738j28389k44448k76648k81275k24503j14836k1238O2202
39413h6743J96735L07763K12142p2257k45199j06806J45902J89679k410k15036
39403C23770l26316l37438j85883J58414M58914M00654L3399k64367k91942k00974
39393b31769j29766m315J90041K70603J58692L6163K8831O833j16157j70028m1794
39382b666P0442j4672j28037m6258J01079O0981q9211r1686J8990j1438j76751
$$ y = [107617, -22367, -260221, -364866, -224783, -25355, 39254, 44814, 129237, 172943, -37855, -417925, -644460, -591680, -432582, -299742, -131622, 74675, 140672, -12557, -181035, -158528, -31141, 10379, 15566, 178408, 450981, 528495, 287894, 26480, 119669, 561862, 997654, 1142392, 1014003, 769555, 492907, 211632, -12871, -127707, -148945, -86743, 109992, 417755, 629897, 557640, 312441, 205635, 351537, 541216, 538806, 323770, -2546, -339984, -525867, -367453, 91461, 492115, 525514, 261147, -30795, -231769, -361535, -365850, -175809, 94794, 253486, 289649, 318480, 325313, 209156, 39128, -2666, 67776, 53104, -74933, -121191, -20112, 40869, -48342, -140028, -121038, -132476, -309227]
39371c09227j98763j196J65169J20484k9806j30275j42817l6183K04969M03023
39361D5378L05352l6988k70838k04415j3251R3242J27604J37122N4527r9672j29487
39350H574K7747J36819J9390j35793n4656J96721L17050J87174m4749k11919k59539
39339A86819j93509p7940k9520p4611q8318O926J06048J18017J33598K16325K09255
39328E13090j609j97523j11158J21181J44985m4962j14223L6363J23519k463j06266
39317C60934j2566P0967o3028k25302j40473P1668Q3880j00078j57876L1823K11969
39306A31918J44352p1230j74299p3999R1189J31845j724j53067j03944J44477
39296F5518L02682J31021k17050l62189j81146O9495J24559J4262o3876j7971
$$ y = [-309227, -507990, -509186, -344017, -223533, -253339, -383614, -526431, -562614, -357645, 45378, 350730, 313742, 42904, -161511, -174762, -81520, 46084, 183206, 237733, 138061, 8574, 36321, 173140, 192530, 56737, 2081, 198802, 515852, 703026, 658277, 446358, 186819, -6690, -84630, -114150, -188761, -277079, -270153, -164105, -46088, 87510, 303835, 513090, 511481, 313958, 202800, 323981, 468966, 424004, 309781, 346144, 469663, 467200, 360934, 348368, 419335, 356307, 131005, -9468, 62200, 146080, 46002, -111874, -80051, 131918, 276270, 205040, 30741, -43258, 47931, 179776, 178052, 24985, -78959, 65518, 368200, 499221, 282171, -80018, -261164, -191669, -67110, -52848, -116724, -134695]
39286a34695Q2443J21385L8534j16272k08130j67087r0334q7818p8889P7028K77159
39275b86676K52143o162j58386R505K59599K36499n1281k98366l24039k06805
39265e73969p5616K4214Q4872J16901J55720J80391R7499q1333j61053k3185J51234
39254a04325J20855n3216j19637l5760J6291k2817k0207N2576N0157m8044n1205
39243b15332J15980K53659J94927M3004n3333j32701k42194k49032p4288P1309
39233b88001k6089j97455j19783J41415J86305r3031l08976j47570J73504K55352
39223d24329R4507J777P0909P6153r0826k08631p9178J58563K58112K23830K10148
39212B91035J96368M4215j73413k10256m8487M0140o1595j14821M3445J54542
$$ y = [-134695, -52252, 69133, 107667, -8605, -216735, -383822, -474156, -561974, -640863, -563835, -286676, -34533, -40695, -199081, -189576, 70023, 306522, 255241, -43125, -367164, -573969, -649585, -625371, -540499, -423598, -267878, -87487, 10012, -71321, -232374, -255559, -104325, 16530, -36686, -156323, -192083, -175792, -198609, -218816, -166240, -116083, -164127, -215332, -99352, 154307, 349234, 392238, 338905, 206204, -35990, -285022, -359310, -288001, -314090, -511545, -631328, -489913, -303608, -396639, -705615, -853185, -679681, -424329, -329822, -328045, -257136, -180983, -271809, -480440, -559618, -401055, -142943, 80887, 291035, 487403, 531618, 358205, 147949, 99462, 139602, 78007, -36814, 6631, 161173]
39202A61173p1635m20336m05133K6650L89544L03846o4081l00139k30943O520
39192f04534J89964J82726J4874j20624o3641R4464J34624N2456O0660K10915
39182A51884K74312J15301o3761l3749J06348J02264o9134k08146k01101j16811
39172E7407l6933L5603J03163J27663O6426q5974k49023k52523j0674K77857K87594
39161C20586m097k47616j89843J0928R4271Q0855J15695J45824N4725l9348M6929
39150C88909J91082J10036j65139l06996j95155o2209p6413j06791k1910P0124
39140a74462M1095l9322p6838j32352k40848k41598j7244K34980K24356n379j17473
39129e45085M1836K33053J68336r8627k57012j33907J24277K56108J67274k6401
$$ y = [161173, 89538, -330798, -735931, -709281, -319737, -15891, -79972, -380111, -611054, -604534, -414570, -231844, -216970, -337594, -401235, -306771, -172147, -119691, -59031, 151884, 426196, 541497, 477736, 443987, 550335, 652599, 583465, 375319, 174218, 57407, 20474, 56077, 159240, 286903, 353329, 267355, 18332, -234191, -244865, 32992, 320586, 316489, 68873, -120970, -110042, -15771, 65084, 180779, 326603, 381328, 341980, 388909, 579991, 690027, 524888, 217892, 22737, -39472, -115885, -222676, -244586, -174462, -133367, -172689, -249527, -381879, -622727, -864325, -881569, -646589, -422233, -427612, -545085, -503249, -270196, -101860, -200487, -457499, -591406, -467129, -211021, -43747, -70148]
39119g0148j62369j65643n4512R7091J85757J39151n285j16981r7320L3559J75007
39108d1693K29224J55183M876r7009q4673n2316j24277k37875j99489K4646K36281
39097a87122K72001J74785L7017j34289k91995k87703q6893J23593J93687J99954
39087A3035K21399J42660r7396k75967j94946l8097q3372k08709q3406K31964
39077c72835L22312O9771j70159j42767l1225m9512p4672O7141K46260K46336
39067A10650J23034O5845N8425m0886j76740j38681Q4843K29454Q9500k17278
39057A88166l89340k75103j8272J10891P674j65333j85477l1160J32559J84369
39047d41026J51372J00653N2464J3100j7240p7818j79798k15393p3285J51266
$$ y = [-70148, -232517, -398160, -452672, -355581, -169824, -30673, -35958, -152939, -250259, -216700, -41693, 187531, 342714, 347590, 250581, 165908, 113592, -10685, -248560, -448049, -423403, -187122, 84879, 259664, 296681, 162392, -129603, -417306, -504199, -380606, -186919, 13035, 234434, 377094, 279698, 3731, -191215, -229312, -312684, -521393, -604799, -372835, -50523, 19248, -150911, -293678, -324903, -374415, -449087, -381946, -135686, 110650, 233684, 299529, 357954, 317068, 140328, 1647, 86490, 315944, 405444, 188166, -201174, -476277, -494549, -383658, -375984, -541317, -726794, -757954, -625395, -441026, -289654, -189001, -136537, -123437, -140677, -218495, -398293, -613686, -686971, -535705]
39037e35705K20757O6329j16525j37899l9486K0922j0212o6171q3810o0210j7395
39026g59405M5154J57616L10874L81148K30317o4189k24255j26599J6668j2295
39016d4966j13760j00147n3332j39256k25309o9772J99451K19083k1851j59140
39006e08999m0439R8158J00430R2552J21407L9176j17864q7461J19483J44793
38996c8764r4177k01861J6252J84755J4718j75467l9423J57090J3076k63735j90194
38985f17730J72288L35641J64505l3759r8436j51819j99016j01194O5995Q6069
38975c77456J0907N8824J55358N0413j43967n6377K77796L86442R3886k25870
38965B29956k74194k16910k51413k46028p3413Q6751O7214J7528J07736J97018
$$ y = [-535705, -314948, -248619, -365144, -503043, -542529, -521607, -531819, -597990, -681800, -742010, -759405, -714251, -556635, -245761, 135387, 365704, 301515, 77260, -49339, -32671, -44966, -158726, -258873, -312205, -451461, -676770, -746542, -547091, -328008, -349859, -508999, -549438, -451280, -350850, -258298, -136891, -97715, -215579, -303040, -183557, -38764, -132941, -334802, -318550, -133795, -119077, -294544, -333967, -176877, -163801, -427536, -617730, -445442, -109801, 54704, 20945, -77491, -229310, -428326, -529520, -463525, -377456, -366549, -307725, -152367, -101954, -245921, -302298, -24502, 361940, 455826, 229956, -44238, -261148, -512561, -758589, -832002, -745251, -678037, -660509, -552773, -355755]
38955c55755P7093j66808k92244k27533n8431J44428L00324K90151J32060L0777
38945a25938R6668J78258J20052O449j5727J5890q217n6376l4605L9400R6024
38934C11878J35293J54146P2781j31678l28321l86909l20633j89569r531J49709
38924e42834J55764L2626O804J76544L10038J65579j35739k72386j51853L3261
38914b22196J06369O5076j9683q5110p2802J9855R9306Q5252K3052M959M0696
38903D4774Q6192J19951J06468j6153k09439l00588j97608m4675l4867j51190
38893e97135k19022j38561M7366K25805K47294J4274l25298m16630j19648K38348
38883a043207K61542K5011o6842J08373K61597J98433R7447J41466J84135K6266
$$ y = [-355755, -278662, -445470, -737714, -965247, -1023678, -879250, -578926, -288775, -156715, -125938, -29270, 148988, 269040, 275489, 259762, 275652, 267435, 211059, 176454, 215854, 311878, 447171, 601317, 674098, 542420, 214099, -172810, -493443, -683012, -692543, -542834, -387070, -354444, -347640, -171096, 138942, 304521, 168782, -103604, -255457, -222196, -115827, -50751, -70434, -155544, -228346, -208491, -109185, -23933, -881, 4078, 44774, 130966, 250917, 357385, 341232, 131793, -168795, -366403, -411078, -445945, -597135, -816157, -954718, -907352, -681547, -434253, -419979, -745277, -1161907, -1281555, -1043207, -781665, -756654, -823496, -715123, -453526, -255093, -157646, -16180, 167955, 194221]
38873A94221j96852k00516o781R0727p447p7620K6570J26105L0748j20525p3764
38862b15134J16389J56887k3975j67333q3065R6018J62652J11133K6814q8354
38852I2032k05020j79439J0113J23824P213j01897P2840L36838K60903j46285
38842B71122m32260l73515k05274j01639Q9913L93862M52684O7868l63678l56833
38832e57750k9606J32143K4489j4548J67033K95919J38813j46229k70286j87769
38822d47791o1761o922M895O0616K03665L74473M37781L15939Q2720j19600k13564
38811F30451j92754q2595K4814N50j38566j78615Q920K22388J56290j73792m29343
38800a52252l72087j13953Q1653R8445K1406K366J16373K89223L62158K74713
$$ y = [194221, -2631, -203147, -209928, -119201, -126648, -204268, -177698, -51593, -20845, -141370, -215134, -98745, 58142, 34167, -133166, -216231, -120213, 42439, 153572, 180386, 92032, -112988, -292427, -282314, -158490, -151277, -253174, -180334, 156504, 417407, 271122, -161138, -534653, -739927, -841566, -751653, -357791, 94893, 162761, -200917, -557750, -587356, -455213, -430724, -445272, -278239, 17680, 156493, 10264, -260022, -447791, -509552, -516474, -511579, -450963, -247298, 127175, 564956, 880895, 963615, 844015, 630451, 437697, 355102, 379916, 380466, 241900, 63285, 72205, 294593, 450883, 277091, -152252, -524339, -638292, -556639, -458194, -436788, -434422, -318049, -28826, 333332, 608045]
38790F08045J38672O4893J108j39238k71017k35902p0867J1214p6519j85130j66188
38779c20929o5246p780j2337q063L4736P8044R2644R9191J24279J41479R2913
38768B48931m482k3841J06011K29307J18693j71517l09020j40845O5138J3272
38758A31647j82300k07824m7675M6196P981K6800J42119J23869j20371l15280
38748c94838j86703J45341L42762K80451J15431J6846q3p257n6912j32727j52626
38737c0315o4447L5642j9731k19868l25715j67840J07198K11444O6677j41413
38727e48368k10067r8736J06596K86014L44168K74205J71309J16362O8801m2043
38717D68241j54884j36256p355L8831q6736k09732j31273O3100R6826j12863l28342
$$ y = [608045, 746717, 811610, 812718, 673480, 402463, 166561, 95694, 106908, 30389, -154741, -320929, -386175, -393955, -406292, -414355, -379619, -301575, -208931, -109740, 14539, 156018, 248931, 244449, 220608, 326619, 555926, 674619, 503102, 194082, 53237, 118375, 131647, -50653, -258477, -306152, -259956, -251975, -225175, -83056, 40813, -79558, -394838, -581541, -436200, -93438, 187013, 302444, 319290, 319207, 311950, 255038, 122311, -30315, -94762, -59120, -78851, -298719, -624434, -792274, -685076, -473632, -406955, -548368, -758435, -857171, -750575, -464561, -120393, 153812, 325121, 441483, 510284, 468241, 313357, 177101, 169746, 208577, 121841, -87891, -219164, -156064, -59238, -172101, -500443]
38706e00443k98996o3454J40957J72333P9412l2972j09573j30857r4790k3431
38696h61814O4102J59755K02591Q7263j62546l16831j97791M1374R7286m4023
38686i30634q4254J33462L96195M48496L18124J64961J1115j77548k95598k11805
38676b27486J896J46510J42004M2851j06566k57790k82407j12466R2211J16368
38666d44875k287l8586O0364R7849n4434k58271l08919j87697k5664Q3494J45759
38655i33267J93017K12923J54666Q881j19619q8360Q4925J85970O1500j54091
38645c93455j91341R524K28398K40677O8515o8090j3891J25236Q9243j76968l59457
38634d41609j51266K62787L87836J16861j14323j1050J45906L5141j29377L64
$$ y = [-500443, -799439, -862893, -721936, -549603, -470191, -503163, -612736, -743593, -838383, -861814, -797712, -637957, -435366, -348103, -510649, -827480, -1025271, -983897, -886611, -930634, -1014888, -881426, -485231, -36735, 281389, 446350, 457465, 279917, -15681, -227486, -225590, -79080, 62924, 105775, -791, -258581, -540988, -653454, -561243, -444875, -447162, -485748, -425384, -327535, -381969, -640240, -949159, -1136856, -1162520, -1079026, -933267, -740250, -527327, -372661, -363780, -483399, -571759, -486834, -300864, -239364, -393455, -584796, -575272, -346874, -106197, -37682, -105772, -119663, 5573, 94816, -82152, -441609, -592875, -330088, 57748, 174609, 60286, 49236, 195142, 230283, 100906, 101270]
38624A01270K30347J06612k85821m02882r8908J77515J26588j7774j4815q486
38614h6354j31311j68921M9938K84128K45257N0199k7673j6587j04216k27127
38604a32667j67408M9918J86893J59047Q6543K9079n7078j20538l6099J52057
38594A49747K27908R3929j01823j76724j20917m4550j3240O293O6584J31191P8508
38583B96906j24828k85536j64738J70659L51013J57214j84969l00123j19133J24112
38573g9423K42385K40395J58871j8068k57462m15100l56244j05152J52400K21430
38563b15968Q0222r1716j13754j2266N1033K6702J4940N2971L3035j09962k72007
38552e56770l10946j92386K8665K41861K89770J21656m6099M9272K97069K96120
$$ y = [101270, 331617, 438229, 152408, -250474, -349382, -171867, -45279, -63053, -77868, -86354, -217665, -386586, -336648, -52520, 192737, 242936, 215263, 198676, 94460, -132667, -300075, -250157, -63264, 95783, 182326, 211405, 154327, 33789, -2310, 149747, 377655, 471584, 369761, 193037, 72120, 27570, 14330, 20623, 87207, 218398, 296906, 172078, -113458, -278196, -107537, 243476, 400690, 215721, -84402, -203535, -79423, 162962, 403357, 562228, 544160, 286698, -128402, -484646, -589798, -437398, -215968, -135746, -227462, -341216, -353482, -302449, -275747, -260807, -207836, -174801, -284763, -556770, -867716, -1060102, -1031437, -789576, -499806, -378150, -424249, -374977, -77908, 218212]
38542B18212m5881l18189k01571N9172O3255j30326j59626L8926J79752J11105
38532a85171j7132o9108q5600r5277m4597K9267M063q8786o5508R4609J60101
38521c63139j5011k52509k84118r0616J22504J94392J34530L6742k5771l0565
38511e73561M590M9382Q5919J02503Q3337L2117j6143l9147n8685r8696j43148
38500e71532j60761j34316n4046N8411J13206L0409j22105j70891m8190J45287
38490i14528L03536L95098L60293J34749j46675j92982N7102K95099K50305L6389
38480E78386r7049j46095k37279l15517k42165p6843L0034J15457K73393L55490
38470B37812J52561j84228k77003p7761P6259R159n8813P0298K56567K84083J63582
$$ y = [218212, 172331, -145858, -347429, -288257, -225002, -355328, -514954, -476028, -296276, -185171, -202303, -271411, -357011, -452288, -496885, -467618, -463555, -552341, -617849, -523240, -363139, -378150, -630659, -914777, -1005393, -882889, -688497, -553967, -517225, -542996, -573561, -568971, -519589, -433670, -331167, -247830, -215713, -231856, -271003, -329688, -428384, -571532, -732293, -866609, -920655, -862244, -749038, -718629, -840734, -1011625, -1059815, -914528, -610992, -215894, 144399, 279148, 132473, -60509, -3407, 291692, 541997, 578386, 481337, 335242, 97963, -217554, -459719, -536562, -506528, -391071, -117678, 237812, 390373, 206145, -70858, -148619, -72360, -63201, -122014, -51716, 204851, 488934, 652516]
38459F52516J2856j27666k10413j38407M1119J15080K2939k4948R4522J80342
38449F17940L6763j81249k07230p4356j0416m8616l1415P4852J54949J96618K87505
38438H15345L64128K49128j1599j23556L5737K08462J20895j38627k91672k71127
38428I57114k33977k58187k54705j69048o8907n39P0865J27896O7741j18298k65966
38417a46011k33623p0456R4628K15170K78779K26552O4610m9437L177J04566N8941
38406E46896j24153k78435l32450l13568j83489Q5005L20094L09998J28839L1157
38396A89894M6780o252j19513q4768O8651M5527j86977k73090n8892J22613J5427
38385b40600j32041l2864J42177J30359P8835K22791L70535K17988o7299j11156
$$ y = [652516, 665372, 537706, 327293, 188886, 230005, 345085, 368024, 343076, 437598, 617940, 654703, 473454, 266224, 191868, 181452, 132836, 101421, 176273, 331222, 527840, 815345, 1179473, 1428601, 1417002, 1293446, 1329183, 1537645, 1658540, 1519913, 1228241, 957114, 723137, 464950, 210245, 41197, -27710, -28249, 42616, 170512, 238253, 119955, -146011, -379634, -450090, -355462, -140292, 138487, 365039, 429649, 380212, 383389, 487955, 546896, 422743, 144308, -188142, -501710, -685199, -600194, -280100, 29898, 158737, 189894, 236674, 230422, 110909, 26141, 94792, 140319, -46658, -319748, -378640, -256027, -240600, -372641, -405505, -263328, -132969, -54134, 168657, 539192, 757180, 689881, 578725]
38375E78725J1201n5613k62374k31146M8365J89182P5988o358M7543K0422j11945
38364C03990q2405J27812J96788N5977K9581K14501L03733K47479M52185R68159
38354B817800J107483L92760o11600j008221p41883m65964n11028o17262n49065
38345a86980l69957j29194K06327M79921M45305J77833N399J1950j6935j43309
38335D80360j74824p0706m5252j46697j13954J65330L91633K88920L8419l45J73646
38324I86530K31295J482l22730m69741l88875k11312m0553J23027K80614L44252
38314E33989K14541n1474k34128j83887q397O6477j3830j00033q3578k8434j5035
38303I6211J0162J23621K43101J88191p5586l44966l76227j45746J19493J74664
$$ y = [578725, 589926, 534313, 271939, 40793, 89158, 278340, 354328, 347970, 395513, 415935, 303990, 221585, 349397, 546185, 602162, 631743, 846244, 1149977, 1397456, 1849641, 2817800, 3925283, 4318043, 3706443, 2698222, 1956339, 1490375, 979347, 362085, -186980, -556937, -686131, -479804, 117, 445422, 623255, 628654, 640604, 623669, 480360, 305536, 234830, 189578, 42881, -71073, 94257, 485890, 774810, 813229, 812884, 986530, 1217825, 1219307, 896577, 426836, 37961, -173351, -213904, -90877, 189737, 533989, 748530, 697056, 462928, 279041, 270644, 337121, 323291, 223258, 139680, 111246, 96211, 106373, 229994, 473095, 661286, 585700, 240734, -135493, -281239, -161746, 12918]
38293A2918Q086j56250j12645R4430K29696J50850l0713j12142o3453l3957j03757
38282a16937j55574o3339R6580J47917O7596j4045l9298p3015j12326m5845J21373
38271a86913J95043P3329o5662k4262J06254R8537m6477j11346k055J32390J33236
38260C02074K0169q3533r7728l8551Q04n9761j64324j60593k5048P2785K9721
38249b03985j9794O1378J69251J45810N4616L2394R430j37865k67723j30783K03230
38238h4041L91492K80182L8815j48409k43175k25506r8757j3961j06030k30665
38228d40055j59917J1749O388j35136r9156J45272K76501J70341P3916J17857
38218c2240J05201m5884q9728R1031K20948Q5133j12861j22998m8174p6380j08703
$$ y = [12918, 21004, -135246, -247891, -153461, 76235, 227085, 196372, 84230, 20777, -13180, -116937, -272511, -335850, -239270, -91353, -23757, -37802, -77100, -150115, -262441, -308286, -186913, 8130, 81459, 15797, -8465, 97789, 196326, 149849, 38503, 36448, 168838, 302074, 322243, 238710, 140982, 102431, 103235, 43474, -120850, -281443, -306491, -233706, -203985, -223779, -162401, 6850, 152660, 207276, 239670, 249100, 111235, -156488, -287271, -84041, 307451, 587633, 626448, 478039, 234864, 9358, -89399, -103360, -209390, -440055, -599972, -588223, -581835, -716971, -816127, -670855, -394354, -224013, -150097, -32240, 72961, 27077, -62651, 28380, 249328, 334461, 221600, 98602, 50428, -25952, -134655]
38207a34655K9362K40086L17107K71274K36596K17542J45795K9564j14476k91231
38197I46964l76497j96511J20418J94203m2775j94234k8800J34420k5742k76929
38187B54517k25341L4228J03270p9699k08868j14458O6918J65000J37887K0454
38177A53908q3788n2665O6673P8536l4724n0610R0583J34329m3618j88153j05084
38166c4613J4460J038N0275K98678M42243K19793o3774J3375L04692L67533J71242
38155A784942M692j09069l45658n78384n08034k13311n1325o5815J1098K13440
38145A42576K87443J71115P4397P8733O7555M0406J03027J78288J14483K8103
38135A286126J41859L43806L19416O4893j44450k31237l33161m13050l06177j09683
$$ y = [-134655, -105293, 134793, 451900, 723174, 959770, 1177312, 1323107, 1352671, 1238195, 946964, 570467, 373956, 494374, 688577, 645802, 451568, 422768, 557188, 531446, 254517, 29176, 63404, 166674, 86975, -121893, -236351, -169433, -4433, 133454, 153908, 70120, 17455, 84128, 162664, 127940, 77330, 167913, 302242, 258624, 70471, -34613, -20153, -19115, 31160, 329838, 772081, 991874, 928100, 941475, 1246167, 1613700, 1784942, 1789634, 1680565, 1334907, 756523, 248489, 35178, -16147, -81962, -70864, 142576, 430019, 601134, 675531, 754264, 821819, 862225, 965252, 1143540, 1258023, 1286126, 1427985, 1771791, 2091207, 2156100, 2011650, 1780413, 1447252, 1034202, 728025, 618342]
38125F18342o9031j18259R82K04117J47248j58674l22544j96945m2310j8654J0205
38114E4477R6093Q8793j7400l9802K9502K0914l7050K6454J05027n3654k96626
38103b3272k07639J43567K03834j62742l92327r6979L40651L94672J51148M1362
38093C92275J62457K52564J37208r9193k62754k08079J8485J42633k9889k80013
38083B25694k38677M1366J56538Q283n8491J32962L00049K01086J2637k1604L0341
38072G90184M86p6717j00706j10690j61445j84298j21298l7389n247k3025p6142
38061a06287j32022j05192J0624P3363L9542R7279L02870L40893R515l27867k45061
38050d2343M8661O6676j32936j30155L7532k7323k61251j96110J63147K95306
$$ y = [618342, 549311, 431052, 432034, 636151, 783399, 624725, 302181, 105236, 62926, 44272, 54477, 150570, 239363, 221963, 182161, 211663, 232577, 195527, 221981, 327008, 273354, -23272, -230911, -87344, 116490, -46252, -438579, -535558, -194907, 199765, 350913, 392275, 554732, 807296, 944504, 845311, 582557, 374478, 392963, 535596, 505707, 225694, -12983, 28383, 184921, 193204, 134713, 267675, 567724, 768810, 781447, 759843, 790184, 790670, 713953, 613247, 502557, 341112, 156814, 35516, -1873, -7120, -30145, -106287, -238309, -343501, -332877, -259514, -219972, -122693, 180177, 521070, 530585, 202718, -42343, 6318, 72994, -59942, -190097, -152565, -179888, -441139, -637249, -474102, -178796]
38040a78796O6215q8464R407L6219j03195p3903J60988J73618j21574k36921L3710
38029c22696K52845J36821Q413J20869K11885Q1850l1427P283m2748k13919j39696
38018F9480K22947L69593J00161j08906L7320J49595n8702k12471l764K05741
38008G70994N0568j91564j48111L2323J04617J87694L33240K37125j52333l58228
37998H66325j64356j8949j85393k26705J16313L00806r9294n60467m27229O0514
37988c38435K88502K44008K49859K59034J20372M6740J63543J14531k55099m10177
37978D82878J2248M64066L31721p7113j43805N6545J47293K61517O14434P93311
37968B943095L49977l34619n94272m67827l92658l71664k06249q8936k05107k14635
$$ y = [-178796, -112581, -201045, -191638, -155419, -258614, -332517, -171529, 2089, -119485, -356406, -322696, -69851, 66970, 75383, 196252, 408137, 489987, 458560, 465843, 423095, 209176, 69480, 292427, 662020, 762181, 653275, 690595, 840190, 781488, 569017, 565253, 770994, 821562, 629998, 481887, 514210, 618827, 806521, 1139761, 1376886, 1224553, 866325, 701969, 683020, 497627, 270922, 387235, 688041, 588747, 28280, -398949, -338435, -49933, 194075, 443934, 702968, 823340, 870080, 1033623, 1148154, 893055, 482878, 495126, 959192, 1290913, 1213800, 1069995, 1126540, 1273833, 1535350, 2149784, 2943095, 3293072, 2958453, 2364181, 1896354, 1503696, 1132032, 925783, 836847, 631740, 417105]
37958D17105J44453M51175L12927R7351K14839L17775J7236k80274j18332J13642
37948A687897n9760k44055O3673M66217M16397K51504M48028O09458K87988R687
37938C937034L24403O98474N90803O58710J490147K232087K186527K595170M568648
37929A9282003O116690M040642j277658n645984o119346m013137k197741j560946
37921H624523j286523r17047o66653n62651m01592j65053P8987L26170M77870
37912E508031M44592M06528N63918Q32720J152704J624661K043174K208148L015489
37903A7799965N547292Q152171O711356k6084p262641r196012n997116k665202
37895A3063729j947907k091055j332399n87169p85009r71957m54393j55116n65298
$$ y = [417105, 561558, 1012733, 1325660, 1423011, 1637850, 1955625, 1972861, 1692587, 1574255, 1687897, 1628137, 1384082, 1447755, 1913972, 2330369, 2581873, 3029901, 3639359, 3927347, 3937034, 4261437, 4959911, 5550714, 6209424, 7699571, 9931658, 12118185, 14713355, 19282003, 25398693, 29439335, 28161677, 22515693, 16396347, 12383210, 10185469, 8624523, 7338000, 6420953, 5754300, 5191649, 4790057, 4625004, 4703991, 5030161, 5508031, 5952623, 6359151, 6923069, 7755789, 8908493, 10533154, 12576328, 14784476, 17799965, 23347257, 31499428, 38210784, 38184700, 30922059, 21726047, 15728931, 13063729, 11115822, 9024767, 7692368, 7105199, 6320190, 5348233, 4893840, 4738724, 4173426]
37886D173426o86490j04127J28239l39953l49232M44272P15613m4301m76868J25486
37876C586065N26489l6859l65213M64270J416276J348174O64909R320q03277j549535
37866E260619j286397k20816J39297m86284o71228l5300M8521o97802o91264M17064
37856A776410Q10566j28663n55057L72963Q88298K2305n76107P6261M47737k66577
37846B868136m10360P01510J106148M96m30352Q18591J454035L06920k63335J005259
37836G157048J667818M75209J37922J969207K902991J493943J275709L947364
37828B1027211N400319L480809K910500O593617R580755Q793506J0136301J6967653
37820H4890671K1724282K1650821L1210717N8623841P7850602N1432301j5804818
$$ y = [4173426, 3486936, 3382809, 3511048, 3171095, 2821863, 3266135, 3981748, 3937447, 3460579, 3586065, 4112554, 4075695, 3710482, 4174752, 5591028, 6939202, 7604111, 7613431, 6810154, 5260619, 3974222, 3753406, 3892703, 3406419, 2735191, 2699891, 2748412, 2050610, 1359346, 1776410, 2586976, 2458313, 1903256, 2276219, 3164517, 3186822, 2610715, 2686976, 3134713, 2868136, 2457776, 3159286, 4265434, 4265930, 3835578, 4654169, 6108204, 6415124, 6151789, 7157048, 8824866, 9300075, 9437997, 11407204, 14310195, 15804138, 17079847, 21027211, 26427530, 29908339, 32818839, 39412456, 48993211, 57786717, 67923018, 84890671, 106614953, 128265774, 159476491, 218100332, 295950934, 347383235, 331578417]
37813C31578417p1988257p7633153m8272844k4413397j9613037j8604693j1978793
37806E9074243p035890q117936q521415m651894k061258l710748m726422k357019
37798A7891661o95773k096532k909047j024501K66294r50670j684073k21291O24283
37789I200351p31450j578171l07620O25330k85719q05925L48413R65654j07815
37780G323048o21832N27679J047209j34195n95175Q63072J822478J006013P76477
37771A2014774K319599L223135K797812M519302R155128J0565787L776912o507456
37763D1864993j1265605q598482m273080k577678k351213j640738r55105r55807
37755I247285q36600k12155N1636l38163n48165k65292o8766n0786K55318O43909
$$ y = [331578417, 259590160, 181957007, 133684163, 109270766, 89657729, 71053036, 59074243, 52038353, 43920417, 35399002, 30747108, 28685850, 24975102, 20248680, 17891661, 17195888, 15099356, 12190309, 11165808, 11432102, 10481432, 8797359, 8576068, 9200351, 8468901, 6890730, 6583110, 7208440, 6922721, 6116796, 6465209, 7430863, 7323048, 6701216, 7228895, 8276104, 8141909, 7546734, 8409806, 10232284, 11238297, 12014774, 14334373, 17557508, 20355320, 24874622, 34029750, 44595537, 48372449, 41864993, 30599388, 22000906, 17727826, 15150148, 12798935, 11158197, 10203092, 9247285, 8410685, 8198530, 8250166, 7912003, 7363838, 7098546, 7029780, 6978994, 7234312, 7878221]
37745G878221N13110J69193L71274R11032J084128J109557J623600K313514K544997
37736A8518626K705332L307195L405196J710033j149334l230669l825435l748260
37728A7692684l446048k602544j481297r32175r82152q74665n16626n13553q20724
37719E522900p53565l35360k81386o13752o02552j40181R9084n1713m4799K02199
37709C000875J49223j91116j32110M08314O80830M64872N17759J202953J669604
37700G771204J014257m39427j579208j755572j197873n45929k68432l33317l44486
37691B321217j26690R221j70194l41831j50258J42746R0269j77370k38767j35998
37681A222345j80511k67542q5330J99465J64536j24330k49360j48250n5144N2219
$$ y = [7878221, 8391331, 8560524, 8931798, 9842830, 10926958, 12036515, 13660115, 15973629, 18518626, 21223958, 24531153, 27936349, 29646382, 28497048, 25266379, 21440944, 17692684, 14246636, 11644092, 10162795, 9230620, 8248468, 7373803, 6857177, 6343624, 5522900, 4769335, 4433975, 4152589, 3538837, 2936285, 2796104, 2895188, 2843475, 2798676, 3000875, 3150098, 2958982, 2826872, 3235186, 3916016, 4380888, 4898647, 6101600, 7771204, 8785461, 8346034, 6766826, 5011254, 3813381, 3267452, 2999020, 2665703, 2321217, 2194527, 2203748, 2033554, 1691723, 1541465, 1684211, 1774480, 1597110, 1358343, 1222345, 1041834, 774292, 688962, 888427, 1052963, 928633, 679273, 531023, 475879, 528098]
37671E28098K94634M13224J33010k23235j79903P8915P0330q3558P4625L92127
37661A498267L08182j35875l59169k32023j58927k37982j85161n0421j48476k99402
37651i87k5217M81735N07547J5557k42384J6341J76834j52300m80300l18674L2760
37640A0912P2036j23053j70615m95J95856K88772K12566l6425k32464r2909K67919
37629C92100M22986K41051J3013p1014j23289j82624j07818O3929R2716m7985
37619F93065j36997j16877j24988j33224r780J08671O094j24993M9040L23846
37609E33857J99691k25551l27325L0978L02747K04031R5735K12625K58397O4989
37599A350174l9860J27960K32203L8885j70900j68215j80513l50061l55200k646
$$ y = [528098, 822732, 1235956, 1368966, 1145731, 965828, 1044743, 1115073, 1031515, 1106140, 1498267, 1806449, 1670574, 1311405, 1079382, 920455, 682473, 497312, 446891, 298415, -987, -26204, 455531, 963078, 978635, 736251, 752592, 929426, 777126, 296826, -21848, 10912, 82948, -40105, -210720, -211215, -15359, 273413, 485979, 449554, 217090, 124181, 392100, 815086, 1056137, 1069150, 998136, 874847, 692223, 584405, 648334, 741050, 693065, 556068, 439191, 314203, 180979, 171199, 279870, 285964, 160971, 210011, 533857, 733548, 507997, 180672, 211650, 514397, 718428, 814163, 1026788, 1285185, 1350174, 1310314, 1438274, 1670477, 1709362, 1538462, 1370247, 1189734, 839673, 484473, 481827]
37589D81827L17810K28226l9755r0862N985j4507r6883o8157l0449j20390j72315
37578D00530k7679J00391k9647k36047j93746N2677K09795J72978M0038j04889
37568C84401j54387L3302L46665L93955M0995l11182k83695n4756j998j05708
37558B87592j01106J3438L3799m9441q6011p4664j05334j16103r915J15324J33662
37547D1241J37160K33249K70136Q2691j48695j37868L1371M1462j17171j22591
37537C10985J46639L95582L17237k6747l20502l30998p5449K27209L32571J73832
37527A150359r5210k74823k79179j19232J35396L24419K84636O3563r0690l2175
37517A067064J41603L11395M80702N82043L89971j47762o67231p34800l58227
$$ y = [481827, 799637, 1027863, 988108, 897246, 903231, 888724, 791841, 723684, 693235, 572845, 400530, 372851, 473242, 443595, 207548, 13802, 66479, 276274, 449252, 489290, 384401, 230014, 263316, 609981, 1003936, 1044931, 733749, 450054, 395298, 393300, 287592, 186486, 199924, 233723, 184282, 98271, 23607, -81727, -197830, -207745, -92421, 41241, 178401, 411650, 681786, 764477, 615782, 477914, 509285, 550747, 433576, 310985, 457624, 853206, 1170443, 1143696, 823194, 492196, 416747, 643956, 976527, 1150359, 1055149, 780326, 501147, 381915, 517311, 841730, 1126366, 1189929, 1099239, 1067064, 1208667, 1520062, 2000764, 2582807, 2972778, 2825016, 2157785, 1422985, 1064758]
37508A064758N3011J77361M8266j21752j98964j90802j67179j64976j53554j00656
37498B45513m2834k6183j7365K3861L4553m4665j04360L941K00636K47120P5043
37487E95260j52594k88535k98930j62459P0958J68927l1391k90211k23397J20813
37477d91559L21989K28321J03225Q1430l2965k84790l77166j88026k2533q0832
37467g42906j05064J31062L87055L68518K13918J83372J80290o542k46869k68272
37457I4562j06958J5989P4417J35440Q3300j71407l80408k47616R5762K65905
37447a41014J64346J0440m4307j1220J05308K56546K52189J9394j82678j12800
37437C16204O2730O8517M462J16591K65019J21675j92871k07136J46142L84055
$$ y = [1064758, 1117769, 1295130, 1343396, 1221644, 1022680, 831878, 664699, 499723, 346169, 245513, 202679, 176496, 159131, 182992, 217545, 172880, 68520, 72461, 273097, 520217, 595260, 442666, 154131, -144799, -307258, -236300, -67373, -98764, -388975, -612372, -491559, -169570, 58751, 161976, 243406, 210441, -74349, -451515, -639541, -662074, -742906, -847970, -716908, -329853, 38665, 252583, 435955, 616245, 609703, 362834, 94562, -12396, 3593, 78010, 213450, 296750, 125343, -255065, -502681, -406919, -141014, 23332, 33772, -10535, -21755, 83553, 340099, 592288, 611682, 429004, 316204, 378934, 447451, 451913, 568504, 833523, 955198, 762327, 555191, 701333, 1085388]
37427A085388J96748j35708k30801j31750j16913k51225l64548l23170j46179
37418d18158O2674J97924K22956J86030J23124O134j28996j25504O2680K04700
37408C93564P2190k08389l15750j73438J2176R3708J07369Q9301K2223l5689O984
37397F4249J01161J19586P3171P6244J32176J46704J11807Q5024M2523n2231j06574
37386G93840l2967N7520J3649r9317j32034j23325j76002j88940k8313J44934
37376B29045P7225j25006j30502O8766J51457J3685r6186m7224j9263j19360j91634
37365a88997j50599j40953j98188j00384K28629M79278L72245P2683o6287Q323
37355C15750O2100m7488k17520k64905j09785J52715K99482J87294n3558j55371
$$ y = [1085388, 1282136, 1146428, 915627, 783877, 666964, 415739, 51191, -271979, -418158, -355484, -157560, 65396, 251426, 374550, 380684, 251688, 126184, 188864, 393564, 465754, 257365, -58385, -231823, -219647, -125939, -18570, 70731, 92954, 57265, 64249, 165410, 284996, 358167, 434411, 566587, 713291, 825098, 910122, 952645, 900414, 793840, 760873, 818393, 832042, 732725, 600691, 477366, 301364, 112424, 84111, 229045, 306270, 181264, 50762, 119528, 270985, 284670, 188484, 141260, 121997, 2637, -188997, -339596, -480549, -678737, -779121, -550492, -71214, 301031, 373714, 307427, 315750, 377850, 330362, 112842, -152063, -261848, -109133, 190349, 377643, 324085, 168714]
37345A68714n6474N1519L3012l3633m8403l3493k0659J3285L8041j5719r0394
37334E796n5743L6369p599j77092k24837o9046N7303m906q0400L0608K26101K92891
37322B9445K20955J22029J6502q8543p3813J13179K79264K09091j6082j21253
37312F90774l988J67593J86187J1844k17778l09611k05327p8719j31434k81215
37302a71674k45230J7394J96464R1608p4307j1149J87633K17672L8595j08597
37292A38409q2032K5603J00481J26235R5377o86q7555p6713j3218n812l1933K1269
37280B09425J31006J35974q536j38084j09749M396M3542j3237n2107k2055j5764
37269A64811j14374k24961j71927N0647K34455K29537J47429J67244K40614J83219
$$ y = [168714, 112240, 163759, 196771, 163138, 114735, 81242, 60583, 73868, 111909, 96190, 5796, -49947, -13578, -21177, -198269, -423106, -492152, -434849, -439755, -520155, -489547, -263446, 29445, 250400, 372429, 388931, 300388, 226575, 339754, 619018, 828109, 812027, 690774, 686786, 854379, 1040566, 1052410, 834632, 525021, 319694, 240975, 109541, -171674, -416904, -399510, -203046, -111438, -185745, -196894, -9261, 208411, 247006, 138409, 56377, 81980, 182461, 308696, 404073, 403387, 315832, 239119, 225901, 220089, 188156, 209425, 340431, 476405, 467869, 329785, 220036, 224432, 267974, 254737, 202630, 180575, 164811, 50437, -174524, -346451, -295804, -61349, 168188, 315617, 482861, 723475, 906694]
37259I06694O109q4358k9998j2220j27041k12506j25109L2395J16504J71722K60939
37248I03131K52402K1794k58786l01766j18819j456r1386k05973j45459K1164
37238G4846Q4647l831p9250R014J89883K40468O9665j37791j53216l1792m1026
37227B21617k47475l82811k24497P7736K18838J43475M9802P7343J69118J97789
37217C00935R2396j09860k36408j03250K10895L45030Q5146l06098m01306j53904
37207b76424J07775J61036R0585K9061k0467n5141j1694R0724J49604J74446K71606
37196G11111L81950K82889m1902k84906k33864r1413j61847l86228m39343j95147
37186d58700J48818L72573M34027L64858J74418p8433k56567k62599j26111L8423
$$ y = [906694, 912803, 828445, 798447, 786227, 659186, 446680, 321571, 353966, 470470, 642192, 903131, 1155533, 1177327, 918541, 616775, 497956, 496500, 405114, 199141, 53682, 74846, 159493, 155662, 76412, 85426, 275309, 515777, 585442, 447651, 294435, 262643, 221617, -25858, -408669, -633166, -555430, -336592, -193117, -143315, -65972, 103146, 300935, 393331, 283471, 47063, -56187, 154708, 499738, 584884, 278786, -122520, -276424, -168649, -7613, 82972, 112033, 91566, 36425, 24731, 115455, 265059, 439505, 711111, 1093061, 1375950, 1334048, 1049142, 815278, 723865, 562018, 175790, -263553, -458700, -309882, 62691, 496718, 861576, 1035994, 957561, 700994, 438395, 312284, 350707]
37176C50707J04887M419j82544k42134n7874K03228K75195J39178J6371K3853
37166F35286M8150L980j2985N4593O5422r4529k96602l65704l38401l13511j96446
37155h10747J26121M50446M24170N5400k52669k35139n4556L1443J6926J9588
37145b29017M4834N8198J09719K07603K20618P7671p3786p9059j6693n0040j51092
37134A18956j58198k9245J29110K20221K09671R6432m3897p5908K0908R7828N9574
37123F45452M742L4439Q9452J10500J72310L02842L68925L07436K52468K82436
37113B571002L35793N40212J164224J896430J716098J41020j759582k402759j591398
37104B611040n70741k51779l00061j53568J4979j52252m18476l53472o0492N8534
$$ y = [350707, 455594, 460013, 277469, 35335, -22539, 180689, 455884, 595062, 611433, 635286, 683436, 687416, 674431, 729024, 794446, 699917, 403315, 37611, -300790, -614301, -810747, -684626, -234180, 189990, 245390, -7279, -242418, -296974, -265531, -248605, -229017, -184183, -125985, -16266, 191337, 411955, 489626, 415840, 336781, 320088, 270048, 118956, -39242, -68487, 60623, 280844, 490515, 586947, 543050, 467142, 488050, 585878, 645452, 650194, 684633, 774085, 884585, 1056895, 1359737, 1728662, 2036098, 2288566, 2571002, 2906795, 3447007, 4611231, 6507661, 8223759, 8364779, 6605197, 4202438, 2611040, 2040299, 1788520, 1488459, 1334891, 1349870, 1197618, 779142, 425670, 365178, 423712]
37094D23712n5858j80948k30538k03751J900L35852M42038J56290j35523m8149
37084E05025J96816J76093j8014p861J47412O2767k50148l72897j89754n0090
37074A99349j47276k34732r6426J22086K13358J94979J48764O4906k7437l3735
37064D03836M032o7803k10158j84753M8800K04869Q2104j35523j51255N5448K68629
37053C18226L23594K20455N9473k9494K0077J16304Q7805j02751l15562m21109
37043B77018m14900l25677j45918R1252K74321L14811K22542O0646j00212j75310
37033G8573j03214P5583K28035K42463J28162K0470P2001K67748L68139J67421
37023A545381j92040l48837k00231k2064l2679j07501p6491k0660m9036m9268
$$ y = [423712, 367854, 186906, -43632, -247383, -245483, 90369, 532407, 688697, 553174, 505025, 701841, 877934, 859920, 852059, 999471, 1062238, 812090, 439193, 249439, 199349, 52073, -182659, -279085, -156999, 56359, 251338, 400102, 465008, 437571, 403836, 407868, 340065, 129907, -54846, -6046, 198823, 280927, 145404, -5851, 49597, 318226, 641820, 862275, 921748, 892254, 912331, 1028635, 1116440, 1013689, 698127, 277018, -137882, -463559, -609477, -518225, -243904, 70907, 293449, 354095, 253883, 78573, -24641, 50942, 278977, 521440, 649602, 670072, 742073, 1009821, 1377960, 1545381, 1353341, 1004504, 804273, 782209, 749530, 642029, 565538, 544878, 495842, 446574]
37013D46574O0725Q0130j48153l76961k89683j3354R8501L7678O0027J54928Q1809
37002A92221j10793j02329J35644K73458J98940J89830L76131M74203K55658r6284
36992A786679l11915l88727m09692l10815o4455J45185J49830K4058o7356p3525
36982D79267r236R2320J03335q1031k84140j97594J25545K64901O0742j08197
36972D45912J05722M90216N86363K85970j47423m51719n18041l54078j27224q5847
36962B29851k44154l14748j22396J27888J86211J25130J32495J56590M2028j42754
36952A76141j98008j04568k605M3061N0212K543q3165r3419L562N9294p047m4696
36940a98695N2244J17287N013r9861L0820K48089K30808p996j61936j05937k036
$$ y = [446574, 507299, 587429, 439276, 62315, -227368, -240722, -142221, -104543, -44516, 110412, 192221, 81428, -20901, 114743, 388201, 587141, 776971, 1153102, 1627305, 1882963, 1786679, 1474764, 1086037, 676345, 365530, 301075, 446260, 596090, 620148, 552792, 479267, 470031, 562351, 665686, 584655, 300515, 102921, 228466, 493367, 554109, 445912, 551634, 1041850, 1628213, 1914183, 1766760, 1315041, 797000, 442922, 315698, 229851, -14303, -329051, -451447, -323559, -137348, -12218, 120277, 276867, 318895, 176141, -21867, -126435, -129040, -85979, -35767, -33224, -116389, -209808, -206246, -146952, -153999, -198695, -146451, -29164, -24151, -124012, -93192, 154897, 385705, 377709, 215773, 109836, 107800]
36929A07800K8744K8543J0626o7398j36120p6241N6982J10347J06055J79890K72208
36918F21436J72156j10831l06985k77064j82000j79964j95221j05428L5631R5936
36908d32334N7933P559J3614P6771J32444R4591k7313q4117L0870J93134J79845
36897B42997k7697k15525k04170k0303J79725K40376J00782j17134j73056J317
36887G312J59990O2827j60702j98265k9082P0338k4404j28535q1427M5645J53641
36876a22662K61245L36148K32803m9129k54776j91818R227J12331R6251Q3874
36866E13494R1422N1515k214K3088R2416Q0249j0717l1559Q2821J96860J45894
36855A233269n6849k40374k55669r3697J37936L07647L46204K91104K50178K75105
$$ y = [107800, 136544, 165087, 175713, 108315, -27805, -104046, -47064, 63283, 169338, 349228, 621436, 793592, 682761, 375776, 98712, -83288, -263252, -458473, -563901, -528270, -432334, -374401, -366842, -353228, -276457, -144013, -49422, -76735, -160852, -129982, 63152, 242997, 215300, -225, -204395, -224698, -44973, 195403, 296185, 179051, 5995, 7312, 167302, 230129, 69427, -128838, -157920, -87582, -111986, -240521, -321948, -276303, -122662, 138583, 474731, 707534, 658405, 403629, 211811, 221038, 333369, 429620, 513494, 604916, 656431, 654217, 677305, 769721, 849970, 839253, 807694, 890515, 1087375, 1233269, 1176420, 936046, 680377, 586680, 724616, 1032263, 1378467, 1669571, 1919749, 2194854]
36845B194854K58850L0474l89010p01339o29656k76116k2325n0017j40144l2189
36835B43382J97418K74553J18486r2544j78847j12668L7560J53861R8961j35341
36825F04821l34160k75196k3490J47336J12899N669l2333j3772J2888O2094J15611
36814C82367Q0991n8856j68333j27366J210N5366k4270j34760j25100M8421K51664
36803A81334K82483J14393j7004J11149L77805M25362J23105k46558l44105j65460
36793H42504M3724J45368J99860K37813J41644j56941m77826n34551k69551O5559
36783B37603K03311J35713K5135n4095j39632k05906j59281k6576L3661l2983
36773A6950r1238l5236O7319J27474J59941J61453N2262j34165j94625m8424J00628
$$ y = [2194854, 2453704, 2484178, 2095168, 1393829, 764173, 488057, 465732, 415715, 275571, 243382, 440800, 715353, 833839, 741295, 562448, 449780, 487340, 641201, 740162, 604821, 270661, -4535, -28025, 119311, 232210, 237879, 205546, 191774, 204662, 266756, 382367, 463358, 404502, 236169, 108803, 110013, 165379, 141109, 6349, -118751, -70330, 181334, 463817, 578210, 561206, 672355, 1050160, 1475522, 1598627, 1352069, 1007964, 842504, 886228, 1031596, 1231456, 1469269, 1610913, 1453972, 976146, 441595, 172044, 237603, 440914, 576627, 601762, 547667, 408035, 202129, 42848, 16272, 49933, 16950, -74288, -109524, -42205, 85269, 245210, 406663, 458925, 324760, 130135, 81711, 182339]
36762A82339P7365J7160J08998K42013J88013n965j12589j10229j56873k41297
36752A88935j85116J7988J61297J33147R682j41158k81711k69806j3846K51732
36742a28856J86512j36589k83266q7187J34935J03149m9765q2831j944Q3059J72354
36731i0429K45482J71462m9168j89209j35259p8807j59910j83838L7302K94019
36721a38355K57537r259j53768n5797P3876Q1948N7434J01126J61033J61512J11167
36710F48454K2092j27730k89015l20487j53404Q7039J91052Q5804p6936p2882
36700f013J35611L20867K33725r0963l64066l76363j95320j3046P8538J07808
36690a69222J16002R8581K1001j11474j77787k2243K94894M50924K43101r3055
$$ y = [182339, 259704, 276864, 385862, 627875, 815888, 809923, 697334, 587105, 430232, 188935, 3819, 21807, 183104, 316251, 325933, 184775, -96936, -366742, -380588, -128856, 57656, -78933, -362199, -449386, -314451, -211302, -261067, -343898, -345842, -262783, -90429, 155053, 326515, 277347, 88138, -47121, -125928, -285838, -469676, -432374, -138355, 119182, 109923, -43845, -99642, -25766, 56182, 113616, 214742, 375775, 537287, 648454, 670546, 542816, 253801, -66686, -220090, -133051, 58001, 143805, 66869, -6013, 129598, 450465, 684190, 593227, 229161, -147202, -342522, -355568, -277030, -169222, -53220, 45361, 66362, -45112, -222899, -245142, 49752, 500676, 743777, 650722]
36680F50722j85343m6080J2700q4811j09819j459J9034r7987r5211R9461J69044
36669C30251n6583k62253j63776L049r9739l08434k22564J30000L50404K76212
36659b3433J05434j9632j44521k32460j38522J04334K74067K70141J87100Q4661
36649D67169n8247j70444j34391r731L8456L1212J35500L24820L53430J22587
36639A100361j66177k90629k40505j16055J9013J18851J36190P3059m0152j93861
36629D00095l28745l02115p8128J41617J61029O6442N9278J27084J23531O1172
36619D31260M0998p383j94809l64780k70358n664J13181O3069J01856K51086K50801
36608D09257Q7361P6832K78645L10459k3057l63300l51587j53727r6952j35281
$$ y = [650722, 465379, 419299, 431999, 347188, 237369, 235910, 254944, 156957, 61746, 161207, 330251, 273668, 11415, -152361, -149312, -249051, -557485, -780049, -650049, -299645, -23433, 82001, 62369, -82152, -314612, -453134, -348800, -74733, 195408, 382508, 467169, 408922, 238478, 104087, 94356, 132812, 164024, 299524, 624344, 977774, 1100361, 934184, 643555, 403050, 286995, 306008, 424859, 561049, 634108, 593956, 400095, 71350, -230765, -308893, -167276, -6247, 60195, 119473, 246557, 370088, 431260, 472258, 464875, 270066, -94714, -365072, -370736, -257555, -194486, -92630, 158456, 409257, 496618, 573450, 852095, 1162554, 1139497, 776197, 424610, 270883, 173931, 38650]
36598C8650n9275M9378j3887j62763j76329j10562j64260k62497j74821K9613
36588a006753N1023j30160j97488k650K20849K47685J70130J78447K57766K63397
36578E2246J57837L4737k5609m1976r6132k15437k73138q9904K84365N09554L35486
36567F32029n0552k51563j61983j3943K3032J0545n72q6587k33079k56997q4236
36556d73906J02505J40993J26955K02261K70625J41298j38400l10912k42672n7442
36546b38695O3624P3359L1819l198k2584n1168r3807r1729M813J03620L5784j71396
36534c59558k40381j6576K42435J81933j25379k50028m001L18644L79309K08287
36524C34685M1382k7975m8702m0715k1265o8535j74857j68071K7451J88531Q0526
$$ y = [38650, -20625, 28753, 14866, -147897, -324226, -434788, -599048, -861545, -1036366, -1006753, -955730, -1085890, -1283378, -1286028, -1065179, -817494, -647364, -468917, -211151, 52246, 210083, 244820, 219211, 177235, 81103, -134334, -407472, -497376, -213011, 296543, 632029, 581477, 329914, 167931, 153988, 177020, 187565, 186993, 100406, -132673, -389670, -473906, -371401, -230408, -103453, 98808, 369433, 510731, 372331, 61419, -181253, -238695, -175071, -101712, -69893, -73091, -95675, -146843, -240650, -332379, -327566, -223946, -188162, -359558, -599939, -616515, -374080, -192147, -317526, -567554, -571555, -252911, 126398, 334685, 376067, 348092, 299390, 258675, 237410, 168875, -5982, -174053, -146602, 41929, 122455]
36513A22455j73647k70609j73300q9180p4092Q125J46501J57148M4383M2643K04406
36502e5167K80759J44088K959K5997O8405j7044r7763l6907K8424l9507r1337
36491B12907J4167P7852j16000l57359k98108k4521Q6638k1115o2371N4698J31142
36480c02070J22817K18950L97243L48010o866l15906l05370j34658m5457Q444
36470a4863J35052K01055M8328j87566k50205j17608L7218J14675J20081M9224
36460A35391o7900j12787l1311O1262O0525K5362J8544l4589j57417j72986K9790
36449b46116K31698J52093j16320k24411p5078P0328J4871j11267j03401R995
36439c97608N4625j1914n4560L3761J82223K31962J41205M1103N3831J14224P1875
$$ y = [122455, -51192, -321801, -495101, -584281, -658373, -650248, -503747, -346599, -302216, -259573, -55167, 225592, 369680, 372639, 398636, 467041, 449997, 352234, 315327, 343751, 304244, 212907, 227074, 304926, 188926, -168433, -466541, -491062, -404424, -425539, -487910, -433212, -302070, -179253, 39697, 436940, 784950, 778084, 462178, 156808, 22150, -23307, -14863, 120189, 321244, 369572, 182006, -68199, -185807, -148589, -33914, 86167, 135391, 67491, -45296, -76607, -15345, 45180, 70542, 89086, 54497, -102920, -275906, -246116, -14418, 137675, 21355, -203056, -278134, -207806, -192935, -304202, -407603, -397608, -342983, -354897, -409457, -375696, -193473, 38489, 179694, 220797, 274628, 388852, 460727]
36428D60727n9327j06316j7655L5987o3474j67121p4333J45539K27138O2969j74910
36417B69224k63276j53453L8753J64253J38820r834j51203j44445L5495K47986
36407A72320K81886O3801k03160k08101O9197K45202k56m31421n00886q2094L55229
36396b38283L98296K03325J45618K23987J32796j96778m56115l80663q2343J14924
36386a35236M9091j35781j77806l880J75679J28968q6198k05545j29879j6502
36376e37089K3139P6523J94963K56331K02215J66803J92949P6905k62065n01316
36366a10642l26052N6312J74653l3986j82807l7293K05270K88488K27425J54639
36356D16007Q7142j1233j01815j31949j23131j14671q6277J5644K07396M14496
$$ y = [460727, 401400, 295084, 277429, 313416, 249942, 82821, 8488, 154027, 381165, 444134, 269224, 5948, -147505, -108752, 55501, 194321, 184487, 33284, -111161, -75666, 172320, 454206, 518007, 314847, 106746, 175943, 421145, 420889, -10532, -511418, -593512, -238283, 160013, 363338, 508956, 732943, 865739, 668961, 212846, -167817, -250160, -135236, -86145, -221926, -399732, -403612, -227933, -98965, -185163, -390708, -520587, -537089, -513950, -437427, -242464, 13867, 216082, 382885, 575834, 652739, 390674, -110642, -436694, -380382, -205729, -239715, -422522, -459815, -254545, 33943, 261368, 416007, 503149, 491916, 390101, 258152, 135021, 20350, -65927, -50283, 157113, 571609]
36346E71609M68512K41107j56563m19259l85787k09254r0365j3466R9349J69159
36336B75042J20422P9986J46942J37180j12935l39080j56870K90375M41047J09280
36326I91389k61744k57761j1437J21458O9022j0087m3252o7069q3582p5622o1291
36315C10024l0284M9639J06901K1102j39632j48398K9644J43718L2150j33830
36305B41034j32362j3604L6735r898n1337m9053l2551n336K5515J6354k4719k3946
36293b3168J7337Q499m3305j1150J07677J33897M271r4311l5834K8936m0730r8187
36281d6068K9200J88209J09589j46285k61783j29165M4177Q8889N5624O444j14852
36270a76021k99485l64153j77546J13675K31846J07924l8468K1371K41744L69011
$$ y = [571609, 1040121, 1281228, 1124665, 705406, 319619, 110365, 20000, 6534, 105883, 275042, 395464, 475450, 622392, 759572, 646637, 307557, 150687, 441062, 882109, 991389, 729645, 471884, 460447, 581905, 650927, 640840, 597588, 530519, 446937, 371315, 310024, 279740, 329379, 436280, 457382, 317750, 169352, 198996, 342714, 374864, 241034, 108672, 95068, 131803, 121905, 70568, 21515, -11036, -16372, 9143, 25497, 778, -23168, -5831, 2668, -40637, -51787, 55890, 189787, 194058, 99747, 63913, 92849, 52119, -46068, -16868, 171341, 280930, 134645, -127138, -256303, -212126, -123237, -67613, -61169, -176021, -475506, -839659, -1017205, -903530, -671684, -563760, -602228, -580857, -339113, 29898]
36260B9898K70648Q8761P598j3265j21897k65579k22493M3984K86183L02923J70004
36249E76765M0559q4743k39024l12263j88018L9290J59271J10154K0078K2219
36239A44288J20205K02062J44243m0121j60453p2089Q4424O1021r1450p4882J40767
36228D58015J93534j08625m28752l69252l6133J69971J19378p652p9904q9055
36218a78475L717J79495K35150N1396j35371n1272J55330J37114q1636j69143
36208A46305n3214J7099l6069k1040Q4501N0905j47781k35667j28520q7071j98887
36197f09439j59167J67741L94792J78463k04014k50005M4179K67141K26415Q6751
36187A42857k2912j38498k18216j28284Q6657J99509J20333r03k6895Q209K1973
$$ y = [29898, 300546, 389307, 396905, 383640, 261743, -3836, -226329, -182345, 103838, 406761, 576765, 617324, 532581, 293557, -18706, -206724, -167434, -8163, 101991, 122069, 144288, 264493, 466555, 610798, 570677, 410224, 338135, 422559, 483580, 392130, 317248, 458015, 651549, 542924, 114172, -255080, -291213, -121242, -1864, -9516, -89420, -178475, -174758, 4737, 239887, 291283, 155912, 104640, 259970, 397084, 315448, 146305, 93091, 110190, 74121, 53081, 137582, 188487, 40706, -194961, -323481, -410552, -609439, -768606, -600865, -206073, -27610, -231624, -481629, -437450, -170309, 56106, 142857, 119945, -18553, -236769, -365053, -278396, -78887, 41446, 40543, 13648, 21857, 43830]
36176D3830q543q1902j60066j27141P2737K68633K23104l2514k15367j70067l5667
36165b22963J6043J1020M4954R0292O1090l3049j11772j33540r5544Q396J46340
36154b18733K16900J40437l9625j91507k07377o7372J51184L00576K62586O8993
36144D16062j18313j78010j36318q5396o2031m8685l5290k4809j4006r965l0865
36133c27626n9916m3429L0912J00313J06448O1132K558n2016p3081j7877P8801
36122a93781R9448J4269l2382P3139K01556J38947q3810k13543j34741j874M4690
36111h8082Q0476J88155K40167Q9547j46984k22462j13415j2663Q495Q3034K46973
36100C53241K97989R0289k01357k82160j08478R3258J25351L293j30854j62593
$$ y = [43830, 35287, -46615, -206681, -333822, -261085, 7548, 230652, 198138, -17229, -187296, -222963, -206920, -195900, -150946, -60654, 436, -32613, -144385, -277925, -373469, -365073, -218733, -1833, 138604, 98979, -92528, -299905, -367277, -216093, 84483, 347069, 416062, 297749, 119739, -16579, -101975, -164006, -212691, -247981, -272790, -286796, -296761, -327626, -387542, -430971, -400059, -299746, -193298, -132166, -129608, -181624, -254705, -272582, -193781, -94333, -80064, -112446, -39307, 162249, 301196, 217386, 3843, -130898, -132772, -88082, -7606, 180549, 420716, 510263, 363279, 140817, 27402, 14739, 23234, 106268, 353241, 651230, 741519, 540162, 258002, 149524, 242782, 368133, 371426, 240572, 77979]
36090G7979p5281M7854R1081L0804k8878J954O4514L3596j01764k27316k52719
36079c38176j85576o9266O4062J73693K19492K03884J56334R0259K8128K7731
36069C70565R5439J12417l0918k42113l09001j86152m5191l41M0286J54063K10258
36058A69312O9858j39762j62675K0088J74650J64082R9753R1020N7106q5322k16859
36047B41251j74958j7333N8293M017m9546l1232r088j6489J5584R2894R2205m5399
36035A60199j92780k13307j40740p4354j2812P7256J36431J11410Q8887J59774
36025I9964K24622J28817n6094r8445N5743K16841K32472J28665m5879k84676
36015F02030m77654m43142k12506n9256j10132j47745K3305K29710J96544K64
$$ y = [77979, 2698, 50552, 141633, 172437, 143559, 145513, 210027, 243623, 141859, -85457, -338176, -523752, -593018, -528956, -355263, -135771, 68113, 224447, 314706, 342834, 370565, 466004, 578421, 547503, 305390, -3611, -189763, -234954, -235295, -195009, -40946, 169312, 239170, 99408, -63267, -43179, 131471, 295553, 395306, 486326, 543432, 458110, 241251, 66293, 48960, 107253, 111270, 61724, 30492, 21404, 4915, 20499, 113393, 205598, 160199, -32581, -245888, -386628, -460982, -473794, -396538, -260107, -148697, -59810, 99964, 324586, 453403, 397309, 298864, 354607, 571448, 803920, 932585, 886706, 602030, 124376, -318766, -531272, -590528, -700660, -848405, -825100, -595390, -398846, -398582]
36005c98582m6755J04734J69366j2982k20080j71262P8741K30801J40453k4681
35995a50247l0076J24481K17681J01691j00999j59386l6776Q4708P3298J695r674
35984A16396K7013K1863n0283j31965j38265k592K37038L93283L11248R9290m303
35973H78723M507p7569k36688j95091P1602J61797j33773m09973k34240J55088
35963a5617K26920N193l9217J62823J71474j64617m12077k50941N4270J53177
35953a08612J30237J98937K50816R1144j44421j88910p5166k0886k8397O0242
35943A64984K07480K13727O8812k6991N566K9039n1636j58324k11097k40680k69153
35932b68273k29656p9406J05118K06500J84811R2141J5165J5268Q7976J67910
$$ y = [-398582, -445337, -340603, -171237, -184219, -404299, -575561, -496820, -266019, -125566, -150247, -180323, -55842, 161839, 263530, 162531, 3145, -33631, 51077, 124375, 126070, 116396, 143409, 165272, 114989, -16976, -155241, -157833, 79205, 472488, 783736, 883026, 878723, 883230, 805661, 568973, 373882, 445484, 607281, 473508, 63535, -170705, -15617, 211303, 216496, 177279, 340102, 511576, 346959, -65118, -316059, -261789, -108612, 21625, 220562, 471378, 562522, 418101, 229191, 154025, 133139, 104742, 164984, 372464, 586191, 655003, 628012, 633578, 662617, 610981, 452657, 241560, 880, -268273, -497929, -577335, -472217, -265717, -80906, 11235, 26400, 41668, 129644, 297554]
35922B97554J80330Q6462r0782k41570k18975j2986J64095J07742q2483j15230
35912G4157P4095K29565J57892j8201r7522p5382l1967N4937J95663K48334R9993
35901I11564j27977k42814k38248k10959j47709j0413P6175l1003k20241k37096
35891d78721m7936J25548J28366K6438o5656j18223j23094o5628M796J0267l0389
35880f34232k7393L3702Q9762J25446J74880K21055K21507K00569J80697P6371
35870F62364j69287l86863l35451o0699J16537J4149k03063k90717k12156o8374
35860i33560Q5069K17424K41215J03611q8893j56834n6238P0652O7011n0270j06031
35849f06844J2946J92326K29778J27628R5632K10399K62120Q2025j60353k09140
$$ y = [297554, 477884, 564346, 473564, 231994, 13019, 33, 164128, 271870, 189387, 74157, 148252, 377817, 535709, 517508, 419986, 344604, 312637, 367574, 563237, 811571, 911564, 783587, 540773, 302525, 91566, -56143, -66556, 9619, -21384, -241625, -478721, -526657, -401109, -272743, -246305, -311961, -430184, -553278, -618906, -614110, -603843, -634232, -661625, -627923, -538161, -412715, -237835, -16780, 204727, 405296, 585993, 662364, 493077, 106214, -229237, -289936, -173399, -159250, -362313, -653030, -865186, -933560, -848491, -631067, -389852, -286241, -375134, -531968, -588206, -517554, -450543, -500813, -606844, -593898, -401572, -171794, -44166, 51466, 261865, 523985, 606010, 445657, 236517]
35839B36517j26933j62446k99723k73438l3697J45674J02478J1071L2829L6986
35829c30682j18214k61903j37693J77240L41552J96089o5300j71256o7383Q5240
35819c52310J10166q958j21995r6594K892P377q6977r0110Q2169K42380J87121
35808a24839j0743j15089m1452R0840J54762J18202K955j15971j13502L8335J63737
35797D7235Q1007j14159j38774Q7547L19212L11550J14199n8846j24054j59533
35787C65384k14605k30821j46880J4572J69219K16831R0561j48248k81190j26851
35777b92028K00972L56202J65826j34923j95376M028J60264O5928j68126l26279
35767a63512l31555k02559M7516L30369M37928K52594o1328k20955j38055M3802
$$ y = [236517, 109584, -52862, -352585, -626023, -659720, -514046, -411568, -400497, -367668, -330682, -448896, -710799, -848492, -671252, -329700, -133611, -198911, -370167, -437550, -352310, -242144, -251102, -373097, -469691, -466799, -459422, -546399, -636509, -554340, -311960, -124839, -135582, -250671, -292123, -201283, -46521, 71681, 74636, -41335, -154837, -116502, 47235, 128242, 14083, -124691, -37144, 282068, 593618, 707817, 648971, 524917, 365384, 150779, -80042, -226922, -212350, -43131, 173700, 264261, 116013, -165177, -292028, -91056, 265146, 430972, 296049, 100673, 104701, 264965, 330893, 162767, -163512, -495067, -697626, -650110, -319741, 118187, 370781, 309453, 88498, -49557, -5755]
35757e755J62068J55883L3971j29346j99574j19730p933J2850K1047J58146L31646
35746D13273K80433m0447l50119l86171j91538J4589J01540Q1276K7070K3901
35736b6193J04419J79210J27035j7310r0752m6343j4826p0261j09161n5305r161
35725b8648n3478o1775J13412L55175L85862J33455j76835l17583l06412k97631
35715b54458l21341k40010K3492K98432L14001M8274j93830j46111P9796J73089
35705b18666O5079j6847P6571K11944J97018K1874j93107l30174k99042r4897
35695e80247J15320J41980N3287R2575K56916K31715j17994m69429m72306k24007
35685i72190n7761n1301m3009N134j2524o7803j2133J36014J85705Q1084j3835
$$ y = [-5755, 156313, 312196, 346167, 216821, 17247, -102483, -110416, -97566, -76519, 81627, 413273, 693706, 653259, 303140, -83031, -274569, -259980, -158440, -77164, -50094, -26193, 78226, 257436, 384471, 367161, 276409, 230066, 215240, 144979, 35818, -19487, -28648, -82126, -143901, -30489, 324686, 710548, 844003, 667168, 349585, 43173, -254458, -575799, -815809, -792317, -493885, -179884, -131610, -325440, -471551, -391755, -218666, -153587, -170434, -93863, 118081, 315099, 336973, 143866, -186308, -485350, -580247, -464927, -322947, -269660, -177085, 79831, 311546, 193552, -275877, -748183, -972190, -1029951, -1081252, -1124261, -1119127, -1131651, -1199454, -1211587, -1075573, -889868, -808784, -822619]
35674h22619K6649J43835K44055L18406L64421L26723J65770q8149l37891m23895
35664h2695k27371J22568K84073J16299q8832j5424J91413J64170q0736j77438
35654B06027l1089L5126j52481l26094k45053q5538r5766j65682o0269J38923
35644g81896J71931N1052L5801K01748L30970K49971M3546j06502j17677j1472
35634F7472J28024J73453O0069j04327j39459j0220J47875K05326J37440k7145
35624F38508k25420l30280k39756k7177J09492Q2652L343N146P7732J18871O8389
35613B81500n6370j88568k32734j25023P7847K22620K17509J21155L7465k2084
35603C33317j11010k18112k39844r8468J46394L30646L36472K02937O5395j4285
$$ y = [-822619, -795970, -652135, -408080, -89674, 274747, 601470, 767240, 679091, 341200, -82695, -310066, -187498, 96575, 212874, 124042, 108618, 300031, 464201, 383465, 206027, 174938, 210064, 57583, -268511, -513564, -599102, -694868, -860550, -920819, -781896, -609965, -558913, -523112, -321364, 9606, 259577, 303123, 196621, 78944, 67472, 195496, 368949, 429018, 324691, 185232, 175012, 322887, 528213, 665653, 638508, 413088, 82808, -156948, -184125, -74633, 8019, 11362, 16508, 94240, 213111, 281500, 225130, 36562, -196172, -321195, -243348, -20728, 196781, 317936, 355401, 333317, 222307, 4195, -235649, -334117, -187723, 142923, 479395, 682332, 747727, 733442]
35593G33442j06474k70402m14122l81462j55108J11384K54546K17092L3813j81436
35583a58727k48219p1623J88228K54802R4829l6031R123L8858j36161l33321k40339
35572f38581Q9563K95648K28430R7224P3040O0965l5123j16649j10848j25783
35562a82114k00190j40070J62746M50393M06886J05039j22997j53507j34124j53727
35552C8335j35642m5143M4028R5972J27441J03705J0992l2711M1707N8067j45343
35541A61408l60859k71225J633L9901j69349j71688J86984M36518J96486k24800
35531a74991l09440o5256J24154J28987J23865J70783J66222J23523J43916J56209
35521E87972J5194j75914j56865Q3085K73070K39916P1198r3039j91727j76089
$$ y = [733442, 626968, 356566, -57556, -439018, -594126, -482742, -228196, -11104, 22709, -158727, -406946, -478569, -290341, -35539, 59290, 23259, 32382, 71240, -64921, -398242, -638581, -549018, -253370, -24940, 72284, 145324, 206289, 171166, 54517, -56331, -182114, -382304, -522374, -359628, 90765, 497651, 602690, 479693, 326186, 192062, 38335, -97307, -142450, -98422, -2450, 124991, 228696, 239688, 206977, 248684, 306751, 161408, -199451, -470676, -469043, -429142, -598491, -770179, -583195, -146677, 49809, -174991, -484431, -549687, -425533, -296546, -172681, -1898, 164324, 287847, 431763, 587972, 603166, 427252, 270387, 353472, 626542, 866458, 937656, 844617, 652890, 476801]
35511D76801m5415N6426m930j27498j13191J2431N8202l803k9584J3248K9626
35500C22313L7185J27667K02750O8079j92955k71439j06226L3211J2617K6911
35490B60113J96303L13223J89817k9134j16374q6885o4740m3226O734k1480j99410
35479D04941l83477m00560k81803j49256k1708J00148J20172J1972m8972P6481
35469e72062K43895K23625M6452n7149J922Q0249K2967j58433l00785k14146J19447
35458e64018M22406L56756l3303l13575k20460J9J457j54114j72639k6269N5612
35447f48128o817o6853l7392L2442J35995K89557L57567J81386j11701k07141
35437h1085m3665J10278O8716m8131q1139o7971r1104j05917o0766k1790m8647
$$ y = [476801, 431386, 487812, 482882, 355384, 242193, 254624, 312826, 309023, 279439, 292687, 322313, 359498, 487165, 689915, 757994, 565039, 293600, 187374, 220585, 233202, 260113, 456416, 769639, 959456, 930322, 813948, 727063, 662323, 619097, 625831, 604351, 404941, 21464, -379096, -660899, -810155, -831863, -731715, -611543, -599571, -648543, -572062, -328167, -104542, -58090, -115239, -113317, -33068, -10101, -168534, -469319, -683465, -564018, -141612, 215144, 181841, -131734, -352194, -352175, -350718, -504832, -677471, -703740, -648128, -654945, -721798, -759190, -726748, -590753, -301196, 56371, 237757, 126056, -81085, -124750, -14472, 54244, 6113, -75026, -142997, -234101, -340018, -400784, -422574, -471221]
35426d71221q3617p2946o5456q9237o5688M4553J38744J31738R7889J25668J42068
35415a67505L4310j31541j76700o1743P3843J21061J19721J40112J54430R1182
35405A97170l4462j11991n9936P5511J69555J57334Q8911L4175j5743r6693j57933
35394B45898r6954P1864J70726N3446j83395k64086m2997K87469L68814Q4400
35384F95185k69931l11242l4144J82597O0399k39261l58441k00574J0165N8743
35374d06504m1589j47286j49355k0231J80517L18287K99082J88033J17242Q1835
35364D20031l5448k13010k30707L5141L76399M56162K00925j36811k96512k67748
35354C08422j97037j49048o8308N5636J15625L8567p7483q1115J8474P3456J9366
$$ y = [-471221, -554838, -627784, -693240, -782477, -848165, -803612, -664868, -533130, -435241, -309573, -167505, -133195, -264736, -441436, -503179, -429336, -308275, -188554, -48442, 105988, 197170, 162708, 50717, -9219, 66292, 235847, 393181, 482092, 516267, 500524, 403831, 245898, 148944, 220808, 391534, 444980, 261585, -2501, -45498, 241971, 610785, 695185, 425254, 114012, 79868, 262465, 322864, 83603, -274838, -475412, -465247, -406504, -448093, -595379, -744734, -764965, -584448, -266161, 32921, 220954, 338196, 420031, 384583, 171573, -59134, -23993, 352406, 808568, 1009493, 872682, 576170, 308422, 111385, -37663, -105971, -50335, 65290, 103857, 26374, -54741, -36267, 37189, 56555]
35343E6555o0913j05074j38597j24007O2031L74676N07181K52643j66655l60273
35333B97567k72933j72398j88435j71055m4983R051j25892k49117j15711J90806
35323h43100L66614K81340Q3565l2908p729J10032K21003K20324R9076j1267Q96
35312D87846N0672l2066k26147l07511j55215P2151J50653O9520j9619m8230p2110
35301c0056r7510m4688O8474P3408j01111k55435j63966Q1381J80631O3198k2254
35290b47928Q1521J87674Q8017p8399l3775J78316K37552L6947j64369j54237
35280A31319o9999j29317k62383k39399n7994M4516l9151j27366l8170J36234
35270f51710J83807R6683N9105J33210J54727J8485j04599l426K22155K66880
$$ y = [56555, -4358, -109432, -248029, -372036, -310005, 64671, 571852, 824495, 657840, 297567, 24634, -147764, -336199, -507254, -552237, -543186, -669078, -918195, -1033906, -843100, -476486, -195146, -111581, -144489, -152218, -42186, 178817, 399141, 498217, 486950, 487846, 538518, 506452, 280305, -27206, -182421, -110270, 40383, 109903, 90284, 42054, -30056, -127566, -172254, -103780, -30372, -131483, -386918, -550884, -469503, -288872, -225674, -247928, -166407, 21267, 109284, 30885, -2890, 175426, 412978, 449925, 285556, 131319, 61320, -67997, -330380, -569779, -627773, -583257, -622408, -749774, -787944, -651710, -467903, -371220, -312115, -178905, -24178, -5693, -110292, -113718, 108437, 375317]
35260C75317O3074j16570p0125M2656k3425k04762k33027m8377J27648J31472
35250D3881N8964O5071J28103J23909L8262j8653J3504N9812L6899K810Q8189
35239F40751K66382L05116N1381l12852m60059l30684j63789j11571o5408N9591
35229a21142J29858M6249l8772K6756J15552L8977j18885j57203j14017j65322
35219c57949k65982k12759j6108J10571J15709J51482K50437K74135K03570J64472
35209D17578J35359k8776k28979j58676J70129L19478M7957l01465k97891k2137
35199E2577J29918K8715j18718j42497o1439O2123J71917J69735K0090j34697
35189A77724j26918J1213J07212P7107k2430j06425j24263p8285n0948j17900
$$ y = [375317, 438391, 321821, 251696, 294352, 270927, 66165, -166862, -215239, -87591, 43881, 102845, 167916, 296019, 419928, 458190, 439537, 453041, 512853, 549752, 552562, 640751, 907133, 1212249, 1263630, 950778, 490719, 160035, -3754, -115325, -180733, -121142, 8716, 54965, 16193, 42949, 158501, 197478, 78593, -78610, -192627, -357949, -623931, -836690, -852798, -742227, -626518, -475036, -224599, 49536, 253106, 417578, 552937, 524161, 295182, 136506, 306635, 626113, 674070, 372605, 74714, 52577, 182495, 211210, 92492, -50005, -111444, -49321, 122596, 292331, 312421, 177724, 50806, 62019, 169231, 246338, 223908, 117483, -6780, -85065, -136013, -253913]
35179b53913j88200q3862J59994K73259J30808o2504j03079p0415r5898r1509
35169c85319M4447J61435Q5640m9653o474J55800J97073J15757J19595K31328
35159F69629K54293J25388m426o0609j28142k07138j60586K3637J53423R2999
35149G58468q2911k35485k80011j51690J26100L20778J85219j68997l34897j32144
35139D430J63535K18042M1979j42897k34305k59475k01475k5726J77596K47023
35129a1273J43758q171p6106n2295l2283q8860j77144j88170j05658m0015n6607
35118f92824o5549J9667J17097J16948R3615J84451L22459L13552J49787P754
35108E66957n8817j62349k85077k26449M3096K33314J09939j67717k62133p9059
$$ y = [-253913, -442113, -525975, -365981, -92722, 38086, -24418, -127497, -197912, -293810, -385319, -340872, -179437, -93797, -143450, -149924, 5876, 202949, 318706, 438301, 669629, 923922, 1049310, 1044884, 984275, 856133, 648995, 488409, 512046, 665469, 758468, 675557, 440072, 160061, 8371, 134471, 455249, 640468, 471471, 136574, 4430, 167965, 386007, 427986, 285089, 50784, -208691, -410166, -435892, -258296, -11273, 132485, 124314, 48208, -4087, -36370, -125230, -302374, -490544, -596202, -636217, -692824, -758373, -738706, -621609, -504661, -411046, -226595, 95864, 409416, 559203, 566957, 508140, 345791, 60714, -165735, -122639, 110675, 220614, 52897, -209236, -288295]
35098b88295J83992L10022K44083P4223n9725q6010p7642j37007k04674j28745
35088a69778O1008J48907O6174O499R5171J67411M8980j39712j72612n4737N6779
35077A14090J34311K26769K23192l4571m14295n47045k85028J03277K77988K03555
35067B243R1160R6959J82944K10346R5890r5745j95769j09887N6576J21354N6281
35056E12352l891J9107M6693J353o3663p8037r5447j99338l23440l02513j02273
35045e89097J18618K07418J80150J38079J14815Q6154N9235M7851N901r7929j69348
35034A01847r0445P1567J13568j5310j38858j28267p6913r6626j11824r842J47225
35023b33878K33664K54283K41474R8753k10580m35037k97968N7924K05072K0600
$$ y = [-288295, -104303, 205719, 449802, 524025, 464300, 378290, 300648, 163641, -41033, -169778, -108770, 40137, 106311, 112810, 207981, 375392, 424372, 284660, 112048, 57311, 114090, 248401, 475170, 698362, 663791, 249496, -297549, -582577, -479300, -201312, 2243, 93403, 190362, 373306, 583652, 679542, 583797, 388028, 278141, 334717, 456071, 512352, 508461, 527568, 574261, 575614, 511951, 433914, 338467, 139129, -184311, -486824, -589097, -470479, -263061, -82911, 55168, 169983, 256137, 315372, 363223, 369124, 271195, 101847, 11402, 82969, 196537, 181227, 42369, -85898, -162811, -259437, -371261, -381103, -233878, -214, 254069, 495543, 594296, 383716, -51321, -349289, -291365, -86293, -65693]
35013f5693j74078j23751K7283M5568k4557J304J31150K08684J36813l3532j54790
35002b5599q0916J59547K91589R6073k19040k31449P0799K29420R890k29122j06495
34991c5303J95625K61695P7615o5500j01957j93378l12026k53476l9592P6901
34981c89396K2171k8545k415p936l6177O1241K33056K26596L0227m2097J31686
34970A98411K32557O374k90494k66738L307J13068n1241j79175m3014J69158J44998
34959C7211j15664l06040j90540J29878L43310K76621P3409m458R6489J88889
34949E29105J28007j0433q9145j10639j50419j89168j51464n8755j643K3417J12650
34938C1513K72651L60938K59382K2686j98339l13880l22235k45573j17830l624
$$ y = [-65693, -239771, -363522, -336239, -290671, -315228, -313924, -182774, 25910, 162723, 129191, -25599, -106515, 53032, 344621, 440694, 221654, -9795, 61004, 290424, 300314, 71192, -35303, 160322, 422017, 499632, 434132, 332175, 138797, -173229, -426705, -466297, -389396, -367225, -395770, -398185, -406121, -442298, -381057, -148001, 78595, 108822, 66725, 198411, 430968, 437342, 146848, -119890, -116583, -3515, -54756, -233931, -276945, -107787, 37211, -78453, -384493, -575033, -445155, -101845, 174776, 248185, 243727, 340216, 529105, 657112, 646679, 557534, 446895, 296476, 107308, -44156, -102911, -104554, -81137, 31513, 304164, 665102, 924484, 947170, 748831, 434951, 112716, -132857, -250687, -254311]
34928b54311M9191O4875Q2379O4650m2020j65484j53207j728R8447M0219j6669
34917b33658J04178K78065K37535l538j49502p3218O753r4867k28209j66213L2022
34906b90652J32648O9612l6255j03125j28701q3518L4091R8555R680j12021q1471
34895d91157N8668J20022R0236J21577K17498K03466M2842q1999p3901o0685j37838
34884H729k03868j69657j16944j11444n7878J00325K17094J58498K9324l502J8847
34873a30476l9128j27929p9999R0836J82453J05150k740J475Q4388J38165J34035
34862C56230R7060K0669j01624k04106j97155r1372j0375m5249j31648j27068
34852d34638J305J42088K06808K28614K37811J63077k1331j63092j26935l8493
$$ y = [-254311, -205120, -140245, -57866, 6784, -35236, -200720, -353927, -355655, -257208, -216989, -233658, -129480, 148585, 386120, 382582, 233080, 159862, 166615, 71748, -156461, -322674, -290652, -158004, -88392, -124647, -227772, -356473, -439991, -405900, -307345, -297665, -409686, -491157, -432489, -312467, -222231, -100654, 116844, 320310, 363152, 281153, 207252, 146567, 8729, -195139, -364796, -481740, -593184, -651062, -550737, -333643, -175145, -145821, -149323, -130476, -169604, -297533, -377532, -286696, -104243, 907, -1833, -358, 84030, 222195, 356230, 453290, 473959, 372335, 168229, -28926, -120298, -130673, -175922, -307570, -434638, -433333, -291245, -84437, 144177, 381988, 545065, 523734, 360642, 233707, 195214]
34842A95214j06128k50119j91173P8712K30525R7663p5777n2854L7025M21l9261
34831g5752J05324K62939J30702j85604k70063k1059K16822K01104R8056J17829
34821E80298J84195J58195J06291J13775N9018j64110l67160k94325l0902R5313
34811D40588j7218j40359r4303K4666O4172L9429J6350m4976j65044j98144j8891
34800i3730K07484J74540j18658k97363j09166J98176K12801l9170j24551J38552
34790A48915L66167J38739l82853o58563m80343j66732m6088o2180p228J23128
34780a027038K08445K53863L32179L81521K86736J11293L5791P9981Q4841j7997
34770G29615j12016j10870q7176j18644j61927j56773j14902l3765J21526K62868
$$ y = [195214, 89086, -161033, -352206, -273494, -42969, 54694, -21083, -73937, -36912, -36491, -75752, 29572, 292511, 423213, 237609, -32454, -53513, 163309, 364413, 462469, 580298, 764493, 922688, 1028979, 1142754, 1201772, 1037662, 670502, 376177, 345275, 440588, 423370, 283011, 188708, 213374, 277546, 316975, 333325, 288349, 123305, -74839, -93730, 113754, 288294, 169636, -127727, -236893, -38717, 174084, 134914, 10363, 148915, 515082, 653821, 270968, -387595, -867938, -1034670, -1080758, -1142938, -1150166, -1027038, -818593, -564730, -232551, 148970, 435706, 546999, 582790, 662771, 747612, 729615, 617599, 506729, 419553, 300909, 138982, -17791, -132693, -166458, -44932, 217936]
34760B17936J90850r2638k63844q3450K17779K30592l6692j73178J1515K15284
$$ y = [217936, 408786, 316148, 52304, -31146, 186633, 417225, 380533, 207355, 218870, 434154]
$$ [...]
##END NTUPLES=NMR SPECTRUM
##END=
