##TITLE=31Pdec_B3C2001
 CDCl3, 24 sc
 21.1.2025
##JCAMPDX= 6.0         $$ Bruker NMR JCAMP-DX V2.0
##DATA TYPE= NMR SPECTRUM
##DATA CLASS= NTUPLES
##ORIGIN= UXNMR, Bruker Analytische Messtechnik GmbH
##OWNER= root
$$ XWIN-NMR		Version 3.5
$$ Tue Jan 21 13:46:09 2025 Russian Standard Time (UT+4h)  she@DPX200
##.OBSERVE FREQUENCY= 81.013821
##.OBSERVE NUCLEUS= ^31P
##.ACQUISITION MODE= SIMULTANEOUS
##.ACQUISITION SCHEME= undefined
##.AVERAGES= 24
##.DIGITISER RES= 17
##SPECTROMETER/DATA SYSTEM= spect
##.PULSE SEQUENCE= zgpg30
##.SOLVENT NAME= CDCl3
##.SHIFT REFERENCE= (INTERNAL, CDCl3, 0, 198.062)
##AUDIT TRAIL= $$ (NUMBER, WHEN, WHO, WHERE, WHAT)
$$ ##TITLE= Audit trail, XWIN-NMR		Version 3.5
$$ ##JCAMPDX= 5.01
$$ ##ORIGIN= Bruker BioSpin GmbH
$$ ##OWNER= she
$$ F:/spectra/data/she/nmr/P31/2/pdata/1/auditp.txt
$$ ##AUDIT TRAIL=  $$ (NUMBER, WHEN, WHO, WHERE, WHAT)
(   1,<2025-01-21 13:44:54.06 +0400>,<she>,<DPX200>,
      <created by zg, POWCHK disabled, PULCHK disabled
       configuration hash MD5:
       00 E9 B6 7A A2 85 ED C7 34 08 36 98 17 FE 4E 26
       data hash MD5: 32K
       BA 00 B8 4A AA 5A BD D4 39 73 53 5D C4 90 51 53>)
(   2,<2025-01-21 13:44:57.89 +0400>,<she>,<DPX200>,
      <Start of raw data processing
       efp BC_mod = 2 LB = 1.5 FT_mod = 6 PKNL = 1 PHC0 = 1770.333 PHC1 = 87.4864 SI = 64K 
       data hash MD5: 64K
       56 BE C4 3B F5 F8 CA 2C 90 44 9C 5E 32 07 9C AD>)
(   3,<2025-01-21 13:45:19.73 +0400>,<she>,<DPX200>,
      <pk PHC0 = 8.006175 PHC1 = -45.20001 
       data hash MD5: 64K
       82 85 27 A8 2C A9 97 0D 5F 39 FE 2B 6A DC C0 F3>)
(   4,<2025-01-21 13:45:23.76 +0400>,<she>,<DPX200>,
      <abs ABSG = 5 
       data hash MD5: 64K
       2D CD 8A 42 36 E6 4F 5E 14 CC 75 9C A9 07 01 4C>)
(   5,<2025-01-21 13:45:42.54 +0400>,<she>,<DPX200>,
      <pk PHC0 = 18.09304 PHC1 = -42.8 
       data hash MD5: 64K
       32 48 68 13 75 EB 85 11 96 D8 43 B7 DC 2C 06 69>)
$$ ##END=
$$ 
$$ hash MD5
$$ AD 3E 6A 5E 63 6C AF 74 93 A6 2B E3 3E 9D 33 6E
##$RELAX= 
##$RELAX= 
##$RELAX= 
##$RELAX= 
##$RELAX= 
##$RELAX= 
##$RELAX= 
##$RELAX= 
$$ Bruker specific parameters
$$ --------------------------
##$DU= <F:/spectra>
##$EXPNO= 2
##$NAME= <P31>
##$PROCNO= 1
##$TYPE= <nmr>
##$USER= <she>
##$AMP= (0..31)
100 100 100 100 100 100 100 100 100 100 100 100 100 100 100 100 100 100 
100 100 100 100 100 100 100 100 100 100 100 100 100 100 
##$AQSEQ= 0
##$AQ_mod= 1
##$AUNM= <au_zg>
##$AUTOPOS= <>
##$BF1= 81.014009
##$BF2= 200.13
##$BF3= 200.13
##$BF4= 200.13
##$BF5= 200.13
##$BF6= 200.13
##$BF7= 200.13
##$BF8= 200.13
##$BYTORDA= 1
##$CFDGTYP= 0
##$CFRGTYP= 5
##$CHEMSTR= <none>
##$CNST= (0..31)
1 1 145 1 1 1 1 1 1 1 1 1 1 1 1 1 1 1 1 1 1 1 1 1 1 1 1 1 1 1 1 1 
##$CPDPRG= <waltz16>
##$CPDPRG1= <>
##$CPDPRG2= <waltz16>
##$CPDPRG3= <>
##$CPDPRG4= <mlev>
##$CPDPRG5= <mlev>
##$CPDPRG6= <mlev>
##$CPDPRG7= <mlev>
##$CPDPRG8= <mlev>
##$CPDPRGB= <>
##$CPDPRGT= <>
##$D= (0..31)
0 1 0 0 0 0 0 0 0 0.06 0 0.03 2e-05 3e-06 0 0 0.0002 0 0 0 0 0 0 0 0 0 
$$ [...]
##$SUBNAM3= <"">
##$SUBNAM4= <"">
##$SUBNAM5= <"">
##$SUBNAM6= <"">
##$SUBNAM7= <"">
##$SUBNAM8= <"">
##$SUBNAM9= <"">
##$SW= 400.765351723535
##$SWIBOX= (0..15)
0 1 3 0 0 0 0 0 0 0 0 0 0 0 0 0 
##$SW_h= 32467.5324675325
##$TD= 32768
##$TD0= 1
##$TE= 0
##$TE2= 300
##$TE3= 300
##$TEG= 300
##$TL= (0..7)
0 120 53 12 22 120 120 120 
##$TP= (0..7)
150 150 150 150 150 150 150 150 
##$TP07= 0
##$TPNAME0= <>
##$TPNAME1= <>
##$TPNAME2= <>
##$TPNAME3= <>
##$TPNAME4= <>
##$TPNAME5= <>
##$TPNAME6= <>
##$TPNAME7= <>
##$TPOAL= (0..7)
0.5 0.5 0.5 0.5 0.5 0.5 0.5 0.5 
##$TPOFFS= (0..7)
0 0 0 0 0 0 0 0 
##$TUNHIN= 0
##$TUNHOUT= 0
##$TUNXOUT= 0
##$USERA1= <user>
##$USERA2= <user>
##$USERA3= <user>
##$USERA4= <user>
##$USERA5= <user>
##$V9= 5
##$VALIST= <valist>
##$VCLIST= <CCCCCCCCCCCCCCC>
##$VD= 0
##$VDLIST= <DDDDDDDDDDDDDDD>
##$VPLIST= <PPPPPPPPPPPPPPP>
##$VTLIST= <TTTTTTTTTTTTTTT>
##$WBST= 1024
##$WBSW= 4
##$XGAIN= (0..3)
0 0 0 0 
##$XL= 0
##$YL= 0
##$YMAX_a= 9108
##$YMIN_a= -3593
##$ZGOPTNS= <>
##$ZL1= 120
##$ZL2= 120
##$ZL3= 120
##$ZL4= 120
##$ABSF1= 198.0616
##$ABSF2= -202.7028
##$ABSG= 5
##$ABSL= 3
##$ALPHA= 0
##$AQORDER= 0
##$ASSFAC= 0
##$ASSFACI= 0
##$ASSFACX= 0
##$ASSWID= 0
##$AUNMP= <proc_1d>
##$AZFE= 0.1
##$AZFW= 0.5
##$BCFW= 0
##$BC_mod= 2
##$BYTORDP= 0
##$COROFFS= 0
##$CY= -3
##$DATMOD= 1
##$DC= 0
##$DFILT= <>
##$DTYPP= 0
##$F1P= 0
##$F2P= 0
##$FCOR= 1
##$FTSIZE= 65536
##$FT_mod= 6
##$GAMMA= 0
##$GB= 0
##$INTBC= 1
##$INTSCL= 9.790993e-09
##$ISEN= 30
##$LB= 1.5
##$LEV0= 0
##$LPBIN= 0
##$MAXI= 10000
##$MC2= 0
##$MEAN= 0
##$ME_mod= 0
##$MI= 50
##$NCOEF= 0
##$NC_proc= -8
##$NLEV= 6
##$NOISF1= 182.463
##$NOISF2= 159.3651
##$NSP= 0
##$NTH_PI= 0
##$NZP= 0
##$OFFSET= 198.0616
##$PC= 4
##$PHC0= 1796.432
##$PHC1= -0.5136108
##$PH_mod= 1
##$PKNL= yes
##$PPARMOD= 0
##$PSCAL= 0
##$PSIGN= 0
##$REVERSE= no
##$SF= 81.0140089999434
##$SI= 65536
##$SIGF1= 159.3651
##$SIGF2= -187.1042
##$SINO= 113.3802
##$SIOLD= 16384
##$SREGLST= <1H.CDCl3>
##$SSB= 0
##$STSI= 65536
##$STSR= 0
##$SW_p= 32467.5324675325
##$SYMM= 0
##$S_DEV= 0
##$TDeff= 32768
##$TDoff= 0
##$TI= <>
##$TILT= no
##$TM1= 0
##$TM2= 0
##$TOPLEV= 0
##$USERP1= <user>
##$USERP2= <user>
##$USERP3= <user>
##$USERP4= <user>
##$USERP5= <user>
##$WDW= 1
##$XDIM= 65536
##$YMAX_p= 443244221
##$YMIN_p= -15600710
$$ End of Bruker specific parameters
$$ ---------------------------------
##NTUPLES= NMR SPECTRUM
##VAR_NAME=  FREQUENCY,     SPECTRUM/REAL,   SPECTRUM/IMAG
##SYMBOL=    X,             R,               I
##VAR_TYPE=  INDEPENDENT,   DEPENDENT,       DEPENDENT
##VAR_FORM=  AFFN,          ASDF,            ASDF
##VAR_DIM=   65536,         65536,           65536
##UNITS=     HZ,            ARBITRARY UNITS, ARBITRARY UNITS
##FACTOR=    0.49542278885378, 1,            1
##FIRST=     16045.7642231865, 0,            0
##LAST=      -16421.768244346, 0,            0
##MIN=       -16421.768244346, -15600710,    0
##MAX=       16045.7642231865, 443244221,    0
$$ Real data points
##PAGE= N=1
##DATA TABLE= (X++(R..R)), XYDATA
$$ [...]
39890 1581731 2059783 1912237 1419907 1099377 1200324 1301263 583374 -1265396 -3409217
39881 -3409217 -4373238 -3437947 -1482479 -211899 -522074 -1831568 -3007890 -3575738 -3818647
39872 -3818647 -4042978 -4181393 -4091359 -3919908 -4012974 -4477830 -4865015 -4428407 -2910160 -977582
39862 -977582 428703 1092781 1431234 1514740 934795 -179221 -874194 -635716 -229432
39853 -229432 -608256 -1563797 -2203642 -2235125 -1939571 -1363347 -530263 -130401 -931670 -2587225
39843 -2587225 -3871184 -3914326 -2450862 601214 4560922 7399978 7330531 5011739 2758797
39834 2758797 1593213 675231 -411928 -970190 -1224161 -2654682 -5138205 -6015234 -3791469
39825 -3791469 -860032 -302657 -1464113 -1334756 601634 1840323 999203 -450274 -1215028
39816 -1215028 -2272986 -4548216 -6550454 -6297295 -4526424 -4039986 -6039690 -8634322
39808 -8634322 -9286978 -7670110 -5477301 -4042887 -3082762 -1865922 -752703 -774250 -1999115
39799 -1999115 -3270066 -3649343 -3244369 -2437691 -1334975 -326743 -23689 -59027 754342
39790 754342 2271955 2517168 578959 -1516490 -1588182 -553926 -625031 -1393791 -632967
39781 -632967 1461790 2075367 266057 -1407499 -908109 244846 -470259 -3089796 -5920942
39772 -5920942 -8016668 -9073270 -8297418 -5401544 -1959373 -110642 -378069 -1841271
39764 -1841271 -3630926 -5092745 -5420371 -4498221 -3412886 -2988330 -2676945 -2028837 -2065301
39755 -2065301 -3594593 -5227092 -5031928 -3480672 -2693732 -3181782 -3494800 -3029602 -2961189
39746 -2961189 -3951348 -4901800 -4754512 -3934826 -3140061 -2068474 -391523 1058080 1216960
39737 1216960 315878 -506742 -767163 -921214 -1161105 -755008 959710 3236610 4264453
39728 4264453 3221629 1465658 827432 1035070 225178 -1809101 -2706914 -905717 1791617
39719 1791617 2735748 2159407 2163500 2901125 2490406 577104 -848221 -826213 -1030470 -2743813
39709 -2743813 -4419967 -4024623 -2260333 -1484973 -2293758 -3097499 -2831280 -2405936 -3164872
39700 -3164872 -4980502 -6375456 -6101535 -4355444 -2563734 -1964297 -2414904 -2790901 -2393588
39691 -2393588 -1476135 -517387 260367 580114 150512 -704560 -1153649 -863972 -296066
39682 -296066 102765 250960 -58719 -1026409 -2068559 -2285813 -1985480 -2479223 -3864969
39673 -3864969 -4373482 -2798652 -404922 632532 -262511 -2106128 -3877337 -4806940 -4120317
39664 -4120317 -2017202 -298090 -450113 -1446602 -995953 1155982 2764553 2131649 129442
39655 129442 -1377220 -1912967 -2327522 -3066018 -3417737 -2389161 102789 2882197 4286988
39646 4286988 3542704 1505652 -130670 -420657 182750 673711 656088 521196 655129
39637 655129 778186 317560 -639457 -1286628 -1328437 -1706104 -3333399 -5489034 -6497923
39628 -6497923 -5838380 -4370157 -2536800 64873 2931574 4221629 3106627 1165532
39620 1165532 240238 124931 -303957 -891214 -827662 -559070 -1210128 -2630461 -3789770
39611 -3789770 -4723284 -6247783 -7933156 -8238761 -6788651 -4827393 -3253164 -1860492
39603 -1860492 -772987 -873847 -2231141 -3562532 -3887828 -3512775 -2998960 -2479981 -2327487
39594 -2327487 -2978948 -3631801 -2719389 -337776 1432656 1407013 780195 752330 537950
39585 537950 -789270 -2180675 -2252874 -1726576 -2123414 -3000502 -2737283 -1462133 -816182
39576 -816182 -988781 -406660 1303704 2311858 1308230 -706304 -2349913 -3834313 -5677257
39567 -5677257 -6848146 -5874877 -3061208 -100287 2068180 3601899 4257220 3168220
39559 3168220 491715 -1982334 -2632844 -1793897 -1119673 -1543385 -2415998 -2535804 -1637648
39550 -1637648 -783471 -1273817 -3069921 -4524100 -4163037 -2566147 -1590683 -1632824 -986791
39541 -986791 1220066 2803215 1056006 -3102030 -5770815 -5096879 -3350397 -3039147 -3283290
39532 -3283290 -2003405 106540 576528 -657182 -1008323 702001 2674643 3316057 3418606
39523 3418606 3849735 3350650 630851 -2902002 -4694453 -4429252 -3815806 -3631786 -3108234
39514 -3108234 -2050720 -1394102 -1287091 -542461 1256168 2676873 2459723 1389550 1019329
39505 1019329 1454499 1739955 1967336 3538822 7084123 11118369 13368376 13016861 11120463
39496 11120463 8942803 6420806 2628338 -2436101 -7099863 -9395016 -8909452 -6852118
39488 -6852118 -4503063 -2267556 -347389 471351 -536880 -2769917 -4407673 -4168431
39480 -4168431 -2696665 -1788955 -2234806 -2855998 -2000055 317375 2340117 2630056 1531707
39471 1531707 282908 -676307 -1804452 -3205384 -4154772 -4019870 -3014230 -1748739 -490228
39462 -490228 767297 1792577 2138588 1706173 1031237 824951 1181914 1366035 684865
39453 684865 -305159 86483 2779768 6269776 7645744 5576156 1725465 -1204651 -2273160
39444 -2273160 -2456788 -2513574 -1947431 -400926 1038250 891019 -783204 -2434864 -2927968
39435 -2927968 -2627982 -2545692 -3106322 -3915347 -4125773 -2943574 -485970 1746710 2144951
39426 2144951 987857 149782 465320 739192 112564 -253723 619679 1185434 -409724
39417 -409724 -2650164 -2060808 1727482 5201345 5889389 5247891 5391963 5708741 4834896
39408 4834896 3826572 4667765 6882519 8225379 7979526 7137619 5911269 3718154 1544870
39399 1544870 1607752 4035343 6115011 5744530 3866727 2581944 2431381 2581006 2392695
39390 2392695 1729804 651051 -337213 -571310 -399647 -1027554 -2499684 -3030541 -1403676
39381 -1403676 943883 1517387 -131388 -2106930 -2688034 -2058317 -1520207 -1791437 -2324592
39372 -2324592 -2068334 -856465 139075 -188188 -1234487 -1394414 -414889 277655 -25335
39363 -25335 -180439 561950 713948 -1389218 -4679519 -6415959 -5723384 -4237008 -3335925
39354 -3335925 -2610613 -1421321 -243695 362560 866599 1890994 3030277 3380227 2701983
39345 2701983 1412878 -94997 -1553491 -2673331 -3413400 -3974964 -4078533 -2814032 80670
39336 80670 3197156 4593603 3924706 2741004 2614826 3620287 4809490 5451984 5301423
39327 5301423 4192943 2239563 405596 62259 1518408 3447619 4326118 4204745 4461056
39318 4461056 5888352 7720715 8691263 8385522 7225925 5754001 4444207 3693972 3332508
39309 3332508 2547375 1074462 148833 1273314 4013715 6011692 5543211 3285580 1123322
39300 1123322 -27474 -521382 -706777 -317931 897224 2656118 4402379 5658303 6060585
39291 6060585 5503821 4434132 3661386 3633249 4051638 4332634 4264581 4071132 3981859 3915342
39281 3915342 3527087 2487699 825973 -872609 -1677035 -900556 1359838 4112979 5859065
39272 5859065 5417766 2896337 -101054 -1758663 -1883606 -2074161 -3635776 -5709382 -6156018
39263 -6156018 -4164570 -1207107 707527 952582 122876 -1251413 -3044967 -4930576
39255 -4930576 -6272712 -6753490 -6597334 -5991838 -4661903 -2341155 445332 2432606 2744551
39246 2744551 1918698 1379639 1672394 1736385 506993 -1266255 -1831333 -869537 175148
39237 175148 380861 508508 1261614 1857074 1422925 556661 128766 -325264 -1350114
39228 -1350114 -1742018 -157282 1989997 1710197 -1332069 -4084752 -4147808 -2394894 -767903
39219 -767903 388591 1488960 2041165 1502737 593418 253853 252653 65311 19226 227695
39209 227695 -375230 -2248044 -3581351 -2437431 163976 1406555 517322 -719611 -1147832
39200 -1147832 -1582935 -2531886 -2806761 -1516763 182037 615090 -167204 -805214 -584359
39191 -584359 -22640 12693 -933494 -2558814 -3605271 -2493090 1113578 5519957 8228047
39182 8228047 7932621 5337163 2460338 1195944 1840254 2628781 1262638 -2604466 -6697451
39173 -6697451 -8290218 -6800382 -4015945 -2132227 -1923177 -2592279 -2984957 -2808002 -2635338
39164 -2635338 -2781320 -2625525 -1504736 68602 816524 258710 -843049 -1600731 -1816942
39155 -1816942 -1675054 -1528723 -2193142 -4398587 -7390140 -8962990 -7708127 -4657615 -1954585
39146 -1954585 -435583 574063 1507040 1819518 1137888 100949 -473599 -629562 -880810
39137 -880810 -1182543 -1012985 -408919 -191109 -849370 -1702092 -1631141 -354030 1510912
39128 1510912 3333692 4735167 5156699 4124820 2136949 408503 -605819 -1594865
39120 -1594865 -2886001 -3537316 -2657745 -782186 936358 2157567 3056220 3377682 2928978
39111 2928978 2370544 2305938 2163351 1257060 312443 385470 822441 147529 -1317389 -1771925
39101 -1771925 -895952 -342897 -927271 -1507885 -1381484 -1607990 -2792394 -3499600 -2397493
39092 -2397493 -446682 611887 677193 641579 508939 -114788 -579464 -68281 680822
39083 680822 332113 -671342 -417794 1733687 4172212 5036777 4102127 2461139 1261947
39074 1261947 1038314 1627376 2446449 3047968 3303705 3002529 1873144 298501 -761204
39065 -761204 -1017202 -1169786 -1468788 -1081004 288728 1387643 1239935 841178 1533867
39056 1533867 2717035 2978594 2678114 3238189 4267398 3769329 1434824 -524007 -564832
39047 -564832 57897 -571080 -2221251 -3088000 -2202610 -57476 2603274 5424479 7865490
39038 7865490 8815840 7330856 3851904 422673 -957779 -459466 -198212 -1404934 -2760472
39029 -2760472 -2546708 -1538061 -2131708 -4938450 -7917659 -9001824 -8081986 -6103529 -3611466
39020 -3611466 -794528 2022393 4471568 6124000 6326054 4844658 2590381 764575
39012 764575 -554318 -1947754 -3166443 -3557079 -3713689 -4872579 -6547238 -6716005 -4861439
39003 -4861439 -2940716 -2564529 -2981188 -2835382 -2252865 -1941627 -1646107 -887693 -185056
38994 -185056 -243112 -731803 -915199 -716940 -339260 235949 607503 -23961 -1321650 -1576995
38984 -1576995 -39163 1856066 2751100 3365387 4689197 5630116 4493979 1845775 -182441
38975 -182441 -800571 -820434 -598340 181868 998845 892247 343448 796064 2233445 3139374
38965 3139374 2984885 2748006 2659630 1585606 -589727 -1982030 -1321947 27383 75585
38956 75585 -892293 -867678 1058036 3693117 5321828 5348862 4438760 3630684 3370238 3245823
38946 3245823 2765905 2211402 2245305 2860203 3400543 3492382 3161119 2233173 661324 -705709
38936 -705709 -973453 -827285 -1790362 -3601241 -4034963 -1995484 868907 2539220 2941117
38927 2941117 2704625 1400854 -1119705 -3011776 -2384709 -310232 330529 -1296289 -3356287
38918 -3356287 -4353868 -4457746 -3735673 -1653580 870294 1381410 -672222 -2410569 -1210866
38909 -1210866 1685544 3230796 2814180 2032038 1254414 -561924 -2747730 -2822792 -577872
38900 -577872 483770 -2298259 -6671313 -8283576 -6436539 -4483319 -4747959 -5591268 -4357751
38891 -4357751 -1359322 631880 128989 -1309739 -1278930 414680 1633415 733933 -1326253
38882 -1326253 -2376529 -1982926 -1711713 -2392168 -2785740 -1875532 -890787 -1380724 -2402107
38873 -2402107 -1796051 243072 1254024 272687 -854785 -591317 61040 -365063 -1321434
38864 -1321434 -1330932 -218514 1207378 2597199 3715695 3620378 1789512 -550181 -1728159
38855 -1728159 -1865395 -2481757 -4205419 -6117678 -7146629 -7008586 -5965965 -4616789 -3721063
38846 -3721063 -3468439 -3267470 -2842834 -2798526 -3388716 -3812389 -3758449 -4368154 -6182809 -7442597
38836 -7442597 -6425125 -4408685 -3943610 -4940528 -5134618 -4010300 -3300328 -3495962 -2981102
38827 -2981102 -1357516 -615872 -1693347 -2537647 -1274659 944442 2029469 1857716 1218920
38818 1218920 -216692 -2671416 -4593053 -4627327 -4095843 -5084487 -6928399 -7093420 -5063292
38809 -5063292 -2884581 -1972540 -1724008 -1486191 -1677827 -2400120 -2827573 -2711781 -2951707
38800 -2951707 -3971806 -4910276 -5115638 -5146396 -5487343 -5475524 -4487990 -3270035 -3035921
38791 -3035921 -3854772 -4831892 -5370419 -5321651 -4270775 -1795329 1394132 3397538 2801621
38782 2801621 287585 -1815143 -1790863 -260789 641758 -184245 -1630777 -2074334 -1569695
38773 -1569695 -1459206 -2140652 -2480481 -1732891 -885227 -1254826 -2426583 -2641895 -1162303
38764 -1162303 606446 670824 -1283702 -3538239 -4179062 -3074261 -1890379 -2150167 -3508512
38755 -3508512 -4289489 -3670593 -2726066 -2888703 -3899850 -4209519 -3368360 -2826208 -3649136
38746 -3649136 -4472488 -3169946 -165057 1743697 1243504 324234 1098842 2530886 2346979
38737 2346979 1090945 1570863 4323855 6392000 5551256 3401806 2644015 3113575 2654594
38728 2654594 842291 -522478 -394799 200854 298962 705096 2530064 4944913 5618521
38719 5618521 3429412 46054 -1700504 -971811 138770 -695233 -2959923 -4015086
38711 -4015086 -2656532 -438655 848689 1243840 1225411 78305 -2595483 -4999941 -4951810
38702 -4951810 -3035352 -1921863 -2718232 -3892393 -3828105 -2516192 -440704 2228864 4570372
38693 4570372 4762583 2249978 -913500 -1918083 101765 3653156 6378112 6526482
38685 6526482 3908331 177873 -2343925 -2695234 -1843142 -1219852 -1414259 -2350947 -3711810
38676 -3711810 -4797674 -4900960 -4264197 -3888728 -4147261 -4535453 -4950182 -5871645 -6856632
38667 -6856632 -6445236 -4468557 -2916498 -3224082 -4082540 -3585984 -2335274 -2260512 -3049698
38658 -3049698 -2245537 912999 3984862 4455903 2669601 690551 -313021 -397134 256884
38649 256884 1314990 1821838 1165991 229204 351167 1357728 1915851 1796676 2257442
38640 2257442 3759147 4855508 4342340 3255474 3360116 4557152 5406561 5610719 6023744
38631 6023744 6329356 4901238 1540262 -1651564 -3114856 -3749463 -4735579 -5207810 -3866563
38622 -3866563 -1469536 379759 1857875 4031307 6100179 6129170 4358354 3246088
38614 3246088 3952170 5099265 5398539 5103958 4226691 1856061 -1525111 -3344995 -2201212
38605 -2201212 -11542 729569 208742 71626 503634 630940 719141 1749523 3368063
38596 3368063 4207909 3905854 3110591 1897386 -59823 -1989320 -2492404 -1555736 -514442
38587 -514442 93895 1106918 2899328 4389940 4429282 3180624 1666043 667531 324226
38578 324226 166010 -583523 -2188613 -3940619 -5002972 -5360257 -5285117 -4477277 -2798639
38569 -2798639 -1354712 -1478803 -2844598 -3942147 -4293545 -4678537 -5095583 -4246204 -1710753
38560 -1710753 799174 1385756 316333 -453637 416991 2496963 4347472 4933387 4470471
38551 4470471 4073164 4382250 4717288 4071687 2657624 1611379 1257360 664826 -887554
38542 -887554 -2891452 -4311596 -4544571 -3492461 -1540860 187213 306545 -1624641 -4741624
38533 -4741624 -7769029 -9735800 -9934282 -8152897 -5258099 -2797599 -1657836 -1550076
38525 -1550076 -1805747 -2019655 -1974809 -1763118 -1974065 -2880242 -3478015 -2399089 136927
38516 136927 2374103 3151708 2825767 1937649 398351 -1513855 -2726089 -2728172 -2296307
38507 -2296307 -2184343 -2138625 -1866845 -1843587 -2320638 -2575559 -2036507 -1231197 -804116 -592280
38497 -592280 -542114 -1423160 -3506785 -5529243 -6208038 -5928944 -5687755 -5296375 -4172121
38488 -4172121 -3123579 -3480901 -4720341 -4783069 -2955367 -924220 -565334 -1869564 -3525833
38479 -3525833 -4603914 -5084554 -5268589 -5132190 -4199966 -2148411 380248 2114203 2676951
38470 2676951 3039218 3812336 3998307 2516108 178697 -1268303 -1552353 -1742424 -2028174
38461 -2028174 -1443790 15803 725095 -503535 -2945647 -5131964 -6400732 -6768318 -6302302
38452 -6302302 -5241942 -3963204 -2455643 -646917 653217 392716 -778368 -643817
38444 -643817 1743202 4669957 6115319 6166874 5924628 5364004 4048235 3026817 3852127
38435 3852127 5872402 6551852 4875265 2696079 2005623 2387188 2233258 1305381 720883
38426 720883 1039168 1737392 2380443 3030031 3360223 2556768 627447 -1080425 -1416896
38417 -1416896 -895119 -794092 -1215837 -1121741 -323552 -255047 -2056178 -4571536 -5196859
38408 -5196859 -2656585 1653100 5062040 5856567 4167394 1347163 -1114741 -2383411
38400 -2383411 -2496498 -1975646 -1243442 -481140 62634 14046 -622446 -1125103 -660083 662169
38390 662169 1699694 1604121 1022166 1390525 2959589 4243097 3918936 2615916 1920368
38381 1920368 2026642 1616101 116889 -1258602 -1291752 -455731 -28998 -421625 -1311514
38372 -1311514 -2602849 -4042436 -4481134 -2935356 -199358 1916611 2936766 3994073
38364 3994073 5609572 6620391 5925030 4162310 2870943 2823309 3928002 5905665 8010632
38355 8010632 8697529 6909035 3716854 1585751 1661665 2588744 2459221 1220467 395230
38346 395230 830869 1735717 2047702 1773991 1411411 857379 -111850 -755349 -56430 1461261
38336 1461261 1892963 381533 -1696403 -2571961 -2122362 -1387434 -1066044 -1352709 -2275128
38327 -2275128 -3188032 -2968908 -1916512 -2263525 -5098722 -7857094 -7153223 -3509356 -666281
38318 -666281 -287554 -200262 1528048 3682439 4453735 4354311 4617264 4675530 3533163 2236751
38308 2236751 2541491 3935944 4319333 3202843 2040784 1564151 990853 112472 93359
38299 93359 1500637 3168777 3867947 3864838 4015354 4333647 4307191 3853084 3142585 2030792
38289 2030792 425448 -1081389 -1550479 -584606 1332720 3159370 3877713 3166061 1659732
38280 1659732 226976 -1000849 -2384186 -3628531 -3724763 -2364931 -657810 163410 215356
38271 215356 453977 1029965 981690 -361453 -2319230 -3527701 -3309627 -2012710 -191640
38262 -191640 1991801 4360908 6211952 6828761 6416221 5845916 5313851 3992668 1519590
38253 1519590 -823162 -1294775 148414 1712876 1830482 693407 -375650 -447909 367962
38244 367962 1293898 1516476 698997 -824892 -2356357 -3357414 -3710891 -3707194 -3875670
38235 -3875670 -4406287 -4472751 -2771603 578016 3242096 2883055 5554 -2527416 -2852342
38226 -2852342 -1785531 -945747 -628667 -335407 -214053 -747508 -1650716 -2233541 -2479013
38217 -2479013 -2717807 -2578443 -1456153 64921 514709 -446667 -1374152 -916312 468138
38208 468138 1314745 1114824 777938 1374515 2961392 4624640 5424411 5346205 5325023 6051407
38198 6051407 6827743 6227261 4043424 1819257 981791 1176297 1119426 397587 -544640
38189 -544640 -1636585 -3104633 -4314472 -4019396 -2010541 528872 2499300 3617916
38181 3617916 3549969 1798102 -932304 -2713374 -2705857 -2204290 -2299031 -1951071 -20800
38172 -20800 2071732 1928988 -276888 -2199250 -2963338 -3848809 -5123615 -4993918 -2809339
38163 -2809339 -863167 -1251328 -2762243 -2871417 -1479446 -486857 -484133 -198915 865804
38154 865804 1381983 382141 -1015174 -975834 718234 2480252 2806404 1858102 1079424
38145 1079424 1428104 2368107 2885544 2962685 3163646 3151788 2080141 530060 301889
38136 301889 1667892 2649879 2068642 1460396 2441932 3964433 4250954 3907184 4493911
38127 4493911 5077309 3226209 -855405 -4131643 -4890956 -4415674 -4081175 -3486347 -2280369
38118 -2280369 -1267397 -505407 1347486 4327354 5895472 4090297 293943 -2753463
38110 -2753463 -4116463 -4206610 -2878097 -162080 2320980 3040751 2997568 4340921 6971467
38101 6971467 8573552 7837805 5710553 3496818 1669521 747722 1404258 3059318 3930936
38092 3930936 3244767 2164306 1865445 1913205 1398562 614716 498230 1044914 1359017
38083 1359017 1017188 516434 422331 725757 1098055 1324650 1378370 1327273 1247045 1110846
38073 1110846 791570 245903 -396945 -974062 -1314331 -1031068 342759 2574251 4272226
38064 4272226 3926788 1742241 -85250 464981 3004164 5290655 5865263 5277280 4599703
38055 4599703 3827099 2415374 567589 -956695 -1816671 -2031603 -1466617 -343419 232639
38046 232639 -554806 -1837578 -2100851 -1418491 -1248130 -2003734 -2369362 -1371706 268259
38037 268259 1361238 1597876 1195549 454325 234990 1628801 4421525 6944063 8065145
38028 8065145 8246709 8118280 7377184 5880855 4478158 3806482 3491033 3411032 4337707
38019 4337707 6246806 7533638 7298128 6943980 7854062 8859390 8018214 5829352 4483995
38010 4483995 4628828 5048731 5093109 5217286 5294675 4505399 2991485 1779006 999251
38001 999251 -16853 -836926 -45434 2430969 4859367 5918789 5779784 4733265 2547988
37992 2547988 -298692 -2472962 -3567540 -4537254 -5730521 -6059629 -4950121 -3612833
37984 -3612833 -3320241 -3651618 -3548966 -3065550 -2881728 -2844961 -2164410 -683151 917799
37975 917799 1976762 2391750 2552608 2990665 3727516 3941608 2926297 1379454 809667
37966 809667 1475467 1971434 1301349 342494 546969 1957697 3321010 3749340 3573885
37957 3573885 3618429 3960498 3540708 1330236 -1859036 -3399568 -1595430 1967468 3896897
37948 3896897 2658943 -266616 -2639974 -3555485 -3332106 -2782968 -2945616 -4321648 -5931529
37939 -5931529 -6042570 -4103829 -1164167 1572147 3615387 4812415 5332420 5884210 6668513
37930 6668513 6451848 4309184 1924966 2014781 4426614 6163006 5689539 4757647 5115284
37921 5115284 5886643 5593973 4637049 4084745 3687978 2768802 1752246 1340985 1374557
37912 1374557 1736331 2996153 4845704 5400611 3638530 1248682 484966 1374612 2596519
37903 2596519 3830376 5382115 6505338 6086192 4431125 2694851 1062820 -909418
37895 -909418 -2645353 -2922113 -1800979 -803281 -984626 -1677620 -1282859 1027237 4265117
37886 4265117 6350288 6384725 5803187 6200071 6671294 5249739 2597255 1616734 3110259
37877 3110259 4684146 4749243 4651922 5624796 6607106 6703905 6936068 7736189 7585326 6158082
37867 6158082 5885670 8084389 10441330 10903594 11195222 13661541 17319450 19873905 21045066
37858 21045066 21336888 20577578 20310759 24001065 31903180 39781314 45787929 53568710
37850 53568710 64965426 76156803 86111959 101207247 124727371 151693066 184864699
37843 184864699 243511981 334897842 421517062 443244221 380963764 279669462 198426825
37836 198426825 154212406 127017934 101561030 81231151 68964917 58284234 46033103
37829 46033103 37650730 35341829 32871197 26262471 19942997 18086593 17931527 15788706
37821 15788706 12882714 11282725 9815318 7736845 7415785 9745758 11206565 8940914
37813 8940914 5164143 3466108 3914588 4610938 5183719 5993291 6258916 5458429 4788093
37804 4788093 5464554 7259299 9724503 12738548 15121351 15409899 14888811 16838876 21704011
37795 21704011 26446213 30379293 37896851 52251566 69009452 79028577 77091298 65611855
37787 65611855 51048224 38701035 30156868 23825436 17759597 12226635 8911766 8072202
37779 8072202 8330552 9099844 10695363 11843153 10186689 6263887 3862092 4825372 6423424
37770 6423424 5809169 4182840 3974741 4467117 3420018 1320698 682404 1946026 2999370
37761 2999370 2446999 984412 -269693 -798854 -238935 1335763 2793620 3001439 2249961
37752 2249961 1574630 1358372 1773917 3565017 6702148 9068872 8421679 5335214 2542672
37743 2542672 1658602 2177065 3399222 5439141 8060700 10164640 11168067 12010531 14250844
37734 14250844 18561458 24188360 29565076 33720520 37515617 42998702 50780013 58328614
37726 58328614 61668901 58855262 51537052 43380212 37177249 33055946 29167785 24302811
37718 24302811 19559061 16727236 15493782 13761299 10763035 7982615 6376961 4649619
37710 4649619 1547795 -1760067 -3255362 -2889087 -2148430 -1566699 -323308 1994446 4571216
37701 4571216 6222802 6263547 4846375 3116164 2560022 3592361 5230032 6419447 6840163
37692 6840163 6246885 4432404 2401368 2052000 3826097 6072695 7501371 8550859
37684 8550859 9370387 8555221 5573994 2656842 2256298 3945523 5598431 6189157 5586330
37675 5586330 3321971 7591 -1500144 816698 4820305 6728493 6182752 5982851
37667 5982851 7348611 8550939 8263140 7292242 6444307 5200005 3271217 1495408 573365
37658 573365 490857 1318960 2889063 3771711 2557896 166068 -1117960 -847283 -530886
37649 -530886 -645187 -12563 1573818 2619802 2424681 2012747 1921562 1282157 -154402
37640 -154402 -1187183 -1121439 -576432 214663 1719448 3159482 2773662 959005 589535
37631 589535 2937916 5742877 6802700 6985064 7779459 8238080 6798381 4361044 2949618
37622 2949618 2495867 1422252 -376976 -1450397 -1251563 -662359 -254813 261161 940551
37613 940551 1369007 1465979 1390238 823664 -584667 -2209423 -2857662 -2172050 -933900
37604 -933900 2672 616343 1564427 3204483 4663357 4350567 2058783 -110906 -152182
37595 -152182 1165536 1744564 1668012 2848308 5377721 7145278 7505311 8222346 9804004
37586 9804004 10091541 8047890 5925906 5812232 6946487 8490027 11782741 17278119
37578 17278119 22369758 25306923 28252341 33159772 37968098 40920627 45025045 53056056
37570 53056056 62124521 70689440 87619265 122936670 167757987 194397966 183257981
37563 183257981 143591484 101743902 74210340 58981191 48352384 39860188 33927015
37556 33927015 29091454 23714489 18622100 15133564 12702293 10279522 7988097 5959579
37548 5959579 3349007 -10821 -2488360 -2675193 -1461186 -825370 -1406670 -2380375 -2989938
37539 -2989938 -3081678 -2651053 -1905965 -1458213 -1564249 -1444292 -212917 1683335 2804063
37530 2804063 2466456 1386215 526923 111354 -29725 46429 108881 -325065 -1189956 -1596511
37520 -1596511 -1041082 -289471 -162105 -39537 1129232 2688581 2818828 1362429 327930
37511 327930 931737 1880313 1703660 1193374 1938894 3669762 4856116 5057119 4799419
37502 4799419 3865168 1811117 -247003 -635564 153606 -6205 -1446093 -2152164 -1183324
37493 -1183324 -245789 -817860 -1879189 -1909217 -1281090 -1044958 -917813 -287938 71836
37484 71836 -745979 -1722885 -1062688 1116312 3012724 3739867 4055778 4673443 5346006
37475 5346006 5627193 5341604 4435913 3413115 3445448 4738087 5338958 3311781 -203187
37466 -203187 -2063527 -1304067 -171991 -572009 -1616644 -1661362 -847739 -259626 -113094
37457 -113094 -347027 -1725166 -4536402 -7047676 -7129448 -5034237 -2908069 -1855222 -1207597
37448 -1207597 -571129 -672041 -1746486 -2742227 -2820593 -2353049 -1800906 -929724 84039
37439 84039 85971 -1451473 -3331523 -4223801 -4305406 -4150561 -3225284 -1209836 212366 -780220
37429 -780220 -2824088 -2429411 1172763 4513235 4251757 1233008 -1142685 -1159185 140407
37420 140407 1120483 1140708 352791 -737053 -1458360 -1466880 -985286 -275226 623410 1399340
37410 1399340 1627152 1819589 3119639 5236144 6088801 4687420 3019145 3447860 5303079
37401 5303079 5949799 4532216 2657599 1762657 1787696 2286893 2876106 2547518 488375
37392 488375 -2165765 -3196650 -2232217 -1078651 -840874 -634977 224515 649828 -574644
37383 -574644 -2957738 -5004982 -5613594 -4227096 -1035786 2261310 3349472 1882703
37375 1882703 4701 -417719 205999 605576 511460 141774 -709071 -1941722 -2759923
37366 -2759923 -2997733 -3503185 -4238909 -3617100 -1028982 1583913 2315973 1987888 2394601
37357 2394601 3184695 2670626 849168 -642211 -1112061 -1306603 -1641069 -1895445 -2475693
37348 -2475693 -4054399 -5928931 -6472214 -5340825 -3732228 -2459807 -1330004 -448896
37340 -448896 -483796 -1321374 -1879317 -1579934 -832757 65929 1260587 2460320 3021794
37331 3021794 3052340 3200564 3302389 2604897 1425955 1041296 1572389 1513192 -30465
37322 -30465 -1938670 -2607723 -1824488 -536272 241759 -227812 -2095469 -4328044 -5333888
37313 -5333888 -4788435 -4011292 -4012687 -4084650 -3007542 -857057 1176162 2252590 2512252
37304 2512252 2574052 2860594 3198839 2963019 1962749 1091446 1451195 2884466 4149290
37295 4149290 4525721 4324746 3756383 2418785 289177 -1752671 -2887627 -3081417 -2480559
37286 -2480559 -929370 1403527 3618242 4830285 4854242 3912865 2333744 814318 229402
37277 229402 689046 1311829 1307496 825094 475213 530037 883346 1347740 1689067 1640053
37267 1640053 1040447 -136077 -1701292 -3010162 -3262294 -2467590 -1627716 -1532647 -2027323
37258 -2027323 -2847446 -4057411 -4973148 -4194638 -2020303 -1174229 -3123898 -5107121 -3359165
37249 -3359165 1742983 6510673 9015026 10190305 10543659 9482113 7995327 8283238
37241 8283238 10136618 11198244 11389272 13306304 17486695 21442505 24486284 29011787
37233 29011787 35688725 42782441 52215147 69254518 91264629 103322921 93077534
37226 93077534 66743178 42614460 30611429 25913432 21413374 17041087 14808472 12953009
37218 12953009 9524748 6491296 6070044 6731143 6274750 5544003 5902821 6103904 4845358
37209 4845358 3685893 4233143 4908420 3733753 2094919 2339233 3515955 3048522 1210926
37200 1210926 330463 483637 -379489 -2376899 -3244357 -2202791 -1200728 -1584398 -2116106
37191 -2116106 -1375430 -175471 -351970 -2277707 -4454268 -4967412 -3138797 -433257 381486
37182 381486 -2092130 -6087636 -8356100 -7424222 -4410585 -1196621 958765 1407123 296315
37173 296315 -1077339 -1276469 -233721 1113234 2462484 4261449 6340205 7766065
37165 7766065 8159955 7941308 7154756 5334919 2791330 731336 -377837 -1418657 -2994785
37156 -2994785 -4218506 -3905874 -2254777 -542962 409286 819121 1231400 1727013 1795316
37147 1795316 851452 -989323 -2712140 -3251849 -2417494 -684904 1510128 3605283 4471551
37138 4471551 3287620 910092 -714171 -795980 -408185 -617482 -972825 -502950 661566
37129 661566 1510995 1438178 529800 -960001 -2625546 -3671508 -3396865 -1873581 212349
37120 212349 2065374 2784313 1589059 -1066603 -3115953 -2805136 -887468 276506 -157861
37111 -157861 -653888 81494 1137697 1063990 162894 -427628 -997156 -2527946 -3929251
37102 -3929251 -2366083 2818623 8338865 10402344 8654003 5483845 2739476 842666
37094 842666 157447 990616 2377021 2830870 2472054 2663937 3399695 3068041 1371248
37085 1371248 348862 1313228 2609353 2070543 315555 -310494 760751 1786486 1313005
37076 1313005 -374368 -2250713 -3475526 -3353996 -1878399 -516434 -1075911 -3309705
37068 -3309705 -4755515 -3556324 -647024 1438905 1371931 88272 -632389 -154598 535325
37059 535325 224876 -957886 -1860796 -2081840 -2470502 -3480320 -4119537 -3432783 -2096636
37050 -2096636 -1365875 -1172183 -605849 322036 909234 1301627 2125879 2794708 1933012
37041 1933012 -441869 -2796110 -4181768 -4758190 -4256574 -2128193 357429 609239 -1580717
37032 -1580717 -3063322 -1618987 788370 1042963 -514865 -1002965 498781 2061783
37024 2061783 2310628 2189600 2838445 3692326 3556564 2229215 250572 -1990044 -4169175
37015 -4169175 -5714614 -6182461 -5630682 -4419739 -2998438 -1837663 -1051433 -192531 955546
37006 955546 1599411 843728 -679999 -1154009 188591 2092330 2928658 2473100 1547813
36997 1547813 704626 28998 -241130 238583 1283657 2119132 2031614 874377 -943666
36988 -943666 -2645288 -3283263 -2151471 593519 3624598 5131477 4377084 2594093 1723916
36979 1723916 2075390 2026017 548220 -921928 -246895 2412165 4797835 5531003 5289140
36970 5289140 4896786 4075109 2888181 2738993 4440441 6371134 6246865 4217617 2571535
36961 2571535 2537249 3026151 2773632 2142724 2081270 2524590 2841313 3063880 3608938 4218380
36951 4218380 4194062 3521013 2878702 2574141 2291073 1994736 2276200 3470967 5043724
36942 5043724 6211344 6680665 6434117 5346124 3533340 1631691 99230 -1409755
36934 -1409755 -3259706 -4680898 -4306770 -1938362 1033220 3201117 4442333 5365852
36926 5365852 6194358 6698479 6692378 6031294 4512760 2318724 253556 -932186 -1186772
36917 -1186772 -790196 165150 1412855 2190963 2071378 1725357 1993929 2500643 2199311
36908 2199311 1141381 539530 974655 1726990 2214618 2846895 3734618 3683375 1665079
36899 1665079 -1283483 -2865619 -2170037 -599505 -80023 -1058720 -2412134 -2716297 -1348772
36890 -1348772 1210663 3796200 5380589 5665262 4914334 3416476 1379523 -751675
36882 -751675 -2295436 -2866058 -2777033 -2749602 -3181517 -3725138 -3662960 -2757374 -1583412 -823972
36872 -823972 -434294 36590 363161 -397051 -2478570 -4481204 -4523766 -2239499 782316
36863 782316 2513455 2231260 920149 207701 821146 1990861 2527236 2332360 2226590
36854 2226590 2271559 1356136 -883212 -2742773 -2310286 -145794 1285602 765778 -469573
36845 -469573 -864837 -454114 13421 605680 1725830 2783667 2605809 1130757 -251088
36836 -251088 -371993 209694 -144821 -2003940 -3760980 -3265851 -662181 1286709 530682
36827 530682 -1363482 -1154981 1471991 3264798 1983560 -390585 -558557 1484812 2851238
36818 2851238 2040945 541786 70643 256653 -225718 -1676930 -3356490 -4436763 -4293563
36809 -4293563 -2723195 -511577 985273 1410607 1797906 2840337 3662675 3148626 1746542
36800 1746542 904599 1097311 1394791 841405 -563223 -2208904 -3493984 -4048500 -3862343
36791 -3862343 -3288730 -2701973 -2305097 -2381218 -3157771 -4014863 -3592765 -1586552 111888
36782 111888 -725711 -3785935 -6383100 -6638073 -5334248 -4249997 -3830134 -3326102 -2377056
36773 -2377056 -1329931 -302626 1019638 2514437 3317127 2827283 1704994 1392918 2512757
36764 2512757 3960141 3975665 2229164 371448 11656 532987 -113446 -2367765 -3969337
36755 -3969337 -2643882 931962 3915718 4606795 3717180 2410615 617893 -1890645
36747 -1890645 -3917061 -3812450 -1847113 -279002 -681744 -2179461 -2943210 -2658374 -2597170
36738 -2597170 -3635552 -5186690 -6099312 -5810922 -4523847 -2991599 -2276686 -2927950 -4104987
36729 -4104987 -4247081 -2913450 -1159634 237755 1831932 4039426 5724385 5505362
36721 5505362 3811001 2323685 1807596 1774367 1888886 2208900 2253367 1479506 691203
36712 691203 1227711 2532005 2416986 286172 -1903387 -2801785 -3685200 -5763690 -7356799
36703 -7356799 -6002723 -2239173 1103845 2814746 4132708 5764281 6459060 5250212
36695 5250212 3317990 2587253 3460483 4664857 4725874 3291958 1563778 1308190 2676726
36686 2676726 3395146 1346922 -2382450 -4657320 -4342268 -3220317 -2629314 -1505610 1198751
36677 1198751 4234122 5718803 5457128 4003860 1032904 -3276142 -6472824 -6028514
36669 -6028514 -2955564 -990269 -2115566 -4773937 -6527708 -6492198 -4882457 -2261006
36661 -2261006 -18451 212648 -1290631 -2153001 -884133 1198904 2054490 1613142 1054733
36652 1054733 540862 -571506 -1824375 -1761962 21589 2305287 3860163 4509297 4433981
36643 4433981 3585747 2226163 1212138 1279716 2519004 4619418 6940169 8331166 7880102
36634 7880102 6170873 4901317 4829763 4978818 4320763 3155856 2004097 250492 -2734561
36625 -2734561 -5826879 -7140170 -6611282 -6000117 -6184558 -6143576 -5231293 -4779575 -6122317
36616 -6122317 -8160675 -8565551 -6986150 -5501845 -5830504 -7420031 -8637989 -8703580 -7836156
36607 -7836156 -6343634 -4346272 -2013228 466372 2862324 4548143 4674678 3199614
36599 3199614 1322085 306163 185216 215658 238317 713162 1508871 1695518 922515
36590 922515 188967 566823 1633594 1975950 1151070 383261 1036517 2905311 4504915
36581 4504915 4889992 4686894 5147458 6470603 7420459 6648454 4142827 1178255 -1027244
36572 -1027244 -2272502 -2936791 -3021979 -2147192 -442538 1181413 2027686 2430842 2992704
36563 2992704 3295423 2249906 -191906 -2616090 -3886680 -4423571 -4980434 -4993710 -3455229
36554 -3455229 -1061670 64860 -921192 -2504718 -2982453 -2497159 -2067301 -1712155 -837697
36545 -837697 151559 70758 -1266200 -2607055 -2746448 -1641267 32532 1696089 3122046
36536 3122046 4412678 5662673 6198778 4677029 897405 -2958887 -4356042 -3583151
36528 -3583151 -3274916 -4515701 -5320082 -3890231 -1575949 -994260 -2434546 -3967891 -4420047
36519 -4420047 -4370961 -4472898 -4543424 -4419191 -4205863 -3502375 -1754636 432362 1753593
36510 1753593 2266331 3491100 5908413 7854241 7803643 6486892 5651032 5711913 5761593
36501 5761593 5129301 3860658 2332676 1432067 2409695 5377970 8498429 9815246 9393287
36492 9393287 8545737 7699267 6550528 5705197 6142213 7085725 6428185 3696777 798781
36483 798781 -761364 -1583212 -2434566 -2515261 -1146548 287782 -10349 -1488624 -2011500
36474 -2011500 -1031862 -181709 -590529 -1232426 -540256 1426170 3167874 3572636 2995901
36465 2995901 2668104 3242382 3958591 3451664 1461933 -754772 -2011156 -2500959 -2916002
36456 -2916002 -2955460 -1750686 540363 2591336 3307032 2601196 992314 -726671 -1649988
36447 -1649988 -1556251 -1394338 -2032099 -2784245 -2344932 -949419 -141472 -346318 -265015 982777
36437 982777 2731188 4346394 6221707 8217676 8747632 6927872 4473515 3760620 4687728
36428 4687728 5077853 3790644 1874336 763941 782538 1533524 2511630 3005178 2315409
36419 2315409 392722 -2234179 -4943806 -6733956 -6022956 -2202318 2592370 4796835
36411 4796835 3099555 -253708 -2311700 -2437964 -1833032 -1289883 -700830 -153987 -147379
36402 -147379 -708254 -1219545 -1205744 -651586 373766 1648833 2356427 1617026 -178807
36393 -178807 -1325641 -675050 973389 2030927 2258705 2801899 4104960 4828360 3403991
36384 3403991 70709 -3261798 -4841999 -4282162 -2375064 -407604 617034 828301
36376 828301 1411203 2972362 4263748 3564150 1230272 -423336 -84063 1014897 1121805
36367 1121805 304175 -180276 191418 1108713 2507914 4432315 6223666 7104971 7353581
36358 7353581 7731832 7916376 6781214 4391662 2505164 2561953 3961665 4882382 4373966
36349 4373966 3215607 2855511 3703587 4579251 4117311 2647797 1914151 2616910 3249558
36340 3249558 2197353 59875 -1317440 -1388454 -1006340 -466109 810843 2614626 3608913
36331 3608913 3090518 1882972 1080089 845580 658641 -118908 -1859347 -3872034 -4321354
36322 -4321354 -2305537 335606 1085574 432274 1200523 3903285 5388456 3317419 -324029
36313 -324029 -1962035 -925086 752265 1681324 2157260 2578249 2746620 2480487 1552267
36304 1552267 -573350 -3712319 -6212756 -6554619 -5310893 -4343657 -4465044 -4993687 -5116847
36295 -5116847 -4511811 -3092413 -1351158 -550900 -1397458 -2858147 -3346026 -2642449 -1625668
36286 -1625668 -693752 333528 1281686 1876987 2512531 3552047 4310274 3901826 2633467
36277 2633467 1463793 739233 567682 1452032 3115432 3823709 2721707 1751282 2998280
36268 2998280 5092162 4942876 2452723 490298 357623 529842 258049 1042238 3401508
36259 3401508 5209870 4837194 3472868 2767282 2477962 2076825 2385034 3679058 4246874
36250 4246874 2963703 1495463 1673112 2265363 853246 -2263251 -4562429 -4947584 -4523262
36241 -4523262 -4224840 -3945006 -3822675 -4305011 -4808859 -4025360 -1775374 669517 2076421
36232 2076421 2037427 672566 -1258232 -2369308 -2007206 -1218806 -1315138 -2118875 -2762540
36223 -2762540 -3288665 -3979068 -4041077 -2726537 -918523 287863 1646639 4110694 6020455
36214 6020455 4925120 1973065 1197042 3775735 6073708 4721411 1066952 -1157212
36206 -1157212 -601402 1114022 2090221 1610540 -89164 -1903778 -2324579 -983262 845966
36197 845966 2039988 2971517 4189765 4877463 3904612 1716653 -26531 -322015 435798
36188 435798 1067174 379438 -1901921 -4337746 -4809204 -3078823 -1349997 -1444734 -2491997
36179 -2491997 -2480666 -1087047 339381 817972 444471 -323312 -829665 -204962 1630760
36170 1630760 3443762 4182040 4246570 4145161 2958390 -96445 -3378456 -4288941 -2822924
36161 -2822924 -1526323 -1744398 -1991674 -630929 1699586 3289201 3605829 3399889 3539956
36152 3539956 4399864 5472621 5181273 2260928 -2146191 -5090384 -5254232 -4488992 -4971594
36143 -4971594 -6148084 -5869384 -3608857 -1021121 206971 -263051 -1814307 -3371039
36135 -3371039 -3678527 -2219523 143146 2162361 3502713 4285931 4060143 2530170 824898
36126 824898 428334 947709 559854 -1196761 -2716996 -2717750 -1599523 110528 2725446
36117 2725446 5719475 6993947 5615746 3899121 4621390 7013021 7790399 5779711
36109 5779711 3107289 1658176 816604 -431610 -1335994 -796393 545991 1198724 854963
36100 854963 182624 -608649 -1602603 -2181478 -1591379 -200966 927934 1367314 1201070
36091 1201070 191506 -1567457 -2639874 -1511171 1249235 3587366 4608876 4988024
36083 4988024 4846922 3363355 1005020 -31415 1198696 2745639 2536040 1247702
36075 1247702 722439 844551 167966 -1062135 -854266 1469865 4085504 5014796 4230482
36066 4230482 2918405 1863614 1160499 586881 -277440 -1576348 -2490467 -1880562 -36467
36057 -36467 1131755 342843 -1329320 -1847509 -930664 -422661 -1854419 -4383027 -5685561
36048 -5685561 -4685043 -2741834 -1786762 -1812747 -1212544 411874 1194893 -350558 -2805623
36039 -2805623 -3506447 -2131268 -825043 -831243 -950135 118221 1726389 2657217 3089936
36030 3089936 3765356 4187762 3235076 1054846 -1103124 -2679266 -4015980 -4851649 -4145562
36021 -4145562 -1889134 152223 374082 -697433 -1228255 -486732 443627 364928 -414964
36012 -414964 -652447 -1105 434403 -402130 -1996814 -2839445 -2331578 -1412399 -1172201
36003 -1172201 -1543703 -1730067 -1334900 -536029 431236 1365514 1926001 1884497 1360398 429345
35993 429345 -1116750 -3084376 -4408729 -4229535 -3260688 -3158566 -4403709 -5599505 -5150791
35984 -5150791 -3061876 -839503 -82802 -1244809 -3192242 -3906345 -2365401 62225
35976 62225 949405 -116560 -850691 529519 2461966 1909295 -1322290 -3920430 -3194280
35967 -3194280 -375725 1264751 613246 -394850 271223 2380894 4353608 5294202 5332745
35958 5332745 4737558 3709652 2738310 2193758 1605833 243704 -1450875 -1927755 -464518
35949 -464518 1731606 3006349 3247298 3572793 4434168 5048885 4717307 3716307 2551109
35940 2551109 1150274 -584136 -1989794 -2207100 -1380544 -610657 -620880 -1012943 -1056185
35931 -1056185 -747348 -664314 -992816 -1193067 -702561 382513 1511405 2338487 2953574
35922 2953574 3569382 4183532 4495889 4030113 2483877 202689 -1783549 -2496698 -1828190
35913 -1828190 -482371 769201 1519365 1607025 1093031 442921 309399 938383 1999780
35904 1999780 2978504 3422943 2975012 1750232 649399 555188 1105621 1074039 189295
35895 189295 -371307 231165 1183978 1207334 190993 -1166622 -2455728 -3223994 -2410995
35886 -2410995 395342 3525826 4515054 2784227 -32903 -2100814 -2458543 -624523
35878 -624523 2978907 6206063 6781327 5179986 4155748 4923550 5806578 5468165 5209325
35869 5209325 6449508 7876180 7339236 5336989 4217583 4523689 4447875 2823562 600728
35860 600728 -860410 -1207157 -514177 1091745 2779999 3402723 3029204 2860527 3207192
35851 3207192 2882350 1213308 -611649 -1065148 -197102 811768 1261477 1315665 1378109
35842 1378109 1786824 2645480 3416309 3200607 1919089 644949 226825 130700 -739342
35833 -739342 -2464330 -3881746 -3667722 -1384249 2132811 5209033 6628174 6619042 6046558
35824 6046558 4897828 2733859 532631 261951 1992941 3321577 2858635 2440661 4052058
35815 4052058 6224251 6083171 3966101 2957880 3967536 4370066 2275070 -667687
35807 -667687 -2093170 -2174204 -2245749 -2111676 -955488 327203 66623 -1497642 -2593213
35798 -2593213 -2698123 -2926931 -3631034 -3610719 -2181786 -356595 677987 883860 580153
35789 580153 -274133 -1234362 -1165451 76051 929109 306445 -565622 38203 1494719
35780 1494719 1548160 -484598 -2991624 -4516336 -5137427 -5099319 -3933284 -1845778 -456021
35771 -456021 -887671 -2144094 -2580882 -2116133 -1684865 -1265322 -26227 1896872 3330835
35762 3330835 3788269 3916163 4138234 4201749 4313609 5302796 7044556 7945066 6861064
35753 6861064 4694627 3278822 3313348 4051893 4374017 3504019 1332962 -1199578 -2550412
35744 -2550412 -2111382 -893897 -165681 -24937 89525 289189 527434 1253911 2648397
35735 2648397 3727518 3423166 2236270 1664094 2214438 3079375 3466402 3010390 1192172
35726 1192172 -2044778 -5040750 -5472446 -3211057 -801817 -493064 -1910564 -3150858
35718 -3150858 -2919717 -999782 1989197 4334895 4036250 1180017 -1394717 -1180698 858955
35709 858955 1567369 -411513 -3271625 -4561994 -3841743 -2654479 -2729147 -4388810 -6190251
35700 -6190251 -6190779 -4081943 -1846751 -1722817 -3790469 -6157432 -7080682 -6147961 -3926528
35691 -3926528 -1595880 -627714 -1527726 -2858554 -2670998 -990023 287419 82015 -616265
35682 -616265 -548062 144469 735109 1127437 1275547 484712 -1433819 -3031929 -2643595
35673 -2643595 -635255 1040118 1462628 1679347 2826310 4500767 5610257 5999634 6370458
35664 6370458 6900030 6737607 5028263 2027491 -1055088 -3186387 -4246946 -4618440 -4348990
35655 -4348990 -3122436 -1025500 1143844 2578824 3110884 2900790 1981338 653621 -73387
35646 -73387 701136 2537097 4014153 4420360 4281153 4026627 3178185 1530247 209829
35637 209829 408084 1519308 1803975 803078 -197916 -315769 -339541 -1212979 -2411840
35628 -2411840 -2832582 -2460518 -2019751 -1579851 -800889 -217314 -866531 -2603235 -4061812
35619 -4061812 -4499696 -4491700 -4544056 -4311230 -3663811 -3224448 -3119533 -2467945 -1068169 -336883
35609 -336883 -1241473 -2384780 -1890024 -530934 -964828 -3840649 -6543980 -6350687 -3391133
35600 -3391133 159850 2587266 3499496 3198372 2271047 1437592 1071610 993827 964633
35591 964633 965264 815127 136194 -965400 -1768084 -1845626 -1560847 -1374639 -1374068 -1844398 -3380165
35580 -3380165 -5682315 -7071710 -6286221 -4284033 -3116216 -3294486 -3594242 -3482699 -4117715
35571 -4117715 -6056494 -7271034 -5191409 -575862 2341817 388384 -4858534 -8945570
35563 -8945570 -9435041 -7617736 -5751217 -4476683 -3510499 -3079126 -3242306 -2945680 -1416543
35554 -1416543 153524 -741 -1532651 -2407295 -1814986 -815412 -26176 1285277 3264839
35545 3264839 4596552 4557871 4337910 5168999 6462966 6902430 6181626 4627944 2351437
35536 2351437 -109086 -1558219 -1753919 -1955669 -2669865 -2450798 -560493 912062 -123798
35527 -123798 -2208345 -2315966 -441547 777580 513643 578683 1707713 2324800 1781134
35518 1781134 1690920 2745557 3069281 1491385 -101848 191278 1099319 509803 -795547
35509 -795547 -594532 730068 640820 -1415004 -3164184 -3016929 -1843058 -615630 1308539
35500 1308539 4283517 6613579 6435748 4400902 2911762 3135531 4104516 4596576 4600999
35491 4600999 4649498 4755596 4670980 4572000 4740700 4857522 4374227 3518492 3114411 3234358
35481 3234358 2873569 1413085 -372902 -1413715 -1719933 -1873267 -1917819 -1836744 -2333002
35472 -2333002 -3596297 -3899912 -1473785 2306173 3893908 2265560 359342 804842
35464 804842 2489905 3064486 2816345 3593162 5121696 5178391 3159944 1070035 679993
35455 679993 1612660 2628429 3171615 3146673 2535414 1761133 1357291 995248 -29279
35446 -29279 -1181099 -964663 734984 2003012 1350001 -384258 -1476899 -1583145 -1389544
35437 -1389544 -804644 1043588 4075135 6682228 7286317 5919196 3920094 2361893
35429 2361893 1162685 -224276 -1641923 -2270769 -1827580 -1026695 -472652 192607 1313933
35420 1313933 2022924 1113454 -1119259 -3012482 -3504184 -3000527 -2305504 -1744868 -1440131
35411 -1440131 -1338907 -717615 1285042 4275808 6689578 7572506 7326990 6466128 4890019
35402 4890019 2953551 1995808 2872419 4802625 6451836 7355834 7584267 6978875 5693186
35393 5693186 4653228 4378848 3947645 2185470 -590458 -2989521 -4242727 -4521438 -4054449
35384 -4054449 -3033945 -2097434 -1780614 -1542745 -244413 2387975 5389221 7420248 7430294
35375 7430294 4998558 977917 -2542132 -3936455 -3565248 -2814151 -2077275 -829981 643570
35366 643570 1058963 -166085 -2181811 -3875500 -4742280 -4516648 -3169651 -1596740 -1134901
35357 -1134901 -1884480 -2484488 -1998513 -991470 -203011 703315 2164223 3392641 3180442
35348 3180442 1630771 132958 -245315 334885 1019676 1115144 516844 -230612 -364419
35339 -364419 310529 1236378 1933140 2705486 4180692 6379596 8551551 9745691 9396773
35330 9396773 7701205 5625962 4152741 3293233 2311085 1111849 680851 1604074 2859058
35321 2859058 2995722 2186802 2110762 3744036 6095363 7420540 7114080 6002944 5099640
35312 5099640 4534074 3785465 2717414 2019291 2367446 3340654 3695848 2846674 1555786
35303 1555786 860752 797569 668794 220171 -49203 366804 1397881 2490409 2918509
35294 2918509 2164890 464341 -1085330 -1409014 -507307 679090 1414166 1817193 2377595
35285 2377595 3213245 3943980 4052041 3243871 1633358 -262273 -1707977 -2073484 -1277871
35276 -1277871 -130711 118502 -813155 -1447330 -80000 2713828 4230198 2956312 684601
35267 684601 172141 1456281 1999865 241740 -2551738 -4183425 -3925529 -2594157 -1394897
35258 -1394897 -1294018 -2590739 -4446859 -5528128 -5571638 -5554166 -5948082 -5904942 -4876851
35249 -4876851 -3911226 -4173126 -4971287 -4546608 -2371233 495215 2894237 4187109 3848848
35240 3848848 1992045 194005 209678 1636887 2319908 1351763 81852 -354717 -692414
35231 -692414 -1664001 -2165483 -926451 1166841 2227813 2046603 1729100 1247337 -471781
35222 -471781 -3049607 -4419501 -3573540 -1697984 -23954 1505501 2588808 1751107 -1178392
35213 -1178392 -3487876 -2638867 89825 1150962 -682391 -3407115 -5083015 -5649526
35205 -5649526 -5312167 -3633560 -1202701 -117800 -1291971 -2670934 -1684810 1449495
35197 1449495 4307447 5416139 5336929 4972065 4304265 2988891 1133135 -831260 -2440938
35188 -2440938 -3263281 -3193125 -2752544 -2692222 -3271942 -4152443 -4810869 -4861119 -4314275 -3749126
35178 -3749126 -3723593 -3756960 -2636347 -217130 1947834 2568066 2383792 2911326 4098261
35169 4098261 4548601 3730518 2598171 2052744 1990820 2023551 2182651 2745689 3953838
35160 3953838 5662657 6695712 5370451 1888162 -608899 842924 5245199 8855020
35152 8855020 9867777 9646304 9382713 8405673 6686099 6302862 8694665 12387495 15145757
35143 15145757 16758340 18086560 19008214 19197181 19557767 20908744 22356992 22826301 23071302
35134 23071302 24302308 26040912 27456856 29707017 34723956 42772003 53389115 67231499
35126 67231499 84445602 103654074 126848778 162550710 215749053 272599838 303067151
35119 303067151 285981599 229802624 164450220 114498507 84041064 64428561 48694617
35112 48694617 35903671 26807577 20575156 15618600 11215903 7797435 6221478 6614688
35104 6614688 7743394 8040762 7361746 6994393 7687024 8388972 7423250 4552110 1517087
35095 1517087 532017 2130331 4399449 4695690 2382773 -536507 -1743930 -885246 843672
35086 843672 2380777 3165569 2728684 1261885 146353 583519 1914819 2514761 2116360
35077 2116360 1894520 2329802 2506680 1847530 1203820 1624533 2948411 4089741 4049799
35068 4049799 2492038 124073 -1411954 -972345 643664 1624100 1496394 1347637 1700679
35059 1700679 1801580 1468780 1895403 3602894 5115413 5037403 4256569 4485130 5448556
35050 5448556 5299175 3483574 1478473 562126 345094 -26460 -369012 125486 1615482
35041 1615482 3359657 4477734 4648165 4220352 3746901 3285884 2339710 812923 -264117
35032 -264117 304349 2154644 3395853 2777439 1196539 388848 569627 392798 -694884
35023 -694884 -1243366 236654 2885531 4369654 3943872 3197887 3463816 4015132 3690100
35014 3690100 2851220 2321723 1544913 -321849 -2196062 -2099834 -217286 1194082 1036632
35005 1036632 331181 -344013 -1839709 -3936179 -4435370 -2452801 -438343 -718466 -1746911
34996 -1746911 -408040 3038731 5128152 3997111 1485292 237792 847979 2302797
34988 2302797 3456723 3505139 2442074 1540484 2186364 3951014 4959485 4244944 2461365
34979 2461365 337088 -1884952 -3258078 -2333439 600441 3030553 3003383 1273604 -128666
34970 -128666 -318942 276758 993539 1177654 400231 -571570 89 2536737 4996365
34961 4996365 5235855 3748123 2698854 2826895 2827499 1642836 -103426 -1233733 -1495261
34952 -1495261 -1477843 -1736822 -2370341 -3061880 -3306375 -2846146 -1991859 -1353744 -1226757 -1264220
34942 -1264220 -666757 1130451 3519491 4625712 2995642 -411082 -2806242 -2607650
34934 -2607650 -1037198 -102093 27954 581120 1880514 2914669 3061529 2910902 3058324
34925 3058324 3087340 2313388 933420 -190567 -688755 -1080644 -1826030 -2287772 -1244086
34916 -1244086 1263549 3186938 2480736 -282842 -2362315 -2093605 -593185 183206 -156413
34907 -156413 -817444 -1471464 -2254245 -2779814 -2477389 -1620261 -907685 -253551 954249
34898 954249 2553823 3593902 3572618 2859601 2066057 1837360 2904524 5174531 6963339
34889 6963339 6497555 4323015 2904022 3453054 4432314 3875685 2051659 729980 491309
34880 491309 127502 -1166669 -2115713 -756841 2733029 5602254 5485460 3126268 1139730
34871 1139730 538741 127181 -595016 -169990 1964779 3413069 1821457 -1304763 -2336256
34862 -2336256 -525641 1284207 880826 -970869 -2781068 -4368199 -5691587 -5897869
34854 -5897869 -4841126 -3764892 -3188401 -1814535 1009898 3350870 3001029 589011
34846 589011 -1421794 -2002236 -2066605 -2322372 -2407422 -1995227 -1240932 -90098 1657586
34837 1657586 3510097 4434523 3933798 2418245 709545 -399958 -636636 -807052 -2103959
34828 -2103959 -4226928 -5219890 -4091749 -2425057 -2074441 -2440166 -1797705 -382681 50863
34819 50863 -708856 -1051237 -367442 105231 -306846 -589085 -124486 -36615 -1378183 -3455089
34809 -3455089 -5004489 -5729628 -5615942 -4052896 -1013642 1864650 2857423 2288958 1869406
34800 1869406 2341690 2991994 3206069 3231436 3249744 2679748 864975 -1895857 -4221020
34791 -4221020 -4578698 -2683528 -115957 1002585 342869 -203398 1013101 3134782 3899386
34782 3899386 2624189 938311 409290 506709 -377000 -2398051 -3664715 -2439486 547234
34773 547234 2662261 2380128 1046828 970989 2232284 2575454 602060 -2231758 -3582789
34764 -3582789 -3213084 -2837743 -3428709 -3951211 -2971154 -623805 1466527 1840524 494188
34755 494188 -1308328 -2356273 -2564023 -2578803 -2522294 -1850700 -679060 -259629 -1309743
34746 -1309743 -2638688 -2655544 -1762430 -1716407 -2676674 -2702367 -875118 734842 -346605
34737 -346605 -3412150 -5237050 -4064680 -1436055 85356 -336630 -1795494 -3173902
34729 -3173902 -3813382 -3422119 -2352670 -1702832 -2292987 -3602259 -4355533 -4071744 -3396178
34720 -3396178 -3008986 -2977476 -3217271 -3713687 -4003632 -3280319 -1510014 267282 1323258
34711 1323258 2225554 3709247 5268767 5923351 5895708 6219884 6809315 6367625 4582941
34702 4582941 3063098 3258520 4432763 4755726 3839795 3056025 3473732 4506840 4842038
34693 4842038 4008924 2647965 1624427 1280096 1407681 1587990 1451731 858824 125483
34684 125483 26974 1127404 2863685 3743397 2998570 1776312 1981235 3959869 5993469
34675 5993469 6120319 3781362 -335028 -5078087 -9036998 -10884533 -10382953 -8726628
34667 -8726628 -7345922 -6635278 -6133971 -5395613 -4196399 -2407931 -245261 1732196 3278159
34658 3278159 4580217 5303051 4341513 1390744 -1879909 -3297204 -2502289 -860088 549306
34649 549306 1686422 2502467 2478687 1522183 347172 -395461 -659571 -489105 277224
34640 277224 1524759 2728236 3520797 3860089 3581355 2460525 815217 -635842 -1594886
34631 -1594886 -2200840 -2288103 -1552319 -537050 -401483 -1354210 -2229536 -2010928 -949547
34622 -949547 143584 796619 723988 -197084 -1333248 -1726449 -1615239 -2322797 -3980258
34613 -3980258 -4791540 -3661774 -2192634 -2538810 -4354562 -5606074 -5556222 -4963146 -3939428
34604 -3939428 -1980317 -92565 -434739 -3153545 -5676336 -6142332 -5652789 -5831612 -5953948
34595 -5953948 -4438719 -2026706 -1162361 -2405542 -3461901 -2239961 533328 2368383
34587 2368383 1741780 -761873 -3277013 -4090845 -2883205 -1167724 -1106487 -3259111 -5660192
34578 -5660192 -5634219 -2502214 1856431 5020905 6116988 5855305 5153572 4336724 3507030
34569 3507030 2934518 2689647 2289071 1211051 -369015 -1780224 -2681749 -3194255 -3266146
34560 -3266146 -2583144 -1331871 -400023 -326482 -532766 -231940 201319 -464155 -2618954
34551 -2618954 -5068480 -6196867 -5453283 -3555108 -1716077 -944365 -1604556 -3108912 -4194609
34542 -4194609 -4012247 -2990028 -2282595 -2358863 -2563229 -2209921 -1584145 -1370438 -1456907 -1133512
34532 -1133512 -520329 -806659 -2415281 -3710186 -2735889 -49867 1543372 493176 -1489183
34523 -1489183 -1771587 -136469 1472742 1851102 1555430 1158239 236638 -1344101 -2611967
34514 -2611967 -2875309 -2774576 -2897423 -2434605 -640148 1223044 1249695 -116144 -487174
34505 -487174 829877 1711349 650846 -644736 222538 2612677 3801281 3000819 2071593
34496 2071593 2120217 1766846 -177783 -2216539 -2066606 -34504 1316238 567930 -1066705
34487 -1066705 -1767876 -1207608 -126247 1061423 2375640 3576738 4213748 4228438 3947324
34478 3947324 3512211 2749359 1663652 763285 709947 1651851 2968712 3848364 4230510
34469 4230510 4878780 6106752 6756755 5341979 2304528 58187 159679 1413310 1832083
34460 1832083 1637778 2641319 4870698 5867770 4148428 1688351 1452105 3410742 4778581
34451 4778581 3933572 2342526 2171588 3376355 4041086 2847426 406470 -1457077 -1201534
34442 -1201534 1203879 3955104 4682624 2704040 -124546 -1241255 179594 2994187
34434 2994187 5743201 7672507 8411118 7847237 6675726 6156620 6723857 7373922 6923779
34425 6923779 5341021 3295617 1041055 -1321629 -2840502 -2249249 179429 2318462
34417 2318462 2391019 880239 -436172 -825430 -1054362 -1769255 -2559249 -2876163 -2850122
34408 -2850122 -2578791 -1496172 541168 2115777 1575634 -452183 -1234187 748627 3665740
34399 3665740 4442683 2348236 -529254 -1956488 -1550425 -242820 952766 1288658 520797
34390 520797 -490333 -194100 1813514 3854867 3859110 1651285 -1162559 -3186186 -4123967
34381 -4123967 -3918597 -2345441 67153 1756974 1611246 225258 -982094 -1438144 -1478977
34372 -1478977 -1206427 -329390 892656 1556761 1252051 498481 -261084 -1259424 -2457953
34363 -2457953 -2873241 -1848589 -508437 -728935 -2620606 -4106126 -3383667 -1032039 792541
34354 792541 659349 -1081172 -2963059 -3527859 -2196445 273574 2274192 2752421 2115796
34345 2115796 1562150 1812137 2735713 3662450 3494626 1121148 -3231432 -7258709 -8387097
34336 -8387097 -6620905 -4597822 -4313292 -4712667 -3398807 -109297 2697174 2792920 792360
34327 792360 -665213 130091 2373214 3981908 3858381 2638634 1520666 935094 545832
34318 545832 101878 -210200 -164885 172558 585223 922908 1122902 1132588 756997 -436936
34308 -436936 -2693480 -5282081 -6619888 -5784635 -3610362 -1624701 -243820 1052096
34300 1052096 2037750 1659878 -32445 -1275113 -804032 360616 510352 -88600 435772
34291 435772 2669632 4764986 4616204 2266610 -451851 -2085211 -2619153 -2555536 -1743317
34282 -1743317 338393 3331091 5668372 5861229 3866876 922369 -1586309 -2667286
34274 -2667286 -1787366 498837 2176345 1382945 -1221519 -2827567 -1755907 679837
34266 679837 2212254 2381458 2300820 2664240 3241502 3730240 3877745 3163663 1492755
34257 1492755 -114725 -557874 -65417 372155 518591 773883 1049161 1016416 1069779 1692140
34247 1692140 2222423 1709819 685284 467229 916539 679813 -380397 -974612 -800227
34238 -800227 -1071041 -2146067 -2783840 -2550601 -2742382 -3689705 -3342800 -358452 3144815
34229 3144815 3992074 1879061 -1078005 -3570181 -5635365 -6768591 -5996856 -3845014
34221 -3845014 -2210794 -2051529 -2741624 -3695129 -4916521 -5788285 -5057400 -2573797 281100
34212 281100 2343589 3653271 4368965 4031322 2498702 516169 -1277556 -2998834 -4619323
34203 -4619323 -5290600 -4225635 -1688828 1284233 3585743 4299068 3132010 965755
34195 965755 -787276 -1721705 -2594826 -3717591 -4218414 -3478693 -2375941 -2268689 -3286893
34186 -3286893 -4305548 -4217912 -2788238 -752677 505163 -9513 -1658443 -2499126 -1374147
34177 -1374147 824804 2393369 2651618 2017695 1014166 39751 -400389 -155194 121303
34168 121303 -324865 -1449453 -2787766 -4284403 -5996114 -7379186 -7798799 -7544141 -7427310
34159 -7427310 -7458035 -6808511 -5112423 -2922634 -749294 1490828 3757409 5376980 5761438
34150 5761438 5225268 4688444 4775244 5372298 5853062 5705373 5178960 5131014 5768853 5854782
34140 5854782 4087692 1270389 -97769 1066305 2774342 2331206 -430666 -3381079
34132 -3381079 -4935265 -5219468 -4615693 -2926003 -633044 470363 -813770 -3264953
34124 -3264953 -4538524 -3925440 -2679330 -1808488 -909975 470341 1550398 1266351 -100797
34115 -100797 -1136611 -1008002 -408947 -752422 -2601133 -4804668 -5253994 -2950417 629692
34106 629692 2896474 3063932 2833250 3703141 4718609 4050843 2022784 893391 1675798
34097 1675798 2767638 2285110 526632 -730366 -598031 150829 281915 -685885 -2297855
34088 -2297855 -3586258 -3657179 -2283946 -140635 1566886 1819982 492515 -1351407 -2177769
34079 -2177769 -1591392 -1080659 -2427822 -5353693 -7590491 -7589270 -6328202 -5835587 -6534331
34070 -6534331 -6882107 -5472472 -2779066 -670070 -603246 -2483469 -4980747 -6527354 -5959008
34061 -5959008 -2819198 2115208 6622364 8351107 6928283 4144383 1655135 -545516
34053 -545516 -2712110 -3756192 -2576877 -73268 1976243 3434932 5193914 6479162
34045 6479162 5261794 1592822 -1875093 -3297825 -3326181 -2772683 -1181613 1142893 2323665
34036 2323665 1835975 1858384 3697776 5184137 4095046 2048341 1965531 3299433 3138554
34027 3138554 972503 -1131131 -2473119 -4223730 -6067906 -5992330 -3972181 -2516430
34019 -2516430 -2624167 -2319910 -406394 1326595 1263269 662631 1226190 2115397 1480202
34010 1480202 -646316 -2856410 -4395887 -4998156 -4025121 -1504412 1037182 2257377
34002 2257377 2454093 2127334 616475 -2146519 -3972144 -2654982 928824 3843006
33994 3843006 4533632 3591553 1926836 72594 -1319246 -2151639 -3532553 -5964397 -7518361
33985 -7518361 -5904236 -1994045 911333 1268694 599091 507754 680271 440738 198987
33976 198987 287160 -29117 -1179087 -2061780 -1322730 853943 3058898 4181709 4004105
33967 4004105 2862380 1378027 229618 -215450 52448 909862 2023665 2840496 3253979
33958 3253979 3953027 5354459 6612476 6689138 5988606 5664571 5645167 4901469 3554480
33949 3554480 2904973 3106467 2686483 1054627 -290053 -69803 823976 960243 619331
33940 619331 922435 1699827 1852013 1266769 799485 560807 -306467 -1972997 -3208414
33931 -3208414 -2765737 -830131 1268460 2456699 2829509 3267870 4191715 4879648 4417847
33922 4417847 3127446 2187904 1739270 535581 -1858355 -3650540 -2825408 20079 2127745
33913 2127745 1725052 -328792 -2000352 -2191746 -1284146 -491525 -981785 -2956091 -5271119
33904 -5271119 -6477976 -6440933 -6348427 -6865576 -7033593 -5709808 -3586562 -2664771 -3597954
33895 -3597954 -4667154 -4138479 -2796132 -2825445 -4476652 -5504079 -4374184 -2376483 -1419627
33886 -1419627 -1181215 -203860 1205100 1444567 639969 742697 2273792 3323781 2685677
33877 2685677 1819324 2302168 3115454 2208949 -500322 -3418685 -5562470 -6810559 -6677143
33868 -6677143 -4742580 -2005804 -149209 472485 792117 1185970 1035839 88821 -975807
33859 -975807 -1436042 -1139358 -419907 -150797 -1293196 -3392706 -4280292 -2592846 172153
33850 172153 1692581 2056020 2862366 3767120 2700566 -304108 -2364594 -1805277 -504502
33841 -504502 -817545 -2258181 -2927213 -2520304 -1979726 -1396878 -288506 754633 592913
33832 592913 -539188 -1142825 -400969 1106325 2409156 2840318 2034074 351103 -848439
33823 -848439 -376380 1366712 2894682 3322778 2772764 1476579 -443722 -2382969 -3447561
33814 -3447561 -3360978 -2437244 -716471 1963017 4913752 6572670 6054399 4254333 2961103
33805 2961103 3092594 4110286 5040140 5658742 6307716 6628315 5319844 1970548 -1407171
33796 -1407171 -2106484 -148222 1509405 773852 -1089247 -1819136 -1511909 -1874939 -3115976
33787 -3115976 -3673862 -2808868 -1526819 -721040 -57014 854312 1589221 1828072 2057621
33778 2057621 2787851 3899519 5106655 6143398 6175242 4133928 311240 -3200174 -4385505
33769 -4385505 -3173527 -1068651 449784 800763 332556 73548 909448 2443845 3097252
33760 3097252 1862249 -343248 -1527609 -669200 1370254 2850718 2890131 2161463 1772691
33751 1772691 1680614 999533 4434 402419 2559476 3900489 2066326 -1256897 -2210966
33742 -2210966 -156950 1695272 1377079 708378 1554271 2654185 2298136 1507083 1807548
33733 1807548 1954698 118845 -2092810 -1382579 2004054 4225116 3141889 598132
33725 598132 -967623 -1202302 -422989 1550771 3904640 4665311 3473941 2445589 2973953
33716 2973953 3839468 3918034 4389806 6224468 7634279 6612445 4354656 3318923 3147951
33707 3147951 1727717 -401065 -321461 2201297 3395761 671930 -3497582 -4838573
33699 -4838573 -2686151 -156933 13226 -2062929 -4556822 -5812454 -5124783 -2933449
33691 -2933449 -586822 680172 637026 -271632 -1651933 -3008227 -3450132 -2535482 -1215080
33682 -1215080 -944778 -1752471 -2075285 -834719 1106680 2132553 1975100 1832482 2508903
33673 2508903 3288092 3069039 2050448 1500482 1937699 2410937 1973688 1128989 1046199
33664 1046199 1833163 2602581 3061087 3810662 4835843 4953933 3526235 1746298 1177689
33655 1177689 1601649 1436778 11239 -1688650 -2515955 -2419140 -2056663 -2010780 -2626563
33646 -2626563 -3927287 -5437053 -6639864 -7669408 -8853238 -9612469 -8861966 -6734111
33638 -6734111 -4692332 -3370406 -1614958 1291196 3715934 3640449 1743005 488379
33630 488379 328609 -913800 -4238661 -7208974 -7047443 -4549575 -2939359 -3474907 -4239341
33621 -4239341 -3382774 -1640292 -773296 -897502 -715174 162860 458217 -1082981 -4119240
33612 -4119240 -7156797 -8931738 -8908862 -6976529 -3567956 -132266 1470475 791534 -371188
33603 -371188 222975 2644593 4689323 4432616 2136009 -505145 -2030792 -1709840 499329
33594 499329 3451814 5024101 4077780 1936996 859804 1350669 2134564 2439827 2730160
33585 2730160 3084297 2549130 761573 -1156611 -2145110 -2507469 -2835910 -2764471 -1853401
33576 -1853401 -799114 -612828 -1253264 -2062444 -2837621 -3464220 -3321828 -2266589 -1395936
33567 -1395936 -1473532 -1449287 -224169 937870 -34215 -2454382 -3407793 -2033758 -651711
33558 -651711 -835826 -1024530 395289 1937440 1250562 -991327 -1959435 -751596 757270
33549 757270 1008878 554147 416731 521227 554391 1087504 2813468 5234338 6853546
33540 6853546 6581318 4775736 3019045 2697139 3520113 3809525 2670559 1258451 1071919
33531 1071919 1649295 1323474 -3648 -526146 647546 1906282 1328396 -611831 -1714241
33522 -1714241 -884663 818660 1816275 1743075 1389386 1535614 2149808 2464946 1621577
33513 1621577 -647623 -3716996 -6292105 -7078447 -5702723 -3282061 -1758666 -2179824
33505 -2179824 -3734052 -4832041 -4851934 -4263823 -3373036 -1914965 24996 1657795 2460309
33496 2460309 2742894 2776332 2081376 321961 -1575833 -2137424 -1226827 -531773 -1778274
33487 -1778274 -4685968 -7058362 -6991963 -4747793 -2152270 -406538 755354 1642530 1513382
33478 1513382 -151470 -2109996 -2500458 -1232667 164778 962243 1848720 2879067 2643227
33469 2643227 479833 -1878344 -2172490 -318854 1802728 2510765 1300189 -1507250
33461 -1507250 -4851814 -7156832 -7551196 -6572036 -4993053 -2762616 -32842 1834584
33453 1834584 1827852 1085698 1367830 2228843 1690298 -486062 -2400500 -3123580 -3896978
33444 -3896978 -5427771 -6218632 -5088378 -3573383 -3813295 -5101927 -4696497 -1765504 1410314
33435 1410314 2444232 1490818 273533 -343761 -838763 -1650508 -2366467 -2493712 -2502045
33426 -2502045 -3577052 -6208966 -9262664 -10774004 -9745807 -7020867 -4404284 -3110817
33418 -3110817 -3014739 -3122248 -2689767 -1983906 -1822508 -2241901 -2059834 -322409 2139699
33409 2139699 3453145 2981924 1995321 1887981 2601008 3160539 2951584 1927427 297979
33400 297979 -1264568 -1634208 -288712 1768413 2747564 1788249 -294624 -1864110 -1946489
33391 -1946489 -1097384 -822906 -1826860 -3012141 -2912601 -1976131 -2252965 -4461951 -6629294
33382 -6629294 -6541880 -4596038 -3062528 -3129803 -3882476 -3934332 -2951073 -1544830 -527625
33373 -527625 -409764 -1135577 -2308464 -3833587 -5802761 -7419338 -7020560 -4126721 -682607
33364 -682607 988481 912255 774562 981890 189823 -2114488 -4269456 -4360232 -2351921
33355 -2351921 277038 2097113 2437185 1450232 91673 -534908 -143547 897292 2527763
33346 2527763 4777124 6635259 6582806 4697280 2902141 2488710 2688822 2472104 2311374
33337 2311374 2893532 3254840 1855017 -1037268 -3484097 -4133894 -3194466 -1556180 -204865
33328 -204865 -196868 -1803351 -3658243 -4014863 -2965046 -2217283 -2526873 -2712896 -1769568
33319 -1769568 -699955 -1236585 -3437554 -5597678 -6322574 -5830633 -5101088 -4378360 -3003997
33310 -3003997 -682435 1513867 1944110 374508 -1346178 -1138800 994798 3085048
33302 3085048 3471001 2274677 624605 -709290 -1481488 -1445098 -418249 1216655 2582274
33293 2582274 3017704 2590857 1912173 1536730 1537874 1628517 1685144 2027552 3004905 4340317
33283 4340317 5137531 4723047 3450952 2500599 2702898 3607735 4037093 3692331 3682381 4886803
33273 4886803 6265063 5861020 3452871 956060 -214160 -910043 -2535783 -4694872
33265 -4694872 -5855006 -5696504 -5381733 -5692716 -6126839 -5854567 -4611135 -2647611 -603400
33256 -603400 695221 1024302 1003063 818905 -506988 -3327569 -5684156 -5341674 -3159672
33247 -3159672 -2275389 -3857646 -5923918 -6738197 -6872148 -6967666 -6078402 -3996235 -3017703
33238 -3017703 -5024619 -8247633 -9356504 -7854031 -6063280 -5378528 -4938469 -3874171
33230 -3874171 -2604855 -1595604 -677827 -8016 -154718 -859443 -1075358 -544618 -92773
33221 -92773 -197735 -572681 -1246485 -2540468 -3756827 -3548001 -2065944 -1109039 -1459369
33212 -1459369 -1691171 -535850 1131429 1883377 1962437 2425589 3063513 2790805 1568799
33203 1568799 446684 -73150 -439438 -964097 -1479421 -2001544 -2608547 -2616164 -1038595
33194 -1038595 1777349 3964253 4174872 3116986 2351563 2058702 991506 -1290793 -3150205
33185 -3150205 -2586188 257673 3279906 4995394 5730145 5964289 4980770 2307351 -641782
33176 -641782 -2018047 -2015857 -2153251 -2459890 -1408710 1258751 3696877 4444235 3875803
33167 3875803 2626182 644615 -1263001 -1141580 1332604 3589985 3426393 1990096
33159 1990096 1710540 2724999 3435717 3317707 2825558 1527725 -1101055 -3667443 -4256714
33150 -4256714 -3519014 -3748689 -4984169 -4772528 -2163106 720169 1813150 1418039 534064
33141 534064 -762906 -2129833 -2313033 -1117909 -238596 -742810 -1385406 -817203 200654
33132 200654 427909 498904 1772621 3916536 5436085 5747159 5049554 3039130 -357402
33123 -357402 -3582810 -4760434 -4199666 -3862175 -4443442 -4696156 -3772795 -2585634 -2324496
33114 -2324496 -2865184 -3271717 -3061206 -2453393 -1863214 -1456924 -951574 114477 1652464
33105 1652464 2839012 2995714 2235883 899906 -920842 -2668249 -2982659 -1162562 1541721
33096 1541721 3128493 2969543 1859759 523608 -792932 -1673615 -1702092 -1106930 -310445
33087 -310445 762688 1991177 2380513 1404538 392186 991902 2709397 3684455 3545434
33078 3545434 3534072 3921699 3460662 1717852 -60888 -911519 -1091069 -569501 1356529
33069 1356529 4146298 5742978 5315856 4449851 4470344 4488724 3481435 2304520 1730432
33060 1730432 264774 -3607930 -8123675 -9790733 -7820570 -4733288 -2742039 -1712505
33052 -1712505 -764534 276203 1551225 3456847 5450325 5934429 4170654 1366707
33044 1366707 -758518 -1695201 -1993416 -2257148 -2849843 -3953553 -5365084 -6565283 -7215829
33035 -7215829 -7253719 -6545168 -5015637 -3097334 -1404828 34965 1595157 3173928 4249880
33026 4249880 4735785 4947397 4783198 3874267 2534360 1496559 634149 -848191 -2717151
33017 -2717151 -3545780 -2753638 -1483561 -723823 62239 1366302 2069813 1107994 -190201
33008 -190201 584180 3453719 5783752 5783868 4595618 4174942 4554427 4409963 3424842 2658214
32998 2658214 2803302 3335231 3628495 3990675 5026146 6422238 6951321 5707373 3140868
32989 3140868 830801 184438 1168572 2265467 1871927 -162090 -2520417 -3908978 -4202177
32980 -4202177 -4003897 -3612846 -2952895 -2217249 -1841347 -1759508 -1269339 164855 2369865
32971 2369865 4770326 6686275 7236499 5759892 2869968 499003 180756 1572086
32963 1572086 3219143 4382289 5340970 6172746 6252843 5219288 3756854 3045401 3704474
32954 3704474 5336101 6752253 6710605 4982045 2811254 1832753 2359935 3121921 2740992
32945 2740992 1024231 -1161914 -2580831 -2042800 953827 5342232 8796915 9679889
32937 9679889 8505790 7019493 6187148 5739106 5345460 5213014 5319559 4946438 3572894
32928 3572894 1750396 446492 -220650 -896677 -1692916 -1780643 -626701 1063052 2330737
32919 2330737 3438482 5346493 7746180 8760130 7189071 4253447 2289199 2205081
32911 2205081 3042679 3601219 3419685 2322948 294855 -1787066 -2342909 -809770 1348188
32902 1348188 2032541 674292 -1418746 -2569719 -2159864 -849767 126518 30132 -649562
32893 -649562 -691063 333555 1319869 838592 -1210950 -3713692 -5859191 -7752358 -9439538
32884 -9439538 -10175469 -9211987 -6935605 -4722518 -3760620 -4197864 -5141314 -5198135 -3397171
32875 -3397171 -136186 2916065 4364595 4443247 4337100 4383181 3823513 2424714 1274034
32866 1274034 1385673 2352095 3108862 3292721 2992071 1968991 374005 -398846 836919
32857 836919 2997740 3786735 2793259 1730871 1421521 736956 -702655 -1128402 493459
32848 493459 2151169 1492953 -578442 -1370580 -460395 275083 144676 385814 1261588
32839 1261588 1060971 -1125698 -3660329 -4442407 -3256756 -1164586 1098533 3195379
32831 3195379 4738509 5616978 6037533 5868234 4858710 3667634 3397863 3811558 3410889
32822 3410889 1741701 192945 -14152 810343 1941156 3028112 3132626 945072 -2842814
32813 -2842814 -5122698 -3818334 -461829 1913972 2096734 750470 -1168655 -2499940
32805 -2499940 -1985568 -105762 610979 -1043819 -2784497 -2101414 -74781 721150 708429
32796 708429 2441497 5999818 8710022 9413803 9630620 10019414 9028299 6185759 3757948
32787 3757948 3483924 3984721 3131395 1103315 -587831 -1512481 -2083275 -2240385 -2030770
32778 -2030770 -2414018 -3867303 -4999786 -4088399 -1466988 903537 1849021 1924363 2342189
32769 2342189 3833687 6145010 7910077 7528070 4922253 1984893 669520 1142279
32761 1142279 2247527 2951504 2648959 990188 -1494516 -3131919 -2515828 12471 2926868
32752 2926868 5157605 6519501 6971985 6319757 4602642 2288530 61942 -1556555
32744 -1556555 -2704966 -4155876 -6156484 -7547536 -7152041 -5911226 -6040571 -7760259
32736 -7760259 -8708344 -7412769 -5425847 -4627729 -4223730 -2467973 -58271 676046 -561032
32727 -561032 -1627340 -1288748 -761615 -1357632 -2493898 -3041584 -3235854 -3964934 -4935259
32718 -4935259 -4834051 -3217618 -1287055 -447588 -596110 -407087 742707 1861939 1832058
32709 1832058 1122469 987253 1347182 923766 -481222 -1512064 -1530304 -1581185 -2186782
32700 -2186782 -1999321 -105448 1951375 2313615 1633521 1594035 1710898 229966 -2306243
32691 -2306243 -3235474 -1769594 -200934 -345556 -1065529 -503830 1117620 2446497 3400730
32682 3400730 4975385 7308582 9304050 9940848 9021503 6837350 3960968 1410845
32674 1410845 319968 977528 2272396 2507325 1191625 -181328 86810 1376133 1266568
32665 1266568 -961108 -2948427 -2606786 -1285782 -1619860 -3364508 -3937113 -2646363 -1622188
32656 -1622188 -2283783 -3500745 -4028786 -4409613 -5300555 -5894395 -5318584 -4054514 -2830853
32647 -2830853 -1596682 -621907 -932360 -2360401 -2825084 -1138927 952303 1322455 725140
32638 725140 1379289 3241703 4098653 3128290 2054443 2270986 2630792 1088875 -2404995
32629 -2404995 -5595377 -6296043 -4586410 -2483642 -1542442 -1344338 -934746 -1021568 -3117493
32620 -3117493 -6503145 -8100056 -6297660 -3183682 -1703747 -2137862 -2885158 -3242183 -3433867
32611 -3433867 -2989461 -1303730 719374 1560942 1240532 771794 -24259 -2091359 -4783169
32602 -4783169 -6122660 -5537700 -4341290 -3286798 -1684518 606145 2301492 2585905
32594 2585905 2248972 2211670 2407796 2745328 3580951 4491684 4184088 2536933 1187327
32585 1187327 1081182 1047181 68929 -656302 306277 1868476 1768901 34623 -1061574
32576 -1061574 -410409 610967 695806 725517 2218463 4649230 5638799 3813024 655012
32567 655012 -978057 -47561 1458012 859109 -2033186 -4818646 -5500525 -4523365 -3458615
32558 -3458615 -2816104 -2142900 -1473921 -1311800 -1397368 -838018 308878 677245 -664791
32549 -664791 -2868077 -4287305 -4319231 -3705633 -3403505 -3814836 -4917889 -6341287 -7133889
32540 -7133889 -6225550 -3699540 -1149400 -20610 178129 1104147 3013319 4113619 3029577
32531 3029577 856841 -247733 206142 928571 966368 504474 -311319 -1804489 -3656160
32522 -3656160 -4668331 -4252648 -3202767 -2479188 -2128815 -1847872 -1592432 -1061298 368788
32513 368788 2449219 3793829 3650051 2987364 2897126 2912647 2103180 930947 567426
32504 567426 996393 1328853 1545566 2256808 2950257 2320034 584108 -254708 914904
32495 914904 2818610 3774006 3923263 4473396 5611524 6325915 5909976 4750143 3748812
32486 3748812 3483092 3763398 3745788 2807261 1467014 885184 1260943 1519973 983063
32477 983063 409759 646108 1096478 607932 -705037 -1720945 -2086487 -2487590 -3214423
32468 -3214423 -3730515 -3891394 -4343471 -5129324 -4937436 -2650952 903733 3580412 4062665
32459 4062665 2867528 1494721 1100829 1788588 2708909 2971588 2704418 2859259 3690725
32450 3690725 4087104 3094079 1480588 711620 707396 -22318 -1899285 -3322724 -2806560
32441 -2806560 -980271 352571 314607 -718611 -2065323 -2917922 -2217405 257955 2815462
32432 2815462 3161289 1006154 -1654839 -3065030 -3452092 -3864419 -4342051 -4088655 -2867328
32423 -2867328 -1371470 -374922 -41454 35439 414614 1234521 1856229 1421489 33999
32414 33999 -999920 -481983 1398545 3379364 4390122 4214601 3300960 2348567 1808014
32405 1808014 1438203 674664 -273593 -256516 1307043 3281060 4040329 3534338 3095424
32396 3095424 3250882 2937272 1329887 -620933 -1368843 -833666 -256773 -322571 -589384
32387 -589384 -850039 -1746183 -3299503 -3896274 -2083804 1015072 2583514 1615674 138592
32378 138592 305702 1596643 2026759 1072674 -145353 -964568 -1720687 -2374556 -2374886 -2085221
32368 -2085221 -2614925 -3730499 -3623581 -1582353 641989 1175152 336430 -553868 -1297729
32359 -1297729 -2244912 -2783080 -2207808 -1302065 -1232837 -1505768 -937464 -148967 -839492 -2622719
32349 -2622719 -2944844 -702656 2159857 3532391 3717643 3965039 4107881 3262629 1792332
32340 1792332 896703 731011 327247 -772497 -1876872 -2150163 -1566339 -891591 -1085353
32331 -1085353 -2424771 -3910900 -4069161 -2765846 -1588850 -1814135 -2632461 -2230773 -205315
32322 -205315 1992017 2825780 2135216 908745 259540 676226 1876203 3321659 4877762
32313 4877762 6587694 7786857 7290201 4981779 2483672 1489861 1952726 2620059 2767740
32304 2767740 2515629 1995742 1373283 1416381 2786520 4665292 5178754 3519381 856514
32295 856514 -1139102 -1941290 -1984076 -1482042 -58473 2507547 5414935 6929318 5747126
32286 5747126 2492538 -613336 -1989390 -2094363 -2087475 -1875818 -596356 1427722 2647400
32277 2647400 2345030 1580705 1772381 3220370 5269746 7057669 7835425 7362750 6239314
32268 6239314 5168896 3959283 2257064 1152819 2469379 5963708 8812899 8891471
32260 8891471 7322764 6585157 7087679 7013238 4956967 1407264 -2066383 -4017765 -3857760
32251 -3857760 -2427493 -1543573 -2008286 -2442701 -1131940 1395792 2919985 2470998 1384256
32242 1384256 1322694 2449593 3803579 4442659 3910055 2414983 809468 -232596 -922142
32233 -922142 -1529492 -1319720 435846 2740405 3817524 3706300 4024224 4983783 4931638
32224 4931638 3556933 2998353 4210842 4648307 1979373 -1727813 -2548854 -405851 1042734
32215 1042734 35643 -1056911 137003 2549062 3823632 3668035 3237512 2729108 1494476
32206 1494476 -311073 -1827106 -2772586 -3404808 -3644436 -3343645 -3057308 -3550625 -4780304
32197 -4780304 -6097157 -7093451 -7612427 -7457954 -6815375 -6392745 -6414583 -6123635 -5036781
32188 -5036781 -3873198 -3304646 -2761653 -1760002 -1427876 -2974162 -5340864 -6416482 -6229853
32179 -6229853 -6678623 -8022572 -8100903 -5748659 -2715726 -986204 -169618 881530 1555745
32170 1555745 609334 -1218595 -1807649 -534484 1165995 2043628 2399104 3092975 4305853
32161 4305853 5484138 5859348 5157875 4304755 4758144 6241480 6004757 1886707 -4389655
32152 -4389655 -8796417 -9738067 -9201550 -8923854 -7793520 -4398716 -265847 1615734 797045
32143 797045 -121142 919665 2882115 3204370 906275 -2579682 -5159776 -5960213 -5522550
32134 -5522550 -4670305 -3601559 -2123786 -378655 1129297 2147007 2816155 3135436 2807349
32125 2807349 1826882 741242 70649 -83664 312045 1287468 2228328 2020808 595686
32116 595686 -386807 532899 2454160 3157552 2138988 1133874 1320822 1538038 251273
32107 251273 -1829896 -2489091 -906388 1464646 2882001 3079942 2876704 3006452 3781602
32098 3781602 5178212 6665912 7365829 6895523 5846669 5081234 4759458 4341002 3350835
32089 3350835 1937317 872373 1030628 2401289 3533389 2758858 424231 -983114
32081 -983114 136814 2062301 1715450 -1218784 -3757177 -3521423 -1620651 -737063 -1546201
32072 -1546201 -2366433 -1745517 -2358 1732008 2817282 3134555 2659435 1541670 265482
32063 265482 -654046 -1072341 -1213534 -1338614 -1426105 -1164681 -361709 668529 1382357 1688630
32053 1688630 1989137 2475300 2854087 2907874 2764204 2393348 1505753 301784 -394097
32044 -394097 -206279 374976 1198344 3033158 5941237 8035284 7348862 4442018 1650061
32035 1650061 70840 -1088387 -2318391 -2831127 -2154799 -1035274 -62734 1234280 3213137
32026 3213137 5257938 6774630 7836825 8192521 7048111 4781915 3409497 3992081
32018 3992081 4821218 3783463 1509635 294219 572720 627665 -299982 -746123 592803
32009 592803 2917645 4570229 4906064 4069280 2058441 -820879 -3252681 -3877976 -2853398
32000 -2853398 -1593993 -951401 -371386 930345 2563002 3297870 2681402 1717706 1620313
31991 1620313 2284520 2611242 2164658 1614026 1334587 623342 -941692 -2225957 -1831496
31982 -1831496 -290727 356020 -725548 -2079565 -2037736 -864332 -32680 17651 402956
31973 402956 2066243 4258703 5192720 4041098 1876435 429202 194541 253086 -86828
31964 -86828 -187021 985775 3340370 5619871 6583543 5817728 3783136 1603753 427577
31955 427577 344760 216631 -810514 -1975731 -1832415 -208997 1609408 2483467 2350913
31946 2350913 1696440 1034917 958046 1819455 3213564 4412657 5276788 6023379 6277450
31937 6277450 5299351 3130901 613765 -1630230 -3250673 -3472527 -1794766 558356
31929 558356 1488904 746522 247953 1073865 1786810 754335 -1349149 -2743987 -3103907
31920 -3103907 -3365161 -3738619 -3488816 -2371830 -996650 56704 442223 -325714 -2390042
31911 -2390042 -4941958 -7109714 -9194066 -11926679 -14673849 -15600710 -13820822 -10447167
31903 -10447167 -7246790 -4966682 -3227111 -1491625 162962 1043144 628504 -516315
31895 -516315 -986467 2888 1824213 3400682 4330584 4641850 4290749 3655711 3704257
31886 3704257 4683741 5330677 4418928 2433443 648592 -607205 -1390802 -762873 2065685
31877 2065685 5601597 7178433 6292207 4945135 4485051 4089873 2878971 1542292 962568
31868 962568 870639 852357 1202289 1713099 1002864 -1678541 -4984800 -6942020 -7041815 -6004302
31858 -6004302 -4504078 -3142012 -2653110 -2992232 -3062950 -2368662 -1939800 -2499411 -2843044
31849 -2843044 -1545164 637908 1754303 1390326 679779 50817 -1151760 -2870200 -3947030
31840 -3947030 -3793692 -2986491 -1957816 -504109 1057757 1620291 782155 -404269 -722648
31831 -722648 -36604 1059236 1939536 1980128 820952 -951721 -2135478 -2261146 -1889722
31822 -1889722 -1399623 -470318 870542 1761579 1717368 1434731 1659326 2006793 1709371
31813 1709371 893529 229083 -236710 -970186 -1882284 -2197826 -1429062 55536 1439381
31804 1439381 2071843 1806069 1120143 802922 1180228 1756601 1874450 1473718 817991
31795 817991 -253475 -2152288 -4544257 -6082260 -5535546 -3059030 -64567 2187980
31787 2187980 3655456 5026663 6386766 6834627 5604310 3152631 716806 -957896
31779 -957896 -1951634 -2387109 -1967599 -509974 1446959 2854813 2946601 1848410 459238
31770 459238 -470155 -1206341 -2587555 -4571594 -5916669 -5775846 -4841379 -4126987 -3411423
31761 -3411423 -2073146 -834615 -1112250 -2827410 -4412422 -4991850 -5032254 -4844764 -4259539
31752 -4259539 -3997093 -5258840 -7289513 -7531995 -5344710 -3428158 -3957138 -5311440 -4763527
31743 -4763527 -2698028 -1578810 -1958099 -2392300 -2592478 -3500867 -4273910 -2449894 1980414
31734 1980414 5432791 5103746 2427147 683148 888075 1708779 2121398 2322817 2652591
31725 2652591 3084616 3478016 3407135 2282526 461517 -520536 174508 1321764 1292800
31716 1292800 399493 162110 625911 48922 -2488982 -5538987 -7039574 -6767269 -6179277
31707 -6179277 -6122816 -5584180 -3170304 509029 2838239 2123362 -160220 -1187181 -519178
31698 -519178 -340710 -1640269 -2225656 -41425 3117862 3536935 673767 -2061919 -1897534
31689 -1897534 87597 1246852 1075713 1077563 1898844 2372437 1486951 120178 245187
31680 245187 2721598 6126465 7815652 6360434 3102180 1077517 2183457 5532845
31672 5532845 8634189 9775041 9018615 7412105 5931065 5114455 5023956 5191241 4887964
31663 4887964 3816441 2546721 2082152 2888187 4381229 5450532 5488485 4795425 3915561
31654 3915561 2821408 1146379 -792263 -1789553 -1047182 638721 1674625 1653589 1729035
31645 1729035 2623524 3144332 1740383 -853672 -1943247 -186412 2656132 4046094
31637 4046094 3675335 2979819 2462505 1180840 -1164430 -3239525 -3697777 -2668810 -1139860
31628 -1139860 105855 411092 -711894 -2532044 -3058740 -1280648 1088629 1343403 -920695
31619 -920695 -3359532 -3767241 -2423029 -1290217 -1663136 -3099185 -4282871 -4426321 -3748017
31610 -3748017 -2804464 -1726947 -401022 882983 1570640 1565217 1113207 44908 -1864939
31601 -1864939 -3674357 -3741519 -1958881 -179294 394106 777188 1954245 2627213 1180965
31592 1180965 -1172766 -1580065 508926 2825723 3632753 3350504 2674615 1433326 700
31583 700 -329298 568530 1034759 254450 -201508 1176974 3353639 4289744 3820205 3334022
31573 3334022 3379119 3205563 2305783 1101993 321251 562906 2004844 3711946 3917119
31564 3917119 1965197 -656704 -2138624 -2395652 -2282720 -1793873 -552546 673554 729613
31555 729613 30307 111067 1356901 2701509 3475382 3983854 4279203 4040968 3840785
31546 3840785 4748876 6197359 5991339 3336456 345020 -662579 -209638 -664442 -2909933
31537 -2909933 -5373069 -6102991 -4654055 -1931320 775063 2268082 1751767 -600448
31529 -600448 -3445251 -5123400 -5023696 -4019858 -3349275 -3202741 -2850155 -2087345 -1777593
31520 -1777593 -2569709 -3792424 -4331394 -4135762 -4051477 -4407440 -4547026 -3752427 -2134495
31511 -2134495 -633111 -289801 -1129139 -1726388 -803870 540640 -278656 -3385657 -5199359
31502 -5199359 -2878640 1561989 3986031 3791809 3789893 4967287 4960984 2367383 -787607
31493 -787607 -2314471 -2755877 -3205356 -2752419 -467321 1896299 1773523 -591241 -2553751
31484 -2553751 -2490292 -1092368 134113 136533 -1303940 -3138656 -3711887 -2963527 -2870298
31475 -2870298 -4440498 -5751016 -4766860 -2659660 -2019632 -2929588 -3453681 -3209734 -3514705
31466 -3514705 -4276032 -3791777 -1971998 -938947 -1678416 -2564379 -2136726 -1150527 -850796
31457 -850796 -1185803 -1774632 -2807085 -3887443 -3701358 -1997493 -384241 -86211 -393935
31448 -393935 -357290 -428543 -1242377 -2276121 -2981599 -3815400 -4868487 -4925404 -3293656 -1219477
31438 -1219477 -96145 333252 574809 -153202 -2225189 -3943292 -3739630 -2702565 -2570456
31429 -2570456 -2534312 -874150 1214412 787345 -2063070 -3970130 -3316435 -2307662 -2994794
31420 -2994794 -4162053 -3817996 -2425642 -1717352 -2020412 -2649224 -3601034 -4956635 -5555004
31411 -5555004 -4144003 -1412826 608101 916848 207550 -462802 -635046 -361505 -44187
31402 -44187 -144731 -469330 -158590 1113968 2544981 3288433 3323139 2693234 999654
31393 999654 -1446869 -3093342 -2980775 -2132441 -1780736 -1272196 483174 2318771 1855152
31384 1855152 -854549 -2895193 -2164722 293098 2246364 3005110 3355718 3961959 4731926
31375 4731926 5062254 4176709 1866004 -883609 -2778245 -3750118 -4546505 -4844653 -3318057
31366 -3318057 51193 3310895 4856809 4980076 4501279 3602471 2945330 3971555 6498589
31357 6498589 7771700 5965172 3197834 2672089 3962831 4038604 2399639 1896828 3991188
31348 3991188 6305865 6213495 4392550 3127182 2997289 3157025 3455195 4209761 4726767
31339 4726767 4003868 2515199 1628475 1503261 1156523 516570 762120 2291366 3774043
31330 3774043 3883339 2949587 2129224 1636016 691652 -986176 -2456945 -2661437 -1962274
31321 -1962274 -2016558 -3726965 -5623958 -5112918 -1568877 2603221 4553590 3962111 2704102
31312 2704102 2214495 2322595 2439228 2611979 3085466 3690298 4068611 3970389 3159960 1617666
31302 1617666 -18915 -852604 -794848 -681232 -1134466 -1890680 -2433893 -2623295 -2387065
31293 -2387065 -1494215 -138708 794783 640088 -215495 -917128 -1279157 -1818432 -2822004
31284 -2822004 -3863911 -4234448 -3564345 -2105266 -643467 -32626 -531881 -1583608 -2353375
31275 -2353375 -2446375 -2053192 -1526845 -951344 -178948 646502 766018 -454683 -2254730
31266 -2254730 -2719157 -1066780 913116 888761 -896375 -2048722 -1591746 -1253165 -2453101
31257 -2453101 -3822018 -3256709 -1231872 -168445 -985281 -2050811 -1585567 326173 2324410
31248 2324410 3247844 2862612 2094666 2579834 4961067 7586666 7974480 5660859 2529288
31239 2529288 348425 -641814 -633744 410591 1620816 1219437 -1031579 -2774611 -1980570
31230 -1980570 160219 974468 61387 -703646 -495689 -650434 -2206103 -4352966 -6009366
31221 -6009366 -7172625 -7730658 -6578763 -3439639 -452295 -146945 -2224101 -3951337
31213 -3951337 -3744263 -2853014 -3101652 -4280985 -4716622 -3720969 -2430294 -2230108 -3048238
31204 -3048238 -3513004 -2547733 -486940 1438393 2440091 2636065 2305656 1407796 244035
31195 244035 -82185 1196624 3108371 3664189 2179277 94722 -753963 71906 1807852
31186 1807852 3504037 4234179 3207567 721715 -1474186 -1815451 -719346 136572 69973
31177 69973 -119986 208579 648018 712568 556728 291236 -357354 -1108412 -878291 655501
31167 655501 2076620 1911629 760601 562455 1924122 3325346 3116350 1359855 -632685
31158 -632685 -1870698 -2366778 -2720424 -3431669 -4416605 -4969970 -4334839 -2408101 173822
31149 173822 2526498 3948506 4163750 3571188 3127176 3530908 4520421 5224828 5013074
31140 5013074 3708674 1440929 -1043433 -2332757 -1645634 -107279 361716 -385566 -416363
31131 -416363 1495021 3833084 3993204 1320529 -2382553 -4941584 -5550698 -4760745 -3671430
31122 -3671430 -3159322 -3254687 -3225504 -2660889 -2227949 -2782867 -3990432 -4614018 -4135796 -3308145
31112 -3308145 -3002584 -3267151 -3716911 -4074732 -3929139 -2661521 -237760 2353308 4051566
31103 4051566 4851872 5480665 6261601 6940990 7418550 7811028 7696916 6181184 3235881
31094 3235881 360607 -859983 -609603 -471608 -1221000 -1847596 -1169895 315114 985739
31085 985739 182594 -1137081 -1900465 -2271305 -3101230 -4579391 -5974131 -6465507 -5782602
31076 -5782602 -4208019 -2441022 -1386809 -1558615 -2508972 -3135166 -2693820 -1369504 117994
31067 117994 1145721 1377295 761573 -311728 -1092803 -1162846 -1054733 -1761898 -3409260
31058 -3409260 -4734472 -4310673 -2195005 107579 1411006 2042747 2901091 3815503 3637361
31049 3637361 1921799 -279773 -1615782 -1805054 -1355645 -445463 1176935 3311825 5027520
31040 5027520 5472720 4626870 3108598 1506525 50408 -1210100 -2045319 -1925136 -436940
31031 -436940 2028865 4212425 4946915 4222187 3129113 2819843 3696854 5428525 7323387
31022 7323387 8625997 8839240 8068503 7013389 6455979 6598132 6761395 5841527 3449423
31013 3449423 731235 -403478 764514 2946066 4382545 4724208 4699224 4401223 3102125
31004 3102125 827124 -1135742 -1891209 -2135745 -2842214 -3444387 -2487803 53348 2203138
30995 2203138 2124523 203465 -1544227 -1913366 -1789557 -2760611 -4799651 -6001283 -4876668
30986 -4876668 -2271035 -266597 401079 736748 1403791 1686879 1044923 306982 282432
30977 282432 309884 -436489 -1054120 -8014 2308110 3853474 3680871 2656949 1389068
30968 1389068 -587907 -3017784 -4291194 -3668417 -2502571 -2062181 -1704323 -624563 183804
30959 183804 -359105 -1092102 -358778 824230 49317 -2345405 -3270025 -1350176 1317911
30950 1317911 2645860 3102542 3489690 2754198 65807 -2892408 -4064077 -4065711 -4721623
30941 -4721623 -5653171 -4967883 -2823024 -1636266 -2644026 -4538740 -5790306 -6158828 -5495275
30932 -5495275 -3275051 -208873 1603675 1273957 410520 798499 2168317 3271706 3774386
30923 3774386 3856812 3144985 1407623 -545107 -1840629 -2633623 -3239908 -3209201 -2423381
30914 -2423381 -2024742 -2774468 -3382116 -2095274 704894 3099880 4219915 4529053 4075954
30905 4075954 2479998 557731 -46486 799523 1380582 507956 -1217677 -2799827 -4018520
30896 -4018520 -4842868 -5118702 -5277508 -5995798 -6788743 -6415092 -5064150 -4448603 -5090087
30887 -5090087 -5302041 -3841608 -1832820 -756817 -133419 1157240 2557734 2761593 2147805
30878 2147805 2375861 3881300 5373896 5647102 4555297 2482022 240790 -659596 902527
30869 902527 4111130 6728746 7210262 5613488 2906507 489748 -100869 1451374 3283557
30860 3283557 3187833 1390812 48916 21351 -33963 -977720 -1581216 -648801 869527
30851 869527 1350780 983352 1159956 1986594 2057281 708037 -898981 -1350490 -659889
30842 -659889 194798 732385 1215756 1697013 1640465 781859 -212049 -564758 -622633 -1450964
30832 -1450964 -3081678 -4034866 -3093612 -881623 939848 1455255 841668 -339616 -1273070
30823 -1273070 -959061 657197 2022677 1640730 77563 -910346 -831685 -542773 -262244
30814 -262244 537286 1232835 270107 -2093645 -3369844 -2211230 -333558 195617 -207348
30805 -207348 -135043 80294 -826543 -2564842 -3677216 -3795875 -3622964 -3172410 -1963501
30796 -1963501 -669561 -613597 -1607170 -2074208 -1436946 -663455 -276352 361096 1327379
30787 1327379 1493334 377096 -850439 -1120387 -951047 -1238192 -1729972 -1800931 -1795584 -2396788
30777 -2396788 -3289006 -3596376 -3265814 -3008471 -3111424 -3185218 -2924279 -2325025 -1244387
30768 -1244387 509744 2588411 4178231 4798208 4680613 4360072 4198697 4268251 4344386
30759 4344386 3978833 2886898 1411759 426454 524499 1232222 1263244 -55611 -1665437
30750 -1665437 -1736433 -40450 1433410 991536 -373654 -381827 1125885 1841893 328449
30741 328449 -1942944 -2746948 -1974990 -1121608 -804505 -263129 949867 2069236 2103166
30732 2103166 939060 -718700 -2043588 -2671812 -2918304 -3332232 -3844233 -3708118 -2623831
30723 -2623831 -1440715 -1146370 -1480872 -1260457 -13165 1291960 1281782 -286793 -2064533
30714 -2064533 -2270036 -660231 781144 -122342 -2924838 -4790061 -3922240 -1567989 169434
30705 169434 1153936 2401139 3490217 2877150 656734 -919128 -194468 1969148 3570923
30696 3570923 3736750 3117241 2853060 3538395 4566140 4379918 2112123 -1069883 -3154132
30687 -3154132 -3644611 -3502424 -2910544 -914230 2285430 4593271 4623635 3462989 2585989
30678 2585989 1523235 -691566 -2895996 -2704196 347996 4337294 7472676 9460936
30670 9460936 10399386 9994098 8312726 6083496 3833357 1651640 -106765 -1030432 -1716104
30661 -1716104 -3347992 -5852281 -7690938 -7909766 -7090747 -5736488 -3265040 301530
30653 301530 3043196 3176218 1639775 1047281 2408028 4344975 5352721 5309401 4663392
30644 4663392 3606608 2514204 2030131 2164894 2206389 1905990 1769420 1783542 1075060
30635 1075060 -403162 -1022099 499719 3004935 4115884 3097040 1307400 153629
30627 153629 -136526 109095 479666 211229 -1282940 -3287881 -4280686 -3871744 -3181116
30618 -3181116 -2945502 -2479659 -1132074 418522 1212891 1401249 1649330 2006038 2339619
30609 2339619 3064992 4294746 4998115 4303304 3078612 2839602 3504540 3715362 3121138
30600 3121138 2709630 2836181 2579749 1442094 222788 -343333 -551560 -787286 -863382
30591 -863382 -899181 -1563234 -2609505 -2416376 -128651 2679663 3730114 2811293 1662040
30582 1662040 1557707 2218538 2925135 3555207 4289380 5020663 5386301 5186787 4753369
30573 4753369 4846192 5788655 6742444 6592926 5654950 5415212 6158387 6173679 4306435 2113056
30563 2113056 2020202 4088281 6173912 6871402 6640650 6122141 5064724 3403232 2067671
30554 2067671 1945540 2735176 3334447 2914789 1416656 -512684 -1935721 -2404146 -2323639
30545 -2323639 -2222430 -2040867 -1775218 -2325315 -4624831 -8068360 -10843080 -11823528 -11206220
30536 -11206220 -9402462 -6547102 -3325788 -1111190 -716959 -1700875 -3149829 -4428442
30528 -4428442 -5024823 -4571277 -3388336 -2357674 -2025896 -2343958 -3160165 -4179885 -4610460
30519 -4610460 -3867388 -2576285 -1835910 -1618659 -1093748 -323110 -99240 -165815 575911
30510 575911 1892897 2266343 1573500 1476461 2226391 1515352 -1787167 -4842301 -4087416
30501 -4087416 55322 3993725 5584906 5706414 5776927 5942986 5734258 4816737 3085889
30492 3085889 1308464 1244098 3573718 6147755 6109464 3548962 1165544 359025 -253588
30483 -253588 -2026670 -4004897 -4404380 -2959283 -827424 866536 1640234 1610096 1464368
30474 1464368 1892584 2710101 3109908 2791947 2050295 861898 -974775 -2730674 -3047745
30465 -3047745 -1694797 62926 1156812 1719767 2169846 2491606 2770206 3214254 3261918
30456 3261918 1992467 -71675 -1036188 -272417 505971 -78591 -698821 762786 3798701
30447 3798701 5599250 4692950 2773056 2455383 4083885 5382403 4139682 873542
30439 873542 -1585665 -1327639 477030 1393452 985773 776734 1268889 1070385 -504768
30430 -504768 -1981718 -1987420 -1290217 -1184109 -1238856 -251579 1650756 3470011 4987153
30421 4987153 6369624 7018656 6548388 6163943 7183559 8735222 8850349 7408684 5929676
30412 5929676 4750853 2784235 177182 -1320666 -1333190 -1793548 -3694470 -5043230 -3813554
30403 -3813554 -1341928 -666750 -2303559 -3751489 -3087431 -1290482 -574982 -1667837 -3463962
30394 -3463962 -4711472 -5205666 -5307803 -4903152 -3481843 -1291188 403483 915343 1394157
30385 1394157 3304623 5868418 6563296 4601034 2444896 2880182 5632528 8078873
30377 8078873 8573848 7724989 6703186 5678742 4185629 2120461 -4657 -1370191
30369 -1370191 -1340770 -111767 1083486 832719 -1267941 -4391366 -7166009 -8332476 -7278582
30360 -7278582 -4693601 -2453641 -1997122 -2772691 -3011301 -2026928 -836308 -244437 652660
30351 652660 3199485 6896364 9321974 8469006 4723602 451576 -2096772 -2464264 -1900878
30342 -1900878 -1830333 -2463206 -2974120 -2868193 -2657996 -2933177 -3266794 -2711987 -1252455
$$ [...]
##END NTUPLES=NMR SPECTRUM
##END=
