##TITLE=31Pdec_B3C1701
 D2O, 24 sc
 17.1.2025
##JCAMPDX= 6.0         $$ Bruker NMR JCAMP-DX V2.0
##DATA TYPE= NMR SPECTRUM
##DATA CLASS= NTUPLES
##ORIGIN= UXNMR, Bruker Analytische Messtechnik GmbH
##OWNER= root
$$ XWIN-NMR		Version 3.5
$$ Fri Jan 17 16:23:32 2025 Russian Standard Time (UT+4h)  she@DPX200
##.OBSERVE FREQUENCY= 81.013821
##.OBSERVE NUCLEUS= ^31P
##.ACQUISITION MODE= SIMULTANEOUS
##.ACQUISITION SCHEME= undefined
##.AVERAGES= 40
##.DIGITISER RES= 17
##SPECTROMETER/DATA SYSTEM= spect
##.PULSE SEQUENCE= zgpg30
##.SOLVENT NAME= CDCl3
##.SHIFT REFERENCE= (INTERNAL, CDCl3, 0, 198.062)
##AUDIT TRAIL= $$ (NUMBER, WHEN, WHO, WHERE, WHAT)
$$ ##TITLE= Audit trail, XWIN-NMR		Version 3.5
$$ ##JCAMPDX= 5.01
$$ ##ORIGIN= Bruker BioSpin GmbH
$$ ##OWNER= she
$$ F:/spectra/data/she/nmr/P31/2/pdata/1/auditp.txt
$$ ##AUDIT TRAIL=  $$ (NUMBER, WHEN, WHO, WHERE, WHAT)
(   1,<2025-01-17 16:21:25.60 +0400>,<she>,<DPX200>,
      <created by zg, POWCHK disabled, PULCHK disabled
       configuration hash MD5:
       00 E9 B6 7A A2 85 ED C7 34 08 36 98 17 FE 4E 26
       data hash MD5: 32K
       6D 18 E0 8D DE D5 19 A4 11 6C 6B 56 1C 3A 17 40>)
(   2,<2025-01-17 16:21:27.90 +0400>,<she>,<DPX200>,
      <Start of raw data processing
       efp BC_mod = 2 LB = 1.5 FT_mod = 6 PKNL = 1 PHC0 = 1403.558 PHC1 = 945.2863 SI = 64K 
       data hash MD5: 64K
       06 70 15 93 7E 96 2B 64 C2 0A 1D 54 33 88 FB D8>)
(   3,<2025-01-17 16:22:28.60 +0400>,<she>,<DPX200>,
      <pk PHC0 = 348.613 PHC1 = -844.5999 
       data hash MD5: 64K
       4A C4 0C 36 F3 C4 0C B8 BB C0 3E C4 FB B9 B0 B6>)
(   4,<2025-01-17 16:22:33.01 +0400>,<she>,<DPX200>,
      <abs ABSG = 5 
       data hash MD5: 64K
       2B 76 54 71 34 65 51 99 DA A4 AC 68 4A 65 D6 AB>)
$$ ##END=
$$ 
$$ hash MD5
$$ 02 19 47 B5 94 AC A7 D6 DA EF 6E 81 D6 E9 B4 55
##$RELAX= 
##$RELAX= 
##$RELAX= 
##$RELAX= 
##$RELAX= 
##$RELAX= 
##$RELAX= 
##$RELAX= 
$$ Bruker specific parameters
$$ --------------------------
##$DU= <F:/spectra>
##$EXPNO= 2
##$NAME= <P31>
##$PROCNO= 1
##$TYPE= <nmr>
##$USER= <she>
##$AMP= (0..31)
100 100 100 100 100 100 100 100 100 100 100 100 100 100 100 100 100 100 
100 100 100 100 100 100 100 100 100 100 100 100 100 100 
##$AQSEQ= 0
##$AQ_mod= 1
##$AUNM= <au_zg>
##$AUTOPOS= <>
##$BF1= 81.014009
##$BF2= 200.13
##$BF3= 200.13
##$BF4= 200.13
##$BF5= 200.13
##$BF6= 200.13
##$BF7= 200.13
##$BF8= 200.13
##$BYTORDA= 1
##$CFDGTYP= 0
##$CFRGTYP= 5
##$CHEMSTR= <none>
##$CNST= (0..31)
1 1 145 1 1 1 1 1 1 1 1 1 1 1 1 1 1 1 1 1 1 1 1 1 1 1 1 1 1 1 1 1 
##$CPDPRG= <waltz16>
##$CPDPRG1= <>
##$CPDPRG2= <waltz16>
##$CPDPRG3= <>
##$CPDPRG4= <mlev>
##$CPDPRG5= <mlev>
##$CPDPRG6= <mlev>
##$CPDPRG7= <mlev>
##$CPDPRG8= <mlev>
##$CPDPRGB= <>
##$CPDPRGT= <>
##$D= (0..31)
0 1 0 0 0 0 0 0 0 0.06 0 0.03 2e-05 3e-06 0 0 0.0002 0 0 0 0 0 0 0 0 0 
0 0 0 0 0 0 
##$DATE= 1737116484
##$DBL= (0..7)
120 120 120 11 120 120 24 19 
##$DBP= (0..7)
150 150 150 150 150 150 150 150 
##$DBP07= 0
##$DBPNAM0= <>
##$DBPNAM1= <>
$$ [...]
##$SUBNAM3= <"">
##$SUBNAM4= <"">
##$SUBNAM5= <"">
##$SUBNAM6= <"">
##$SUBNAM7= <"">
##$SUBNAM8= <"">
##$SUBNAM9= <"">
##$SW= 400.765351723535
##$SWIBOX= (0..15)
0 1 3 0 0 0 0 0 0 0 0 0 0 0 0 0 
##$SW_h= 32467.5324675325
##$TD= 32768
##$TD0= 1
##$TE= 0
##$TE2= 300
##$TE3= 300
##$TEG= 300
##$TL= (0..7)
0 120 53 12 22 120 120 120 
##$TP= (0..7)
150 150 150 150 150 150 150 150 
##$TP07= 0
##$TPNAME0= <>
##$TPNAME1= <>
##$TPNAME2= <>
##$TPNAME3= <>
##$TPNAME4= <>
##$TPNAME5= <>
##$TPNAME6= <>
##$TPNAME7= <>
##$TPOAL= (0..7)
0.5 0.5 0.5 0.5 0.5 0.5 0.5 0.5 
##$TPOFFS= (0..7)
0 0 0 0 0 0 0 0 
##$TUNHIN= 0
##$TUNHOUT= 0
##$TUNXOUT= 0
##$USERA1= <user>
##$USERA2= <user>
##$USERA3= <user>
##$USERA4= <user>
##$USERA5= <user>
##$V9= 5
##$VALIST= <valist>
##$VCLIST= <CCCCCCCCCCCCCCC>
##$VD= 0
##$VDLIST= <DDDDDDDDDDDDDDD>
##$VPLIST= <PPPPPPPPPPPPPPP>
##$VTLIST= <TTTTTTTTTTTTTTT>
##$WBST= 1024
##$WBSW= 4
##$XGAIN= (0..3)
0 0 0 0 
##$XL= 0
##$YL= 0
##$YMAX_a= 16753
##$YMIN_a= -8703
##$ZGOPTNS= <>
##$ZL1= 120
##$ZL2= 120
##$ZL3= 120
##$ZL4= 120
##$ABSF1= 198.0616
##$ABSF2= -202.7028
##$ABSG= 5
##$ABSL= 3
##$ALPHA= 0
##$AQORDER= 0
##$ASSFAC= 0
##$ASSFACI= 0
##$ASSFACX= 0
##$ASSWID= 0
##$AUNMP= <proc_1d>
##$AZFE= 0.1
##$AZFW= 0.5
##$BCFW= 0
##$BC_mod= 2
##$BYTORDP= 0
##$COROFFS= 0
##$CY= -3
##$DATMOD= 1
##$DC= 0
##$DFILT= <>
##$DTYPP= 0
##$F1P= 0
##$F2P= 0
##$FCOR= 1
##$FTSIZE= 65536
##$FT_mod= 6
##$GAMMA= 0
##$GB= 0
##$INTBC= 1
##$INTSCL= 9.790993e-09
##$ISEN= 30
##$LB= 1.5
##$LEV0= 0
##$LPBIN= 0
##$MAXI= 10000
##$MC2= 0
##$MEAN= 0
##$ME_mod= 0
##$MI= 50
##$NCOEF= 0
##$NC_proc= -6
##$NLEV= 6
##$NOISF1= 182.463
##$NOISF2= 159.3651
##$NSP= 0
##$NTH_PI= 0
##$NZP= 0
##$OFFSET= 198.0616
##$PC= 4
##$PHC0= 1752.171
##$PHC1= 100.6864
##$PH_mod= 1
##$PKNL= yes
##$PPARMOD= 0
##$PSCAL= 0
##$PSIGN= 0
##$REVERSE= no
##$SF= 81.0140089999434
##$SI= 65536
##$SIGF1= 159.3651
##$SIGF2= -187.1042
##$SINO= 113.3802
##$SIOLD= 16384
##$SREGLST= <1H.CDCl3>
##$SSB= 0
##$STSI= 65536
##$STSR= 0
##$SW_p= 32467.5324675325
##$SYMM= 0
##$S_DEV= 0
##$TDeff= 32768
##$TDoff= 0
##$TI= <>
##$TILT= no
##$TM1= 0
##$TM2= 0
##$TOPLEV= 0
##$USERP1= <user>
##$USERP2= <user>
##$USERP3= <user>
##$USERP4= <user>
##$USERP5= <user>
##$WDW= 1
##$XDIM= 65536
##$YMAX_p= 300264258
##$YMIN_p= -37995480
$$ End of Bruker specific parameters
$$ ---------------------------------
##NTUPLES= NMR SPECTRUM
##VAR_NAME=  FREQUENCY,     SPECTRUM/REAL,   SPECTRUM/IMAG
##SYMBOL=    X,             R,               I
##VAR_TYPE=  INDEPENDENT,   DEPENDENT,       DEPENDENT
##VAR_FORM=  AFFN,          ASDF,            ASDF
##VAR_DIM=   65536,         65536,           65536
##UNITS=     HZ,            ARBITRARY UNITS, ARBITRARY UNITS
##FACTOR=    0.49542278885378, 1,            1
##FIRST=     16045.7642231865, 0,            0
##LAST=      -16421.768244346, 0,            0
##MIN=       -16421.768244346, -37995480,    0
##MAX=       16045.7642231865, 300264258,    0
$$ Real data points
##PAGE= N=1
##DATA TABLE= (X++(R..R)), XYDATA
$$ [...]
40724b09672k42335J85947O02366N01729p4262n93142o73646l55676R3380L47220
$$ -209672 -452007 -266060 336306 838035 763773 170631 -503015 -858691 -765311 -418091
40714d18091J74047k86665n47358l16644J44855M25690M81448M73808L52293j1617
$$ -418091 -244044 -530709 -1078067 -1394711 -1249856 -824166 -342718 131090 483383 471766
40704D71766m38629o04540n06270l81324k38323R6933M69127M10181j66721o78130
$$ 471766 33137 -571403 -1077673 -1458997 -1697320 -1600387 -1131260 -721079 -887800 -1565930
40694a565930n31180J74135Q32401J020490P63032K86233j88591m53075m00119
$$ -1565930 -2097110 -1922975 -1090574 -70084 692948 979181 790590 337515 -62604
40685f2604j79863q8667k14113l20268j84717O7075J25817m9893j53185K4901
$$ -62604 -242467 -331134 -545247 -865515 -1050232 -983157 -857340 -907233 -1060418 -1035517
40675a035517K51106J46263k47539m36606p5864N81956R65622Q09518L65443M6531
$$ -1035517 -784411 -638148 -885687 -1322293 -1398157 -816201 149421 958939 1324382 1370913
40665A370913o457M296j84416n67657q12287n67711J22047P64176Q45747L17002
$$ 1370913 1364456 1368752 1184336 616679 -195608 -763319 -641272 122904 968651 1285653
40655A285653l74895p10866n47149j85042k4369j34172k04845J3397L20410L18041
$$ 1285653 910758 199892 -347257 -532299 -556668 -690840 -895685 -882288 -561878 -243837
40645b43837K9069n0175L30716P07160M82144j95003n61337k53875K43412L29219
$$ -243837 -214768 -264943 65773 772933 1255077 1060074 498737 244862 488274 817493
40635H17493P0675o7531l220p3760l51279m23844m8148L71934L10172j03171k53874
$$ 817493 888168 820637 817417 743657 392378 -31466 -79614 292320 602492 499321 245447
40624B45447N7678L38053J48468k68045l96149k04359r9287k49288l83195l05758
$$ 245447 303125 641178 789646 521601 125452 -78907 -178194 -427482 -810677 -1116435
40614a116435k20607l45457m83826k62096L18455Q19379Q58891N00637J10731
$$ -1116435 -1337042 -1682499 -2166325 -2428421 -2109966 -1290587 -431696 68941 179672
40605A79672n5812m4929k8213n4289n3716l5070j12217k80292l30850j34557J18474
$$ 179672 123860 78931 50718 -3571 -57287 -92357 -204574 -484866 -815716 -950273 -831799
40594h31799J46519n0547k49074l37655l41472j86827K31994P35542R29057O71071
$$ -831799 -685280 -735827 -984901 -1322556 -1664028 -1850855 -1618861 -883319 45738 716809
40584G16809K16892j47066l32662k99089m0437J96046P9320k75337l54178k904
$$ 716809 933701 786635 453973 154884 114447 310493 389813 114476 -239702 -242606
40574b42606L09228K27487K5532L1474M7940j58350k56277J07578N16798K99132
$$ -242606 66622 294109 319641 351115 399055 240705 -15572 92006 608804 907936
40564I07936l49886n58361p6450L98611L23999R466m2926J28381K06797R5409
$$ 907936 558050 -311 -76761 321850 645849 655315 612389 740770 947567 1042976
40554A042976j73069n90397r22381p19014O7790Q15631R32035N48595K12858J70687
$$ 1042976 869907 279510 -642871 -1361885 -1294095 -478464 453571 1002166 1215024 1385711
40544A385711K72900L37121K67389J0076l21862m61566l48191k40002k63961j81294
$$ 1385711 1658611 1995732 2263121 2273197 1951335 1489769 1141578 901576 637615 456321
40534D56321J19040K76761K5733k46726n5490L07248J05954o71487j131674o40175
$$ 456321 575361 852122 877855 631129 575639 882887 988841 317354 -814320 -1454495
40524a454495L26632P82660L88486k73030m40205K4135N69348O11149J77827j96961
$$ -1454495 -1127863 -345203 43283 -229747 -669952 -645817 -76469 534680 712507 515546
40514E15546j98759q7813j98472l84769k80689P6637K62346N1150l17670m48646
$$ 515546 316787 228974 30502 -354267 -634956 -558319 -295973 -244823 -562493 -1011139
40504a011139j45948M57811R13106P40610j6440o76933o68894k26397J3476r2751
$$ -1011139 -1157087 -699276 213830 954440 938000 261067 -407827 -634224 -620748 -713499
40494g13499j76788q7258n5622j47773j29163M4166J42117J69746L98072P34910
$$ -713499 -890287 -977545 -1033167 -1180940 -1310103 -1265937 -1123820 -954074 -556002 178908
40484A78908O68495J07518l00341o4340M35421N52589K45598j22793m41601p48576
$$ 178908 847403 954921 654580 590240 1025661 1578250 1823848 1701055 1259454 510878
40474E10878p91884l28075K99075M79371J88884k2698R6472J83301o5880l92418
$$ 510878 -281006 -609081 -310006 169365 358249 335551 432023 615324 549444 157026
40464A57026m00100j46478n140r4905j17748K20486P65310R90101N60649k35843
$$ 157026 -243074 -389552 -394692 -489597 -607345 -386859 378451 1368552 1929201 1693358
40454A693358p71933p81590n57774m06438k40447O9037K70955O7654k99321k45741
$$ 1693358 921425 139835 -417939 -824377 -1064824 -995787 -724832 -657178 -956499 -1202240
40444a202240L57656R36029Q66333J81104m69846m84555N9848M47782J50589m25099
$$ -1202240 -844584 91445 957778 1138882 669036 184481 244329 692111 842700 417601
40434D17601l96481K97390O37021m9962r93586j008691j83473L60722J84423k7904
$$ 417601 21120 318510 955531 905569 -88017 -1096708 -1280181 -919459 -735036 -762940
40424g62940J97071M03562J85595n3315J10412L20129Q9025l32525m20067k30019
$$ -762940 -565869 -162307 23288 -30027 80385 400514 489539 157014 -263053 -493072
40414d93072j08499K1132L32113M31296j11826p95516o80515J65292O35232J60301
$$ -493072 -601571 -580439 -248326 182970 71144 -724372 -1404887 -1239595 -604363 -444062
40404d44062n36441n83276j01611K54826K84413K02831O7718j71226l12908j34555
$$ -444062 -980503 -1563779 -1665390 -1410564 -1126151 -923320 -855602 -1026828 -1339736 -1474291
40394a474291J71683K53694J71423K67700N39825N94763K56319j86514m20930
$$ -1474291 -1302608 -1048914 -877491 -609791 -69966 524797 781116 594602 173672
40385A73672m48689l68750j57034J43149K83670J28149n8896Q2670M83735O98447
$$ 173672 -275017 -643767 -800801 -657652 -373982 -245833 -304729 -222059 261676 960123
40375I60123N02752J87387J28113K58208J96318j72543n14165n17506l11341k09416
$$ 960123 1462875 1650262 1778375 2036583 2232901 2060358 1546193 1028687 717346 507930
40365E07930k03113k2400L10043L46990j61395p63926p56710p7775N60435N10300
$$ 507930 304817 282417 592460 939450 778055 14129 -742581 -820356 -259921 250379
40355B50379q8015n76105n67848k17959J92159N77084Q48064P22624P1062o70657
$$ 250379 162364 -413741 -981589 -1199548 -1007389 -430305 417759 1140383 1211445 540788
40345E40788q35296l54860Q5463p7183n45768o12550j30312L90595N80495O16666
$$ 540788 -294508 -649368 -563905 -641088 -1186856 -1799406 -1929718 -1539123 -958628 -341962
40335c41962P20989P15985L82176o5836k47780j95065k70333n53654o73014l30965
$$ -341962 379027 1095012 1477188 1411352 1163572 968507 698174 144520 -528494 -859459
40325h59459K56848N79198L56323k15923o53427o04304j83208J41099J07931K0542
$$ -859459 -602611 -23413 332910 116987 -536440 -1140744 -1323952 -1182853 -1074922 -1054380
40315a054380L09966Q08720Q27517P8307q16738j009505m09981L22035O44891
$$ -1054380 -744414 64306 891823 970130 153392 -856113 -1266094 -944059 -299168
40306b99168O31391N78779M90991J81579k90118n78913m78956j92519n1649p4940
$$ -299168 332223 911002 1401993 1583572 1293454 714541 235585 43066 -8583 -83523
40296h3523J6726L40221O19258N56808K76377J40367J97383J30276j97135m92033
$$ -83523 -66797 273424 892682 1449490 1725867 1866234 2063617 2193893 1996758 1504725
40286A504725n16084m90143o92302q96433o52736l2269L87467L32658J73575K88329
$$ 1504725 988641 498498 -193804 -1090237 -1742973 -1775242 -1387775 -1055117 -881542 -593213
40276e93213N02380M44053J28114j65065l50711m95040m81640j54925K70355L80690
$$ -593213 -90833 353220 481334 316269 -34442 -529482 -1011122 -1166047 -895692 -515002
40266e15002J73309Q0575K93105M72250L25096P8302P5899K00504P1387l49288
$$ -515002 -341693 -261118 31987 504237 829333 907635 983534 1184038 1255425 906137
40256I06137p23814q33913p51520n33299j12804M09025O80292M97418J03137r7805
$$ 906137 182323 -651590 -1403110 -1936409 -2049213 -1640188 -959896 -462478 -359341 -457146
40246d57146j4206R4483p102k58303m02482k76650J9517K30136K22291J33464
$$ -457146 -471352 -376869 -383971 -642274 -1044756 -1321406 -1301889 -1071753 -849462 -715998
40236g15998J93579M27636O14149N33158J80660k52101n26795m97782k15323Q0909
$$ -715998 -522419 -94783 519366 1052524 1233184 981083 454288 -43494 -258817 -177908
40226a77908J45444o5856l87894n90960m89750l2933N72616R24704Q01923M18472
$$ -177908 -32464 -98320 -486214 -1077174 -1566924 -1599857 -1027241 -102537 699386 1117858
40216A117858J30890L213r0778q0707J74071M13165J46746n53443r28731n04423
$$ 1117858 1248748 1251961 1161183 1080476 1254547 1667712 1814458 1261015 332284 -172139
40206a72139K04573L41294k14219q03363q39380l32882L05361O63755O16633M39664
$$ -172139 32434 373728 159509 -643854 -1483234 -1816116 -1510755 -847000 -230367 209297
40196B09297N03111P01840N03145j99652p24092n30797q2992j42037n56101n47012
$$ 209297 712408 1414248 1917393 1717741 993649 462852 379860 237823 -318278 -865290
40186h65290n017L96596L50606K51743K72644P2468k91875j54379N67161R04289
$$ -865290 -870307 -473711 -123105 128638 401282 473750 181875 27496 594657 1498946
40176A498946K58700n39230m63963J00212L7479o68827r39260k89348N74010R27978
$$ 1498946 1757646 1218416 754453 854665 892144 223317 -715943 -1005291 -431281 496697
40166D96697Q34704N53361L9409n87638p90396l04321L91575O81456N09213J75840
$$ 496697 1331401 1884762 1924171 1336533 546137 241816 633391 1314847 1824060 1999900
40156A999900j49578l85302l66669q3745J69049J76202R0459R0163L7098k19831
$$ 1999900 1850322 1465020 1098351 1014606 1183655 1359857 1450316 1540479 1577577 1357746
40146A357746m62795l85802q3182Q7128K1369n7418J7625J66705K26223R7153
$$ 1357746 894951 509149 425967 513095 534464 477046 494671 661376 887599 984752
40136I84752k28344o11521p92338o40612l28893r9993N4431K81449N00787M35995
$$ 984752 756408 144887 -647451 -1288063 -1616956 -1716949 -1662518 -1381069 -880282 -444287
40126d44287P8829j48341P9398M47098L19266l58112q41015n34371J52370L65741
$$ -444287 -365458 -513799 -434401 12697 331963 -26149 -867164 -1401535 -1249165 -883424
40116h83424L9868r9451K12466L46849n6716l46771M1371M80868J09524o45360
$$ -883424 -843556 -943007 -730541 -383692 -440408 -787179 -745808 -264940 -155416 -800776
40106h00776o59959O5142M59299J94026P0541M07276M63804m3841k44753L12029
$$ -800776 -1460735 -1395593 -936294 -742268 -671727 -264451 199353 155512 -89241 222788
40096B22788O73954O9492o76314n10837M5891j43719q41350r08870k72929J34217
$$ 222788 896742 966234 289920 -220917 -175026 -318745 -1160095 -2068965 -2341894 -2207677
40086b207677J05477K79661O46696M88664j14372k42755J87486K21251l15997
$$ -2207677 -2102200 -1822539 -1175843 -687179 -801551 -1044306 -856820 -635569 -951566
40077i51566l49601N07341J064063M56899m12812m04822N4201r1711o91926p91234
$$ -951566 -1301167 -793826 270237 727136 314324 -90498 -36297 -128008 -819934 -1611168
40067a611168k59140K06523K94197K13448k8569m66435o15365o7772O28336O55883
$$ -1611168 -1870308 -1663785 -1369588 -1156140 -1184709 -1651144 -2266509 -2334281 -1705945 -1050062
40057a050062K13444J11020L48669K11631l49380n91803k78063m039q4531j38696
$$ -1050062 -836618 -725598 -376929 -165298 -514678 -1106481 -1384544 -1388583 -1473114 -1611810
40047a611810L514k2788k48847j31193M48290Q06391M93090p6152m01880n33367
$$ -1611810 -1608296 -1631084 -1879931 -2011124 -1562834 -756443 -263353 -339505 -741385 -1274752
40037a274752n36681j66901M39532N65077n174m57368j50641L87537L92789Q1560
$$ -1274752 -1811433 -1978334 -1538802 -973725 -978899 -1436267 -1586908 -1199371 -806582 -725022
40027g25022Q1382K66597J45381p0128J52730N27623L07474l46202m69476J64741
$$ -725022 -643640 -377043 -231662 -301790 -149060 378563 686037 339835 -129641 35100
40017C5100O79866N01081J38326J68577L09395O5574l67692m65581j90356J06626
$$ 35100 714966 1216047 1354373 1522950 1832345 1897919 1530227 1064646 874290 980916
40007I80916K75947L78655L59187J47343j03507k41439l85960o43161p73075n18561
$$ 980916 1256863 1635518 1994705 2142048 2038541 1797102 1411142 767981 -5094 -523655
39997e23655q5691J10216O5223J48999M95289Q19235Q56217O25660K09725l66822
$$ -523655 -609346 -499130 -433907 -284908 210381 1029616 1885833 2511493 2721218 2354396
39987B354396r01657r96805n31987M9197K07183m3970k39652j79920j89758n19605
$$ 2354396 1452739 455934 -76053 -26856 180327 136357 -103295 -283215 -472973 -992578
39977i92578q08826n14045K50384P40856N34396M2638j33836J6064J20999Q0275
$$ -992578 -1801404 -2315449 -2065065 -1324209 -789813 -747175 -881011 -864947 -743948 -663673
39967f63673L5198p5753l53800m55418N2657Q14710Q85065L7954p99757p87582
$$ -663673 -628475 -704228 -1058028 -1513446 -1460789 -646079 238986 276940 -522817 -1310399
39957a310399k07549K07915L52340M91435M69511J5433m79359l85959J04916K46916
$$ -1310399 -1517948 -1310033 -957693 -466258 3253 18686 -460673 -846632 -741716 -494800
39947d94800J2905J31656P12015Q58188Q7365p79126p83040j67060K03801J94941
$$ -494800 -481895 -350239 361776 1219964 1307329 528203 -254837 -421897 -218096 -23155
39937b3155L05250N50918L76785l29269r06406p81938j46688L76292L63573j58950
$$ -23155 282095 833013 1209798 880529 -25877 -807815 -954503 -578211 -214638 -373588
39927c73588p41538p84753j60141M67036L44979l61192p45362l57609L06010O20447
$$ -373588 -1115126 -1899879 -2060020 -1592984 -1248005 -1609197 -2354559 -2712168 -2406158 -1785711
39917a785711N75719M54546K83346l788k14844j27009J49352L52307M14790L63083
$$ -1785711 -1209992 -755446 -472100 -475888 -690732 -817741 -668389 -316082 98708 461791
39907D61791J22933k43589l48275N6165N55313M69950k25284p83034n96890O8553
$$ 461791 584724 341135 -7140 49025 604338 1074288 849004 65970 -530920 -462367
39897d62367M41685J58105l99075o42188m71259k63449k18512k6361N67226J126348
$$ -462367 -20682 137423 -261652 -903840 -1375099 -1638548 -1857060 -1883421 -1316195 -189847
39887a89847R71194K24083k05474J19616N33434K98376k96516m73252j69930M7725
$$ -189847 781347 1005430 799956 919572 1453006 1751382 1454866 981614 811684 859409
39877H59409L5314J88392N33820N38156J8091m84678n50973m81913o56792q27820
$$ 859409 894723 1083115 1616935 2155091 2173182 1688504 1137531 655618 -1174 -828994
39867h28994n40639J14819O45845P95160O44668L24286j845q2606J04214J79935
$$ -828994 -1369633 -1254814 -608969 186191 830859 1155145 1153300 1070694 1174908 1354843
39857A354843j26498n13805n53484l78209m34833p02370p17651l55610j9523M5327
$$ 1354843 1228345 714540 161056 -217153 -651986 -1354356 -2072007 -2427617 -2447140 -2401813
39847b401813J02153L72326N73548L23260k66522o89677o00566q3781M98229P89980
$$ -2401813 -2299660 -1927334 -1353786 -1030526 -1297048 -1986725 -2587291 -2671072 -2172843 -1382863
39837a382863P00949M75139L86591L57845J01109l40300n18118j94680K72575
$$ -1382863 -681914 -206775 179816 537661 638770 298470 -219648 -414328 -141753
39828a41753L95415J61830q7540j91776k60456l30264k44832R1086N19422P30285
$$ -141753 253662 415492 327952 136176 -124280 -454544 -699376 -608290 -88868 641417
39818F41417N13074j2162l91666k61555J56823K61572r6542l53232p4799L45682
$$ 641417 1154491 1142329 750663 489108 645931 907503 810961 457729 382930 728612
39808G28612L04782l9310n3887K95781M06760P6328j86941p2467M3509j59281
$$ 728612 1033394 994084 940197 1235978 1642738 1719066 1532125 1459658 1503167 1343886
39798A343886l92717l85904m28592p30267q09904k29748N11108O23872K64395
$$ 1343886 951169 565265 136673 -593594 -1403498 -1633246 -1122138 -498266 -233871
39789b33871K41316O43305P03407J01063n13634n61886l06320k04401j80862o478
$$ -233871 7445 650750 1354157 1455220 941586 379700 73380 -131021 -311883 -318361
39779c18361J59335J01862n034N9653J56933J22969J12423K01205Q4956l49543
$$ -318361 -159026 -57164 -62198 -2545 154388 277357 389780 590985 675941 326398
39769C26398n93484k30726L01276L01799j64960n05104n59738n74136m45620J07812
$$ 326398 -267086 -497812 -196536 105263 -59697 -564801 -1124539 -1698675 -2144295 -2036483
39759b036483P07771N90202j59406n39716o0775N88425O58718L53429K36542K93457
$$ -2036483 -1328712 -738510 -897916 -1437632 -1498407 -909982 -251264 102165 338707 632164
39749F32164J74051j06514k84153l27738l38670k77509j70953k31342m11325k84296
$$ 632164 806215 699701 415548 87810 -250860 -528369 -699322 -930664 -1341989 -1626285
39739a626285K14201M41137q286n26254l71449J25765J04917l76141m24238K19180
$$ -1626285 -1412084 -970947 -979233 -1505487 -1876936 -1751171 -1646254 -2022395 -2446633 -2227453
39729b227453P82833P03982L64704K72634K88154J07498j12952j09483j8478o7706
$$ -2227453 -1444620 -740638 -375934 -103300 184854 292352 179400 69917 51439 -16267
39719a6267j36200m0757Q0137P3064J29270M02918N67461K44076l31621n70564
$$ -16267 -152467 -193224 -113087 -40023 89247 492165 1059626 1303702 972081 401517
39709D01517l49287j00494j28655k76340l03330k08989q4459N6375J99866L04776
$$ 401517 52230 -48264 -176919 -453259 -756589 -965578 -1050037 -993662 -793796 -489020
39699d89020L96248M85937M09213J571n47583q05537o22434k66332L2417L22938
$$ -489020 -92772 393165 802378 803949 256366 -549171 -1171605 -1437937 -1405520 -1082582
39689a082582N64766M23934j90579o75243l43286N74100J073302O52170n2575
$$ -1082582 -517816 -93882 -284461 -959704 -1302990 -728890 344412 996582 944007
39680I44007j90884J63944K83407o7922l62983j96537J43211K03656J4472j03924
$$ 944007 753123 917067 1200474 1132552 769569 573032 716243 919899 934371 830447
39670H30447l9648J32435L82256N73924L57810l37284r06445o89099R4878N61522
$$ 830447 790799 923234 1305490 1879414 2237224 1899940 993495 304396 399274 960796
39660I60796L14029j62756l26478k16549p1668J27561L83687M01290J997m95554
$$ 960796 1274825 1112069 785591 569042 497374 624935 1008622 1409912 1411909 916355
39650I16355o99546o73915o67586o00740k72028J36792K55727J14185O9192K01662
$$ 916355 216809 -457106 -1124692 -1725432 -1997460 -1860668 -1604941 -1490756 -1421564 -1219902
39640a219902K24637j1775l21002m91721m38547p2128N76126J107912J080253
$$ -1219902 -995265 -1007040 -1328042 -1819763 -2258310 -2330438 -1754312 -646400 433853
39631D33853O19423K71053J86861k0687m75631o80492k95429K31500K81720n0898
$$ 433853 1053276 1324329 1511190 1490503 1014872 334380 38951 270451 552171 501273
39621E01273k09944o1435K1531j46769l13502k56458o6707J13393K63668L07163
$$ 501273 291329 229894 251425 104656 -208846 -465304 -532011 -418618 -154950 152213
39611A52213J10351j96479k17154J85461O00946N44202P1493k98459k08042J76957
$$ 152213 262564 66085 -151069 34392 635338 1179540 1251033 952574 744532 921489
39601I21489M04760K02854k89145o51325n36153L8485O97558R94145P09160k7166
$$ 921489 1326249 1529103 1239958 588633 52480 90965 788523 1782668 2491828 2464662
39591B464662p95982j110952p51341L6992P31106R65119P57979L66864L4394j39309
$$ 2464662 1668680 557728 -193613 -156621 574485 1539604 2297583 2664447 2698841 2559532
39581B559532k30021m25013p83343j033646p85666k0041P85111J102570Q03801
$$ 2559532 2329511 1904498 1121155 87509 -698157 -718198 66913 1169483 1973284
39572A973284J34771n18869p47197l12959M89759Q96577M51475l79861p25714
$$ 1973284 2108055 1589186 841989 529030 1018789 1915366 2366841 1986980 1261266
39563A261266l76901M8237K2318k43924k56073J9155J76479k7218l76147m71540
$$ 1261266 884365 932602 954920 710996 454923 474078 650557 623339 247192 -224348
39553b24348j52549L36979N44949K53787k41739m29846j83123J20638J34139m0328
$$ -224348 -376897 -39918 505031 758818 517079 87233 -95890 24748 158887 118559
39543A18559r8288K7987J71062K00508J08408l9466r9868K2812J30627j12343
$$ 118559 20271 48258 219320 419828 528236 488770 388902 411714 542341 429998
39533D29998n92409o72227m6351O68919O92046J69955q6026J76997L89023J58945
$$ 429998 -162411 -834638 -880989 -212070 479976 649931 563905 740902 1129925 1288870
39523A288870j73485k29640j93551l20445l56142M0445O14995P66153L29082k77248
$$ 1288870 1115385 885745 692194 371749 15607 56052 671047 1437200 1766282 1489034
39513A489034n78094m25073M542L15558J66246l03020n10719j79487K14714R2928
$$ 1489034 910940 485867 490409 805967 972213 669193 158474 -21013 193701 286629
39503B86629l92246o22293l87877K1556M08704P26638O71666k7913q68549r19087
$$ 286629 -105617 -727910 -1115787 -1094231 -685527 41111 712777 684864 -183685 -1102772
39493a102772j40652M35606K27350l6594L91733R16368N24755m23806n72307L39838
$$ -1102772 -1243424 -807818 -580468 -617062 -225329 691039 1215794 791988 219681 559519
39483E59519J003470M90692m37488o26469k16008j04422l48597k32234K91002
$$ 559519 1562989 2053681 1616193 989724 773716 669294 320697 88463 379465
39474C79465L92027k11562o56023k47887M17890L54323l27570o30928j55453M19603
$$ 379465 771492 559930 -96093 -343980 73910 428233 100663 -530265 -685718 -266115
39464b66115L90018q7851m00580k97996M824K58833L92835M09268L09762J22542
$$ -266115 123903 36052 -364528 -662524 -657700 -398867 -6032 403236 712998 835540
39454H35540r5930k78600l60752l37417k86884k45387j10138J90437M84650N11990
$$ 835540 739610 461010 100258 -237159 -524043 -769430 -879568 -689131 -204481 307509
39444C07509K74974L6857l3012j3044l0604j17842k61441l79833k79516J05728
$$ 307509 582483 619340 586328 573284 542680 424838 163397 -216436 -495952 -390224
39434c90224M65598M17676M3096k41653l23920m37114n29879j95260N43894R80617
$$ -390224 75374 493050 536146 294493 -29427 -466541 -996420 -1191680 -647786 332831
39424C32831O58370N8764j21134O2845J08194m3784p9162j5327j31857l15141
$$ 332831 991201 1049965 928831 991676 1099870 1056086 976924 961597 829740 514599
39414E14599j61221K66755M24820J10430k82297m42471n16953o29797n52082j15867
$$ 514599 353378 620133 1044953 1155383 873086 430615 -86338 -716135 -1268217 -1384084
39404a384084M41259P87662Q35859O10153J29750m02834o44504n32080l55921
$$ -1384084 -942825 -155163 680696 1290849 1420599 1017765 373261 -158819 -514740
39395e14740k87665k00268q8644k08621n46714o09637j17366M67325N40359K04851
$$ -514740 -802405 -1002673 -1091317 -1299938 -1846652 -2456289 -2573655 -2106330 -1565971 -1361120
39385a361120L5671J70716J58175k81160p82235p89547k36438L95510O00847L30954
$$ -1361120 -1325449 -1154733 -996558 -1277718 -2059953 -2849500 -3085938 -2690428 -2089581 -1758627
39375a758627l1394j14437R9866L88453N85060O10804L59224j62838o36108o77848
$$ -1758627 -1790021 -1904458 -1804592 -1416139 -831079 -220275 138949 -23889 -659997 -1337845
39365a337845k92976J85321N40592P32121O28106J71613k21957k5372N55025P12999
$$ -1337845 -1630821 -1445500 -904908 -172787 455319 626932 404975 379603 934628 1647627
39355A647627J89368l70859m52352l28003k95403n0720N34304P26603r2651j238872
$$ 1647627 1836995 1466136 1013784 685781 390378 339658 873962 1600565 1507914 269042
39345B69042j461881o24553K55271M89524L35237J53901j07603m03750l61363
$$ 269042 -1192839 -1817392 -1562121 -1072597 -737360 -583459 -691062 -1094812 -1456175
39336a456175J09986N61577O30440M36737J75387j76210n36382n98147k71779
$$ -1456175 -1346189 -784612 -154172 282565 457952 281742 -254640 -852787 -1124566
39327a124566J55690M68761P11477Q15686N57006O0566j88341q4862j21386n62028
$$ -1124566 -968876 -500115 211362 1027048 1584054 1644620 1456279 1371417 1250031 688003
39317F88003r38778p71389l04694m9757O195J92910M51855M07139J8296l18448
$$ 688003 -250775 -1022164 -1326858 -1376615 -1370420 -1177510 -725655 -318516 -300220 -618668
39307f18668k98730r428K51546K13686j82577o04125n06538K17195R38617R60813
$$ -618668 -917398 -926826 -675280 -461594 -644171 -1248296 -1754834 -1537639 -599022 361791
39297C61791L51670k03411k67426l5244R5719J3143j01417n3069J28810J82887
$$ 361791 713461 510050 242624 207380 303099 316242 214825 161756 290566 473453
39287D73453p6146m23826m15331P936L78021L16804j1608k63044l81021m17992
$$ 473453 397307 -26519 -441850 -433914 -55893 260911 249303 -13741 -394762 -812754
39277h12754k43487J78054N01636M11011P6692j83177l94904o14658m84630K24845
$$ -812754 -1056241 -878187 -376551 34460 111152 -72025 -466929 -1081587 -1566217 -1341372
39267a341372Q87769O61112k10638n96086r9282L96964J30437m32231m40899M4514
$$ -1341372 -453603 207509 -3129 -599215 -698497 -301533 -171096 -603327 -1044226 -999712
39257i99712L12075J36349o6489k9563P1378P6941O1524N8663n950o7240K6268
$$ -999712 -687637 -551288 -617777 -647340 -575962 -499021 -437497 -378834 -384784 -452024 -425756
39246d25756J75689J00323j92421l37345j18779K36949L95479K83771q03l79234
$$ -425756 -250067 -149744 -342165 -679510 -798289 -561340 -165861 117910 117107 -262127
39236b62127o83333n87598M4661Q16005J075130O01127j52692n52872m05148l2396
$$ -262127 -945460 -1533058 -1488397 -672392 402738 1003865 851173 298301 -106847 -139243
39226a39243J45763J3789j98027j79690J32969M51892M05284l0916m50950m71917
$$ -139243 6520 20309 -177718 -357408 -224439 227453 632737 601821 150871 -321046
39216c21046j76517O3765J16425J62174K58091J95614p5863k62991k22283k68093
$$ -321046 -497563 -433798 -317373 -155199 102892 298506 222643 -40348 -262631 -530724
39206e30724n93001p31268k01317N21865M48217m51651j011967m47605N45199
$$ -530724 -1123725 -1854993 -2056310 -1534445 -1086228 -1537879 -2549846 -2997451 -2452252
39197b452252Q15988L31805j315K46730O06462O30019M56567K96092M580m97709
$$ -2452252 -1636264 -1304459 -1305774 -1059044 -452582 177437 634004 930096 934676 436967
39187D36967q49097o73490j22439L15526L68287J20376k10849m06707l01118O7027
$$ 436967 -412130 -1085620 -1208059 -892533 -524246 -403870 -614719 -1021426 -1322544 -1255517
39177a255517M20795N05550L19050L2010j76565j66877N9916K38062Q0748k52332
$$ -1255517 -834722 -329172 -10122 21888 -154677 -321554 -261638 -23576 57172 -195160
39167a95160k55615J88406N52480M15120P9103M2360K11939J76877j7086j4393
$$ -195160 -450775 -262369 290111 705231 784334 826694 1038633 1215510 1198424 1184031
39157A184031R0648j22110n23202m73415Q4839L72125j4734l80641k0780N73817
$$ 1184031 1274679 1152569 629367 155952 240791 612916 598182 217541 196761 770578
39147G70578L93734n45642j189389r06264j90869K23287K76430L07531L79885
$$ 770578 1164312 618670 -570719 -1476983 -1667852 -1444565 -1168135 -860604 -480719
39138d80719L16394J58167J74967M31256O00205L24897k90383o74205m04760K10790
$$ -480719 -164325 -6158 168809 600065 1200270 1525167 1234784 560579 155819 366609
39128C66609M36881P0267k57258m578M20071K28565n33379r71278n58026K18394
$$ 366609 803490 873757 616499 611921 1031992 1260557 727178 -244100 -802126 -583732
39118e83732N81155L48157j23479m53211m48610j49654J06359k1093l31104k09925
$$ -583732 -2577 345580 222101 -231110 -679720 -829374 -723015 -744108 -1075212 -1285137
39108a285137M58240R37576N80197k30579n53956j00788N13344O41287K86165
$$ -1285137 -826897 110679 690876 460297 -93659 -194447 318897 960184 1246349
39099A246349j29541l32751l97698n10930o27876m31610K14063Q36519P60591
$$ 1246349 1116808 784057 386359 -124571 -752447 -1184057 -969994 -133475 627116
39090F27116N1229m06700n4410N65662O18375J59348q9249J04491K32298q9936
$$ 627116 678345 271645 217235 782897 1401272 1560620 1471371 1575862 1808160 1718224
39080A718224o21046r30594q44828m03154J67749M02770J8020n53859n67821r721
$$ 1718224 1097178 166584 -678244 -1081398 -913649 -510879 -492859 -1046718 -1614539 -1624260
39070a624260L28187P942m08891k27787L77346P03123N03074J34396p4361j31565
$$ -1624260 -1296073 -1288131 -1697022 -1924809 -1547463 -844340 -341266 -206870 -281231 -412796
39060d12796j35325r7684k3634O4981J61031K01122R0821p8341n0297J88834K92261
$$ -412796 -548121 -645805 -669439 -604458 -443427 -242305 -151484 -229825 -280122 -91288 200973
39049B00973Q4241q1040J61585N77363O85365N11976M38796M07944m8244q75792
$$ 200973 285214 204174 365759 943122 1628487 2140463 2579259 2987203 2938959 2063167
39039B063167j282152q14756j10318l8380m70345n44664J1863N43777N35227L28612
$$ 2063167 781015 -33741 -144059 -182439 -652784 -1197448 -1185585 -641808 -106581 222031
39029B22031M14930N47420J50030o51457j051748o39321Q5890M23815K76799J8568
$$ 222031 636961 1184381 1334411 682954 -368794 -1008115 -922225 -498410 -221611 -203043
39019b03043q5349l4036Q9099J62156M8676j89437k58121k0027K65399L14719
$$ -203043 -288392 -322428 -233329 -71173 -22497 -211934 -470055 -490082 -224683 90036
39009I0036K21849K09906J96083l5294l60796l95472m288N40843Q48290O50848
$$ 90036 311885 521791 717874 682580 321784 -73688 -77976 462867 1311157 1962005
38999A962005k9183o89165o20866K12702Q77794N74957k52396n80317l05816k13479
$$ 1962005 1932822 1243657 622791 835493 1713287 2288244 2035848 1455531 1149715 936236
38989I36236n50536o68134k57931P6979j00557l27300j36811J15159j7622k12160
$$ 936236 385700 -282434 -540365 -463386 -563943 -891243 -1028054 -912895 -930517 -1142677
38979a142677P188L63148L20625L1296p414J37104O4386j19782j4887K41610J69646
$$ -1142677 -1135489 -772341 -451716 -420420 -427834 -290730 -226344 -346126 -361013 -119403 50243
38968E0243j66263k60094n9948L0691r369J98602N88863O15823J83011j80578
$$ 50243 -116020 -376114 -436062 -405371 -414740 -216138 372725 988548 1171559 990981
38958I90981k38501l47286o00797n01609J00108M88979P8896o44259q01721l42596
$$ 990981 752480 405194 -195603 -697212 -597104 -108125 -29229 -673488 -1475209 -1817805
38948a817805N0678L2898o1764R0296L06843K54414j0299q5046K38695O37911
$$ -1817805 -1767127 -1734229 -1795993 -1705697 -1398854 -1144440 -1154739 -1239785 -1001090 -363179
38938c63179O04438J17497k79334k13504J3088l3107j86080K258M22032N05476
$$ -363179 241259 358756 79422 -134082 -120994 -154101 -340181 -337923 84109 589585
38928E89585J11783l05238m25830l47514j19583L20609O59824M06996k28384m22838
$$ 589585 701368 396130 -29700 -377214 -496797 -176188 483636 890632 662248 239410
38918B39410K1212L25172P825l36407j00486K97505J94625j70622j69493P6254
$$ 239410 260622 585794 593619 257212 156726 454231 648856 478234 308741 384995
38908C84995J9848j96799L2523N80638O09427j17937q04610p45233k21683K6322
$$ 384995 404843 208044 240567 821205 1430632 1312695 508085 -237148 -458831 -432509
38898d32509k40462o11999n60116M3300P73814J020783O48234J39607p6146j18439
$$ -432509 -672971 -1284970 -1845086 -1801786 -1027972 -7189 641045 780652 704506 586067
38888E86067k01931j50662J49001K77751o2324l42054J3259M89299J55791p19766
$$ 586067 384136 233474 382475 660226 597902 255848 269107 758406 914197 194431
38878A94431r17085j75296L87599Q5969l34994j01639L18519J92223j61658l3497
$$ 194431 -722654 -897950 -510351 -424382 -759376 -861015 -542496 -350273 -511931 -545428
38868e45428L82145M07377J05993K0449M0356l39396q18192n50768L23269O10723
$$ -545428 -163283 244094 350087 370536 410892 71496 -746696 -1297464 -974195 -363472
38858c63472j17876p43378k62610O84166Q39753K43649K8379N36706P86589O7119
$$ -363472 -481348 -1224726 -1487336 -803170 36583 280232 308611 845317 1631906 1699025
38848A699025q77939q89824m9952M84564J17375m79543m36878J68672O25124O10814
$$ 1699025 821086 -68738 -118690 365874 483249 3706 -433172 -264500 360624 971438
38838I71438L99209K42590Q5891r9908j54419k7211Q4625K6395j49655l91799
$$ 971438 1370647 1613237 1699128 1599220 1444801 1417590 1502215 1528610 1378955 987156
38828I87156p16765r58258p94875k39355K15759K24705R2565K98078P07439P06614
$$ 987156 270391 -687867 -1482742 -1722097 -1506338 -1281633 -1189068 -890990 -183551 523063
38818E23063R8693n46603n94618j25944K15308M9852k95589k57356J94478M87232
$$ 523063 621756 75153 -519465 -645409 -430101 -380249 -675838 -933194 -738716 -251484
38808b51484K14097k75495l25184J26164M80308L26321p7598l17988l91437m53638
$$ -251484 -37387 -312882 -638066 -511902 -31594 294727 217129 -100859 -492296 -945934
38798i45934l73467M245L56994J73525m46145p46261k56597N29235O85320m2203
$$ -945934 -1319401 -1315156 -958162 -784637 -1230782 -1977043 -2233640 -1704405 -1019085 -1061288
38788a061288q97079r47170j46871O02432N13136j53424m57788J4021P12628R66572
$$ -1061288 -1958367 -2905537 -3052408 -2449976 -1936840 -2090264 -2548052 -2534031 -1821403 -854831
38778h54831Q16068P05309O86181L99473k46174q01441p76829k05590L53109K98046
$$ -854831 -38763 666546 1352727 1752200 1506026 704585 -72244 -277834 75275 373321
38768C73321m46556j250820j317095n41397L33628N83407K89403L9728J11124
$$ 373321 -73235 -1324055 -2641150 -3182547 -2848919 -2265512 -1976109 -1936381 -1825257
38759a825257L01443L84554L26426J45686o6265o5122K36060M56441J55766m81847
$$ -1825257 -1523814 -1139260 -812834 -667148 -733413 -798535 -562475 -106034 49732 -432115
38749d32115p95018m97686J7108K76623K44302J53579J81960L89926O77071P35651
$$ -432115 -1227133 -1724819 -1707711 -1431088 -1186786 -1033207 -851247 -461321 215750 951401
38739I51401L56670j81531l64353j07479J89660K73640K94584L71845L62330K00189
$$ 951401 1308071 1126540 762187 654708 844368 1118008 1412592 1784437 2146767 2346956
38729B346956N0166j2095p0949n1130J73539K73149k87226j264439j615225q67393
$$ 2346956 2397122 2385027 2314078 2262948 2436487 2709636 2422410 1157971 -457254 -1324647
38719a324647J53537N00506L64021M59435P26768N54012k2002l05394p3283J51058
$$ -1324647 -1171110 -670604 -306583 152852 879620 1433632 1411630 1106236 1032953 1184011
38709A184011M0042r1638M5241K66582L50195L41181K18384j76521o40999o23954
$$ 1184011 1224053 1132415 1177656 1444238 1794433 2135614 2353998 2177477 1536478 912524
38699I12524p6598K36849k72704j128369j383223q27406r0394K92805L80260L86367
$$ 912524 835926 1072775 800071 -328298 -1711521 -2538927 -2629321 -2336516 -1956256 -1569889
38689a569889K51671j18452m76492m19016P6805N45346N84646L68384L72331O38043
$$ -1569889 -1318218 -1436670 -1913162 -2332178 -2255373 -1710027 -1125381 -756997 -384666 253377
38679B53377O62807J60691m44755o09501m20300k84561j30614M25568J177122
$$ 253377 916184 1076875 632120 22619 -397681 -682242 -812856 -387288 789834
38670G89834J326219N82633l66928p91397p65488p14737o31811k70458K32540
$$ 789834 2116053 2698686 2331758 1540361 774873 60136 -571675 -842133 -609593
38661f09593M88917M35473L12784J97782j9534k81293l67165k16266L9921K81118
$$ -609593 -120676 314797 627581 825363 805829 524536 157371 -58895 -18974 262144
38651B62144L95423K44569q4580j99258R0912L99410K87914n5622j36714M0896
$$ 262144 657567 902136 817556 618298 709210 1108620 1396534 1340912 1204198 1245094
38641A245094N4446j62257k37028m8645J12923J38283K40152L89039K43500j60383
$$ 1245094 1299540 1137283 900255 851610 964533 1102816 1342968 1732007 1975507 1815124
38631A815124l00992m5451K5691m08029p36207l09497M92679P70789L52997j54383
$$ 1815124 1514132 1468681 1494372 1086343 350136 40639 533318 1304107 1657104 1502721
38621A502721l46081l47398k62990J1350L74487M99445L24619R0775j42664n01488
$$ 1502721 1156640 809242 546252 557602 932089 1431534 1756153 1846928 1704264 1202776
38611A202776p79497n23911J87225O35364M15822p864m7953J73302J62818j38854
$$ 1202776 423279 -100632 86593 721957 1137779 1129915 1081962 1255264 1418082 1279228
38601A279228l77327l77509k68051j62668j01364j70117l24753k59106J67495
$$ 1279228 901901 524392 256341 93673 -7691 -177808 -502561 -761667 -594172
38592e94172N41974L92830n3499j47803J78103K84494j52036n70016l34010L03914
$$ -594172 -52198 340632 287133 139330 317433 601927 449891 -120125 -454135 -150221
38582a50221N20679K0374o01242n90221J33298R27533J087435N26476j66501l78647
$$ -150221 370458 390832 -210410 -800631 -667333 260200 1347635 1874111 1707610 1328963
38572A328963j26603Q8438M917j35908j02267n5836j90483l21152j85904O6416
$$ 1328963 1202360 1290798 1295715 1159807 1057540 1001704 811221 490069 304165 370581
38562C70581Q2889j33191k66579k21454j99026k54191j94549R803J14606K0821
$$ 370581 453470 320279 53700 -167754 -366780 -620971 -815520 -805717 -691111 -670290
38552f70290p3896r5897k61412n81567o16357j04544M98258N95199L21647K67588
$$ -670290 -744186 -840083 -1101495 -1683062 -2299419 -2403963 -1905705 -1310506 -988859 -721271
38542g21271M51443K72917l84774p20069j19881Q11499R46176J14219p36146q21114
$$ -721271 -269828 3089 -381685 -1101754 -1221635 -410136 536040 650259 -85887 -907001
38532i07001l63498r728N7325Q5227J86505K22047J12984n6156j85244j79523
$$ -907001 -1270499 -1280227 -1222902 -1137675 -951170 -729123 -616139 -672295 -857539 -1037062
38522a037062P2416M91192O95774M22544j2044m4118L31337N07259J48551k93369
$$ -1037062 -964646 -473454 222320 644864 632820 588702 920039 1427298 1575849 1282480
38512A282480k35158K01527L98806R7761l71043o42695o92898o11486l77865l3616
$$ 1282480 1047322 1248849 1647655 1745416 1374373 731678 38780 -572706 -950571 -984187
38502i84187J88135J32075k2595K3166K88759N02445M58893K29081O08j40069
$$ -984187 -796052 -663977 -686572 -663406 -374647 127798 586691 815772 816380 676311
38492F76311j89478j15324P6488J95141j4919n15438q93461p97307l38737J32328
$$ 676311 486833 371509 447997 643138 628219 112781 -780680 -1577987 -1916724 -1784396
38482a784396N26523R68310J294716J051081J85850o21890o86230j71780J36337
$$ -1784396 -1257873 -289563 1005153 2056234 2242084 1620194 933964 762184 898521
38473H98521j56399o17033o05394p4692L88577K55904l05288n84456j95417L80641
$$ 898521 742122 125089 -480305 -554997 -166420 89484 -215804 -800260 -995677 -615036
38463f15036M20609j0636k03567J097o6102o37688q14614R3854J215435J181104
$$ -615036 -194427 -205063 -408630 -407533 -473635 -1111323 -1925937 -1832083 -616648 564456
38453E64456J63465l88383L3136L75819j01169o45094l52494L75878N91613K30708
$$ 564456 727921 339538 372674 748493 647324 2230 -350264 25614 617227 847935
38443H47935j12346k54472l67560l06297J07394M64975L15912N7513L70403R58392
$$ 847935 735589 481117 113557 -192740 -85346 379629 695541 753054 1123457 2081849
38433B081849Q36005j36734r67853r38150m18976k4066K35181N18513N53643M1178
$$ 2081849 2917854 2781120 1813267 875117 456141 432075 667256 1185769 1739412 1780590
38423A780590p08273j048838p69330k80304j04912l24926m85288r6366O61621
$$ 1780590 1072317 23479 -745851 -1026155 -1131067 -1455993 -1941281 -2037647 -1376026
38414a376026R71924M17896l23643l52442J66615L27186n4433k33514J03800K80460
$$ -1376026 -404102 13794 -309849 -662291 -495676 -168490 -222923 -456437 -352637 -72177
38404g2177j66537o17921l30419M27256Q76838Q26928N79613K05398l42034p14789
$$ -72177 -238714 -856635 -1187054 -759798 117040 943968 1523581 1728979 1386945 672156
38394F72156n23564j2737K73381L14557M49954N80379K99965k24416l04492J94332
$$ 672156 148592 135855 409236 723793 1173747 1754126 2054091 1829675 1525183 1719515
38384A719515N41148J80571m97268p73289n25678j55084P6415K18935L23650L10643
$$ 1719515 2260663 2441234 1943966 1170677 644999 489915 566330 785265 1108915 1419558
38374A419558J06604k80107p60441j121584j106663o86691j56251J72339K74784
$$ 1419558 1526162 1246055 485614 -635970 -1742633 -2429324 -2585575 -2413236 -2138452
38365b138452L02928L09505K70761K69981L94317M71014K14084k65127m12054
$$ -2138452 -1835524 -1526019 -1255258 -985277 -590960 -119946 94138 -170989 -583043
38356e83043M1362N54832M13103k33425n03819l5362N07318M67220J46110J88759
$$ -583043 -541681 13151 426254 192829 -310990 -346352 160966 628186 774296 963055
38346I63055M94601M57683L736l80472m92659n01673l01749L26480R13507O62717
$$ 963055 1457656 1915339 1919075 1538603 1045944 544271 242522 569002 1482509 2145226
38336B145226k12226n56668j4447L92899m3743n65302k72578M04820N74671L59377
$$ 2145226 1933000 1376332 1361885 1754784 1711041 1145739 873161 1277981 1852652 2212029
38326B212029L56838L32870k58272r52316q34300j23052J50433j24316j05764
$$ 2212029 2568867 2901737 2643465 1691149 856849 733797 884230 759914 654150
38317F54150L35147L64236k05125m57565M2892M86628K03959k88204k63902J34122
$$ 654150 989297 1353533 1148408 690843 733735 1220363 1424322 1136118 872216 1006338
38307A006338M25714N58021N40028J13708o17391r83220p15516l59332k38065
$$ 1006338 1432052 1990073 2530101 2643809 2026418 1043198 327682 -31650 -269715
38298b69715Q0408P03408Q28815O0142o56770l93710L17266M71158K20265L02760
$$ -269715 -189307 514101 1342916 1403058 746288 352578 669844 1141002 1361267 1664027
38288A664027N34028K37981l10737l11103J4138k38371r11653r02472p1680M57056
$$ 1664027 2198055 2436036 2125299 1814196 1828334 1589963 678310 -224162 -295842 161214
38278A61214J59942j79507n1493p4826n92923p42432J07481J032019P94119k86283
$$ 161214 321156 141649 90156 15330 -577593 -1320025 -1212544 -180525 613594 327311
38268C27311q21105l05884M31524N53536J26538k78924k78765O7790L22058Q4778
$$ 327311 -493794 -799678 -368154 185382 311920 32996 -245769 -177979 144079 228857
38258B28857m09044m36341J68024N98737K22290l77470k48239M15173N62375j1814
$$ 228857 -180187 -616528 -448504 150233 372523 -4947 -253186 161987 724362 712548
38248G12548l02359L08528J010770P06705m14720j150362q57350r3657K91164
$$ 712548 410189 718717 1729487 2436192 2021472 871110 13760 -79897 211267
38239B11267J40234j21881j80968p4694Q4404K58621L25273Q3518l96679o57809
$$ 211267 351501 229620 48652 -26042 58362 316983 642256 725774 329095 -328714
38229c28714l64179J92355M09421J48651j52578j54712R92R9847K17215M16013
$$ -328714 -692893 -500538 -91117 57534 -95044 -249756 -248764 -148917 68298 484311
38219D84311M50962J35509k63415l74204k43424j17880O9204M92327Q57003O31998
$$ 484311 935273 1070782 807367 433163 189739 71859 141063 633390 1490393 2122391
38209B122391j01236o08503m86843j74724k19409n06224n90445m19400k67102
$$ 2122391 2021155 1412652 925809 751085 531676 25452 -564993 -984393 -1251495
38200a251495j98972q3829J303j27597k89415o0453N37328R16091O93008K20425
$$ -1251495 -1450467 -1534296 -1532993 -1660590 -1950005 -2010458 -1473130 -557039 135969 356394
38190C56394P1937K73192L80627J69961j14192j82238p2904k3486j68960m69576
$$ 356394 428331 701523 1082150 1252111 1137919 955681 882777 859291 690331 220755
38180B20755q01358j008454r40260n51739J3876M80142O19769M33490J62916Q0746
$$ 220755 -580603 -1589057 -2529317 -3081056 -3067180 -2587038 -1967269 -1533779 -1370863 -1290117
38170a290117K43068M79287O04880N54109L28584j1411k67163k24535L2771J42752
$$ -1290117 -1047049 -567762 37118 591227 919811 908400 641237 416702 449473 592225
38160E92225m3940k13785n5972K39076K57964k0687k48512k44610j38207l6936
$$ 592225 548285 334500 278528 517604 775568 754881 506369 261759 123552 86616
38150H6616O0241N1781j61321l70737k86157o0720j08257l66319l03868K12309
$$ 86616 146857 198638 37317 -333420 -619577 -680297 -788554 -1154873 -1458741 -1246432
38140a246432O56670O71138N43711N50111M46519O8282j57581J16537M64077L14514
$$ -1246432 -589762 81376 625087 1175198 1621717 1689999 1532418 1648955 2113032 2427546
38130B427546j16242k23974l1699o0303l88614n99520n63676n47223n72902l80399
$$ 2427546 2311304 2087330 2055631 1995328 1606714 1007194 443518 -103705 -676607 -1057006
38120a057006m0574P4228j6836Q9791M13008N13962L03438K08357L52024K99581
$$ -1057006 -1097580 -1023352 -1040188 -950397 -537389 -23427 280011 488368 840392 1139973
38110A139973j04985l69472j95032n339j68995l25784o3250K74495J28721l10189
$$ 1139973 1034988 665516 470484 465145 296150 -29634 -92884 181611 310332 143
38100A43l90279k5141K51051J71285M9232J62875L58239M02124L17327J94295
$$ 143 -390136 -415277 -164226 7059 56291 219166 577405 979529 1296856 1491151
38090A491151j9421l40341n63695m70002j39513J13000J28850Q9972K06925L30405
$$ 1491151 1471730 1131389 567694 97692 -41821 71179 200029 290001 496926 827331
38080H27331J29451l18769m79746j34412J65269j36127o37346m12863O43618J549850
$$ 827331 956782 638013 158267 23855 189124 52997 -584349 -997212 -353594 1196256
38070A196256J436958M71625n83125j189157j196149p16128j61826n920k17194
$$ 1196256 2633214 3104839 2521714 1332557 136408 -579720 -741546 -747466 -964660
38061i64660k90135j7561K30052K12237K44386N56011P57676M34275j41503l85208
$$ -964660 -1254795 -1272356 -1042304 -830067 -585681 -29670 728006 1162281 1020778 635570
38051F35570j73310J93958M79013N30122J63688m94677q46715m98125J28075L09886
$$ 635570 462260 656218 1135231 1665353 1829041 1334364 487649 -10476 117599 427485
38041D27485n2318m49960m80469j45110L37118O24332M00832j96460n53949l12714
$$ 427485 375167 -74793 -555262 -700372 -363254 261078 661910 465450 -88499 -401213
38031d01213J92286N17348O71127P20010M21880j92766m68100n7229L43475J5151
$$ -401213 -208927 308421 979548 1699558 2121438 1928672 1460572 1403343 1746818 1761969
38021A761969n52345m23320K25018M20742j2480l72971m34619o16039p97553l20345
$$ 1761969 1209624 786304 1011322 1432064 1419584 1046613 611994 -4045 -801598 -1121943
38011a121943N98344P94579k7630o69054k74054L77557K75224j63937O3351P93991
$$ -1121943 -523599 270980 243350 -425704 -699758 -322201 -46977 -210914 -147563 646428
38001F46428R95550M26239j31601j66634J6447P5166J04779J76992Q9124j88700
$$ 646428 1641978 2068217 1936616 1769982 1786429 1861595 1966374 2143366 2232490 2043790
37991B043790l28041j44395J01269J24981L3686Q1054K29256K11998m8930l07316
$$ 2043790 1715749 1571354 1672623 1797604 1831290 1912344 2141600 2353598 2304668 1997352
37981A997352l07050j06367P004j16929l27133l94930k62205M590L45653O52797
$$ 1997352 1690302 1583935 1590939 1474010 1146877 751947 489742 494332 839985 1492782
37971A492782P36426N38842K67467J44596J61943K34697L60333L99092J7835p66026
$$ 1492782 2229208 2768050 3035517 3180113 3342056 3576753 3937086 4336178 4354013 3587987
37961C587987j281914r53752j35015L57249L52188L19308L89306J79350l32188
$$ 3587987 2306073 1352321 1217306 1574555 1926743 2246051 2635357 2814707 2482519
37952B482519n61598k28035J74199J74825K0554J37380L62071K10006l40555p58850
$$ 2482519 1920921 1692886 1867085 2041910 2062464 2199844 2561915 2771921 2431366 1672516
37942A672516n88565N4385N76316M79182n8639l06821R2952N76784M36304j34440
$$ 1672516 1083951 1138336 1714652 2193834 2135195 1828374 1921326 2498110 2934414 2799974
37932B799974l81798j76607q3732l09418m26992k46702j16265j57936k9724K89285
$$ 2799974 2418176 2241569 2157837 1848419 1421427 1174725 1058460 900524 870800 1160085
37922A160085K96628j11870l15384L7513M66170N04693L45685J98988j64625o77041
$$ 1160085 1456713 1344843 1029459 1066972 1533142 2037835 2383520 2582508 2417883 1740842
37912A740842o27776K20447R23457O02583k18505m20999N5654L16082m5742n26175
$$ 1740842 1113066 1333513 2256970 2859553 2641048 2220049 2275703 2591785 2546043 2019868
37902B019868o12012l10862J80380O76700Q73235N57202j8115l61206l11215q4182
$$ 2019868 1407856 1096994 1277374 1954074 2827309 3384511 3366396 3005190 2693975 2609793
37892B609793J20106K60253L31684L49538L36040K11753q7492l49426k77464L4110
$$ 2609793 2729899 2990152 3321836 3671374 4007414 4219167 4131675 3782249 3504785 3538895
37882C538895K24986K35445K34748R0340l80506p21042l15200M35239M91917j21991
$$ 3538895 3763881 3999326 4234074 4324414 3943908 3222866 2907666 3342905 3834822 3712831
37872C712831k18491O35075J368708J107706L81869j724j01234j54891P4759N28980
$$ 3712831 3494340 4129415 5498123 6605829 6987698 6985974 6884740 6729849 6804608 7333588
37862G333588N63788J35381Q9352O31710Q67112N03743M37587R11383R29279M05640
$$ 7333588 7897376 8032757 8122109 8753819 9620931 10124674 10562261 11473644 12402923 12808563
37852A2808563P94839K397055L337467K730164K397586L624873M880021M985165
$$ 12808563 13603402 16000457 19337924 22068088 24465674 28090547 32970568 37955733
37844C7955733N638099Q013989R985101J0130582J1157190J5171201J9444194
$$ 37955733 43593832 51607821 61592922 71723504 82880694 98051895 117496089
37837A17496089K2491192K9716718M3759301N1778309L5022649n594306m4234597
$$ 117496089 139987281 169703999 213463300 265241609 300264258 294669952 250435355
37830B50435355n6910475m5832135l0531628k2533719j8549556j3799474r922332
$$ 250435355 193524880 147692745 117161117 94627398 76077842 62278368 52356036
37823E2356036q820473q039090n624855l666906l992078m686357l569176j725021
$$ 52356036 43535563 35496473 29871618 26204712 22212634 17526277 13957101 12232080
37815A2232080j135303j439998j241462o12239m27317o74395q45358q60831p02318
$$ 12232080 11096777 9656779 8415317 7803078 7375761 6701366 5856008 4995177 4292859
37806D292859k06090K86260K24725l4858K53254O46594Q5841j010488j117656
$$ 4292859 4086769 4373029 4597754 4562896 4816150 5462744 5548585 4538097 3420441
37797C420441j75631K29890m54337r49000m97356J1781o5497m5364M86324P74009
$$ 3420441 3244810 3474700 3020363 2071363 1574007 1585788 1520291 1474927 1961251 2735260
37787B735260M26864K13776N17131N61275m3800n36454n12803o08362r33160n29093
$$ 2735260 3162124 3375900 3893031 4454306 4410506 3874052 3361249 2752887 1819727 1290634
37777A290634P23286J374258O37145k90294k85775o2696n54974j088301p01125
$$ 1290634 2013920 3388178 4025323 3735029 3449254 3386558 2831584 1743283 1042158
37768A042158J7378K8958k91326q207N59599M90575J3429L7763M61209M30967
$$ 1042158 1059536 1088494 797168 788961 1348560 1839135 1852564 1890327 2351536 2782503
37758B782503p4495k91147n3968P0000j32556l20575l16971j89773J24159N42521
$$ 2782503 2708008 2416861 2362893 2432893 2300337 1979762 1662791 1473018 1597177 2139698
37748B139698N77036P3403k83260L6437M76343K98106j91404k59996j9054l3819
$$ 2139698 2716734 2790137 2506877 2543314 3019657 3317763 3126359 2866363 2847309 2813490
37738B813490j70426O1240M14090K90457o3667J18585P77575J092114Q26888N94389
$$ 2813490 2643064 2704304 3118394 3408851 3345184 3463769 4241344 5333458 6160346 6754735
37728F754735P50979R74506J050387J248896J737582K275549K674152L077349
$$ 6754735 7505714 8480220 9530607 10779503 12517085 14792634 17466786 20544135
37720B0544135L651067M279446M534130L797027J748543j000311l201234m220794
$$ 20544135 24195202 28474648 33008778 36805805 38554348 37554037 34352803 30132009
37712C0132009m498692m486767l944983k837835k002440k005982k086426j301231
$$ 30132009 25633317 21146550 17201567 14363732 12361292 10355310 8268884 6967653
37704F967653j38636J82430m11988q95953q12174o77927p83986p31454l06544
$$ 6967653 6829017 7011447 6599459 5703506 4891332 4213405 3429419 2697965 2391421
37695B391421R8325J19458j75392n36881o42004j51809P33151J107442M75394
$$ 2391421 2489746 2609204 2433812 1896931 1254927 1103118 1836269 2943711 3419105
37686C419105l58350l68094J23683j7991r17128j505635j069230K2523J052641
$$ 3419105 3060755 2692661 2816344 2798353 1881225 375590 -693640 -671117 381524
37677C81524J510210J080880M6638n15221M5717P92335M05139p42568j093530
$$ 381524 1891734 2972614 3019252 2504031 2549748 3342083 3747222 3004654 1911124
37668A911124l44280J86183k45372q15956p29575l26503n5500K99586P17379N37380
$$ 1911124 1566844 1753027 1507655 691699 -37876 -364379 -419879 -120293 597086 1134466
37658A134466k85297o86155q2837N93436L51861l28870m13751M6431K46026K3140
$$ 1134466 849169 163014 80177 673613 1025474 696604 282853 329284 575310 598450
37648E98450j08139K1324Q8915k6627j18768j01991n9560K6734K06521L79119
$$ 598450 490311 511635 600550 573923 455155 353164 293604 320338 526859 905978
37638I05978M35977L67939J15962l26480o06798l25119K68309N01935K95074K01070
$$ 905978 1341955 1709894 1825856 1499376 892578 567459 835768 1337703 1632777 1833847
37628A833847L17470P3946n92424q56776l38096J41017j47742o14457l09582N19322
$$ 1833847 2151317 2225263 1632839 776063 437967 578984 431242 -183215 -492797 26525
37618B6525P86080J41755o42308p27562n7096P32045Q87279K50781m13729k20010
$$ 26525 812605 954360 312052 -415510 -472606 259439 1146718 1397499 983770 763760
37608G63760N73832P62956p5022q81025o52013J44142M13024J2798l46401l03782
$$ 763760 1337592 2100548 2025526 1144501 492488 636630 1049654 1062452 716051 412269
37598D12269j25918o4351j02793j51348m8696L46649P65905O88241J68630j03991
$$ 412269 286351 222000 119207 -32141 -80837 265812 1031717 1719958 1888588 1784597
37588A784597J14906K48719p702j20105K02966L21091j94585o48328l33353K89806
$$ 1784597 1899503 2148222 2140520 2020415 2223381 2544472 2349887 1701559 1368206 1658012
37578A658012M83531M89695Q47474J195953Q89489K13165q5012P5596M01300R77256
$$ 1658012 2141543 2631238 3478712 4674665 5564154 5777319 5692307 5767903 6169203 7146459
37568G146459J764975K138807J939272K069812L009288L983997M878676P154939
$$ 7146459 8911434 11050241 12989513 15059325 18068613 22052610 26931286 34086225
37560C4086225J0647038J1213979N069962n087192j1887515j1651575p749561
$$ 34086225 44733263 55947242 61017204 55930012 44042497 32390922 24641361
37553B4641361m972861m030393l211534k288925k092223k175523j557878p03258
$$ 24641361 19668500 15638107 12426573 10137648 8045425 5869902 4312024 3608766
37545C608766o39945r77360o59210R3281L38452K05512M26734O91960J74950p47864
$$ 3608766 2968821 1991461 1332251 1425532 1763984 1969496 2396230 3088190 3263140 2515276
37535B515276r54593m40070j58798k55490j4124N39483N28087j91429p16276n62864
$$ 2515276 1560683 1120613 961815 706325 692201 1231684 1759771 1568342 852066 289202
37525B89202k31153j14942J9929K49911K33160k4488q1754P0745l3922l69027
$$ 289202 58049 -56893 -36964 212947 446107 421619 339865 410610 376688 7661
37515G661l53904N0444J66561k07902m01202k7314L71582K97099O7699Q5791P9584
$$ 7661 -346243 -295799 -129238 -337140 -738342 -765656 -394074 -96975 -29276 56515 136099
37504A36099l01777p20707o22128q2946L57175M42703L55932L43678M93378O75829
$$ 136099 -165678 -886385 -1508513 -1591459 -1234284 -791581 -435649 -91971 401407 1077236
37494A077236N51542o8915p72130q64739k82824K89131L60322J54223r125j98984
$$ 1077236 1628778 1559863 787733 -77006 -359830 -70699 289623 443846 434721 235737
37484B35737l77936r1020P60162J358951R05927k13490r08651q28962n87600o00506
$$ 235737 -142199 -233219 526943 1885894 2791821 2578331 1669680 840718 253118 -347388
37474c47388m99615O3141O75939O87081J19281l85862l96988q1163K06786L45262
$$ -347388 -847003 -783862 -107923 579158 698439 312577 -84411 -165574 41212 386474
37464C86474L28664N7649m38930p43432m35055K35134M88735L0609m98454m20011
$$ 386474 715138 772787 333857 -409575 -844630 -609496 -120761 -90152 -588606 -1008617
37454a008617M613J4571m68221p41023l87465J86900M43540L96837L55553M07470
$$ -1008617 -1004004 -989433 -1457654 -2198677 -2586142 -2399242 -1955702 -1558865 -1203312 -795842
37444g95842M55914M57044L71215J43986q3402n4759J32452J7178n03685q26078
$$ -795842 -339928 117116 488331 632317 548915 494156 626608 643786 140101 -685977
37434f85977l93485M77453R43739O49390K6834l04100j18343L50009O49129M76071
$$ -685977 -1079462 -602009 341730 991120 1017954 713854 595511 945520 1594649 2070720
37424B070720k788l06909k54410j81994l53035m86702k53831O1792o6621n32593
$$ 2070720 2067932 1761023 1506613 1324619 971584 484882 231051 292843 226222 -306371
37414c06371o79474k62932K38135L97680L93424N22713O23562L79603p1469k76018
$$ -306371 -985845 -1248777 -1010642 -612962 -219538 303175 926737 1306340 1234871 958853
37404I58853j31712k7567k44190n15623m05124K4543K18088j17011n38723m43837
$$ 958853 827141 799574 555384 39761 -365363 -340820 -122732 -239743 -778466 -1222303
37394a222303M1371J99137j99765m89218r8352N23793N27844p2948m33252j21341
$$ -1222303 -1180932 -981795 -1181560 -1670778 -1769130 -1245337 -717493 -790441 -1223693 -1345034
37384a345034L38081L28490k4575j88451J8652L41561N03924M37136K59752J77231
$$ -1345034 -1006953 -678463 -703038 -891489 -872837 -531276 -27352 409784 669536 846767
37374H46767K24058Q9615m62500r90060p27995K59033Q92483M59217l91037o06467
$$ 846767 1070825 1160440 697940 -292120 -1020115 -761082 131401 590618 199581 -406886
37364d06886j91485O7781j4055J26735O20538Q16382L71620j51190k11474j23203
$$ -406886 -598371 -530590 -544645 -417910 202628 1019010 1390630 1239440 1027966 904763
37354I04763l94788p65432n86828J06867N74958L64310j95477n26530m22639o0008
$$ 904763 509975 -255457 -842285 -735418 -160460 203850 8373 -518157 -940796 -1000804
37344a000804K90018M52514M59136N22172P44301Q71452N32602k62048j036510
$$ -1000804 -710786 -258272 200864 723036 1467337 2338789 2871391 2609343 1572833
37335A572833j283684q68880o3414O38189P87938L25867k97563n29500k94436
$$ 1572833 289149 -579731 -643145 -4956 782982 1108849 811286 281786 -12650
37326a2650k719L4331m1265K8654J70031J21077q1470q3384K26649M12316L4178
$$ -12650 -15369 18962 -22303 6351 176382 297459 215989 132605 359254 771570 805748
37315H05748o08774o91911L7049P61804N71585l35219r48363q21748m81497l73461
$$ 805748 196974 -494937 -457888 303916 875501 540282 -408081 -1229829 -1711326 -2084787
37305b084787j84309L61273P22206K95498m74425n95387J6315M36996J62090j90867
$$ -2084787 -2269096 -1907823 -1185617 -890119 -1364544 -1959931 -1943616 -1506620 -1344530 -1535397
37295a535397Q6846P35784R81936O23193J65544Q3969L49632O15199O08389L71835
$$ -1535397 -1448551 -712767 269169 892362 1057906 1141875 1491507 2106706 2715095 3086930
37285C086930K08860K83259K76964k68860j194411j682158j228814l48983M6525
$$ 3086930 3295790 3579049 3856013 3587153 2392742 710584 -518230 -867213 -820688
37276h20688k05985l94767O7464Q61141J144611N71060k98822o67565m20843j27042
$$ -820688 -1026673 -1421440 -1353976 -492835 651776 1222836 924014 256449 -164394 -291436
37266b91436j66761k86154j91709r2209k09781k01120K72346P35521M99352j25114
$$ -291436 -458197 -744351 -936060 -1028269 -1238050 -1439170 -1166824 -431303 68049 -57065
37256e7065j96652K97771L76827k35425n58010j8520N07508J37022n55365n16609
$$ -57065 -253717 44054 420881 185456 -372554 -391074 116434 253456 -301909 -818518
37246h18518J62037O85788R18453J132445J003052J63602o61792m58100M09104
$$ -818518 -656481 29307 947760 2080205 3083257 3246859 2585067 2126967 2536071
37237B536071P13237L79291M77745J231921J643650J322438J061765J209927J182474
$$ 2536071 3249308 3628599 4106344 5338265 6981915 8304353 9366118 10576045 11758519
37228A1758519J195772K549257M998649N676116K489708k588095n626523n409511
$$ 11758519 12954291 15503548 20502197 26178313 28668021 26079926 20453403 15043892
37220A5043892m003791l139625k361709j066374j43333m54248j155393q85478
$$ 15043892 11040101 7900476 5538767 4472393 4329060 3874812 2719419 1833941
37212A833941J81025O83872Q0645p55692q76442l72585K5389n2084l07819l10006
$$ 1833941 2014966 2698838 2779483 2023791 1147349 774764 800153 748069 440250 130244
37202A30244q7363l3893k30072j91760L80816Q88781M80309o33545j218120n91749
$$ 130244 42881 8988 -221084 -412844 -32028 856753 1337062 703517 -514603 -1106352
37192a106352M80011Q59075M55529L7144K6970J55039J49252J25493K11247K66497
$$ -1106352 -626341 232734 688263 725407 752377 907416 1056668 1182161 1393408 1659905
37182A659905J62071K5462K5647J00286N2615j66354l66500k99199N2453L49062
$$ 1659905 1821976 1847438 1873085 1973371 2025986 1859632 1493132 1193933 1246386 1595448
37172A595448J80526m23614r06339p79094j93813K94010M30587M38223N16619
$$ 1595448 1775974 1352360 446021 -333073 -526886 -232876 197711 635934 1152553
37163A152553N30501L19927K2386j34341j62648k03747k26475r4686J35758K40196
$$ 1152553 1683054 2002981 2025367 1891026 1728378 1524631 1298156 1203470 1339228 1579424
37153A579424J26385j17325m52129q78170j151515q66009l5420O79080O48513
$$ 1579424 1705809 1588484 1136355 258185 -893330 -1759339 -1794759 -1115679 -467166
37144d67166M6553l86501k79509K9087J06265j0662m2716M8901J02665J16673
$$ -467166 -420613 -807114 -1086623 -1057536 -951271 -961933 -1004649 -955748 -853083 -736410
37134g36410K61208N49458P28773N59549Q4587m09117o23713m55832n4719L10564
$$ -736410 -475202 74256 803029 1362578 1447165 1038048 414335 -41497 -96216 214348
37124B14348M78132M72788L64828J61422r4319k44059j78882p669R2031J24708
$$ 214348 692480 1165268 1530096 1691518 1597199 1353140 1174258 1166589 1258620 1383328
37114A383328J87355J78397j22385o02439p36738k15771N10115O58614R4908m56969
$$ 1383328 1570683 1749080 1626695 1024256 287518 71747 581862 1240476 1335384 878415
37104H78415l36622K18091M63910J83081j17863l6066J77220J09846j51379k12701
$$ 878415 541793 759884 1223794 1406875 1289012 1252946 1430166 1540012 1388633 1175932
37094A175932P976K48022L66525M57965N43328N17958M20553M07327M16247K00561
$$ 1175932 1183908 1431930 1798455 2256420 2799748 3317706 3738259 4145586 4561833 4762394
37084D762394k22207m90108l91927j45350m6327j23884k85987n15968p30141o91626
$$ 4762394 4540187 4050079 3658152 3512802 3466475 3342591 3056604 2540636 1810495 1118869
37074A118869k93904K22853M89428L15497k47002r09672j193243q03547n6776
$$ 1118869 824965 1047818 1537246 1852743 1605741 696069 -497174 -1300721 -1357497
37065a357497M04279L93310K76946K28706k8283n01184o08263n1137N53381N15760
$$ -1357497 -953218 -559908 -282962 -54256 -82539 -583723 -1191986 -1243123 -689742 -173982
37055a73982R7792J0910K45807J90411k58295n03774k03255K62871L99983J68954
$$ -173982 -76190 -65280 180527 370938 112643 -391131 -594386 -331515 68468 237422
37045B37422j40290j96226J98724Q16854J002404M35430k68524l11572J08408
$$ 237422 97132 -99094 99630 916484 1918888 2354318 2085794 1774222 1882630
37036A882630J19291m11611o75561k54567K43752K02126j47913k90684j59974
$$ 1882630 2001921 1590310 914749 660182 903934 1106060 958147 667463 507489
37027E07489J11643N21526Q28778N10800l92498j003324p45394j77923p7819k85692
$$ 507489 619132 1140658 1969436 2480236 2087738 1084414 339020 161097 83278 -202414
37017b02414k12479M7484P692k03961j04714J27990o9306m61426k06767O48120
$$ -202414 -414893 -367409 -359717 -563678 -668392 -540402 -609708 -1071134 -1277901 -629781
37007f29781R79387K77792m84157l02632L80578M74582r1230m58198k93148j37793
$$ -629781 349606 627398 143241 -159391 221187 695769 604539 146341 -146807 -284600
36997b84600k78501k18249L72272R28960P96660K70055J46523M74836M98501j05077
$$ -284600 -563101 -781350 -409078 519882 1316542 1586597 1733120 2207956 2706457 2601380
36987B601380o45382m07977L18431O82680L81148j98062o89195j005823r99005
$$ 2601380 1955998 1548021 1866452 2549132 2930280 2732218 2043023 1037200 38195
36978C8195n16830J22385L19036K5442j60971N6736K33168K1216j55836J72367
$$ 38195 -478635 -356250 -37214 -11772 -172743 -116007 117161 138377 -17459 154908
36968A54908O02830L79533m00000q37357m84375J19911L16965J72573J47625L17538
$$ 154908 757738 1137271 737271 -100086 -584461 -464550 -147585 24988 172613 490151
36958D90151L33812L2504k88019k87457o3614Q032j24408m4552M83617R79490
$$ 490151 823963 856467 568448 280991 217377 225409 101001 56449 540066 1519556
36948A519556P68103m7258o23199m58908M4450K70202J34799j15821l73947n62443
$$ 1519556 2287659 2240401 1617202 1158294 1202744 1472946 1607745 1491924 1117977 555534
36938E55534m76957j52784k8355l21904n97678l93284Q3738L62863M27396M77745
$$ 555534 78577 -74207 -102562 -424466 -1022144 -1415428 -1331690 -968827 -541431 -63686
36928f3686L80699K1671j49570K93452Q72249P49245J1109m53465k97108n2884
$$ -63686 317013 338684 189114 482566 1354815 2104060 2115169 1661704 1364596 1311712
36918A311712j05812k20655k16212k36324j77531K67436P73990N37682l95756
$$ 1311712 1205900 985245 769033 532709 355178 622614 1396604 1934286 1538530
36909A538530r13473m37580J89821N7187m65654n28997j89463m7538q0093J43080
$$ 1538530 625057 187477 377298 434485 -31169 -560166 -749629 -797167 -877260 -734180
36899g34180M51137L04792j42148j67847L62225Q02341P23000L60268K2282k53646
$$ -734180 -283043 21749 -120399 -288246 73979 876320 1599320 1959588 1981870 1728224
36889A728224l76826k06639J2548j43195n20593m90467K7083L20929l4962n03399
$$ 1728224 1351398 1144759 1157307 1014112 493519 3052 30135 351064 316102 -187297
36879a87297m05661J02680L83320K66617J20444J87098L36309L74289J99055k73139
$$ -187297 -592958 -490278 -106958 159659 280103 467201 803510 1177799 1376854 1103715
36869A103715r50227j359008r92021K9383R20473J022006M62976q4650j67249
$$ 1103715 153488 -1205520 -2197541 -2168158 -1247685 -225679 237297 152647 -14602
36860a4602R1009K95280K35635l255k28224l07035k08898j102J77193K03722N3995
$$ -14602 76407 371687 607322 604067 375843 68808 -140090 -141192 36001 239723 293718
36849B93718k15307n04883o59799n41148k27066j0915j7614L2538L95991P70850
$$ 293718 78411 -426472 -1086271 -1627419 -1854485 -1865400 -1883014 -1850476 -1454485 -683635
36839f83635O10619k9347m39256j94364L05336M69201K62622J0622j40575j72806
$$ -683635 -73016 -102363 -541619 -735983 -430647 38554 301176 311798 171223 -1583
36829a583L3912M11595M76907p8907p79525q91792m26247m7305p0414j53640n999
$$ -1583 32329 443924 920831 841924 62399 -829393 -1255640 -1302945 -1373359 -1526999 -1532998
36818a532998K00413K57576K35672K03479R6356J0521J57353L68660J71702m05596
$$ -1532998 -1332585 -1075009 -839337 -635858 -539502 -528981 -371628 -2968 168734 -236862
36808b36862o50793j53816N11942N64323P2313k94683k79820j99884k46811k43658
$$ -236862 -887655 -1041471 -529529 34794 107107 -187576 -467396 -667280 -914091 -1157749
36798a157749j12125m4153r1811l4403J85043K79628P7155j76811k16725j66505
$$ -1157749 -1269874 -1314027 -1405838 -1440241 -1255198 -975570 -898415 -1075226 -1291951 -1458456
36788a458456k52918l44582j53145K27244L96039K73576K45650N36764P98465
$$ -1458456 -1711374 -2055956 -2209101 -1981857 -1585818 -1312242 -1066592 -529828 268637
36779B68637N93990M3166l39540k95062J7362L73851O14079M99271p4583o71853
$$ 268637 862627 905793 566253 271191 288553 662404 1276483 1775754 1701171 1029318
36769A029318o33053K2750M91995K54901k20394k24322J78184L85460J77995j74213
$$ 1029318 396265 419015 911010 1165911 945517 721195 899379 1284839 1462834 1288621
36759A288621m87227p41571p41185l20508J88872L21427K46148M91256R21082
$$ 1288621 801394 59823 -681362 -1001870 -812998 -491571 -245423 245833 1166915
36750A166915P91687j8010o59385n41694j45809j35164l40035k40481R2460K33718
$$ 1166915 1958602 1940592 1281207 739513 593704 458540 118505 -121976 -29516 204202
36740B04202J87346K37400K97219Q7503k28888k47353k8949K4787q8227l669K66805
$$ 204202 391548 628948 926167 1013670 784782 537429 508480 533267 445040 441371 708176
36729G08176K96928K5054p7955J94614M05257J60881l02607n30649m53873k79820
$$ 708176 1005104 1030158 952203 1146817 1552074 1712955 1410348 879699 425826 146006
36719A46006j14660M207k1019j48855j11910J80601L73136J05459m46805p82123
$$ 146006 31346 35553 14534 -134321 -246231 -65630 307506 412965 -33840 -815963
36709h15963o93230l67589K8033N00493R49003J061444O46942q6487o93601q40825
$$ -815963 -1509193 -1876782 -1848749 -1348256 -399253 662191 1309133 1222646 529045 -311780
36699c11780m75551J78578O95000O75969J22708m53467m86933J5422M50640L06605
$$ -311780 -787331 -608753 86247 762216 884924 431457 -55476 -40054 410586 717191
36689G17191k74566p45487p95307n14661o8486M25449P05899M89053n9658l44809
$$ 717191 442625 -302862 -1098169 -1612830 -1681316 -1255867 -549968 -60915 -120573 -465382
36679d65382o9875L66853M63019K70934J33105Q0164p1318k67262l37800l68520
$$ -465382 -535257 -168404 294615 565549 698654 778818 707500 440238 102438 -266082
36669b66082m55451l13235K62055P26662L52178n83115j006487n68817o4950o9389
$$ -266082 -721533 -1034768 -772713 -46051 306127 -276988 -1283475 -1852292 -1917242 -1986631
36659a986631r8658L50959Q29342P49970M32732M25944L96902k43066j033843
$$ -1986631 -2085289 -1734330 -904988 -155018 277714 703658 1100560 857494 -176349
36650a76349r77182j75540K66889L0511J6690O86873J184825P42771o1947k75610
$$ -176349 -1153531 -1329071 -1062182 -1031671 -1014981 -328108 856717 1599488 1537541 1261931
36640A261931J1196J33322J14213M12938P85252M98120l93384r80462q19422m34875
$$ 1261931 1273127 1406449 1520662 1933600 2718852 3216972 2823588 1843126 1023704 588829
36630E88829k93189j17205L71109P39560M65633j82680m88265k77037l6782j28565
$$ 588829 295640 178435 549544 1289104 1754737 1572057 1083792 806755 769973 641408
36620F41408l32380k35248K21973O76611O87983J44434n68110q46461m44335K42361
$$ 641408 309028 73780 295753 972364 1660347 1804781 1236671 390210 -54125 188236
36610A88236N46378J86178m68149p60055l98095K15637M00780L5074k23590J84783
$$ 188236 734614 920792 452643 -307412 -705507 -489870 -89090 -54016 -277606 -92823
36600i2823Q37005Q18847M4765n57503l63650J04556P1375l31878m19074p6019
$$ -92823 744182 1563029 1607794 1050291 686641 791197 862572 530694 111620 35601
36590C5601J81167R9775m8455o8290p3948p3311J06447L81768M25852K20477P6299
$$ 35601 216768 316543 268088 199798 125850 52539 158986 540754 966606 1187083 1263382
36579A263382Q505l08983p80443p44126K2020P32403N74233j57954n06783j76852
$$ 1263382 1271887 962904 182461 -561665 -539645 192758 766991 609037 102254 -74598
36569g4598J99711N0707m36289p03486n27192j51726J06136K36560M79658Q60270
$$ -74598 125113 175820 -260469 -963955 -1491147 -1642873 -1536737 -1300177 -820519 39751
36559C9751R36860L34127n23418p25007r1182M76651K26835l98545n06863j00708
$$ 39751 976611 1310738 787320 62313 -28869 447782 674617 276072 -230791 -331499
36549c31499N7992k95630n97021l84431J24398N13451O58632N82146L04208N491
$$ -331499 -273507 -569137 -1166158 -1550589 -1426191 -912740 -254108 328038 632246 637737
36539F37737o5622L8374N7930N226R3513J92561n4711m78998m18262K45364P37075
$$ 637737 572115 610489 668419 673645 767158 959719 905008 426010 7748 253112 990187
36528I90187M63699j49336l65859j56850M7202J67002L74293M91743K01704k79442
$$ 990187 1453886 1304550 938691 781841 829043 996045 1370338 1862081 2063785 1784343
36518A784343l87955m9896K35499J61667o1691j92903k54178k41838j5061L67255
$$ 1784343 1396388 1346492 1581991 1743658 1681967 1489064 1234886 993048 977987 1345242
36508A345242N99195N70554M85455M04854R1414m74246q39829o72428k78502j63406
$$ 1345242 1944437 2514991 3000446 3405300 3496714 3022468 2182639 1510211 1231709 1068303
36498A068303l27566m12693l52896l86118m77977k70665K65083O06314L88966
$$ 1068303 740737 328044 -24852 -410970 -888947 -1159612 -894529 -288215 100751
36489A00751k6084p7592J74978K35510L2618R390K90150L79911l539l61328j94790
$$ 100751 74667 -2925 172053 407563 440181 449571 739721 1119632 1116093 754765 559975
36478E59975Q6773k38552r25414r30601N3516J044553J071630L58792k27545l30267
$$ 559975 646748 408196 -517218 -1447819 -1394303 -349750 721880 1080672 853127 522860
36468E22860j52793J58565N18816O02133K21080j64047K5759N45324N75424r3969
$$ 522860 370067 528632 1047448 1649581 1870661 1706614 1732373 2277697 2853121 2759152
36458B759152p97177r92588q63139p22003m68624J857L69467L25259R6756J17656
$$ 2759152 1961975 969387 106248 -615755 -1084379 -1082522 -713055 -387796 -291040 -173384
36448a73384M04988O24426N86634L55479K5645l01665m52882l73471k77460l55061
$$ -173384 231604 856030 1442664 1798143 1823788 1522123 1069241 695770 418310 63249
36438F3249m42044k40417K10455N37952M86485J67744j21250j82054m0736J07836
$$ 63249 -378795 -619212 -408757 129195 615680 783424 662174 480120 439384 547220
36428E47220J20487J00737K41614M43416L25669k46703q78747j074562p58699
$$ 547220 667707 768444 1010058 1453474 1779143 1532440 653693 -420869 -1179568
36419a179568j93429L93030Q55728J023376Q37246M77469J28361k16321n09575
$$ -1179568 -1372997 -979967 -124239 899137 1736383 2213852 2342213 2125892 1616317
36410A616317m86724p6923K72884J11100l60361n87224m61254l13181k37099k1068
$$ 1616317 1129593 1052670 1325554 1436654 1076293 489069 27815 -285366 -522465 -543533
36400e43533K70772K93062R8627J78367O06148P71620L09102k72115l33811j4429
$$ -543533 -272761 20301 118928 297295 903443 1675063 1984165 1712050 1378239 1363810
36390A363810J31055L0730N6559L05016M82250M22331K41679J5506k83851n48595
$$ 1363810 1494865 1525595 1582154 1887170 2369420 2791751 3033430 3048936 2765085 2216490
36380B216490o12023n49465n59381n70624l24257J47270M67457L95037Q1785j78558
$$ 2216490 1604467 1055002 495621 -75003 -399260 -251990 215467 610504 692289 513731
36370E13731k23825o1807J34270J24666p3571r3032K69284O37739N56027J91619
$$ 513731 289906 228099 362369 487035 413464 320432 589716 1227455 1783482 1975101
36360A975101J2884n1669m20541q79473o58810L00912J003663P30600k7639m80550
$$ 1975101 1987985 1936316 1515775 636302 -22508 278404 1282067 2012667 1985028 1504478
36350A504478o47991q71346q70019k14222O41594P80219J62726l32014k15216
$$ 1504478 856487 -14859 -884878 -1099100 -457506 322713 485439 153425 -61791
36341f1791Q0860Q0661r6607j88046k00391j09007K56798P34874P84797K55208
$$ -61791 19069 99730 3123 -184923 -385314 -494321 -237523 497351 1282148 1537356
36331A537356k82755l15283o5076k5000k04378k49139k3285L04507N30930M82884
$$ 1537356 1254601 939318 874242 849242 644864 395725 372440 676947 1207877 1690761
36321A690761O9253m51724n43818m8457M95916N09432Q7748k54864k83060j27930
$$ 1690761 1760014 1308290 764472 716015 1211931 1721363 1809111 1554247 1271187 1143257
36311A143257N2422J10151j46243o31252q40432m64726P4498J68819j21398k80834
$$ 1143257 1195679 1305830 1159587 528335 -312097 -776823 -702325 -533506 -654904 -935738
36301i35738j99219j80346k05757Q2641O00520P39900L07574p9977J03461N02932
$$ -935738 -1134957 -1315303 -1521060 -1438419 -837899 -97999 209575 129598 233059 735991
36291G35991M36544r8528m50928k13294K91822M46333M8407m70214n10004J1643
$$ 735991 1172535 1074007 623079 409785 701607 1147940 1196347 726133 216129 227772
36281B27772N36800N38998J53755j14107j41850k31338m62269n06641j97047J68764
$$ 227772 764572 1303570 1457325 1343218 1201368 970030 507761 1120 -195927 -27163
36271b7163K78679J87572N5038j44871m24997n95311n00370k19304J12853M23096
$$ -27163 251516 439088 494126 349255 -75742 -671053 -1171423 -1390727 -1277874 -854778
36261h54778N49472L26077m5133j00965K13851L86065P5470l88227n24621l19788
$$ -854778 -305306 20771 -24362 -125327 88524 474589 550059 161832 -362789 -682577
36251f82577k1654K76474N03674M63794K01707J24461L55976L99658q1074n92776
$$ -682577 -704231 -427757 75917 539711 741418 865879 1221855 1621513 1540439 947663
36241I47663n14841p8644L5578k36255m15308l69347l39290k50748J47900N24866
$$ 947663 432822 354178 389756 153501 -261807 -631154 -970444 -1221192 -1073292 -548426
36231e48426K38006n50870q96214l81580L95235Q46039J039663J025606M38020
$$ -548426 -310420 -861290 -1757504 -2139084 -1743849 -897810 141853 1167459 1605479
36222A605479o73732j411392j122339l37275O5629R4842K89358N85733M32693
$$ 1605479 931747 -479645 -1601984 -1939259 -1873630 -1778788 -1489430 -903697 -471004
36213d71004j66721n68880m27515l0173L03005N15332M88454Q2343l81177l06211
$$ -471004 -637725 -1206605 -1634120 -1664293 -1361288 -845956 -357502 -275159 -656336 -962547
36203i62547K88370O41439L12145j48176k580N97085Q58980M57683j39755m27364
$$ -962547 -674177 -32738 279407 131231 128651 725736 1584716 2042399 1902644 1475280
36193A475280m62199n62684p46530p31064l53573K27875P08711Q54905N86767
$$ 1475280 1013081 450397 -296133 -1027197 -1380770 -1152895 -444184 410721 997488
36184I97488L0791m89411o79677n44380k89069M1001N52057J046124R67998J42180
$$ 997488 1028279 538868 -140809 -685189 -974258 -933257 -381200 664924 1632922 1775102
36174A775102p39049q45701k67402J81368J17649o8932n7820o4782k20439j66857
$$ 1775102 1036053 190352 -77050 104318 221967 153035 95215 30433 -190006 -356863
36164c56863K79205O16920L62582j68751l68193k71336l45866n87995n42660j54335
$$ -356863 -77658 539262 901844 733093 364900 93564 -252302 -840297 -1382957 -1537292
36154a537292Q2883r0608l31176k62585K8182K32744K23153P9001l5664L4263
$$ -1537292 -1454409 -1545017 -1876193 -2138778 -2110596 -1877852 -1654699 -1575698 -1611362 -1577099
36144a577099K50074L25965R6503j77573j64128M5301J63941K34411M49195O31834
$$ -1577099 -1327025 -1001060 -904557 -1082130 -1246258 -1200957 -1037016 -802605 -353410 278424
36134B78424M77436J77861J50205K34907o8310n77478n40968O6213L29812j37212
$$ 278424 755860 933721 1083926 1318833 1250523 673045 132077 198290 528102 390890
36124C90890m86352k7861N37321J72576q22659j208894n67669K91126N89704L92533
$$ 390890 -95462 -123323 413998 586574 -236085 -1444979 -2012648 -1721522 -1131818 -739285
36114g39285R4040j63145l47951l48494j59049M3978J28710J08984M6659M5588
$$ -739285 -645245 -808390 -1156341 -1504835 -1663884 -1619906 -1491196 -1382212 -1335553 -1289965
36104a289965K05927L67760J42599m97423r52916p16867p3125L73265N39192O81283
$$ -1289965 -1084038 -716278 -573679 -1071102 -2024018 -2740885 -2814010 -2440745 -1901553 -1220270
36094a220270P03524L66508l3817K17K58889Q8861m41438n28881P9853O73070
$$ -1220270 -516746 -150238 -184055 -183838 75051 163912 -277526 -806407 -726554 -53484
36084e3484P00842M71025L62928J68877k84054n83176l93395q0199p1205j15531
$$ -53484 647358 1118383 1481311 1650188 1366134 782958 389563 309364 238159 122628
36074A22628J91806N93995N53206J26506j79220j96560j55322j31337J2861K38671
$$ 122628 314434 908429 1461635 1588141 1408921 1212361 1057039 925702 938563 1177234
36064A177234L27133J84144j38563n30474p13047m25015R776j52469r07932j152043
$$ 1177234 1504367 1688511 1549948 1019474 306427 -118588 -108812 -261281 -1169213 -2321256
36054b321256j76995J091232J268269M47087j23353J0337J08919k38322m63238
$$ -2321256 -2498251 -1407019 -138750 308337 184984 195321 304240 65918 -397320
36045c97320j68443J86787J93449J51548L41170M63782L03522J71323J91093o7893
$$ -397320 -565763 -378976 -185527 -33979 307191 770973 1074495 1245818 1436911 1369018
36035A369018o75657q66741k05285N11595L82728j77285j32533N07360P93752
$$ 1369018 693361 -173380 -378665 132930 515658 338373 205840 713200 1506952
36026A506952L90997o8182j92921l70828q44345j114551p02677P1047M98899L29857
$$ 1506952 1897949 1829767 1636846 1266018 421673 -692878 -1395555 -1324508 -825609 -495752
36016d95752r7644l12935j05370L32297N39927K46564k92100n89521m71100r7505
$$ -495752 -593396 -906331 -1011701 -679404 -139477 107087 -185013 -774534 -1245634 -1343139
36006a343139L53169O69183N07345j68522p21230n31010N0660J49917k59068k93454
$$ -1343139 -989970 -320787 186558 18036 -703194 -1234204 -1183544 -1033627 -1292695 -1586149
35996a586149L59019Q26612L73704m70520p36626l37739J33451M21569O42054
$$ -1586149 -1227130 -400518 -26814 -497334 -1233960 -1571699 -1438248 -1016679 -374625
35987c74625O51177K09974l67550m75622j01093J77638N6937k05518l47605l64745
$$ -374625 276552 486526 118976 -356646 -457739 -280101 -223164 -428682 -776287 -1141032
35977a141032k14479J53999M43862K76714j30422j66969K19549M50409L19189
$$ -1141032 -1355511 -1201512 -757650 -480936 -611358 -778327 -558778 -108369 210820
35968B10820K84113M78755K87258n51985j192493p95689J75360O38576M49163
$$ 210820 494933 973688 1260946 708961 -483532 -1279221 -1103861 -465285 -16122
35959a6122L29562N08917M86132J43808M2807L50051M26158o5254m56358r4066
$$ -16122 313440 822357 1308489 1452297 1495104 1845155 2271313 2206059 1749701 1655635
35949A655635N83828P03503K32949j46543j64964j89625m21119n92957n52483
$$ 1655635 2239463 2942966 3175915 3029372 2864408 2674783 2253664 1660707 1108224
35940A108224n15163n54480l65129J90147O99596O97296K92817M715R8817L41598
$$ 1108224 593061 38581 -326548 -136401 563195 1260491 1553308 1558023 1656840 1998438
35930A998438L62153P5063k79928m38505l95836l36438l00241j11023K42967L99744
$$ 1998438 2360591 2435654 2155726 1717221 1321385 984947 684706 573683 816650 1216394
35920A216394Q4117m05263n62072m10359l89586n29612l46199K65877O54079L25681
$$ 1216394 1300511 895248 333176 -77183 -466769 -996381 -1342580 -1076703 -422624 -96943
35910i6943k50101l04368J01379K43315j09533l76215r0890M28762O10800M09151
$$ -96943 -347044 -651412 -550033 -306718 -416251 -792466 -883356 -454594 156206 565357
35900E65357J81846L4560k65807p22094q67449l66877L47452M58792j47241n94217
$$ 565357 747203 781763 515956 -206138 -1073587 -1440464 -1093012 -634220 -781461 -1375678
35890a375678j29958P95243J092353N19948p1241n7866J38847q2009m95948n21911
$$ -1375678 -1505636 -710393 381960 901908 830667 772801 911648 829639 333691 -188220
35880a88220k09421l4643k0619J61029L70934J21138m49363n46271P9932O27519
$$ -188220 -397641 -432284 -452903 -291874 79060 200198 -249165 -795436 -715504 -87985
35870h7985L56177l47835n34278L3143O84556P80675L91950J5522r2520j53288
$$ -87985 268192 -79643 -613921 -580778 103778 884453 1276403 1291925 1199405 1046117
35860A046117m64240q62019q06215j40115N13111M96118N3465k9186L63645N23280
$$ 1046117 581877 -280142 -1086357 -1226472 -713361 -217243 -163778 -192964 170681 693961
35850F93961J00936k93638n9083M51724M90563j4267n03815o10144m08427p0613
$$ 693961 794897 501259 442176 893900 1384463 1370196 866381 256237 -152190 -222803
35840b22803K38049K84851M4795j03465J20771L84283J86898l47604o46783n35469
$$ -222803 15246 300097 344892 241427 362198 746481 933379 585775 -61008 -596477
35830e96477l42011k09144Q1519N05262O19517K47433j45165q6632K41036L40598
$$ -596477 -938488 -1147632 -1066113 -560851 58666 306099 160934 74302 315338 655936
35820F55936J51356N8935K35162L61363J39448j84871j12509L17618L95814l11671
$$ 655936 807292 866227 1101389 1462752 1602200 1417329 1304820 1622438 2018252 1706581
35810A706581j138557r85279J84145J144663R70999J70382k32683j57601k44294
$$ 1706581 568024 -417255 -233110 911553 1882552 2052934 1820251 1662650 1418356
35801A418356n52938m66491J30429N16234K30006k67101l99807l00565l54554
$$ 1418356 865418 398927 529356 1045590 1275596 1008495 608688 308123 -46431
35792d6431m36470j62589L90116P29757N82891J09522m01146p32022p24418l57184
$$ -46431 -482901 -645490 -255374 474383 1057274 1166796 765650 33628 -690790 -1047974
35782a047974J62466N53483O90151O16444M35337K43939O4497j79911m88266o42490
$$ -1047974 -885508 -332025 358126 974570 1409907 1653846 1718343 1538432 1050166 407676
35772D07676m78123k09751j44734j46623J44544N64689N07781q3225m61036j64617
$$ 407676 -70447 -280198 -424932 -571555 -427011 137678 645459 562234 101198 -63419
35762f3419K38969K2794n77392p43674k68048K80033M18661K08586p3368k09297
$$ -63419 175550 198344 -379048 -1122722 -1390770 -1110737 -692076 -483490 -556858 -766155
35752g66155m1793L57109N85609L79970M7981k911L0514k92340p30447n51801
$$ -766155 -807948 -450839 134770 514740 562721 559810 590324 297984 -432463 -984264
35742i84264K66551P96731M37218k16676k58722K52546M95721J15012l64859l70410
$$ -984264 -717713 79018 516236 299560 40838 293384 789105 904117 539258 168848
35732A68848l9500P1284k15692m85386l12987J57223L92420J60867j98990k54840
$$ 168848 129348 200632 -15060 -500446 -813433 -656210 -263790 -102923 -301913 -556753
35722e56753J4504L14165L85909J05441m70451r16345o65603J92864P23601K94016
$$ -556753 -542249 -228084 157825 263266 -207185 -1123530 -1789133 -1596269 -872668 -578652
35712e78652m33619l87614L02660N37973M2766k06434L39489Q29026M18050k87389
$$ -578652 -1012271 -1399885 -1097225 -559252 -516486 -722920 -383431 445595 863645 576256
35702E76256j81054N76038Q50217L02792k42104j97480J6649j62113o04913q68321
$$ 576256 395202 971240 1821457 2124249 1882145 1684665 1701314 1539201 934288 65967
35692F5967q09663m96569R032M68059N04958J47927o4028J63553L97550J33674
$$ 65967 -743696 -1240265 -1231233 -763174 -258216 -110289 -174317 -10764 386786 520460
35682E20460l93554n31606j50461K31837K31677O5075J20793L94823N56627M25265
$$ 520460 126906 -404700 -555161 -323324 -91647 -26572 94221 489044 1045671 1470936
35672A470936J71838L9679m341k09210o24096r12838p47042k75836M5079N5009
$$ 1470936 1642774 1682453 1678112 1468902 844806 -68032 -815074 -1090910 -1045831 -990822
35662i90822J8751J26227K14962J38534P2135J98316L53846K80228K2424k07527
$$ -990822 -972071 -845844 -630882 -492348 -420213 -221897 131949 412177 434601 227074
35652B27074l66900m71051l50660Q5535M85928L97091q1550m16391l93572k91772
$$ 227074 -139826 -610877 -961537 -876002 -390074 7017 -74533 -490924 -884496 -1176268
35642a176268k73602j33841J80937L18693Q8520j51102m3026J91487J68695M8847
$$ -1176268 -1449870 -1583711 -1402774 -1084081 -995561 -1146663 -1189689 -998202 -829507 -780660
35632g80660K85148P85880Q92812K90397n05631p72647m06911R4885L01975K60060
$$ -780660 -495512 290368 1183180 1473577 967946 195299 -211612 -116727 185248 445308
35622D45308K65321M10066M71411K46293j28901l33211k79098j66480j22659o6714
$$ 445308 710629 1120695 1592106 1838399 1709498 1376287 1097189 930709 808050 741336
35612G41336k482j07397l49889l71207l2225K66325J92450P8661L89702Q53138
$$ 741336 738854 631457 281568 -89639 -121864 144461 336911 415572 805274 1658412
35602A658412P75538J26433l97683m46678m38036o85505p89824l17682M20491
$$ 1658412 2433950 2560383 2162700 1716022 1277986 592481 -197343 -515025 -94534
35593i4534P60964N39094J32662j06860j05827M3062J30768m1772l42191l54374
$$ -94534 666430 1205524 1338186 1231326 1125499 1168561 1299329 1257557 915366 560992
35583E60992J5265K93504J01531k82920m05437l31965l74720m09170p0097N02739
$$ 560992 576257 869761 971292 688372 282935 -49030 -423750 -832920 -903017 -400278
35573d00278P31189M32746N9219J2449J68119K04247L6647k03122l47790k79420
$$ -400278 330911 763657 822876 835325 1003444 1207691 1244338 1041216 693426 414006
35563D14006o4816J4845j64864k57932J26018P41811R05959M11327k03365m04076
$$ 414006 349190 364035 199171 -58761 67257 809068 1715027 2126354 1922989 1518913
35553A518913k56367j08424o9351l5488L7793R4483L4651k51186o85031q63709
$$ 1518913 1262546 1154122 1084771 1049283 1087076 1181559 1216210 965024 279993 -583716
35543e83716m65987J96654M67050K47611J22556M08919O24009K44351m40001o77054
$$ -583716 -1049703 -853049 -385999 -138388 -15832 393087 1017096 1261447 821446 144392
35533A44392k09417N02097Q51356O08599L9738k85401j6698M77026M38119k54454
$$ 144392 -65025 437072 1288428 1897027 1936765 1651364 1634666 2111692 2549811 2295357
35523B295357p94270n04150K31790N53497K92917j6065p0811j08031l22378n50012
$$ 2295357 1501087 996937 1228727 1782224 2075141 2059076 1988265 1880234 1557856 1007844
35513A007844o10703n24826l19177J935K50346J98673k6505p8989L8831k9401
$$ 1007844 397141 -127685 -446862 -444927 -194581 4092 -22413 -101402 -62571 -91972
35503i1972l35357m30223n2360M03381M33247J38152J1588J99011L64837K50225
$$ -91972 -427329 -857552 -909912 -506531 -73284 64868 76456 275467 640304 890529
35493H90529K845j29035j57413k35169l20356j78367K56159O67200O30396Q1035
$$ 890529 893374 764339 606926 371757 51401 -126966 129193 796393 1426789 1507824
35483A507824n74697q26168m90828J74649O83582O67535J88048k57044j96425
$$ 1507824 933127 106959 -383869 -209220 474362 1141897 1329945 1072901 876476
35474H76476K84552O27253M62525k898l39365m00830l33942k99781l74326n46373
$$ 876476 1161028 1788281 2250806 2247908 1908543 1507713 1173771 873990 499664 -46709
35464d6709o41761m45873p2775M2796k43724m70568k01537K86807L89501O8288
$$ -46709 -688470 -1134343 -1207118 -1164322 -1408046 -1878614 -2080151 -1793344 -1403843 -1335555
35454a335555j40299M4675L14838L34618J98131J72043K92777L67154J93987k40760
$$ -1335555 -1475854 -1431179 -1116341 -781723 -583592 -411549 -118772 248382 442369 201609
35444B01609o33886n47152L4835N18698M38030J53048K97814P23102O92841Q6420
$$ 201609 -432277 -979429 -944594 -425896 12134 165182 462996 1186098 1878939 1965359
35434A965359m05709m16363l71863n15274l52986L45727P95258K68063o32155
$$ 1965359 1559650 1143287 771424 256150 -96836 248891 1044149 1312212 680057
35425F80057o99128J76819R36344Q34725J40205o11240j186121j347369q05699
$$ 680057 -19071 157748 1094092 1928817 2069022 1457782 271661 -1075708 -1881407
35416a881407J90709Q44324P39879L05375P4259J0142j09532j72737n0988o356
$$ -1881407 -1690698 -846374 -106495 198880 273139 283281 173749 1012 -49976 -56332
35406e6332k71377n49789m51824j53968p3101j05032J74959O47797O83388J43334
$$ -56332 -327709 -877498 -1329322 -1483290 -1556391 -1661423 -1486464 -838667 -155279 -11945
35396a1945k93708r0257L84674M40526M9242k09997p636L66258M76236K65344
$$ -11945 -305653 -395910 -11236 429290 478532 268535 260899 627157 1103393 1368737
35386A368737K2207m356J32162J65472n3581l71764n57737o10565o35998n13983
$$ 1368737 1390944 1386588 1518750 1684222 1630641 1258877 701140 90575 -545423 -1059406
35376a059406n7763M93474O15570K78799P0858K65993L33264j64255p23574o22620
$$ -1059406 -1117169 -623695 -8125 270674 341532 607525 940789 776534 52960 -569660
35366e69660n6950K47623K37839M06092O44770L30488l79926m93458K46957Q32500
$$ -569660 -626610 -378987 -141148 264944 909714 1240202 860276 366818 613775 1446275
35356A446275N47282O498n7454k9455m88578r23648n42475K41513L83097j01723
$$ 1446275 1993557 2000055 1942601 1913146 1424568 500920 -41555 199958 583055 481332
35346D81332k70887J00323K65918r5637m35444m41317m69315o13756m11981J71100
$$ 481332 210445 310768 576686 481049 45605 -395712 -865027 -1478783 -1890764 -1719664
35336a719664M60611J87931n2974R0225J30551k01483k77312L12915Q32218M80048
$$ -1719664 -1259053 -1071122 -1124096 -1033871 -903320 -1104803 -1382115 -1069200 -236982 243066
35326B43066k91699n10974j95217j07480l62546l29761J88036O30823N96927L09163
$$ 243066 -48633 -559607 -754824 -862304 -1224850 -1554611 -1366575 -735752 -138825 170338
35316A70338N6908j78242l97241m14256j73715J27354K97149K51342n4787m69499
$$ 170338 227246 49004 -348237 -762493 -936208 -808854 -511705 -260363 -315150 -784649
35306g84649n71829j49028M04206N72656M16179L11134K24095j39162n81519n12556
$$ -784649 -1356478 -1505506 -1101300 -528644 -112465 198669 422764 283602 -297917 -810473
35296h10473J29668O66988N52419l2983n85051q18637o69672k04285K78246L97800
$$ -810473 -680805 -13817 538602 505619 -79432 -898069 -1567741 -1772026 -1493780 -1095980
35286a095980J16837k39726m26735m44869k92707M8122L63110L71462K03157K73974
$$ -1095980 -979143 -1218869 -1645604 -2090473 -2383180 -2335058 -1971948 -1600486 -1397329 -1123355
35276a123355N99942O99627L31814j17365k02363J3587J99489K38719K25325K39474
$$ -1123355 -523413 176214 508028 390663 188300 201887 401376 640095 865420 1104894
35266A104894L32591N07026N59519K06026m74145r77762r42638n48298j88850
$$ 1104894 1437485 1944511 2504030 2710056 2235911 1258149 315511 -232787 -421637
35257d21637K2443K20804M41686N31804L65845M0762j58513m0711J93117R2877
$$ -421637 -399194 -178390 263296 795100 1160945 1201707 1043194 1002483 1195600 1288477
35247A288477m42070r11841q16865k93047J77932M36316N75838M73139R725l89041
$$ 1288477 846407 -65434 -882299 -1175346 -997414 -561098 14740 487879 497604 108563
35237A08563j63625M40953N95254J29779k29713p3452P6491k45034o11149m29332
$$ 108563 -55062 385891 981145 1110924 881211 807759 884250 639216 28067 -401265
35227d01265R0968L23504J50437q6423k21815k98162k28163N2402K91711K28083
$$ -401265 -310297 13207 163644 77221 -144594 -442756 -670919 -618517 -326806 -98723
35217i8723J0275o3364j2859k2042m5529O2165K33707L35632M02961M34639K45954
$$ -98723 -88448 -151812 -164671 -186713 -232242 -170077 63630 399262 802223 1236862 1482816
35206A482816j52015l53244j12535K22353K41491J11810K25714M97215N07202
$$ 1482816 1330801 977557 865022 1087375 1328866 1440676 1666390 2163605 2670807
35197B670807J53357k86268n63114n67795k60832J65309L36302K20458K24133
$$ 2670807 2824164 2537896 1974782 1406987 1146155 1311464 1647766 1868224 2092357
35188B092357M47437L88701j54414n34558k67238M9871l09288r06064q41530k87364
$$ 2092357 2539794 2928495 2774081 2239523 1972285 2022156 1712868 806804 -34726 -322090
35178c22090j06660k59513M9394P12675O72954k34773p99138k79455N28652P18596
$$ -322090 -428750 -688263 -638869 73806 746760 511987 -287151 -566606 -37954 680642
35168F80642O02856P96752R77910N60224j16416k82767N2769L03947L44762M90116
$$ 680642 1283498 2080250 3058160 3618384 3501968 3219201 3271970 3575917 3920679 4410795
35158D410795P02796O31431L11588J51812L05904O01418R51991J331876J512935
$$ 4410795 5113591 5745022 6056610 6208422 6514326 7115744 8067735 9399611 10912546
35149A0912546J342525J131221J285495J721696K099910K426592K931755L559736
$$ 10912546 12255071 13386292 14671787 16393483 18493393 20919985 23851740 27411476
35141B7411476M109538M704853N614142O789873Q097705R795396J2257590J5427927
$$ 27411476 31521014 36225867 41840009 48629882 56727587 66522983 78780573 94208500
35133I4208500J8919951K2020658K2795852J8100123O429885q907154k1149377
$$ 94208500 113128451 135149109 157944961 176045084 182474969 173567815 152418438
35126A52418438k5697019k3668277j9406605j5721072j2669777r816032p580542
$$ 152418438 126721419 103053142 83646537 67925465 55255688 45439656 37859114
35119C7859114o234538n192755m025547l194715l084028l048614k251080r93506
$$ 37859114 31624576 26431821 22406274 19211559 16127531 13078917 10827837 9834331
35111I834331l60255o87435j180042j127072p82248p23039q87061p63552k79566
$$ 9834331 9474076 8786641 7606599 6479527 5697279 4974240 4087179 3323627 3044061
35102C044061N3962j08556m76881n60746l02447o3565j18336l63458n04395l84786
$$ 3044061 3098023 2989467 2512586 1951840 1649393 1585828 1467492 1104034 599639 214853
35092B14853j00870J32194J77943O5730o1493m5874J93919N55963P26372M20263
$$ 214853 113983 246177 424120 489850 428357 382483 576402 1132365 1858737 2279000
35082B279000k36570p06461n92921r9149K50364K44512J01009K6763j9593j03659
$$ 2279000 2042430 1335969 743048 643899 894263 1138775 1239784 1266547 1246954 1143295
35072A143295j54984j17773k9554R5581K14827R4275m33774r91547q99836j16517
$$ 1143295 988311 870538 840984 936565 1151392 1245667 811893 -179654 -1079490 -1196007
35062a196007N32435M16981k4545J5078M62261M89218j77392p69175n24108K83156
$$ -1196007 -663572 -246591 -271136 -256058 206203 695421 518029 -251146 -775254 -492098
35052d92098P28668L91773k52110n26834l37387j34789k34501l95362k06106K45008
$$ -492098 236570 628343 376233 -150601 -487988 -622777 -857278 -1252640 -1458746 -1213738
35042a213738L97644r805n12603m97048K8399N40677P08947O34241M70757K06476
$$ -1213738 -816094 -825899 -1338502 -1835550 -1807151 -1266474 -557527 76714 547471 753947
35032G53947j29367l63186l87138k54847j8877L02567N55386M98604J24706k62573
$$ 753947 624580 261394 -125744 -380591 -399468 -96901 458485 957089 1081795 819222
35022H19222l79398k09614J15670M65688O53107M69108l8044m60222m05967N0307
$$ 819222 439824 230210 345880 811568 1464675 1933783 1895739 1435517 1029550 1079857
35012A079857M22102L15182j88397o51495p41943n35187l46744l29192l54995
$$ 1079857 1501959 1817141 1628744 977249 235306 -299881 -646625 -975817 -1330812
35003a330812k82759j47277j2808J62534L83652N27069N49481N88017O62759N08499
$$ -1330812 -1613571 -1760848 -1773656 -1611122 -1227470 -700401 -150920 437097 1099856 1608355
34993A608355k5299o03494p50074m19215O2750M34900N64951L34485j04058k12158
$$ 1608355 1583056 979562 229488 -189727 -126977 307923 872874 1207359 1103301 891143
34983H91143K41392O05170J60293o52660o99021J34274O82483K47136m09371l71342
$$ 891143 1132535 1737705 1897998 1245338 546317 680591 1363074 1610210 1200839 829497
34973H29497N0687O7533j98338r2412K62411J41028m65381p64103m47761r9485
$$ 829497 880184 947717 749379 656967 919378 1060406 595025 -169078 -616839 -716324
34963g16324j09059q8273K57433M76879J47147l09414k32930K41374M20250J16220
$$ -716324 -825383 -913656 -656223 -179344 -32197 -341611 -574541 -333167 87083 203303
$$ [...]
##END NTUPLES=NMR SPECTRUM
##END=
