##TITLE=31Pdec_B1d-2101-2
 CDCl3, 24 sc
 21.1.2025
##JCAMPDX= 6.0         $$ Bruker NMR JCAMP-DX V2.0
##DATA TYPE= NMR SPECTRUM
##DATA CLASS= NTUPLES
##ORIGIN= UXNMR, Bruker Analytische Messtechnik GmbH
##OWNER= root
$$ XWIN-NMR		Version 3.5
$$ Tue Jan 21 18:05:59 2025 Russian Standard Time (UT+4h)  she@DPX200
##.OBSERVE FREQUENCY= 81.013821
##.OBSERVE NUCLEUS= ^31P
##.ACQUISITION MODE= SIMULTANEOUS
##.ACQUISITION SCHEME= undefined
##.AVERAGES= 24
##.DIGITISER RES= 17
##SPECTROMETER/DATA SYSTEM= spect
##.PULSE SEQUENCE= zgpg30
##.SOLVENT NAME= CDCl3
##.SHIFT REFERENCE= (INTERNAL, CDCl3, 0, 198.062)
##AUDIT TRAIL= $$ (NUMBER, WHEN, WHO, WHERE, WHAT)
$$ ##TITLE= Audit trail, XWIN-NMR		Version 3.5
$$ ##JCAMPDX= 5.01
$$ ##ORIGIN= Bruker BioSpin GmbH
$$ ##OWNER= she
$$ F:/spectra/data/she/nmr/P31/2/pdata/1/auditp.txt
$$ ##AUDIT TRAIL=  $$ (NUMBER, WHEN, WHO, WHERE, WHAT)
(   1,<2025-01-21 18:04:33.64 +0400>,<she>,<DPX200>,
      <created by zg, POWCHK disabled, PULCHK disabled
       configuration hash MD5:
       00 E9 B6 7A A2 85 ED C7 34 08 36 98 17 FE 4E 26
       data hash MD5: 32K
       5D 0F 66 54 CF 32 DC 79 B5 50 FB 51 5C 58 C0 75>)
(   2,<2025-01-21 18:04:35.90 +0400>,<she>,<DPX200>,
      <Start of raw data processing
       efp BC_mod = 2 LB = 1.5 FT_mod = 6 PKNL = 1 PHC0 = 1686.652 PHC1 = 270.4863 SI = 64K 
       data hash MD5: 64K
       BF 7A F8 53 7A F8 AC 1C 3C 8C FE CA 81 A3 8D 78>)
(   3,<2025-01-21 18:05:10.17 +0400>,<she>,<DPX200>,
      <pk PHC0 = 105.0387 PHC1 = -249.6 
       data hash MD5: 64K
       56 3E 54 CE F8 23 E6 AB DB E4 6B 43 6A F6 79 E9>)
(   4,<2025-01-21 18:05:14.85 +0400>,<she>,<DPX200>,
      <abs ABSG = 5 
       data hash MD5: 64K
       37 76 3C 3E 9F 5A 6D 19 EB AE D0 A7 6E EA F2 BC>)
$$ ##END=
$$ 
$$ hash MD5
$$ 0F B2 59 7C 7B 6E CC D2 FB 30 EC 55 8D E1 0D 35
##$RELAX= 
##$RELAX= 
##$RELAX= 
##$RELAX= 
##$RELAX= 
##$RELAX= 
##$RELAX= 
##$RELAX= 
$$ Bruker specific parameters
$$ --------------------------
##$DU= <F:/spectra>
##$EXPNO= 2
##$NAME= <P31>
##$PROCNO= 1
##$TYPE= <nmr>
##$USER= <she>
##$AMP= (0..31)
100 100 100 100 100 100 100 100 100 100 100 100 100 100 100 100 100 100 
100 100 100 100 100 100 100 100 100 100 100 100 100 100 
##$AQSEQ= 0
##$AQ_mod= 1
##$AUNM= <au_zg>
##$AUTOPOS= <>
##$BF1= 81.014009
##$BF2= 200.13
##$BF3= 200.13
##$BF4= 200.13
##$BF5= 200.13
##$BF6= 200.13
##$BF7= 200.13
##$BF8= 200.13
##$BYTORDA= 1
##$CFDGTYP= 0
##$CFRGTYP= 5
##$CHEMSTR= <none>
##$CNST= (0..31)
1 1 145 1 1 1 1 1 1 1 1 1 1 1 1 1 1 1 1 1 1 1 1 1 1 1 1 1 1 1 1 1 
##$CPDPRG= <waltz16>
##$CPDPRG1= <>
##$CPDPRG2= <waltz16>
##$CPDPRG3= <>
##$CPDPRG4= <mlev>
##$CPDPRG5= <mlev>
##$CPDPRG6= <mlev>
##$CPDPRG7= <mlev>
##$CPDPRG8= <mlev>
##$CPDPRGB= <>
##$CPDPRGT= <>
##$D= (0..31)
0 1 0 0 0 0 0 0 0 0.06 0 0.03 2e-05 3e-06 0 0 0.0002 0 0 0 0 0 0 0 0 0 
0 0 0 0 0 0 
##$DATE= 1737468273
##$DBL= (0..7)
120 120 120 11 120 120 24 19 
##$DBP= (0..7)
150 150 150 150 150 150 150 150 
##$DBP07= 0
##$DBPNAM0= <>
##$DBPNAM1= <>
$$ [...]
##$SUBNAM3= <"">
##$SUBNAM4= <"">
##$SUBNAM5= <"">
##$SUBNAM6= <"">
##$SUBNAM7= <"">
##$SUBNAM8= <"">
##$SUBNAM9= <"">
##$SW= 400.765351723535
##$SWIBOX= (0..15)
0 1 3 0 0 0 0 0 0 0 0 0 0 0 0 0 
##$SW_h= 32467.5324675325
##$TD= 32768
##$TD0= 1
##$TE= 0
##$TE2= 300
##$TE3= 300
##$TEG= 300
##$TL= (0..7)
0 120 53 12 22 120 120 120 
##$TP= (0..7)
150 150 150 150 150 150 150 150 
##$TP07= 0
##$TPNAME0= <>
##$TPNAME1= <>
##$TPNAME2= <>
##$TPNAME3= <>
##$TPNAME4= <>
##$TPNAME5= <>
##$TPNAME6= <>
##$TPNAME7= <>
##$TPOAL= (0..7)
0.5 0.5 0.5 0.5 0.5 0.5 0.5 0.5 
##$TPOFFS= (0..7)
0 0 0 0 0 0 0 0 
##$TUNHIN= 0
##$TUNHOUT= 0
##$TUNXOUT= 0
##$USERA1= <user>
##$USERA2= <user>
##$USERA3= <user>
##$USERA4= <user>
##$USERA5= <user>
##$V9= 5
##$VALIST= <valist>
##$VCLIST= <CCCCCCCCCCCCCCC>
##$VD= 0
##$VDLIST= <DDDDDDDDDDDDDDD>
##$VPLIST= <PPPPPPPPPPPPPPP>
##$VTLIST= <TTTTTTTTTTTTTTT>
##$WBST= 1024
##$WBSW= 4
##$XGAIN= (0..3)
0 0 0 0 
##$XL= 0
##$YL= 0
##$YMAX_a= 6724
##$YMIN_a= -6455
##$ZGOPTNS= <>
##$ZL1= 120
##$ZL2= 120
##$ZL3= 120
##$ZL4= 120
##$ABSF1= 198.0616
##$ABSF2= -202.7028
##$ABSG= 5
##$ABSL= 3
##$ALPHA= 0
##$AQORDER= 0
##$ASSFAC= 0
##$ASSFACI= 0
##$ASSFACX= 0
##$ASSWID= 0
##$AUNMP= <proc_1d>
##$AZFE= 0.1
##$AZFW= 0.5
##$BCFW= 0
##$BC_mod= 2
##$BYTORDP= 0
##$COROFFS= 0
##$CY= -3
##$DATMOD= 1
##$DC= 0
##$DFILT= <>
##$DTYPP= 0
##$F1P= 0
##$F2P= 0
##$FCOR= 1
##$FTSIZE= 65536
##$FT_mod= 6
##$GAMMA= 0
##$GB= 0
##$INTBC= 1
##$INTSCL= 9.790993e-09
##$ISEN= 30
##$LB= 1.5
##$LEV0= 0
##$LPBIN= 0
##$MAXI= 10000
##$MC2= 0
##$MEAN= 0
##$ME_mod= 0
##$MI= 50
##$NCOEF= 0
##$NC_proc= -7
##$NLEV= 6
##$NOISF1= 182.463
##$NOISF2= 159.3651
##$NSP= 0
##$NTH_PI= 0
##$NZP= 0
##$OFFSET= 198.0616
##$PC= 4
##$PHC0= 1791.691
##$PHC1= 20.88629
##$PH_mod= 1
##$PKNL= yes
##$PPARMOD= 0
##$PSCAL= 0
##$PSIGN= 0
##$REVERSE= no
##$SF= 81.0140089999434
##$SI= 65536
##$SIGF1= 159.3651
##$SIGF2= -187.1042
##$SINO= 113.3802
##$SIOLD= 16384
##$SREGLST= <1H.CDCl3>
##$SSB= 0
##$STSI= 65536
##$STSR= 0
##$SW_p= 32467.5324675325
##$SYMM= 0
##$S_DEV= 0
##$TDeff= 32768
##$TDoff= 0
##$TI= <>
##$TILT= no
##$TM1= 0
##$TM2= 0
##$TOPLEV= 0
##$USERP1= <user>
##$USERP2= <user>
##$USERP3= <user>
##$USERP4= <user>
##$USERP5= <user>
##$WDW= 1
##$XDIM= 65536
##$YMAX_p= 350226880
##$YMIN_p= -24261757
$$ End of Bruker specific parameters
$$ ---------------------------------
##NTUPLES= NMR SPECTRUM
##VAR_NAME=  FREQUENCY,     SPECTRUM/REAL,   SPECTRUM/IMAG
##SYMBOL=    X,             R,               I
##VAR_TYPE=  INDEPENDENT,   DEPENDENT,       DEPENDENT
##VAR_FORM=  AFFN,          ASDF,            ASDF
##VAR_DIM=   65536,         65536,           65536
##UNITS=     HZ,            ARBITRARY UNITS, ARBITRARY UNITS
##FACTOR=    0.49542278885378, 1,            1
##FIRST=     16045.7642231865, 0,            0
##LAST=      -16421.768244346, 0,            0
##MIN=       -16421.768244346, -24261757,    0
##MAX=       16045.7642231865, 350226880,    0
$$ Real data points
##PAGE= N=1
##DATA TABLE= (X++(R..R)), XYDATA
$$ [...]
40817e73158n25272j37808k9084K51139Q24491R65382K17300o64147p17613k17006
$$ -573158 -1098430 -1236238 -1265322 -1014183 -189692 775690 992990 328843 -388770 -605776
40807f05776j73939p26354j028561o55118j29963O7194J37317L25087L99155J68778
$$ -605776 -779715 -1506069 -2534630 -3189748 -3319711 -3252517 -3115200 -2790113 -2390958 -2222180
40797b222180n5612M9176K86692L02862J75691K59524O05708Q27745N05837l30545
$$ -2222180 -2277792 -2228616 -1941924 -1639062 -1463371 -1203847 -598139 229606 735443 404898
40787D04898j029304p87964L48579J148997M93050j011197j540316m37654Q33375
$$ 404898 -624406 -1412370 -1063791 85206 578256 -432941 -1973257 -2410911 -1577536
40778a577536P06118l84367q69937l93666k0647k99418m66902J05000Q18116Q20725
$$ -1577536 -871418 -1255785 -2125722 -2519388 -2540035 -2839453 -3306355 -3201355 -2383239 -1562514
40768a562514K35146k77205n25085o23359l69111L48787Q75520M76421m36443
$$ -1562514 -1327368 -1604573 -2129658 -2753017 -3122128 -2773341 -1897821 -1421400 -1857843
40759a857843p13519j44460K44426j77741o88063m27232K62255N09877L19553
$$ -1857843 -2571362 -2715822 -2471396 -2649137 -3337200 -3764432 -3502177 -2992300 -2672747
40750b672747L34336N43359L12017k89623k76272P27073J613582J132025m05536
$$ -2672747 -2338411 -1795052 -1483035 -1772658 -2048930 -1321857 291725 1423750 1018214
40741A018214j472801j174250r8333O46341O68497L79147K37567K57383J96229
$$ 1018214 -454587 -1628837 -1727170 -1080829 -412332 -33185 204382 461765 657994
40732F57994o026j30851j6280J80052K16571J41090J43747J16748j99549n74222
$$ 657994 651968 521117 504837 684889 901460 1042550 1186297 1303045 1103496 529274
40722E29274l53508N17108J060602L99464j010877j872456j569184o08774K97778
$$ 529274 175766 692874 1753476 2152940 1142063 -730393 -2299577 -2908351 -2610573
40713b610573Q96343J120148Q78038L41777p8841k53079l80710m36478j32668
$$ -2610573 -1714230 -594082 283956 625733 546892 293813 -86897 -523375 -656043
40704f56043M12283O28835L94334K65679L95233P48j340286k508639k001526m1310
$$ -656043 -243760 385075 779409 1045088 1440321 1441069 100783 -2407856 -4409382 -4450692
40694d450692J508248J425640M45812Q690M46593R34400Q00628K89391M2302J86751
$$ -4450692 -2942444 -1516804 -1070992 -1062302 -615709 318691 1119319 1408710 1451012 1637763
40684A637763J60674n08448j397112j522381o21490L55767M47060k7819j6744
$$ 1637763 1798437 1289989 -107123 -1629504 -2250994 -1895227 -1448167 -1475986 -1492730
40675a492730O65109J102067O68095j59175o17034n88397l51481K418M36040O87113
$$ -1492730 -827621 274446 942541 783366 166332 -422065 -773546 -771128 -335088 352025
40665C52025N86298L58820K52140J69392K525k5683K38256M43570J64059m35674
$$ 352025 938323 1297143 1549283 1718675 1721200 1695517 1933773 2377343 2541402 2105728
40655B105728p87316o30464j78055K62860M64345K35835l70790q96182r03629
$$ 2105728 1318412 687948 509893 772753 1237098 1472933 1102143 205961 -697668
40646f97668n37388k97710k85589n8677O59034J429118J487512O17976n17336
$$ -697668 -1235056 -1532766 -1818355 -1877032 -1217998 211120 1698632 2316608 1799272
40637A799272j023327p26117k75082j85970j52406K71439O81035L23261n31998
$$ 1799272 775945 49828 -225254 -411224 -563630 -292191 388844 712105 180107
40628A80107p47610n3010M70540J37131k32024K18736Q35349N63987k06341l29476
$$ 180107 -567503 -620513 -149973 -12842 -244866 -26130 809219 1373206 1166865 837389
40618H37389J03015K2815n95909o42098J06273N20545J17463n7045P00492J378191
$$ 837389 940404 963219 367310 -274788 -168515 352030 469493 412448 1112940 2491131
40608B491131P97752n05628j115395p53658l48682n00397q80091r69120o19902
$$ 2491131 3288883 2783255 1667860 914202 565520 65123 -814968 -1784088 -2403990
40599b403990J0407N61670O98570N82400P12159R75689N34707p93835j803358
$$ -2403990 -2393583 -1831913 -1133343 -550943 161216 1136905 1671612 877777 -925581
40590i25581j399108k22431K41932k43512n73406p9507P08780J104352J064996
$$ -925581 -2324689 -2547120 -2305188 -2548700 -3122106 -3201613 -2492833 -1388481 -323485
40581c23485P85589L15115j93168m86735o16803q01250q89137n64285l2573J87446
$$ -323485 462104 777219 584051 97316 -519487 -1320737 -2209874 -2774159 -2806732 -2619286
40571b619286J38674L28778P17306O19695j90452j030988j204819o92128K25465
$$ -2619286 -2480612 -2151834 -1434528 -814833 -1005285 -2036273 -3241092 -3933220 -3707755
40562c707755J313120K105858K005561J039989J989m30401k41173K96246Q38527
$$ -3707755 -2394635 -288777 1716784 2756773 2758762 2328361 2087188 2383434 3221961
40553C221961P68129l02277j580346j657366m45515M80311P0544p34523n72768
$$ 3221961 3990090 3687813 2107467 450101 4586 484897 555441 -179082 -751850
40544g51850L00338O53709K00106l65134p18216j036099j119796o48115q8790
$$ -751850 -451512 202197 402303 37169 -681047 -1717146 -2836942 -3485057 -3573847
40535c573847j03971k15547N55189J739177J687055J38256j051770n17617O67221
$$ -3573847 -3677818 -3893365 -3338176 -1598999 88056 226312 -825458 -1343075 -675854
40526f75854P30508k28112p58843m15103q5801k58231m00851j98583j34299m30614
$$ -675854 54654 -173458 -932301 -1347404 -1433205 -1691436 -2092287 -2290870 -2425169 -2855783
40516b855783m42798K97403J202263J460384J177599R65772Q11202K10114o82892
$$ -2855783 -3298581 -3001178 -1798915 -338531 839068 1804840 2616042 2826156 2143264
40507B143264r13651q499J199517J446053M50604q73425j445608r89621j11711
$$ 2143264 1229613 1221114 2420631 3866684 4317288 3443863 1998255 1008634 896923
40498H96923L47917J00475l26389k22103L61532O06982M7146p37463r46472o85513
$$ 896923 1244840 1345315 1018926 796823 1158355 1765337 1812483 1075020 128548 -556965
40488e56965o10586p05908l06962N90753R83396K45775q72222j218046o59567
$$ -556965 -1167551 -1873459 -2180421 -1589668 -606272 -360497 -1232719 -2450765 -3110332
40479c110332P4973N17472P19912P14521M61805K08832K50332M05786L00154M2284
$$ -3110332 -3035359 -2517887 -1797975 -1083454 -621649 -412817 -162485 243301 543455 585739
40469E85739J3559J03828j39630o35634p84842m28624n1452J12198M04605R20338
$$ 585739 599298 703126 563496 -72138 -856980 -1285604 -1337056 -1224858 -820253 100085
40459A00085J104193N76441k47182p51139p86208m19477L17701R99523Q29234
$$ 100085 1204278 1780719 1533537 782398 -3810 -423287 -105586 893937 1723171
40450A723171k85246j264670j142854l00752K82465M58620P00626R02785M75299
$$ 1723171 1437925 173255 -969599 -1270351 -987886 -529266 171360 1074145 1549444
40441A549444m83930j123918j019248n68842j51430K75472O04791M54857j20637
$$ 1549444 1065514 -58404 -1077652 -1646494 -1797924 -1522452 -917661 -462804 -583441
40432e83441n16527m35878k25308j53941m6837J50311J75420O5523J86545L73387
$$ -583441 -1099968 -1535846 -1761154 -1915095 -1961932 -1811621 -1636201 -1570678 -1384133 -1010746
40422a010746n2188r80866j228311k25015R40237J044871M71011L63521P42680
$$ -1010746 -1062934 -2043800 -3272111 -3497126 -2556889 -1512018 -1041007 -677486 65194
40413F5194P04334P1442m55975o12962p77381q96967m26817N30985J136810J050394
$$ 65194 769528 840970 384995 -227967 -1005348 -1902315 -2329132 -1798147 -661337 389057
40403C89057P32442L88467k33608p80060l38122R64204J680652J077806K53589
$$ 389057 1121499 1509966 1276358 496298 158176 1122380 2803032 3880838 4134427
40394D134427L43522P40574K53467q69466j402338j044630n63500l85103k38809
$$ 4134427 4477949 5218523 5471990 4602524 3200186 2155556 1592056 1206953 968144
40385I68144J0933K38171N44833R06432O79196m48399j418708j044416L1254J65106
$$ 968144 979077 1217248 1762081 2668513 3347709 2899310 1480602 436186 467440 632546
40375F32546o44188p64484K16173O50434l95356j421575q10656O76308J256725
$$ 632546 -11642 -776126 -559953 90481 -304875 -1726450 -2537106 -1860798 -604073
40366f04073Q02293M59498M32738k7410q35426j052235o10887m65293q56390q82207
$$ -604073 198220 657718 1090456 1063046 227620 -824615 -1435502 -1900795 -2757185 -3639392
40356c639392j25316N94643N45977L0946m46883q55495r48906o1304J617121K551926
$$ -3639392 -3764708 -3170065 -2624088 -2593142 -3040025 -3895520 -4844426 -4905730 -3288609 -736683
40346g36683J658408j23322j062843q75671o09142o96671m51036M33475J101481
$$ -736683 921725 798403 -264440 -1140111 -1749253 -2445924 -2896960 -2463485 -1362004
40337a362004P74115o0595l41115J54148O97877O86767K70414o8731j15429M6382
$$ -1362004 -587889 -648484 -989599 -835451 -137574 549193 819607 750876 635447 681829
40327F81829L12499O12432P69871N66023L2283m80667o71922o23075o00220o48045
$$ 681829 994328 1606760 2376631 2942654 2974937 2494270 1822348 1199273 599053 -48992
40317d8992o30845n66217n45535l64654K58053R81941R69492Q1304o22131j91265
$$ -48992 -679837 -1246054 -1791589 -2156243 -1898190 -916249 53243 134547 -487584 -678849
40307f78849Q18004J067119L43336k16677P7135M40638j09813j230773j749662
$$ -678849 139155 1206274 1549610 1332933 1410068 1850706 1740893 510120 -1239542
40298a239542j234797k95983M34730Q43515R19932N74760M5672j23116K27339
$$ -1239542 -2474339 -2770322 -2335592 -1492077 -572145 2615 48287 -74829 152510
40289A52510O27503O24222K64595k10970o70513q64727m36800M77492J130786
$$ 152510 780013 1404235 1668830 1457860 787347 -77380 -514180 -36688 1094098
40280A094098J059862O51980L78123J0778p36367j305136r56881o2117K93081
$$ 1094098 2153960 2805940 3184063 3194841 2458474 1153338 196457 134340 427421
40271D27421p8286k95568M4879K72185o5343l89840j60740J99893J72984Q7930
$$ 427421 349135 53567 98446 370631 305288 -84552 -245292 -45399 127585 215515
40261B15515L60266N42533J22518l60442j07806N04988M92298o2799j92112K25999
$$ 215515 575781 1118314 1240832 880390 772584 1277572 1769870 1707071 1514959 1740958
40251A740958L04369j64215k68606L56432P57195K31269m92627n19319k59278
$$ 1740958 2045327 1881112 1612506 1968938 2726133 2957402 2464775 1945456 1686178
40242A686178n94531j286182j337184n38374L70879Q35076Q52963M30557l70588
$$ 1686178 1091647 -194535 -1531719 -2070093 -1699214 -864138 -11175 419382 48794
40233D8794r03773m26524P23803J268200N68292n96364j120534q48944m01921
$$ 48794 -854979 -1281503 -557700 710500 1278792 682428 -438106 -1287050 -1688971
40224a688971k18041k30597k38438j83617r6463K7743K70929O86069J062091R38660
$$ -1688971 -1907012 -2137609 -2376047 -2559664 -2656127 -2628384 -2357455 -1671386 -609295 329365
40214C29365J35265q12495j109400o20356O672J87363J1708r6375K7962K28528
$$ 329365 464630 -347865 -1457265 -2077621 -2070949 -1883586 -1871878 -1968253 -1940291 -1711763
40204a711763K91521Q9907l24516o46404n59950j60069J36119K01346L64855P64067
$$ -1711763 -1420242 -1330335 -1654851 -2301255 -2861205 -3021274 -2885155 -2683809 -2318954 -1554887
40194a554887R38186M79227k00094l01788K19059N10891k3823q92875j143374
$$ -1554887 -616701 -137474 -337568 -639356 -420297 90594 66771 -826104 -1969478
40185a969478n28311L43533Q68954J009244R53089O81289J52954l59792n10346
$$ -1969478 -2497789 -2154256 -1285302 -276058 677031 1358320 1511274 1151482 641136
40176F41136l59743k77881l85554m26372k19151R9088L47168M66239L20375k53922
$$ 641136 281393 3512 -382042 -808414 -1027565 -928477 -581309 -115070 205305 -48617
40166d8617j002901j285928q56621k36707K9513Q5453K88751M60835K37579j47574
$$ -48617 -1051518 -2337446 -3194067 -3430774 -3401261 -3315808 -3027057 -2566222 -2328643 -2476217
40156b476217j57789J71000M15593O53998J233659J689483J036358n43487j442571
$$ -2476217 -2634006 -2463006 -2047413 -1393415 -159756 1529727 2566085 2022598 580027
40147E80027p07850N91837R20632L46908q939Q7183n0881m43829l09685L64449
$$ 580027 -127823 464014 1384646 1731554 1722615 1809798 1758917 1315088 1005403 1369852
40137A369852N26722j68311n51222K66129J283900R22163o52697j715414j316892
$$ 1369852 1896574 1728263 1177041 1443170 2727070 3649233 2996536 1281122 -35770
40128c5770l06692J14738j22048l38868k32173j2799J69182L62197N21289N01576
$$ -35770 -342462 -227724 -349772 -688640 -920813 -933612 -764430 -402233 119056 620632
40118F20632L02140M9234j96288m07107m84195m15706m18117o44156q38311n93446
$$ 620632 922772 972006 775718 368611 -115584 -531290 -949407 -1593563 -2431874 -3025320
40108c025320O8335O67381Q38200O45662K98074j20399m86497n11755n6226N60866
$$ -3025320 -2956985 -2289604 -1451404 -805742 -507668 -628067 -1114564 -1626319 -1682545 -1121679
40098a121679Q05560M81274o5348k67760J45796Q54580J148584N96888m28514
$$ -1121679 -316119 165155 99807 -167953 -22157 832423 1981007 2577895 2149381
40089B149381j062099q32653o0067O49115R86942R05596L89817l86336r26425
$$ 2149381 1087282 254629 194562 843677 1830619 2736215 3126032 2739696 1813271
40080A813271q53060m03422j50367k81706m61999l71105o8710J89808K33504M2397
$$ 1813271 960211 556789 406422 124716 -337283 -708388 -777098 -587290 -353786 -311389
40070c11389k49678m07207l27263j92112k25185l89160n15084n72747n52512k80793
$$ -311389 -561067 -968274 -1295537 -1487649 -1712834 -2101994 -2617078 -3189825 -3742337 -4023130
40060d023130K62963O14040L04941l76641o30567j64640N40394J016847J258779
$$ -4023130 -3760167 -3146127 -2841186 -3217827 -3848394 -4013034 -3472640 -2455793 -1197014
40051a197014J245657O94728l27411j073542q86122N322Q18192J047282O63918
$$ -1197014 48643 743371 415960 -657582 -1543704 -1538382 -720190 327092 991010
40042I91010j12413q26879r35420m29864m3740l40640q48772o64040K54298J004075
$$ 991010 878597 51718 -883702 -1313566 -1357306 -1697946 -2546718 -3210758 -2956460 -1952385
40032a952385R37706L76259K2555J04650K65739L5601o62976j299172j128533
$$ -1952385 -1014679 -638420 -615865 -511215 -245476 -209875 -872851 -2172023 -3300556
40023c300556p3192R67828J093408N27710K41852N33812O67531P6646p49182r86880
$$ -3300556 -3373748 -2405920 -1312512 -784802 -542950 -9138 658393 735039 -14143 -1001023
40013a001023o05558k46209k26574k07947J26337M74398K55074n37505j073175
$$ -1001023 -1606581 -1852790 -2079364 -2287311 -2160974 -1686576 -1431502 -1969007 -3042182
40004c042182n31844P96025J630131J187998J99609o7443M50460N84743l21150
$$ -3042182 -3574026 -2778001 -1147870 40128 239737 172294 622754 1207497 886347
39995H86347j445942j627528q09932J78738Q04240J122011J167293P72990M6993
$$ 886347 -559595 -2187123 -2997055 -2818317 -2014077 -892066 275227 1048217 1095210
39986A095210n01588n10982j62980J07617J32791J39261M10680Q48925R40436
$$ 1095210 593622 82640 -80340 27277 160068 299329 710009 1558934 2499370
39977B499370L33285n83235j006350p23752l90390n70018r30025q01291j84294
$$ 2499370 2832655 2249420 1243070 519318 128928 -441090 -1371115 -2172406 -2356700
39968b356700L42065M92648M75820M30348K55184L727j08935j57476m37410q45845
$$ -2356700 -2014635 -1521987 -1046167 -615819 -360635 -356908 -465843 -623319 -1060729 -1906574
39958a906574q67345l48840K23437M37692M39313M33490K55514j27949j66688
$$ -1906574 -2773919 -3122759 -2899322 -2461630 -2022317 -1588827 -1333313 -1461262 -1627950
39949a627950O06998J688834J981244J051642m10705j394310j473289r31631l41801
$$ -1627950 -1020952 667882 2649126 3700768 3290063 1895753 422464 -509167 -850968
39940h50968j10314k17361l30961k63249k09603l71463n13778k16029M85903J028281
$$ -850968 -961282 -1178643 -1509604 -1772853 -1982456 -2353919 -2867697 -3083726 -2597823 -1569542
39930a569542R52237L98739q8930j27858J64480L32371J18879j87752j45034J34176
$$ -1569542 -617305 -218566 -307496 -435354 -270874 61497 180376 -7376 -152410 -18234
39920a8234Q2769l83138o01778k22894Q8922l06814q07283l66428P57491J209333
$$ -18234 64535 -318603 -920381 -1143275 -1054353 -1361167 -2168450 -2534878 -1777387 -568054
39910e68054N39127j90005j30716J66153p5478n21210m35645M9921L39809M49269
$$ -568054 -28927 -218932 -349648 -183495 -258973 -780183 -1215828 -1165907 -826098 -376829
39900c76829O75711O81087J7279p37288n65606L29696O50663o0419p63997n79576
$$ -376829 298882 979969 997248 259960 -305646 24050 674713 614294 -149703 -729279
39890g29279l6478n1847n14815o75003l80375j19282j04635j8573L78322Q58213
$$ -729279 -765757 -817604 -1332419 -2007422 -2387797 -2507079 -2611714 -2630287 -2251965 -1393752
39880a393752R82679N53037j07851k88798L74327J235149J224857L08821k96033
$$ -1393752 -411073 141964 34113 -254685 119642 1354791 2579648 2888469 2592436
39871B592436J76994P82636J13304j573810k466457j472316M56750J552956J154165
$$ 2592436 2769430 3552066 3665370 2091560 -374897 -1847213 -1390463 162493 1316658
39862A316658J6281q21173r57080n87118m6579M23372O47584N13995J19924j66914
$$ 1316658 1332939 511766 -445314 -1032432 -1079011 -655639 -8055 505940 625864 458950
39852D58950j1965M46988O51444K65524l65367n85579k01161K81226K06781m86988
$$ 458950 446985 893973 1545417 1810941 1445574 859995 658834 940060 1146841 659853
39842F59853j101835q48755K10329J068122R00511J15498k00598K07283M90839
$$ 659853 -441982 -1290737 -1080408 -12286 888225 1003723 803125 1010408 1501247
39833A501247P2766m82068m10075J05300L63708K24891M9207p8592l29789n68764
$$ 1501247 1574013 1091945 681870 787170 1150878 1375769 1424976 1346384 1016595 447831
39823D47831n17529l23525l10562l42221j01764K12438K35630K54658P48362J250571
$$ 447831 -69698 -393223 -703785 -1046006 -1147770 -935332 -699702 -445044 303318 1553889
39813A553889P94165m11847r54189k56661N00073J55366p45497r28324k88809
$$ 1553889 2348054 1936207 982018 725357 1225430 1380796 635299 -293025 -581834
39804e81834J96696N630m41864o06683l56979J74739O19885M76866j93473m76356
$$ -581834 -385138 -379508 -821372 -1428055 -1785034 -1610295 -990410 -513544 -707017 -1183373
39794a183373K51225J162371Q85768n21003j493846j019250J55806P34827M89255
$$ -1183373 -932148 230223 1115991 594988 -898858 -1918108 -1762302 -1027475 -538220
39785e38220J18457Q3754K31363K84209J56902j12124l70870l73677l8382M09270
$$ -538220 -419763 -336009 -104646 179563 336465 224341 -146529 -520206 -558588 -149318
39775a49318O88274O80605L12445m27317j128729j044430J3609J133221J202147
$$ -149318 538956 1219561 1532006 1104689 -24040 -1068470 -1054861 78360 1280507
39766A280507K58821n63577m45118K56026O40873L21431l58569q09656o97033
$$ 1280507 1539328 975751 530633 786659 1427532 1748963 1390394 580738 -116295
39757a16295k08411N1502k91268p84888o27874J52541N97773K14203k10368J81541
$$ -116295 -324706 -273204 -564472 -1349360 -1977234 -1824693 -1226920 -1012717 -1223085 -1041544
39747a041544Q96325Q26763M2454l16609J01826L53408j38902o10219k84408L53015
$$ -1041544 -145219 681544 723998 407389 509215 862623 723721 113502 -170906 182109
39737A82109M72438K41327K37383K11349l82497j076238q99374l0650L37913j42753
$$ 182109 654547 895874 1133257 1344606 962109 -114129 -1013503 -1044153 -706240 -848993
39727h48993m74513N5282Q39009J009467O29905K88728K00018J92733O0285l91878
$$ -848993 -1323506 -1268224 -429215 580252 1210157 1498885 1698903 1891636 1951921 1560043
39717A560043j103181j421374p41244L91006P52320K55359J49105R50483J454111
$$ 1560043 456862 -964512 -1705756 -1314750 -562430 -307071 -157966 792517 2246628
39708B246628O26187p29833j312863j245822j306909j193340k28851Q27591N81838
$$ 2246628 2872815 2142982 830119 -415703 -1722612 -2915952 -3144803 -2317212 -1735374
39699a735374n63566o78157P79686K109125J957885J093768P36870O05529j61615
$$ -1735374 -2298940 -2977097 -2197411 -88286 1869599 2963367 3700237 4305766 4144151
39690D144151j200379j408615o76029Q3288L34932L28561K63081m895m04538n81202
$$ 4144151 2943772 1535157 859128 942416 1277348 1605909 1868990 1864095 1459557 878355
39680H78355m90750m72465o41751p12502n01467j60505J68128N01554P23987N67019
$$ 878355 387605 -84860 -726611 -1439113 -1940580 -2101085 -1932957 -1431403 -707416 -140397
39670a40397P5149k45279m965N34187P51568M09608j04143k72742k4929K57594
$$ -140397 -65248 -310527 -315492 218695 970263 1379871 1275728 1002986 978057 1235651
39660A235651K11045j57242n65716p55624o34972k78310J00634L05891M05689
$$ 1235651 1446696 1289454 723738 -31886 -666858 -945168 -844534 -538643 -132954
39651a32954O36001Q92879O22039l88748j341462j175102j0651P96406L17720
$$ -132954 503047 1395926 2017965 1629217 287755 -887347 -897998 -101592 216128
39642B16128p77570j138190m04806N68969R29756O53832J78877k19898m63582
$$ 216128 -561442 -1699632 -2104438 -1535469 -605713 48119 226996 7098 -456484
39633d56484m72814k67124p3589l3186J02697O50894J359986J474135O51570m73617
$$ -456484 -929298 -1196422 -1270011 -1303197 -1200500 -549606 810380 2284515 2936085 2462468
39623B462468j002182q56433p03427q73088r33019m84084J82084N36869M71985
$$ 2462468 1460286 603853 -99574 -972662 -1905681 -2389765 -2207681 -1670812 -1198827
39614a198827J55649l21456p42115o61292m1760M13756J73168k60630j02474M42441
$$ -1198827 -1043178 -1364634 -2106749 -2768041 -2809801 -2396045 -2222877 -2483507 -2585981 -2143540
39604b143540N16914J5264k93757j0411M56779P48927R18609Q06325N2210r71945
$$ -2143540 -1626626 -1611362 -1905119 -1915530 -1458751 -709824 208785 1015110 1067320 95375
39594I5375j206043l30582O79144Q94420N35091K41524O1993k15999m40231m56979
$$ 95375 -1110668 -1441250 -762106 132314 667405 908929 970922 754923 314692 -142287
39584a42287m93930o08939m14278Q5958J67395m06649o95593r878P88686N68360
$$ -142287 -636217 -1245156 -1659434 -1573476 -1406081 -1812730 -2508323 -2518201 -1729515 -1161155
39574a161155j63309j4099J008091J440631N79891o04628r96361o25900j21508
$$ -1161155 -1324464 -1338563 -330472 1110159 1690050 1085422 89061 -536839 -658347
39565f58347J59204J05731k10847k99609K81459J024595Q98809r1206p25502l26562
$$ -658347 -499143 -393412 -604259 -903868 -622409 402186 1300995 1209789 484287 157725
39555A57725K84236J73462k79306j75323L79616N38818J42835j02418J49731L17555
$$ 157725 441961 615423 336117 160794 540410 1079228 1222063 1119645 1269376 1586931
39545A586931j95248j042618j275077m87143O44465J070709N47006j17070j03646
$$ 1586931 1391683 349065 -926012 -1413155 -768690 302019 849025 731955 628309
39536F28309L97271N65593J25023l93095m98947k70021M0667L30625M15689N0482
$$ 628309 1025580 1591173 1716196 1323101 824154 554133 594800 925425 1341114 1391596
39526A391596n61273p98911m48144J1293K14682M10722P38221O44225k80749j311836
$$ 1391596 830323 31412 -416732 -405439 -190757 219965 958186 1602411 1321662 9826
39516I826j275202j33029Q67968P68273K3151k30607L64151J063554J049452L98179
$$ 9826 -1265376 -1398405 -530437 237836 260987 30380 394531 1458085 2507537 2905716
39506B905716j43203j38449J22842J98259M5562k41558p89929j520518j732876
$$ 2905716 2762513 2624064 2746906 2945165 2990727 2749169 1959240 438722 -1294154
39497a294154q85587L40762O29681k23558j007995p86748k3510L94774M10205
$$ -1294154 -2179741 -1838979 -1209298 -1432856 -2440851 -3227599 -3251109 -2856335 -2446130
39488b446130M44477N14894M51428M51292O48154N81586r7050p57381n02137M59271
$$ -2446130 -2001653 -1486759 -1035331 -584039 64115 645701 548651 -208730 -710867 -251596
39478b51596R99520N70285k49353o94000o05277k44610N9761N728m16211p20155
$$ -251596 747924 1318209 1068856 374856 -230421 -475031 -415270 -409542 -825753 -1545908
39468a545908m55800J18791L82834K32792M9773l2322j25596k706O37148J322964
$$ -1545908 -2001708 -1882917 -1500083 -1267291 -1217518 -1249840 -1375436 -1378142 -740994 581970
39458E81970J153612J55365n96159m97259j75060k98461m89903q6317O42276P85088
$$ 581970 1735582 1890947 1294788 797529 622469 324008 -165895 -252212 390064 1175152
39448A175152K015j096851j584177r44484M84802J575953J384269K86503m24746
$$ 1175152 1177167 80316 -1503861 -2448345 -1963543 -387590 996679 1283182 858436
39439H58436k77795j16450m86970o25987R8391P60975J77363j066691j372550
$$ 858436 580641 464191 -22779 -648766 -550375 210600 387963 -678728 -2051278
39430b051278n56753N7275q8742r5188M96387P62607J13665m76673l3777P31754
$$ -2051278 -2608031 -2550756 -2639498 -2734686 -2238299 -1475692 -1362027 -1838700 -1872477 -1140723
39420a140723N58885l25021o53414j56847K13549k0878k15031J87804Q33238J148622
$$ -1140723 -581838 -906859 -1560273 -1717120 -1503571 -1524449 -1739480 -1551676 -718438 430184
39410D30184J040467O07163j14095p93010q57875k67121L15436M31969L72463
$$ 430184 1470651 2077814 1963719 1170709 312834 45713 361149 793118 1165581
39401A165581M84677N36103K21024k05212l33328k55541k84779l34637j12892
$$ 1165581 1650258 2186361 2407385 2202173 1868845 1613304 1328525 993888 880996
39392H80996L06901O09976P25587P14183M18174k19555o96594m65877J53403K37924
$$ 880996 1187897 1797873 2523460 3237643 3655817 3436262 2739668 2273791 2427194 2665118
39382B665118m87096j242833j212743m73678K92882O11740N05197K76033K10947
$$ 2665118 2178022 935189 -277554 -751232 -458350 153390 658587 934620 1145567
39373A145567L29041L61512J44709p1311j3175P5131k19262o57385n13535L01820
$$ 1145567 1474608 1836120 1980829 1909518 1896343 1971474 1752212 1094827 581292 883112
39363H83112Q95493M78869o36073j425028j216048j96753P86211Q39322j15303
$$ 883112 1778605 2257474 1621401 196373 -1019675 -1216428 -430217 409105 293802
39354B93802j012491p35216L99018R77374M56626j83031j35781K1812l77305o96245
$$ 293802 -718689 -1453905 -1054887 -77513 379113 196082 60301 82113 -295192 -991437
39344i91437j30024O13392L19862n39581l81125Q07003J211319M6134j109951
$$ -991437 -1121461 -508069 -188207 -727788 -1108913 -301910 909409 955543 -154408
39335a54408p24464M50101Q00366L49003K95170P71906P31338j04785p28660n29304
$$ -154408 -878872 -428771 371595 720598 1015768 1787674 2519012 2414227 1685567 1156263
39325A156263k09783n13906j020975q56990N7947J068689J588779J326699K15450
$$ 1156263 946480 432574 -588401 -1445391 -1387444 -318755 1270024 2596723 2812173
39316B812173j251039j997002j412616k48488K28977j14568k37906M00199R79386
$$ 2812173 1561134 -435868 -1848484 -2096972 -1867995 -1982563 -2220469 -1820270 -840884
39307h40884N64832m84557j065311q87321o67782q62601j012835n71411K47171
$$ -840884 -276052 -760609 -1825920 -2713241 -3381023 -4243624 -5256459 -5827870 -5580699
39298e580699Q08018Q24559M35673j28204n62588m56505L00417J203550J599683
$$ -5580699 -4772681 -3948122 -3512449 -3640653 -4203241 -4659746 -4359329 -3155779 -1556096
39289a556096J378957R06433M40249Q392k80780k87737j79932k65456m62129l81622
$$ -1556096 -177139 729294 1169543 1177935 897155 609418 429486 164030 -298099 -679721
39279f79721p86K38912J47478J04776L96981O78738M78712o9509m04732k55387
$$ -679721 -680507 -441595 -294117 -189341 207640 886378 1365090 1295581 890849 635462
39269F35462J67180N32905O24105L49804j30525m06129k68429n9362k10021n45974
$$ 635462 802642 1335547 1959652 2309456 2178931 1772802 1504373 1445011 1234990 689016
39259F89016n26171j64123j34173p39902j316816j114544l89314O777l9957K57272
$$ 689016 162845 -1278 -135451 -875353 -2192169 -3306713 -3696027 -3689250 -3729207 -3471935
39249c471935J227301J946754J383990q3471j033780p73048K074M12516M72051
$$ -3471935 -2244634 -297880 1086110 1002639 -31141 -804189 -802115 -389599 82452
39240H2452N50092M92386L8860l21797J36177J077181J245615J44445j209412
$$ 82452 632544 1124930 1163790 841993 978170 2055351 3300966 3445411 2235999
39231B235999j614126j107409n26198k12691R8287M34875M78661K65040K12297
$$ 2235999 621873 -485536 -1011734 -1224425 -1126138 -691263 -212602 52438 264735
39222B64735K98126n8016r35114j398014o69010O09098J057775L84826k91232
$$ 264735 562861 504845 -430269 -1828283 -2497293 -1888195 -830420 -445594 -736826
39213g36826r0809M67144M54842J7471K5764N64503P62115K16296l62584l35199
$$ -736826 -827635 -360491 94351 111822 137586 702089 1464204 1680500 1317916 982717
39203I82717j13604k74588l75069L68507J551184J826773P57756n54638j002150
$$ 982717 869113 594525 219456 587963 2139147 3965920 4723676 4169038 3166888
39194C166888p92714p48650r85617j002256o83455m60080n54022o58455m46628
$$ 3166888 2374174 1625524 639907 -362349 -1045804 -1505884 -2059906 -2718361 -3164989
39185c164989j991L72351N43816O63562R50790J305904J166956Q3413j411029
$$ -3164989 -3166980 -2794629 -2250813 -1587251 -636461 669443 1836399 1919812 508783
39176E08783j948943q25756R21418J529528N56980o71295p75349J00230P51902
$$ 508783 -1440160 -2265916 -1344498 185030 742010 70715 -704634 -604404 147498
39167A47498N24446q5729l15529q7353J31021R3581J3281N6364l982l64135o71183
$$ 147498 671944 586215 270686 183333 314354 407935 421216 477580 473598 109463 -561720
39156e61720l93480K91430N10354j27089q16008n40350M75531R54538K48182q04256
$$ -561720 -955200 -663770 -153416 -280505 -1096513 -1636863 -1161332 -206794 41388 -762868
39146g62868j007902l20502K70546J35049l09961l36012J52571O51237P45503
$$ -762868 -1770770 -2091272 -1820726 -1685677 -1995638 -2331650 -2179079 -1527842 -782339
39137g82339M85962K10606K29749N96577R76525Q48522J03343o45340p01325k13733
$$ -782339 -296377 -85771 143978 740555 1717080 2565602 2668945 2023605 1322280 1108547
39127A108547o024l60215n18293K07189J263999J434657M43096o41778p28386
$$ 1108547 1102523 742308 224015 431204 1695203 3129860 3572956 2931178 2202792
39118B202792L5726N57217R5285r47366j474737q97278J41238M46305k38539q39570
$$ 2202792 2238518 2795735 2891020 1943654 468917 -428361 -287123 159182 -79357 -918927
39108i18927l84327O39479R92857M20200j79497k13789p5101j96967l58522l13868
$$ -918927 -1303254 -663775 329082 749282 569785 355996 280895 83928 -274594 -588462
39098e88462l08676m69095l80159J40124M59527N453p43944q52750k08087M46676
$$ -588462 -897138 -1366233 -1746392 -1606268 -1146741 -1141288 -1885232 -2737982 -2946069 -2499393
39088b499393N54808K37075j19170k43020k0750M55327R18267J186321J210396
$$ -2499393 -1944585 -1707510 -1826680 -2069700 -2090450 -1635123 -716856 469465 1679861
39079A679861Q36515K483p39947o41092K0755L3333q93978j394974m74881P10807
$$ 1679861 2516376 2518859 1778912 1137820 1158575 1191908 297930 -1097044 -1571925 -861118
39069h61118M32011r47996j452413l57802R99143J319029P60069J7555o25690
$$ -861118 -429107 -1377103 -2829516 -3187318 -2188175 -869146 -109077 -91522 -717212
39060g17212q99392m41648L63931N14929j39643n85207k70463Q5114q4989j77928
$$ -717212 -1616604 -2058252 -1694321 -1179392 -1319035 -1904242 -2174705 -2089591 -2174580 -2352508
39050b352508L02549O03480Q090o76372k85561O76924O61595n31915j409977r28095
$$ -2352508 -2049959 -1446479 -1438389 -2114761 -2400322 -1723398 -1061803 -1593718 -3003695 -3931790
39040c931790K53722R67864R72788P33805N58597N02865O26645Q23585O91340
$$ -3931790 -3678068 -2710204 -1737416 -1003611 -445014 57851 684496 1508081 2199421
39031B199421J0175p89658r81708l63159M73668P50594L22789j96369j80476K53538
$$ 2199421 2209596 1419938 438230 75071 548739 1299333 1622122 1425753 1245277 1498815
39021A498815M47778J10227l29529l72888j04634K7709j92671o10546r09168p60339
$$ 1498815 1946593 2056820 1727291 1354403 1249769 1277478 1084807 474261 -434907 -1195246
39011a195246l3424R24356J478787J375746R22617L67639m05965j256633j438183
$$ -1195246 -1228670 -304314 1174473 2550219 3472836 3840475 3434510 2177877 739694
39002G39694m99598Q26262J326252P48623p1945m21179l83619k89081j32773J94511
$$ 739694 240096 1066358 2392610 3141233 3069288 2648109 2264490 1975409 1842636 2037147
38992B037147N19788N32222J45294m17347p87189p13967l30099j07310l54634
$$ 2037147 2556935 3089157 3234451 2817104 2029915 1315948 985849 878539 523905
38983E23905q08659r19490m82547K11351P66553R76219P71971J63893o47606j201645
$$ 523905 -284754 -1204244 -1686791 -1475440 -708887 267332 1039303 1203196 555590 -646055
38973f46055r81965R6377J297355J468240K78543j110177j233842j56630O53280
$$ -646055 -1628020 -1531643 -234288 1233952 1512495 402318 -831524 -988154 -334874
38964c34874L85413j54751p1480K17061k1947l34851J81179J166059J379115O19885
$$ -334874 50539 -104212 -175692 41369 19422 -315429 -134250 1031809 2410924 3030809
38954C030809n4433r5358j42629o07245q06544j65426O81427Q00283L20130P0681
$$ 3030809 2976376 2881018 2738389 2131144 1324600 1159174 1840601 2640884 2961014 3031695
38944C031695K75061L82565J6969n72135r74896j029235p24203r5123O53017J146254
$$ 3031695 3306756 3689321 3706290 3134155 2159259 1130024 405821 310698 963715 2109969
38934B109969J120246O63496J32991k02105m39079q77708j519759j882169j472283
$$ 2109969 3230215 3893711 4026702 3824597 3385518 2507810 988051 -894118 -2366401
38925b366401l44436R55937J841169J922983J095658k67902j366926j583872r97367
$$ -2366401 -2710837 -1754900 86269 2009252 3104910 2837008 1470082 -113790 -1111157
38916a111157j20309O06674Q29639K57261q44623j483265r20109L57196J215507
$$ -1111157 -1231466 -624792 204847 462108 -382515 -1865780 -2785889 -2428693 -1213186
38907a213186J205928P29371K06310j48399j2124O55394J079319N23023m29480
$$ -1213186 -7258 722113 928423 780024 767900 1423294 2502613 3025636 2596156
38898B596156n42096J47354L31750m59061j123254q17362j82913l4434p0696J70304
$$ 2596156 2054060 2201414 2533164 2074103 950849 133487 -49426 -83860 -154556 15748
38888A5748J86616m94929j070776m97494P81652J393706R63835L15576o743k26923
$$ 15748 202364 -292565 -1363341 -1860835 -1079183 314523 1278358 1593934 1587191 1360268
38878A360268l96887j15113N86698R67687N22582l86299j064647j196241q92165
$$ 1360268 963381 848268 1434966 2402653 2925235 2538936 1474289 278048 -614117
38869f14117m28446l2768L10402P62864J150979R31522L1237p05242n26751J01734
$$ -614117 -1042563 -1075331 -764929 -2065 1148914 2080436 2111673 1406431 879680 981414
38859I81414J40091m71897p49337j60320O22237O95934N0934n84391o53442k90932
$$ 981414 1121505 649608 -99729 -260049 362188 1058122 1109056 524665 -128777 -419709
38849d19709r3280m21877q89270p58887L9838P31234P73914N31709M28825J55979
$$ -419709 -512989 -934866 -1824136 -2583023 -2543185 -1811951 -1038037 -506328 -77503 78476
38839G8476n24337q59167p3437J157275J388243L89662o87739j037754r11222
$$ 78476 -445861 -1305028 -1378465 -221190 1167053 1556715 868976 -168778 -1080000
38830a080000o01119K1973P41822R48831O78260O01819P11223K27063q01231j161445
$$ -1080000 -1681119 -1659146 -917324 31507 709767 1311586 2022809 2249872 1448641 287196
38820B87196l95107K81070j30862q21134n90019K26056N49109L94612M63104N65372
$$ 287196 -107911 173159 42297 -778837 -1368856 -1142800 -593691 -199079 264025 829397
38810H29397K7374p30126o41055R6374J66245o77303j142158n19547K15919J08963
$$ 829397 856771 126645 -514410 -418036 -251791 -929094 -2071252 -2590799 -2374880 -2265917
38800b265917l02259j48068K39807R9995k69149p1516M34669L01502l47920k92293
$$ -2265917 -2568176 -2716244 -2476437 -2376442 -2645591 -2717107 -2282438 -1980936 -2328856 -2621149
38790b621149Q04760J612005R54489m95098j171082o71102M1033J87924J0536
$$ -2621149 -1816389 -204384 750105 255007 -916075 -1587177 -1546144 -1358220 -1347684
38781a347684L8144L38102P19458J052259J096473N59709l25880p71283l93584
$$ -1347684 -1309540 -971438 -251980 800279 1896752 2456461 2130581 1359298 965714
38772I65714K01614K52518j30964k95320n1202K64281M64075N61575L28068m35843
$$ 965714 1167328 1419846 1288882 993562 942360 1206641 1670716 2232291 2560359 2124516
38762B124516j232448j241584m38485L69099O92460P97277Q85614P12438K85018
$$ 2124516 892068 -349516 -788001 -418902 273558 1070835 1956449 2668887 2953905
38753B953905O5075O7461l69754j368896j924690j268724q4694M85626M19921
$$ 2953905 3018980 3086441 2716687 1347791 -576899 -1845623 -1930317 -1444691 -1024770
38744a024770M50828O49604M76000k8744k03846J03936L34138J92324j2722r4541
$$ -1024770 -573942 75662 551662 522918 319072 423008 757146 949470 936748 842207
38734H42207k55428n02297n15737k24358J30952N15190R64910R96350Q6457j152192
$$ 842207 586779 84482 -431255 -655613 -524661 -9471 955439 1951789 2038246 886054
38724H86054j322910j26855J066166J009725O4800o50122p20372l77003J89877
$$ 886054 -436856 -563711 502455 1512180 1576980 926858 206486 -170517 19360
38715A9360O36484L15520p31843j250151l06825J108231J203253j49769j302275
$$ 19360 655844 971364 239521 -1010630 -1317455 -209224 994029 844260 -458015
38706d58015j139899k61341L29502M78981L98760N3829l06822K8304J056544J497800
$$ -458015 -1597914 -1859255 -1529753 -1050772 -652012 -598183 -905005 -876701 179843 1677643
38696A677643L90317j317174j858620j019030k56941m97450r85430o86277J84280
$$ 1677643 2067960 750786 -1107834 -2126864 -2383805 -2881255 -3866685 -4552962 -4368682
38687d368682O88188N40275J99304k5136k00346k50795Q9543P20108J093585Q69489
$$ -4368682 -3680494 -3140219 -2940915 -2966051 -3166397 -3417192 -3327649 -2607541 -1513956 -644467
38677f44467K99220j66603l29081j75681K65562P49937P88708J67897o26472q60749
$$ -644467 -345247 -511850 -840931 -1016612 -751050 -1113 787595 955492 329020 -531729
38667e31729m40896l6561k08092o67789o58132L3433P44353P46896J71961j73601
$$ -531729 -972625 -1009186 -1217278 -1885067 -2543199 -2509766 -1765413 -1018517 -846556 -1020157
38657a020157J16085N20049L43916l12123p38168o08958k79431o0555K22834O85945
$$ -1020157 -904072 -384023 -40107 -352230 -1090398 -1699356 -1978787 -2039342 -1816508 -1130563
38647a130563R28820O33061K56755M74727J043745R50163j35384j191298j073628
$$ -1130563 -201743 431318 688073 1162800 2206545 3156708 3021324 1830026 756398
38638G56398j3861O67945K28074o55588q33965r0788P07760P05933l3834p66399
$$ 756398 742537 1410482 1638556 982968 149003 58215 765975 1471908 1438074 671675
38628F71675r35515n90220p0520L76984N77784L41878k90889q38880p69216j62593
$$ 671675 -263840 -854060 -924580 -547596 30188 372066 81177 -757703 -1526919 -1689512
38618a689512L00875J76030j59801j4256O45762J079353P31151R813j94639L33825
$$ -1689512 -1388637 -1212607 -1372408 -1386664 -740902 338451 1069602 1079415 884776 1218601
38608A218601Q48591O21675j43716o88507p18222n71208m71471k15266K44862
$$ 1218601 2067192 2688867 2545151 1856644 1138422 567214 95743 -119523 125339
38599A25339M77393J96021k36401l63932l06270l41869j99981M78957J170961
$$ 125339 602732 798753 562352 198420 -107850 -449719 -649700 -170743 1000218
38590A000218Q84433l09122j060731n07518M93378N66479k75172p83904l46107
$$ 1000218 1884651 1575529 514798 7280 500658 1067137 791965 8061 -338046
38581c38046K11281q5539r44415j208714l86178P46368J108797N21830k81006
$$ -338046 -126765 -212304 -1156719 -2365433 -2751611 -2005243 -896446 -374616 -655622
38572f55622o48181o37207n75120l92910K03946J064583J587442J455106R51690
$$ -655622 -1303803 -1941010 -2516130 -2909040 -2705094 -1640511 -53069 1402037 2353727
38563B353727M09851k13608r40677j375802j155642n47464j31448j9813J46826
$$ 2353727 2763578 2549970 1609293 233491 -922151 -1469615 -1601063 -1620876 -1474050
38554a474050M81404O17647K96590k08008m44867l25041j38077j74029m39081
$$ -1474050 -992646 -374999 -78409 -286417 -731284 -1056325 -1194402 -1368431 -1807512
38545a807512o57399n26309n6514L82426M71396K99048J42067L9254j28841k53857
$$ -1807512 -2464911 -2991220 -3047734 -2665308 -2193912 -1894864 -1752797 -1713543 -1842384 -2096241
38535b096241q7038K82263M22580J27697l20616n17349k58866M78763J439252
$$ -2096241 -2183279 -1901016 -1478436 -1350739 -1671355 -2188704 -2447570 -1968807 -529555
38526e29555J919935J290067p9945r63157p18463o9221K0045k97539j98594M11166
$$ -529555 1390380 2680447 2600502 1637345 918882 849661 869706 572167 373573 784739
38516G84739Q02440N81105R8290l12172o85078q71928m61299M18640R31948O09339
$$ 784739 1587179 2168284 2266574 1954402 1269324 397396 -63903 354737 1286685 1896024
38506A896024J5472r8683K16288M22048K77507j78649q93767j482737j214252
$$ 1896024 1911496 1812813 2029101 2451149 2728656 2550007 1656240 173503 -1040749
38497a040749m5772Q54733N12756l82525m86530Q1212l778r23035j187165M6932
$$ -1040749 -1086521 -231788 280968 -101557 -588087 -506875 -510653 -1433688 -2620853 -2573921
38487b573921J547215J784407J011331M68007L87988J00283m08679m33370M9214
$$ -2573921 -1026706 757701 1769032 2237039 2625027 2725310 2316631 1883261 1932475
38478A932475J68091m45858j040605q48150p3069N40684N71648J11717m32570
$$ 1932475 2100566 1654708 614103 -234047 -307116 233568 805216 916933 484363
38469D84363n72756j97465J56362m9652m96677m01004K80373P77103O84888L91107
$$ 484363 -88393 -285858 -129496 -179148 -675825 -1076829 -796456 -19353 665535 1056642
38459A056642J76203j84212o03901m58773K68983N56074j67097q93547m03885
$$ 1056642 1232845 1048633 444732 -14041 254942 811016 643919 -249628 -653513
38450f53513Q30468J231147L15131p85711r69082l39043L78092P19052N43402
$$ -653513 176955 1408102 1723233 937522 -31560 -370603 7489 726541 1269943
38441A269943n3716n71252m34061J83733L74190l12990j127409j013764r178P30325
$$ 1269943 1216227 644975 210914 394647 768837 455847 -671562 -1685326 -1694504 -964179
38431i64179L44821o10800p60045L64182J555738J352356J2328p45596j50614
$$ -964179 -619358 -1230158 -1990203 -1626021 -70283 1282073 1294401 548805 398191
38422C98191N07816j15403j289104j344149l16075J94220k96462m02445O92794
$$ 398191 906007 790604 -498500 -1842649 -2158724 -1964504 -2260966 -2663411 -1970617
38413a970617J718395J295416J44182q5905O24236Q13121q4470j013983j070310
$$ -1970617 -252222 1043194 1187376 1101471 1725707 2538828 2454358 1440375 370065
38404C70065o87631o07072o63811k86176M22014Q24520P08670M88534M87249M83096
$$ 370065 -317566 -924638 -1588449 -1874625 -1452611 -628091 80579 569113 1056362 1539458
38394A539458J26457m50171o99307l39107K36823M13005J34663l3258L17858Q86030
$$ 1539458 1665915 1215744 516437 177330 414153 827158 961821 928563 1246421 2132451
38384B132451J045990N66007k65401j032398j455044j384410q20100K8663Q09186
$$ 2132451 3178441 3744448 3479047 2446649 991605 -392805 -1212905 -1184242 -375056
38375c75056J177756R58235L28657j77825j31828K87177N10660L13355j8025k48522
$$ -375056 802700 1760935 2089592 1911767 1779939 2067116 2577776 2891131 2873106 2624584
38365B624584m69235p43706r81815j223887j446274j077170L80187K052774K227200
$$ 2624584 2155349 1411643 429828 -794059 -2240333 -3317503 -2937316 -884542 1342658
38356A342658P65734k97521L96500J364772N26449j410409j898885m40597Q07892
$$ 1342658 2108392 1810871 2207371 3572143 4098592 2688183 789298 348701 1156593
38347A156593N21167q620N91375J481061J195542J0701p94516r68703j081107
$$ 1156593 1677760 1669140 2260515 3741576 4937118 4947819 4153303 3184600 2103493
38338B103493j068713m82962K95509M52684N8269j77861j49111k19234j99294
$$ 2103493 1034780 551818 847327 1300011 1358280 1180419 1031308 812074 612780
38329F12780K96464P37099K77759o14826n72990M90495J053152K65318p73144
$$ 612780 909244 1646343 1924102 1309276 736286 1226781 2279933 2545251 1772107
38320A772107p20552J29700N65696K47506j56258j38869J65834M09203K98179
$$ 1772107 1051555 1181255 1746951 1994457 1838199 1699330 1865164 2274367 2572546
38311B572546l41040j240961j626250r46649M25808J551787J832939J346969N45132
$$ 2572546 2231506 990545 -635705 -1582354 -1156546 395241 2228180 3575149 4120281
38302D120281q5263k75932j82840j84568l27817k49436J76461M72011J35351o70636
$$ 4120281 4035018 3759086 3576246 3391678 3063861 2814425 2990886 3462897 3598248 2927612
38292B927612j282119j189788l75261P04677J290881Q50431k88966j136279j114082
$$ 2927612 1645493 455705 80444 785121 2076002 2926433 2637467 1501188 387106
38283C87106o23349l27147l01931k30990k2621K03298M32887O37147N98512K52199
$$ 387106 -236243 -563390 -865321 -1096311 -1118932 -915634 -482747 154400 752912 1005111
38273A005111o1564o6053J2869j29098l06524j33310L82554R36147J308119J244095
$$ 1005111 943547 877494 890363 761265 454741 321431 703985 1640132 2948251 4192346
38263D192346L90838j048712j994188j590455m04336K59026P2550j36894J18012
$$ 4192346 4583184 3534472 1540284 -50171 -454507 -195481 -122931 -259825 -141813
38254a41813K85631j64565q02079q27487r7309Q39237J378565J265474O66558
$$ -141813 143818 -20747 -822826 -1650313 -1747622 -908385 470180 1735654 2402212
38245B402212M7975k52476l64932n09980m33167K06930R43149P79762m08860j495716
$$ 2402212 2450187 2197711 1832779 1322799 889632 1096562 2039711 2819473 2410613 914897
38235I14897j496223p01567J7481L86547N97125N53220N2445n42599n84956n1667
$$ 914897 -581326 -1282893 -1265412 -878865 -281740 271480 323925 -218674 -803630 -855297
38225h55297M42327N29017M19153L22453J30935j41894j41978K67178O05809L59997
$$ -855297 -412970 116047 535200 857653 988588 846694 704716 971894 1577703 1937700
38215A937700k35461m40387j4649M36790K70627l79307q60867q27278m31214J36667
$$ 1937700 1702239 1261852 1247203 1683993 1954620 1575313 714446 -112832 -544046 -407379
38205d07379P96503J263249J147427N66666J37701Q4109r6644o83160j062050
$$ -407379 389124 1652373 2799800 3366466 3504167 3588276 3491632 2808472 1746422
38196A746422o46410O1061J49527l15991n13992k45589q2107j89286n8610M53164
$$ 1746422 1100012 1161073 1310600 994609 480617 235028 152921 -36365 -94975 358189
38186C58189Q16487P91232P45287P62627M32098j64187l35579p2975k59545r90868
$$ 358189 1174676 1965908 2711195 3473822 3905920 3741733 3406154 3333179 3073634 2082766
38176B082766j010340K17282J175523M37314r20564q01505O51630J255333J45979
$$ 2082766 1072426 1289708 2465231 2902545 1981981 1180476 1832106 3087439 3233418
38167C233418j026156p27772L35492O16274k5888n68477n18567k66061j36448
$$ 3233418 2207262 1479490 1814982 2431256 2405368 1836891 1318324 1052263 915815
38158I15815l8799L7842r9646m13701n73340m33015k29399j70679r7050K09158
$$ 915815 877016 914858 815212 401511 -171829 -604844 -834243 -1004922 -1101972 -892814
38148h92814M94236J96093o62301j100738k76340J143514J499772L21319q31820
$$ -892814 -398578 -202485 -864786 -1965524 -2241864 -1098350 401422 722741 -109079
38139a09079l75724J099570J617538M88197q97692j041212j42834M76657J32951
$$ -109079 -484803 614767 2232305 2720502 1822810 781598 638764 1115421 1248372
38130A248372n74658o66837J5165O13234L12302n22556p29718J1976O35892K46742
$$ 1248372 673714 6877 22042 635276 947578 425022 -304696 -292720 343172 589914
38120E89914n31815n90429n3980J48583l3373J19731M71294J7029j234653j772148
$$ 589914 58099 -532330 -586310 -437727 -471100 -351369 119925 136954 -1097699 -2869847
38110b869847o01003J301975K242400J715528M64645o28523j090735q92222n06006
$$ -2869847 -3470850 -2168875 73525 1789053 2253698 1625175 534440 -357782 -863788
38101h63788m86533o49224k41318P88623J450939J085861L16536O2407K90341
$$ -863788 -1350321 -1999545 -2240863 -1452240 -1301 1084560 1401096 1463503 1753844
38092A753844M11900L36488L81051N21642M38489J06156j81213k30689p4512J31588
$$ 1753844 2165744 2502232 2883283 3404925 3843414 3949570 3768357 3537668 3463156 3594744
38082C594744J53221r8473l20751j98996o791k41057o84963n93297J38952Q32626
$$ 3594744 3747965 3649492 3328741 3129745 3122954 2881897 2196934 1603637 1742589 2575215
38072B575215J104275J127553P67287l37174j595154j718476o04618L68432M44364
$$ 2575215 3679490 4807043 5574330 5237156 3642002 1923526 1318908 1687340 2131704
38063B131704M24061Q44329Q64702k3245p67705m88985L3342m2917l5623P00689
$$ 2131704 2555765 3400094 4264796 4241551 3473846 2984861 3018203 2975286 2939663 3640352
38053C640352J132921L12285o05518j75505P51569N49732j84919K88233J635768
$$ 3640352 4773273 5085558 4480040 4304535 5056104 5605836 5420917 5709150 7344918
38044G344918K069842J652991K114378L554089M211601L680174L622411M917500
$$ 7344918 9414760 11067751 13182129 16736218 20947819 24627993 28250404 33167904
38036C3167904O584652P870021R070913J0237927J1494391J4291081J9471240
$$ 33167904 39752556 47622577 56693490 66931417 78425808 92716889 112188129
38029A12188129K4976493K9428715L6497824M8718260N6279526M1465712O72221
$$ 112188129 137164622 166593337 203091161 251809421 308088947 349554659 350226880
38022C50226880m4357404o5856055n8096759l8984803k6258660k1421465j7569362
$$ 350226880 305869476 240013421 181916662 142931859 116673199 95251734 77682372
38015G7682372j2698809r519507q300906o750747m693302l806139l852786l091004
$$ 77682372 64983563 55464056 47163150 40412403 35719101 31912962 28060176 24969172
38007B4969172j677069j345504k165604k536257k140891k189422k719639k239758
$$ 24969172 23292103 21946599 19780995 17244738 15103847 12914425 10194786 7955028
37999G955028m66601Q57261O10673j32560p8862L28646N6479o17797o56344l9489
$$ 7955028 7488427 8345688 8956361 8823801 8744939 9073585 9130064 8512267 7855923 7816434
37989G816434K65648q9032l27334J75390Q82084P97058j95071j170336j284695
$$ 7816434 8082082 7993050 7665716 7841106 8723190 9520248 9325177 8154841 6870146
37980F870146o50108L2144L58900M32952M29294M07666M89748P74221J062787
$$ 6870146 6220038 6252182 6611082 7044034 7473328 7880994 8370742 9144963 10207750
37971A0207750J097805J077020J445932K163241K757595L160583L708737M073793
$$ 10207750 11305555 12382575 13828507 15991748 18749343 21909926 25618663 29692456
37963B9692456L098815L40614k899260m843030n066020m362728l338488k104992
$$ 29692456 32791271 33131885 30232625 25389595 20323575 15960847 12622359 10517367
37955A0517367j047788p58708j118453j354603j166437r86294r84992p14404n6354
$$ 10517367 9469579 8710871 7592418 6237815 5071378 4085084 3100092 2385688 2329334
37946B329334L49015J28297j43928P5011L19865p0684o94961o18656R6921M33325
$$ 2329334 2678349 2806646 2662718 2737729 3057594 2986910 2291949 1673293 1770214 2203539
37936B203539O692l78136n8612M83704M81954N4575j82541k20853n52869j086155
$$ 2203539 2210231 1832095 1773483 2257187 2739141 2793716 2611175 2390322 1837453 751298
37926G51298r71937K17736J642639J939353P14020r44783j519454o21556N89607
$$ 751298 -220639 -2903 1639736 3579089 4293109 3348326 1828872 1207316 1796923
37917A796923P12501k38464q78372k78918Q08329J038064L14213k43016J2862
$$ 1796923 2509424 2270960 1392588 1113670 1921999 2960063 3274276 3031260 3044122
37908C044122N27334O63929O49628R07133J124395P03322j77003n99403K9864
$$ 3044122 3571456 4235385 4885013 5792146 6916541 7619863 7442860 6843457 6873321
37899F873321J363348K520617K850465K394610J844848J950130K797398L815216
$$ 6873321 8236669 10757286 13607751 16002361 17847209 19797339 22594737 26409953
37891B6409953M561875N172830N808986O025487N073810K669577p47300m236929
$$ 26409953 30971828 36144658 41953644 47979131 53052941 55722518 54975218 50738289
37883E0738289o656521p218578o222220m928837m284177m045942l533720k757090
$$ 50738289 44081768 36863190 30640970 25712133 21427956 17382014 13848294 11091204
37875A1091204k180675j778972j139511l21917J96719L82197O59589J014174Q44653
$$ 11091204 8910529 7131557 5992046 5670129 5866848 6249045 6908634 7922808 8767461
37866H767461p9006j133627j551415j146855k49110N76987P05115l9325r31250
$$ 8767461 8688455 7554828 6003413 4856558 4607448 5184435 5889550 5850225 4918975
37857D918975j024780l77164Q0519k6853r9315J65067J08173o35876j145991m57223
$$ 4918975 3894195 3517031 3597550 3570697 3471382 3636449 3744622 3108746 1962755 1505532
37847A505532P82166J012587p9414j150486j029321o6767O15127N14766j8319
$$ 1505532 2287698 3300285 3220871 2070385 1041064 974297 1589424 2104190 2085871
37838B085871m59444n53186l20315J773J07917n8906k19196j41053J6443m4312
$$ 2085871 1626427 1073241 752926 754699 862616 803710 584514 443461 459904 415592
37828D15592k56843k20470K30494P40570Q61111N94867L26570L07731M01747K98768
$$ 415592 158749 -61721 168773 909343 1770454 2365321 2691891 2999622 3401369 3700137
37818C700137j61849q11102j167951q20758o266M61605K14156m9472M13116J037180
$$ 3700137 3538288 2727186 1559235 738477 732211 1193816 1407972 1358500 1771616 2808796
37808B808796N97463q14858j637354j014755N2343L96207L58469P82174J340639
$$ 2808796 3406259 2591401 954047 -60708 -8365 387842 746311 1528485 2869124
37799B869124J169384M59495M1333j33629o95191j388506j344675o17506l6171
$$ 2869124 4038508 4498003 4539336 4405707 3710516 2322010 977335 359829 323658
37790C23658L20739J031953J828559J791249J085930Q24513J040552N88904o18120
$$ 323658 644397 1676350 3504909 5296158 6382088 7206601 8247153 8836057 8217937
37781H217937j176888n67790n3423l92910n32887L88616J515658J938485K194300
$$ 8217937 7041049 6473259 6419836 6026926 5494039 5882655 7398313 9336798 11531098
37772A1531098K830676L139474K727367K721536L920351N357211O191033P231212
$$ 11531098 14361774 17501248 20228615 22950151 26870502 32227713 38418746 45649958
37764D5649958R072496J1022841J3725793J9512657K6544424K5861289J0387309
$$ 45649958 54722454 65745295 79471088 98983745 125528169 151389458 161776767
37757A61776767j3703073l0660280l1568014k2331555j3948523j0212813q172883
$$ 161776767 148073694 117413414 85845400 63513845 49565322 39352509 31179626
37750C1179626n868772m241522l438712k192304o55072l49121j270807j811975
$$ 31179626 25310854 21069332 17630620 15438316 14783244 14434123 13163316 11351341
37742A1351341j530000j500639j899398j625754n58642L0139k73373l55816L19776
$$ 11351341 9821341 8320702 6421304 4795550 4236908 4267047 3993674 3637858 3957634
37733C957634P71873L23318k79392l49685m06302r36295j249178n81224N59515
$$ 3957634 4729507 5052825 4773433 4423748 4017446 3081151 1831973 1250749 1810264
37724A810264J103105Q26646K78885j29986k58467L9905O34158R31703N59830
$$ 1810264 2913369 3740015 4018900 3888914 3630447 3670352 4304510 5236213 5796043
37715E796043p2025l55327k93011k80598m16940n16710n45014n70095m80753j85548
$$ 5796043 5724018 5368691 5075680 4795082 4378142 3861432 3316418 2746323 2265570 2080022
37705B080022N9608o1537m04054n10393k51394J8547j2825j97769j40338L02329
$$ 2080022 2139630 2078093 1674039 1163646 912252 930799 917974 720205 579867 882196
37695H82196Q10681Q78345L23376m49564p70823l64802L42529O28579J78000o31587
$$ 882196 1692877 2571222 2894598 2445034 1674211 1309409 1651938 2280517 2458517 1826930
37685A826930j119520r47947l70655J27903L30488L50365L44369L80659N01791
$$ 1826930 707410 -240537 -611192 -483289 -152801 197564 541933 922592 1424383
37676A424383O20373M07280l07961j009384r02734l0075O07900L84885j08689
$$ 1424383 2044756 2452036 2144075 1134691 231957 201882 809782 1194667 1085978
37667A085978r6029J23125k17766q79303q06291K43196J261892J396584R03150
$$ 1085978 989949 1113074 895308 16005 -790286 -547090 714802 2111386 3014536
37658C014536L64703k00103r02769j347729j137448n94728l03207k03981J87692
$$ 3014536 3379239 3179136 2276367 928638 -208810 -803538 -1106745 -1310726 -1123034
37649a123034Q32277J125637Q35882M57031M30793N09887K23758l28734n37833
$$ -1123034 -290757 834880 1670762 2127793 2558586 3068473 3292231 2963497 2425664
37640B425664o9397O81064R80426M86773m48838j134280j154820o95265l03576
$$ 2425664 2356267 3037331 4017757 4504530 4055692 2921412 1766592 1071327 767751
37631G67751l28042n68870n29931n5353L96802L03284j57384k24274M16115J074268
$$ 767751 439709 -129161 -659092 -714445 -317643 -14359 -171743 -396017 20098 1094366
37621A094366Q89405l0770q02167r86864r92640j130199r62036o3063J060888
$$ 1094366 1983771 1953001 1150834 163970 -828670 -1958869 -2920905 -2983968 -1923080
37612a923080J483605J083202N86275M19837K23833k94508o95756m74477O7846
$$ -1923080 -439475 643727 1230002 1649839 1873672 1579164 883408 408931 476777
37603D76777K16319j18272l51680j34966K75757N74387P19510N71209j08767r58838
$$ 476777 693096 574824 223144 88178 363935 938322 1657832 2229041 2120274 1161436
37593A161436r86583J54503J336635J175773j59868j161360r45378j76098J54148
$$ 1161436 174853 329356 1665991 2841764 2681896 1520536 575158 399060 553208
37584E53208O9898K64689R17123J410244J085255k8360j156812j402218o41044
$$ 553208 623106 887795 1804918 3215162 4300417 4272057 3115245 1713027 1071983
37575A071983K30704L15969j12020n9284N92384Q32138J60820n02129k41375L87627
$$ 1071983 1302687 1618656 1506636 1447352 2039736 2871874 3032694 2530565 2289190 2676817
37565B676817L12868k60547k39416M61998P38834J08482n38009m20601l6222j59413
$$ 2676817 2989685 2729138 2489722 2951720 3690554 3799036 3261027 2840426 2804204 2644791
37555B644791n02500k63928M38689O13278j69414j105889j138719j94940P97293
$$ 2644791 2142291 1878363 2317052 2930330 2760916 1655027 516308 321368 1118661
37546A118661R54046L17114k78015j17060O74386J331296J262308N46257l10236
$$ 1118661 2072707 2389821 2111806 1994746 2669132 4000428 5262736 5808993 5498757
37537E498757r12332j220466j372112j365777j008827k83124L30009K26017n13645
$$ 5498757 4586425 3365959 1993847 628070 -380757 -663881 -333872 -107855 -621500
37528f21500j059564q30855j84336K44197M71688Q67419J239524J001365K03921
$$ -621500 -1681064 -2511919 -2696255 -2452058 -1980370 -1112951 126573 1127938 1331859
37519A331859l64066k58965Q7609J34749o9289k25257k71548k13821M3241L53974
$$ 1331859 967793 708828 796437 931186 861897 636640 365092 151271 194512 548486
37509E48486K93583j55356l42762J44402P22988N50027k40136o80317k91694L41292
$$ 548486 842069 686713 343951 488353 1211341 1761368 1521232 840915 549221 890513
37499H90513M47566N6646j63610J71406O80832O76150o431p41869p60985J2365
$$ 890513 1338079 1394725 1231115 1402521 2083353 2759503 2753072 2011203 1250218 1262583
37489A262583R31675J383997J313459R72915N05071m0456n38985q81558j071863
$$ 1262583 2194258 3578255 4891714 5864629 6369700 6329244 5790259 4908701 3836838
37480C836838j061046o84085L4121O88930Q43351M54510j97126q28887j233432
$$ 3836838 2775792 2091707 2125828 2814758 3658109 4112619 3915493 3086606 1853174
37471A853174j252214r29435n46158k74084L3626M64266P00107M50884O9814K02972
$$ 1853174 600960 -328475 -874633 -1148717 -1115091 -650825 49282 500166 569980 772952
37461G72952P87990R61866K32440p23577q90648k56668K59151J57229l8173K11767
$$ 772952 1560942 2522808 2755248 2031671 1141023 884355 1143506 1300735 1262562 1474329
37451A474329M61690p8991j193489j695893r04783N25371J454094J427716P53285
$$ 1474329 1936019 1857028 663539 -1032354 -1937137 -1411766 42328 1470044 2223329
37442B223329p8200o40695o45755k11259J99818L98680O37191Q66573M69069o65034
$$ 2223329 2145129 1504434 858679 647420 847238 1245918 1883109 2749682 3218751 2553717
37432B553717j423939p85305N29634Q03863l47199j471905j276005j47662O55739
$$ 2553717 1129778 344473 874107 1677970 1330771 -141134 -1417139 -1564801 -909062
37423i09062N39830j35107o76008n63222K04925R81527J076208O22409L81400
$$ -909062 -369232 -504339 -1180347 -1743569 -1538644 -557117 519091 1141500 1522900
37414A522900O34943Q61175N98394r012o52571j191858j391210r70319r4985P28029
$$ 1522900 2157843 3019018 3617412 3608400 2955829 1763971 372761 -597558 -692543 35486
37404C5486J264925J491416J142369J94801m40349J40058J311786J635626J024498
$$ 35486 1300411 2791827 3934196 4128997 3688648 3828706 5140492 6776118 7800616
37395G800616P29168J191217J652639J986009K877232L985478M375661N133389
$$ 7800616 8529784 9721001 11373640 13359649 16236881 20222359 24598020 29731409
37387B9731409Q238126J1601352R217424p25532j1202687j3970086r593339n307120
$$ 29731409 37969535 49570887 58788311 58062779 46860092 32890006 23296667 17989547
37379A7989547m525342m038604j465205N43982m72985k259064j645856M93437
$$ 17989547 13464205 9425601 7960396 8504378 8031393 5772329 4126473 4619910
37371D619910J280450L83940m91751q34096j168681j069251k1641P83883M5417
$$ 4619910 5900360 6284300 5792549 4958453 3789772 2720521 2698880 3482763 3528180
37362C528180j133925p49363Q09571J405370N76754j58350j85486m87583j304248
$$ 3528180 2394255 1644892 2454463 3859833 4436587 4278237 4092751 3605168 2300920
37353B300920j455320n49899J58844j22774m78112K1530Q00056Q77522L64417
$$ 2300920 845600 295701 454545 331771 -146341 -124811 675245 1552767 1917184
37344A917184m1498k04181l88924n63415n09831k23200J78343N42009N44671J8433
$$ 1917184 1875686 1671505 1282581 719166 209335 -13865 164478 706487 1251158 1269591
37334A269591n20770l49704L63356O79310K34017l29006m46877l23951k68560
$$ 1269591 748821 399117 762473 1441783 1675800 1346794 899917 575966 307406
37325C07406j74075j6059r7475m07246m51696j10022P1014j48601k05526K56856
$$ 307406 133331 117272 19797 -387449 -839145 -949167 -878153 -1026754 -1232280 -975424
37315i75424O38209L39004j62253j0439O76817J012388O68540J85496j9627k10710
$$ -975424 -337215 1789 -160464 -170903 505914 1518302 2186842 2372338 2352711 2142001
37305B142001p05870j230084j230271o03703J72389O08457P02629P49928P67444
$$ 2142001 1436131 206047 -1024224 -1627927 -1455538 -847081 -144452 605476 1372920
37296A372920M41385k28166o31168k94639L70624O03202L56711J89854K39626
$$ 1372920 1814305 1586139 954971 660332 1030956 1634158 1990869 2180723 2420349
37287B420349J10336j78422l0450O44762J003847M07143o39629j177116r25052
$$ 2420349 2530685 2352263 2321813 2966575 3970422 4377565 3737936 2560820 1635768
37278A635768k90824K65138M53408K21044k6198K20502O71757L88251p28478j440727
$$ 1635768 1344944 1610082 2063490 2284534 2258336 2478838 3150595 3538846 2810368 1369641
37268A369641q83589O5270J00026n59577p47103l30019j61129l06896P5216R54082
$$ 1369641 486052 551322 651348 91771 -655332 -985351 -1146480 -1453376 -1378160 -424078
37258d24078J111843J37740o91512l34279M29663L62635k70583l40386K12121
$$ -424078 687765 825505 133993 -200286 229377 592012 321429 -18957 193164
37249A93164M09289p7458n25255m39079j47199K6329K24234M42420L17855j17832
$$ 193164 602453 524995 -260 -439339 -586538 -560209 -335975 106445 424300 306468
37239C06468k24225K92409Q63220R34080P27471O16175L77569k12272n62634K3824
$$ 306468 82243 374652 1237872 2171952 2899423 3515598 3893167 3680895 3118261 3142085
37229C142085J052130J212576J35568j074518j300582o74811l1627K25072J80290
$$ 3142085 4194215 5406791 5542359 4467841 3167259 2492448 2460821 2685893 2866183
37220B866183j46364p36999j199618j089376n59949j92166j70173q6620L61528
$$ 2866183 2719819 1982820 783202 -306174 -866123 -1058289 -1228462 -1315082 -953554
37211i53554R02886J083069Q17385L65675k6428k77780m00362m30105l72501j71070
$$ -953554 -50668 1032401 1849786 2215461 2189033 1911253 1510891 1080786 708285 537215
37201E37215J78960M83918M83751J91251n4075K6147L07481M07253J15102l95056
$$ 537215 716175 1200093 1683844 1875095 1821020 1847167 2154648 2561901 2677003 2281947
37191B281947p55550p56515n04831k57388j55996j85595l03657m20754l04303
$$ 2281947 1526397 769882 265051 7663 -148333 -333928 -637585 -1058339 -1362642
37182a362642J77591O67283O00898Q1975l9460O11751J160567O55085l71853n28338
$$ -1362642 -1185051 -517768 83130 165105 125645 737396 1897963 2553048 2181195 1652857
37172A652857L27228P74322m1398j106950j090041k40699K77895K90293N80394
$$ 1652857 1980085 2754407 2713009 1606059 516018 275319 553214 843507 1423901
37163A423901J229002J311922M50868m89984p38970p10753j087107j516460j103688
$$ 1423901 2652903 3964825 4415693 3925709 3186739 2475986 1388879 -127581 -1231269
37154a231269J33186J132748J105430L58614k76773l55741j2858L60087M17054
$$ -1231269 -1098083 34665 1140095 1498709 1221936 866195 853337 1213424 1630478
37145A630478Q8193k95157k60337K69193Q14842Q51813L69841k19093o34399r53967
$$ 1630478 1718671 1423514 1163177 1432370 2247212 3099025 3468866 3249773 2615374 1661407
37135A661407j256676j299669q09265j0556M72252L68871J17483K05677M24199
$$ 1661407 404731 -894938 -1704203 -1714759 -1242507 -873636 -756153 -550476 -126277
37126a26277K21175l40571n78513k28593J46347R7961L9144N03334J128705J118909
$$ -126277 94898 -245673 -824186 -1052779 -906432 -808471 -769327 -265993 862712 1981621
37116A981621M78156r93O3006K27141R7842j47458l32769o28521r68842q35029
$$ 1981621 2459777 2458784 2521790 2748931 2846773 2699315 2366546 1738025 769183 -65846
37106f5846j17130M35621K17227l32195m88264l84009n63980p96049l24109Q04922
$$ -65846 -182976 252645 469872 137677 -350587 -734596 -1298576 -2094625 -2418734 -1613812
37096a613812J626761J574145J084000P20729M52817P7026k71943l56927j38887
$$ -1613812 12949 1587094 2671094 3391823 3844640 3921666 3649723 3292796 3153909
37087C153909L26730Q67830J056505O44558J03920M1394J33146m38211j438716
$$ 3153909 3480639 4348469 5404974 6049532 6153452 6194846 6327992 5889781 4451065
37078D451065j640770p69835j52394p33018j586018j347401j73807P95298J115281
$$ 4451065 2810295 2040460 1888066 1155048 -430970 -1778371 -1952178 -1156880 -41599
37069d1599J024845M89012m43445q83202r2526J113395J298228M39631l28780
$$ -41599 983246 1472258 1028813 145611 53085 1166480 2464708 2904339 2575559
37060B575559o63800j081757j278419l07669J312547J642253J69605j166804p87591
$$ 2575559 1911759 830002 -448417 -756086 556461 2198714 2368319 1201515 413924
37051D13924L14395M12470l26190n80798j76658K8990r0961R6402N67622O24702
$$ 413924 728319 1140789 814599 233801 57143 86133 -4828 91574 659196 1283898
37041A283898J56110k84495n00326o35633l82505N65800J447440J172033J26481
$$ 1283898 1440008 1155513 655187 19554 -362951 202849 1650289 2822322 2948803
37032B948803j60649O51253J154358M01521p18294j046313q63553j039114j415410
$$ 2948803 2788154 3439407 4593765 4995286 4276992 3230679 2367126 1328012 -87398
37023h7398j194849l69389L25542N78146O80912P39296N52517J88697o9105k75108
$$ -87398 -1282247 -1651636 -1326094 -747948 -67036 672260 1224777 1413474 1344369 1069261
37013A069261o15337p48846j54335Q33401J171042N16990k63384l53396n8512
$$ 1069261 453924 -294922 -449257 384144 1555186 2072176 1808792 1455396 1396884
37004A396884j35421o20058r39508q15206m39961p177L55357L90143L8269k28186
$$ 1396884 1261463 641405 -298103 -1113309 -1553270 -1560447 -1205090 -814947 -776678 -1004864
36994a004864m0790J15085l80670r45685l08899J408823K380336J541043K30640
$$ -1004864 -1045654 -930569 -1311239 -2256924 -2565823 -1157000 1223336 2764379 2995019
36985B995019K36852J087896Q42894q01400j934898j226969K54613P48687J39692
$$ 2995019 3231871 4319767 5162661 4361261 2426363 1199394 1454007 2202694 2342386
36976B342386l94053k91746q5513k81198o75088p92354m57797R1323L92896J95225
$$ 2342386 1948333 1656587 1571074 1289876 614788 -177566 -635363 -544040 -151144 44081
36966D4081j52877q0150L08580K71068l53156o67022k2791Q44455P93332o0309
$$ 44081 -108796 -188946 119634 390702 37546 -629476 -652267 192188 985520 925211
36956I25211n55442j38280N68720P96242M53037j05300m54554k07855O15478J251367
$$ 925211 369769 231489 800209 1596451 2049488 1944188 1489634 1281779 1897257 3148624
36946C148624Q29202n11507j647792j736235j007678k34836J23806J18841L6519
$$ 3148624 3977826 3466319 1818527 82292 -925386 -1160222 -1036416 -917575 -881056
36937h81056R3683K25615K04184P0139J36561L34112Q7026o74276j016400l25277
$$ -881056 -787373 -561758 -357574 -287435 -150874 183238 270264 -404012 -1420412 -1745689
36927a745689M78919J79750p29703p08185L25995P96168J9103p56114n22199o5000
$$ -1745689 -1266770 -1087020 -1816723 -2524908 -2198913 -1402745 -1383642 -2139756 -2661955 -2726955
36917b726955k52357k76110Q32482K032686J523930l35016j289073m09219P26764
$$ -2726955 -2979312 -3255422 -2422940 -390254 1133676 798660 -490413 -899632 -172868
36908a72868N43212l98255o35285K391N56639N88510M96540M77634K49842j39467
$$ -172868 370344 -27911 -663196 -660805 -104166 484344 980884 1458518 1708360 1568893
36898A568893j48139L22127N49289K5898o61265n96015J35104N58258J60038n80307
$$ 1568893 1420754 1742881 2292170 2318068 1656803 1060788 1195892 1754150 1914188 1333881
36888A333881j071819j281417j247089o80801L75065J096437Q32437J29214K2745
$$ 1333881 262062 -1019355 -2266444 -2947245 -2572180 -1475743 -643306 -514092 -491347
36879d91347N75756R36519O79613J99776j87876o11136r79258q39671j53962N21140
$$ -491347 84409 1020928 1700541 1900317 1712441 1101305 122047 -717624 -871586 -350446
36869c50446Q42661R63601Q90680M16672j30901n4424M90880M77280l54482r33638
$$ -350446 492215 1455816 2346496 2763168 2632267 2577843 3068723 3546003 3191521 2257883
36859B257883n46256M4046k7457l34442j71645O1085k75442o74477l53728J78208
$$ 2257883 1711627 1755673 1728216 1393774 1222129 1283214 1007772 333295 -20433 157775
36849A57775p5294p41634o06105L30010R36276R03628R06934Q77560P638j249887
$$ 157775 82481 -659153 -1265258 -935248 1028 904656 1811590 2689150 2696788 1446901
36839A446901j176417M83241J632943P71466p84296j020133k11526n9944p63405
$$ 1446901 270484 753725 2386668 3158134 2373838 1353705 1142179 1082235 318830
36830C18830r09694j0742P21336M16060j59587o938M88103K28082q54063j585031
$$ 318830 -590864 -601606 119730 535790 376203 369265 857368 1085450 231387 -1353644
36820a353644j046898K88339J169143J067953O70688P42122R53792M31187p20933
$$ -1353644 -2400542 -2112203 -943060 124893 795581 1537703 2491495 2922682 2201749
36811B201749j317970p60594N3764M3191n44842o95503j80526L32847M20988K58980
$$ 2201749 883779 123185 176949 220140 -324702 -1020205 -1200731 -867884 -446896 -187916
36801a87916k1464m63524p86849n66361J3478L06171J73426Q4729J95797J57230
$$ -187916 -209380 -672904 -1459753 -2026114 -2012636 -1706465 -1533039 -1448310 -1252513 -1095283
36791a095283j1318K14335P89325Q41349M1372o61282m42438M8928k54760j032137
$$ -1095283 -1106601 -892266 -102941 738408 779780 118498 -323940 -275012 -529772 -1561909
36781a561909j036582j14500N23552J75748l87911k68550K37232L16615n0905
$$ -1561909 -2598491 -2712991 -2189439 -2013691 -2401602 -2670152 -2432920 -2116305 -2167210
36772b167210k13903J09322N70013P70008O05340K02680q9579J28261P51188J052052
$$ -2167210 -2381113 -2271791 -1701778 -931770 -326430 -123750 -213329 -85068 666120 1718172
36762A718172N70049j63279l23394M0567J95489q6695k95599j42085L5060n941
$$ 1718172 2288221 2124942 1801548 1842115 2037604 1950909 1655310 1513225 1548285 1542344
36752A542344j8636J09856M2635l04767l95218P9478N43842L57622j63234k50699
$$ 1542344 1523708 1633564 1676199 1371432 976214 1055692 1599534 1957156 1793922 1543223
36742A543223J08567K40769q1475l46574k03449K5849n0713k76349j96720L46738
$$ 1543223 1651790 1892559 1811084 1464510 1261061 1286910 1236197 959848 763128 1109866
36732A109866J015495J185130M21806r51966j881974j599841n47856J85403K49248
$$ 1109866 2125361 3310491 3732297 2780331 898357 -701484 -1249340 -1063937 -814689
36723h14689J97062K93170O9485n75381p59771J21807J175836J066038j0107n20593
$$ -814689 -617627 -324457 -254972 -830353 -1590124 -1468317 -292481 773557 763450 242857
36713B42857J65423Q70416M10766o70042j032460n53562k71014n20479l93505
$$ 242857 408280 1278696 1689462 1019420 -13040 -566602 -837616 -1358095 -1751600
36704a751600N96507J433472J022413n4278l08702M48920Q85828K25906o26605
$$ -1751600 -1155093 278379 1300792 1246514 937812 1386732 2272560 2498466 1871861
36695A871861n70030O4182K26069j47385j93669L25364N70268q4672j077657j363979
$$ 1871861 1301831 1366013 1592082 1444697 1251028 1576392 2146660 2061988 984331 -379648
36685c79648o43359M62454J172056J184598P22877J99956j43949l37069m46381
$$ -379648 -1023007 -560553 611503 1796101 2518978 2718934 2574985 2237916 1791535
36676A791535l99364j58023R7753J79338J34899M2729k39661p54537j052788o43324
$$ 1791535 1392171 1234148 1331901 1511239 1646138 1688867 1449206 694669 -358119 -1001443
36666a001443J87699N57109J19767m77601n20263j53414p744k14527k86482P6470
$$ -1001443 -813744 -256635 -136868 -614469 -1134732 -1288146 -1295890 -1510417 -1796899 -1720429
36656a720429M95491M04033j75475n91259l32129L21496N87878J01944o50454
$$ -1720429 -1224938 -820905 -996380 -1587639 -1919768 -1598272 -1010394 -908450 -1558904
36647a558904q83300l37226N14731R30259N33654k81185n55688K78431J552880
$$ -1558904 -2442204 -2779430 -2264699 -1334440 -800786 -1081971 -1637659 -1359228 193652
36638A93652J914518R31761l53065q08511n79580n17898p72304p48799k12473
$$ 193652 2108170 3039931 2686866 1878355 1298775 780877 8573 -740226 -952699
36629i52699L86970O33088N09950J06589m11943o16118k47261K32537J91154j79846
$$ -952699 -565729 67359 577309 683898 271955 -344163 -591424 -358887 -167733 -347579
36619c47579j71361K45108M12687J92767J92670N96894P47925K75217k22219j08444
$$ -347579 -518940 -273832 138855 331622 524292 1121186 1869111 2144328 1922109 1813665
36609A813665L81027O41491N15373J98521j14891j70747J74007M64449L6408q30685
$$ 1813665 2194692 2836183 3351556 3550077 3435186 3264439 3438446 3902895 3939303 3108618
36599C108618r89340p0791Q30086P02877j667k87860j33144j77275m67576m92678
$$ 3108618 2119278 2048487 2878573 3581450 3579783 3291923 3158779 2981504 2513928 2021250
36589B021250j56705J43383K51101L67475N52274O40259N22663J52937m62504
$$ 2021250 1864545 2007928 2259029 2626504 3178778 3819037 4341700 4494637 4032133
36580D032133j000773r87482n24060k79813m21531k91918L65810P35755K11837
$$ 4032133 3031360 2043878 1519818 1240005 818474 526556 892366 1628121 1839958
36571A839958m98469m99798j82048m34104r85396q38050m1361K90528k62278p88151
$$ 1839958 1341489 841691 659643 225539 -759857 -1597907 -1639268 -1348740 -1611018 -2399169
36561b399169l56613Q72989K009103K267167J449894J46308o55055o25376m69067
$$ -2399169 -2755782 -1882793 126310 2393477 3843371 3989679 3334624 2709248 2240181
36552B240181p66601j026316o22891k4857o5939n24299n73489k13888k5759J21721
$$ 2240181 1473580 447264 -175627 -200484 -266423 -790722 -1364211 -1578099 -1603858 -1482137
36542a482137P43770J376210J023300o9226n60762n9809L91578J05788l47684
$$ -1482137 -738367 637843 1661143 1591917 1031155 971346 1362924 1468712 1121028
36533A121028l79177k58553l36822m76240n92948p59015n99498K97355J282595
$$ 1121028 741851 483298 146476 -329764 -922712 -1681727 -2281225 -1983870 -701275
36524g01275J238573L65454n8643J78391N459p18918p21267K95033P79727p1071
$$ -701275 537298 902752 844109 1022500 1027959 309041 -412226 -117193 662534 591463
36514E91463p61525K3044J080805O14634q31493j293957l65146O21637Q10043
$$ 591463 -170062 -147018 933787 1548421 716928 -577029 -942175 -320538 489505
36505D89505M93842m8076p75952j138778n32470N55368J030784O93792K30663
$$ 489505 983347 935271 159319 -979459 -1511929 -956561 74223 768015 998678
36496I98678j0253j70700j32002K55800M56270j18950r78829j140408o12912k04149
$$ 998678 988425 817725 685723 941523 1397793 1278843 300014 -840394 -1453306 -1657455
36486a657455r8363J99112O60427O73055J61992k79039l60236k81293j03675J39318
$$ -1657455 -1755818 -1556706 -896279 -223224 -61232 -340271 -700507 -981800 -1085475 -946157
36476i46157R796o11783p63581L76162J846529J935474O54738l75362m28435l41176
$$ -946157 -936361 -1548144 -2311725 -1935563 -89034 1846440 2501178 2125816 1697381 1356205
36466A356205n60280l92089K84890L46787o80274j565326j195055j69218M18637
$$ 1356205 795925 403836 688726 1035513 355239 -1210087 -2405142 -2574360 -2155723
36457b155723O07706Q85140R33637L06525m15713l67263K16350M26832J01473
$$ -2155723 -1548017 -662877 270760 577285 161572 -205691 10659 437491 538964
36448E38964j48013j4211K48230M00592L54811o143n42015p07430k42076L51712
$$ 538964 390951 376740 624970 1025562 1380373 1374230 832215 124785 -117291 234421
36438B34421N16949L71788K39283L1278l04072l67606o3800q8832p76598j137457
$$ 234421 751370 1123158 1362441 1393719 1089647 722041 658241 569409 -207189 -1344646
36428a344646j91561J253651J493160L45588p08757q07044o74316r97322j230368
$$ -1344646 -1536207 -282556 1210604 1556192 847435 40391 -633925 -1631247 -2861615
36419b861615p34005J6744K88397L50774Q76966J604142J637066Q64288R8827
$$ -2861615 -3595620 -3578876 -3290479 -2939705 -2062739 -458597 1178469 2042757 2141584
36410B141584j77122k97154m84232l43494K71325O47812J87651n15527m46539
$$ 2141584 1964462 1667308 1183076 839582 1110907 1758719 1946370 1430843 984304
36401I84304K19625K72735o69582j467581j083763k3248N65469N24354M97921
$$ 984304 1203929 1476664 807082 -660499 -1744262 -1767510 -1202041 -677687 -179766
36392a79766O09958M22548J1767l7100K48951J72497l86673o88396l98616j24161
$$ -179766 430192 852740 864507 827407 1076358 1248855 862182 173786 -224830 -348991
36382c48991k39341j82297M43761R78954P17510P4501j15572J25107K07661M5899
$$ -348991 -588332 -770629 -326868 652086 1369596 1444097 1328525 1453632 1661293 1707192
36372A707192l7097n6205j53666k2449N58217R48392L91885o77591j078822n47526
$$ 1707192 1670095 1613890 1460224 1437775 1995992 2944384 3336269 2658678 1579856 1032330
36362A032330K1872J5333j83310p3481K23179L69707K97050O5581k44492m48441
$$ 1032330 1054202 1069535 886225 812744 1035923 1405630 1702680 1768261 1523769 1075328
36352A075328n26500p99726j245940j032324L22499J677011J458351J6145p12256
$$ 1075328 548828 -250898 -1496838 -2529162 -2206663 -529652 928699 944844 232588
36343B32588m6575N81526J11289n60381m07558j9964j80645j83991P20947J425054
$$ 232588 186013 767539 878828 318447 -89111 -109075 -289720 -473711 247236 1672290
36333A672290N42140r35028q53562N98578J055059k17689j166102l66954P34307
$$ 1672290 2214430 1279402 425840 1024418 2079477 1861788 695686 328732 1063039
36324A063039L62885p41484q15984p488K13123k75082k36360N52189Q71527J52261
$$ 1063039 1425924 684440 -131544 -139032 74091 -200991 -437351 114838 986365 1138626
36314A138626o59617p10467l17705L8782N47820J259245J518839R64607K61902
$$ 1138626 479009 -231458 -549163 -510381 37439 1296684 2815523 3780130 4042032
36305D042032J13795K25025m7069o30245j049927j265760j454290j406837q91090
$$ 4042032 4155827 4380852 4333783 3703538 2653611 1387851 -66439 -1473276 -2364366
36296b364366k49609P2002K45863O05169Q54458N58198Q4750J17769M37452K32145
$$ -2364366 -2613975 -2541973 -2296110 -1690941 -836483 -278285 -193535 -75766 361686 593831
36286E93831m17418m83462L68236J143608R63700K37607j73294k08432l56098
$$ 593831 176413 -307049 61187 1204795 2168495 2406102 2232808 2024376 1668278
36277A668278p08110r56721r74678q00720l32655M18056R93624R22495L40061
$$ 1668278 960168 3447 -971231 -1771951 -2104606 -1686550 -692926 229569 569630
36268E69630k09290l95691j91738L50095R45510R95735K50521n89738n47748L47028
$$ 569630 360340 -35351 -227089 123006 1068516 2064251 2314772 1725034 1177286 1524314
36258A524314R97953N77677n25023j258450j052680k26177M78271N47906L3719
$$ 1524314 2522267 3099944 2574921 1316471 263791 37614 515885 1063791 1097510
36249A097510n80417q23230n72603j0629N58945P64075L18505n82753j196071
$$ 1097510 517093 -306137 -878740 -889369 -330424 433651 752156 169403 -1026668
36240a026668r25464l8465O41200P18977N29290M16942J83574m51910j138193
$$ -1026668 -1952132 -1990597 -1349397 -630420 -101130 315812 499386 47476 -1090717
36231a090717j105881j55435R01684J058209K72908m84847m26180J45930L86524
$$ -1090717 -2196598 -2352033 -1450349 -392140 -119232 -604079 -1030259 -884329 -497805
36222d97805P7720k61878l20467l69527n33510l81654K86795Q03630M44191m41226
$$ -497805 -420085 -681963 -1002430 -1371957 -1905467 -2287121 -2000326 -1196696 -752505 -1193731
36212a193731q24360l93046J69692L19191L33768O22803R53392P84103L1454q45216
$$ -1193731 -2018091 -2411137 -2241445 -1922254 -1588486 -965683 -12291 771812 803266 -41950
36202d1950j305990j057947k14670O00286O22584j84924q54906m72588O14643
$$ -41950 -1347940 -2405887 -2620557 -2020271 -1397687 -1582611 -2437517 -2910105 -2295462
36193b295462J196955Q33232M21243Q07215J444410J158223m2363q39299m42727
$$ -2295462 -1098507 -265275 155968 963183 2407593 3565816 3523453 2684154 2241427
36184B241427L21053K91762l38293m56008K04967P02202L34049m29272p80546
$$ 2241427 2562480 2854242 2515949 2059941 2264908 2967110 3301159 2871887 2091341
36175B091341o44796m49361l26482q9118K55861M42382L09377n2889m33402o12900
$$ 2091341 1446545 997184 670702 581584 837445 1279827 1589204 1536315 1102913 490013
36165D90013m94751k47464j41557j83463j48276J7398J65199L05316N39469O38225
$$ 490013 -4738 -252202 -393759 -577222 -725498 -708100 -542901 -237585 301884 940109
36155I40109K97488j15022J47162R23738J044388N554j128653j223322o57667
$$ 940109 1237597 1122575 1269737 2193475 3237863 3243417 2114764 891442 233775
36146B33775m72054o23626k89574M81068P23173J51830l64818j64716L28948M47945
$$ 233775 -238279 -861905 -1151479 -670411 52762 204592 -160226 -324942 4006 451951
36136D51951K69281L38615Q28564J282049J039729m4104j170610j257354l76969
$$ 451951 721232 1059847 1888411 3170460 4210189 4166085 2995475 1738121 1361152
36127A361152N9035p79708j709480j090080O93505J690788J130866J83577j38091
$$ 1361152 1420187 640479 -1069001 -2159081 -1465576 225212 1356078 1539655 1401564
36118A401564k31502n59038n77061R2318O33143K52770m60819m81203K0142O2854
$$ 1401564 1170062 611024 33963 126281 759424 1012194 551375 70172 90314 153168
36108A53168n49153j048409r18417m37713q1812k1775j61627k08924J80175R76892
$$ 153168 -395985 -1444394 -2362811 -2800524 -2882336 -2904111 -3065738 -3274662 -3094487 -2117595
36098b117595J682530J892324J638818R97882r6425j320048j880679j478461p78776
$$ -2117595 -435065 1457259 3096077 4093959 3997534 2677486 796807 -681654 -1460430
36089a460430l99082n5785O12621J033099M56509o74761j117838m47977N65297
$$ -1460430 -1859512 -1915297 -1302676 -269577 186932 -487829 -1605667 -2053644 -1488347
36080a488347J109412J055220N84748r3075n70999n04811j93802k90676p96202
$$ -1488347 -378935 676285 1261033 1167958 596959 92148 -101654 -392330 -1188532
36071a188532r44767l05677N49012P96941L78866j10736k96036l66386n55173
$$ -1188532 -2133299 -2438976 -1889964 -1093023 -714157 -824893 -1120929 -1487315 -2042488
36062b042488o26980j70179O83836J229743J063118N94433L16394J3121o18765
$$ -2042488 -2669468 -2839647 -2155811 -926068 137050 731483 1047877 1060998 442233
36053D42233r80789k88978Q48078Q90698l40906j215697o97580J94617K20597
$$ 442233 -538556 -827534 20544 911242 570336 -645361 -1342941 -1148324 -927727
36044i27727j57607M5447M25949O2693n58538k70084O37195P90437l860o44205
$$ -927727 -1085334 -1039887 -613938 -551245 -1109783 -1379867 -742672 47765 43905 -600300
36034f00300p77678j111772j549064r44063P36141J788237J153158p7976m64491
$$ -600300 -1377978 -2489750 -4038814 -4982877 -4246736 -2458499 -1305341 -1383317 -1847808
36025a847808j55006L3493K11318P72931J118715M81851n28030o18751J79741
$$ -1847808 -2002814 -1969321 -1758003 -985072 133643 615494 87464 -531287 -351546
36016c51546M80543m47661j698481k003519j196403o7173O96300J011297J075750
$$ -351546 128997 -318664 -2017145 -4020664 -5217067 -5284240 -4587940 -3576643 -2500893
36007b500893R12360L85612l84419r05601q67952n86555m60890k09817O89281
$$ -2500893 -1588533 -1202921 -1587340 -2492941 -3360893 -3947448 -4408338 -4618155 -3928874
35998c928874J882645K298566J570385M77208k72915q09914j277216j210774m02863
$$ -3928874 -2046229 252337 1822722 2299930 2027015 1217101 -60115 -1270889 -1673752
35989a673752M27159N95206M08593L91140K63308l51571q30082l38148O40010
$$ -1673752 -1246593 -651387 -242794 148346 411654 60083 -769999 -1108147 -468137
35980d68137Q17258P5140l15104L45253J124901Q60165k57542j124261j162570
$$ -468137 349121 424261 109157 454410 1579311 2439476 2181934 1057673 -104897
35971a04897o62877o4954M12790N37390J00487o08897p96057p164J149364J520495
$$ -104897 -767774 -832728 -419938 117452 217939 -390958 -1187015 -1194179 -44815 1475680
35961A475680P25066l94223q37866o18104m87497p97413j164797j116347m90862
$$ 1475680 2200746 1806523 968657 350553 -136944 -934357 -2099154 -3215501 -3706363
35952c706363O69368J960316K456571J553875J8530p18330m54386l61433r65619
$$ -3706363 -3036995 -1076679 1379892 2933767 2952297 2233967 1779581 1418148 452529
35943D52529j247197m24464O08084O83158J82046J60124M32029K7181q72210j009625
$$ 452529 -794668 -1219132 -611048 72110 254156 414280 846309 873490 1280 -1008345
35933a008345m3540R20459R72886M02249k04222p87773j341249j469511r11435
$$ -1008345 -1051885 -131426 841460 1243709 1039487 251714 -1089535 -2559046 -3470481
35924c470481K0546P86278J015757O03576p9372k50530L41569Q03206K82630n33076
$$ -3470481 -3449935 -2663657 -1647900 -1044324 -1123696 -1374226 -1032657 -229451 53179 -479897
35914d79897k73695Q91968J291607K27615r81781r62804l4645O84802Q11366N52346
$$ -479897 -753592 138376 1429983 1657598 675817 -286987 -321632 363170 1174536 1726882
35904A726882O253n61030n70965m7638J28105l80973o39522J8126P23197M81862
$$ 1726882 1733135 1172105 601140 553502 681607 300634 -338888 -320762 402435 884297
35894H84297j07745K6839L91167k52653j453495j426342N4616J033131K58484
$$ 884297 776552 803391 1194558 941905 -511590 -1937932 -1883316 -850185 -591701
35885e91701r54244p47681O56996J574465J260687M43508j26926m69462p59292
$$ -591701 -1545945 -2293626 -1636630 -62165 1198522 1642030 1515104 1045642 286350
35876B86350q67477o91104l44673Q8426N31567O36305O2074q63351j272563p62677
$$ 286350 -581127 -1272231 -1616904 -1528478 -996911 -360606 -298532 -1161883 -2434446 -3197123
35866c197123J28858O71839P74646P76034P88000O97822N83795O02172N57045
$$ -3197123 -3068265 -2396426 -1621780 -845746 -57746 640076 1223871 1826043 2383088
35857B383088J41104l76716l24491L14404O47437Q8596p25780q27459k92256J0010
$$ 2383088 2524192 2147476 1822985 2137389 2784826 2873422 2147642 1320183 1027927 1037937
35847A037937k25201m62671l45504j37245l7400J34331L41729J89715l04864n32065
$$ 1037937 812736 350065 4561 -132684 -170084 -35753 305976 495691 190827 -341238
35837c41238k48640K3042o599J93356R42148J515571J166942L10250k38799n70252
$$ -341238 -589878 -566836 -573435 -380079 562069 2077640 3244582 3554832 3316033 2745781
35827B745781j111609j306539l09918J179579J367601o8226j316361r51583J69098
$$ 2745781 1634172 327633 17715 1197294 2564895 2496669 1180308 228725 397823
35818C97823M31716j75017m25170O6436M52482J92384j88373j04964J96174J63620
$$ 397823 829539 654522 229352 295788 748270 940654 752281 647317 843491 1007111
35808A007111k15377n43377o31654n46286k33700M01175J003830Q52925k10640
$$ 1007111 791734 248357 -383297 -929583 -1163283 -762108 241722 1094647 884007
35799H84007j239018j118278m611Q17684O56113K17039K51803K63706m96097j399656
$$ 884007 -355011 -1473289 -1477900 -660216 -4103 212936 464739 728445 232348 -1167308
35789a167308j151937Q8825P66329K63230l06001j22631M2725n16834q95613m7191
$$ -1167308 -2319245 -2230420 -1464091 -1200861 -1506862 -1629493 -1586768 -2103602 -2999215 -3046406
35779c046406J219755J315520L21435k68902O6308M20440L30510L94844P26192
$$ -3046406 -1826651 -511131 -189696 -458598 -392290 28150 358660 753504 1479696
35770A479696M35684o81350j375009p58627K63228M01644j33118k80275P7749
$$ 1479696 1915380 1234030 -140979 -899606 -636378 -234734 -367852 -648127 -570378
35761e70378K11515j681L5669M27723N71453K42932l7098P6907K45214J06944
$$ -570378 -358863 -360544 -324875 102848 674301 917233 880135 957042 1202256 1309200
35751A309200k01179m88376r01315j471579j676301r39267N15341J639695J516981
$$ 1309200 1108021 619645 -281670 -1753249 -3429550 -4368817 -3853476 -2213781 -696800
35742f96800L28635o92299m45213Q26224J731190J295848M4302p53408n94429
$$ -696800 -368165 -1060464 -1505677 -679453 1051737 2347585 2391887 1638479 1044050
35733A044050n6942J79848O2111q9517p0457R4162K36761J95741N0168P7304K67151
$$ 1044050 987108 1166956 1229067 1139550 1069093 1163255 1400016 1595757 1645925 1723229 1990380
35722A990380J84045l01361n24347Q0660Q83757P20793m01299j191033q42019
$$ 1990380 2174425 1873064 1348717 1429377 2313134 3033927 2632628 1441595 599576
35713E99576j4601L20595J88982J95790M50637N78685M26588J96143J12620L12625
$$ 599576 584975 905570 1094552 1290342 1740979 2319664 2746252 2942395 3055015 3367640
35703C367640P43332R17933K72407q86758j395724p18685J63931L1283r17969
$$ 3367640 4110972 5028905 5301312 4414554 3018830 2300145 2464076 2495359 1577390
35694A577390j488418j192016o22879l20693j87476n7756j8917l298K67848P49397
$$ 1577390 88972 -1103044 -1725923 -2046616 -2234092 -2291848 -2310765 -2314063 -2046215 -1296818
35684a296818J015111Q55160M57491k7310n69643r04828p00946j57980J50520
$$ -1296818 -281707 573453 1030944 1003634 433991 -470837 -1171783 -1329763 -1179243
35675a179243J06828R9307J85000m0237n34521n89576O8730O91561N73227Q3396
$$ -1179243 -1072415 -973108 -788108 -828345 -1362866 -1952442 -1883712 -1192151 -618924 -535528
35665e35528l3951J05004k01154r69759j357057q09959K26988R40475J046661
$$ -535528 -569479 -464475 -665629 -1635388 -2992445 -3802404 -3575416 -2634941 -1588280
35656a588280Q30803N90251L46469N2883j62783j29473M1849r992m05807p55369
$$ -1588280 -757477 -167226 179243 232126 69343 -60130 -18281 -28273 -434080 -1189449
35646a189449o10371m9963M55937O34826N49524K96781l4546k10873p8647J59535
$$ -1189449 -1799820 -1849783 -1393846 -759020 -209496 87285 52739 -158134 -236781 -77246
35636g7246K93809M94223Q07843O33312m17814j389876r21727O19829J290754
$$ -77246 216563 710786 1518629 2151941 1734127 344251 -577476 42353 1333107
35627A333107K56291j035921j082302l80494j77811l50630k815O12353M23351
$$ 1333107 1589398 553477 -528825 -909319 -1087130 -1437760 -1440575 -828222 -404871
35618d04871n04985q79448q7728J048188J561501J343749P54017J65925k0910
$$ -404871 -909856 -1789304 -1877032 -828844 732657 2076406 2830423 2996348 2975438
35609B975438K31311K45921m56367j104331o63714L00785J87789j104364j776329
$$ 2975438 3206749 3452670 2996303 1891972 1228258 1529043 1716832 612468 -1163861
35600a163861p63208P14823J049162M08380j3281J07256K08336K6981k57392n83769
$$ -1163861 -1927069 -1212246 -163084 245296 232015 339271 547607 574588 317196 -266573
35590b66573q51816o54808Q3788O96753O86277M81449N87462O71457L34837N0883
$$ -266573 -1118389 -1773197 -1689409 -992656 -306379 175070 762532 1433989 1768826 1819709
35580A819709K77423L27240n79272j637017j318861K53969J279152P27197n02185
$$ 1819709 2097132 2424372 1845100 208083 -1110778 -856809 422343 1149540 647355
35571F47355j119838q91816j83578P39493J415427J226209L51260j90668j1413
$$ 647355 -472483 -1364299 -1547877 -808384 607043 1833252 2184512 1993844 1982431
35562A982431L6944o40362j239992q43585l7448o4723q18458r69072n1364P86078
$$ 1982431 2019375 1379013 139021 -704564 -742012 -806735 -1625193 -2594265 -2645629 -1859551
35552a859551M72153m89289q35318k74445L33661L18694n711m6728J51535J74029
$$ -1859551 -1387398 -1876687 -2712005 -2986450 -2652789 -2334095 -2339806 -2386534 -2234999 -2060970
35542b060970R9937M08678R85040R87334J35528n45339m4249R95023R47373n41425
$$ -2060970 -1961033 -1552355 -567315 420019 555547 10208 -34041 960982 1908355 1366930
35532A366930j975227j915774o09010O72924J159021R53586N00032K32451L51905
$$ 1366930 -608297 -2524071 -3133081 -2460157 -1301136 -347550 152482 384933 736838
35523G36838N28534K19298m49677p10513l87390l06591q92295j211018l61421
$$ 736838 1265372 1484670 1034993 324480 -62910 -369501 -1261796 -2472814 -2834235
35514b834235Q63929R22710k20068j073692q27253k97085l93030p91575p03945
$$ -2834235 -1970306 -1047596 -1267664 -2341356 -3168609 -3465694 -3858724 -4650299 -5354244
35505e354244r4869N33494R64640J224298J145155N99429p9040m09306l32367
$$ -5354244 -5449113 -4915619 -3950979 -2726681 -1581526 -982097 -1061137 -1470443 -1802810
35496a802810q0834L06714Q94243J382461J212305K70538p55976r34633l7572
$$ -1802810 -1883644 -1576930 -682687 699774 1912079 2182617 1426641 492008 454436
35487D54436J095385J294805L06021q62381j101259n26444j57858l62065l59196
$$ 454436 1549821 2844626 3150647 2288266 1187007 660563 502705 140640 -218556
35478b18556M27311J261397J038741n3838o93778k54391L31334p1434j150430
$$ -218556 208755 1470152 2508893 2455055 1761277 1506886 1838220 1766786 616356
35469F16356j512300n25508Q80915J438280R94335L15122j50119o01412j090636
$$ 616356 -895944 -1421452 -540537 897743 1892078 2207200 2057081 1455669 365033
35460C65033j201799p85737l32947j92203o900N50178J051521R98213P18357P64203
$$ 365033 -836766 -1622503 -1955450 -2147653 -2154553 -1604375 -552854 445359 1163716 1927919
35450A927919Q52573L84927l25409n09730m07880q82470j551209r53742R21240
$$ 1927919 2780492 3165419 2840010 2330280 1922400 1039930 -511279 -1465021 -543781
35441e43781J958424P97732j047449j365035l95107n2877p16234q26020L30357
$$ -543781 1414643 2212375 1164926 -200109 -595216 -648093 -1364327 -2190347 -1859990
35432a859990J373084R69199k71283r15110o53201j51109L08998R50329J557324
$$ -1859990 -486906 482293 211010 -704100 -1357301 -1508410 -1199412 -249083 1308241
35423A308241J409952L08614r76397j554222j343219q69840m02343K52232J051115
$$ 1308241 2718193 3026807 2050410 496188 -847031 -1716871 -2119214 -1866982 -815867
35414h15867J357853P57252r1248j53611M57542N39189l67409j170591q91979
$$ -815867 541986 1299238 1207990 1054379 1511921 2051110 1683701 513110 -378869
35405c78869k21115l75388j056258q51049N51997J865816K036929J403116P21211
$$ -378869 -599984 -975372 -2031630 -2882679 -2330682 -464866 1572063 2975179 3696390
35396C696390J13593n04924q19438n75339r1212J95749K62563K25202J5368l00255
$$ 3696390 3809983 3305059 2485621 1910282 1819070 2014819 2277382 2502584 2517952 2217697
35386B217697l29674J31160P32546R84825P10389m3432j072751j838433j750852
$$ 2217697 1888023 2019183 2751729 3736554 4446943 4403511 3330760 1492327 -258525
35377b58525q78902O4931N80587P19515N37923o0524p69985r68794o49560m76291
$$ -258525 -1137427 -1072496 -491909 227606 765529 705005 -64980 -1033774 -1683334 -2159625
35367b159625o07971l65762M83607J084809P98495K49937K64123N61557M46224
$$ -2159625 -2767596 -3133358 -2649751 -1564942 -766447 -516510 -252387 309170 755394
35358G55394R2247R6562K74717j3544o70429r90063p50817l17376P2206L08101
$$ 755394 847641 944203 1218920 1205376 534947 -455116 -1205933 -1523309 -1451103 -1143002
35348a143002Q0826n40620o23372M66307J754402J706394L79734p22145q51899
$$ -1143002 -1062176 -1602796 -2226168 -1759861 -5459 1700935 2080669 1358524 506625
35339E06625p14929q54186p65618q8817N48874N40822K26210J82513L52951M24525
$$ 506625 -208304 -1062490 -1828108 -1916925 -1368051 -827229 -601019 -418506 -65555 358970
35329C58970L89743K53947j48020o15658n73280l3831J91244k42188n38278k2746
$$ 358970 748713 1002660 854640 238982 -334298 -368129 -176885 -419073 -957351 -980097
35319i80097O74787N47052k50633p03369m08985J54570O02692R68054J086697
$$ -980097 -305310 241742 -8891 -712260 -1121245 -966675 -363983 604071 1690768
35310A690768N52143m68964j045205n21871N88585J134637O26893k75175o14792
$$ 1690768 2242911 1773947 728742 206871 795456 1930093 2556986 2281811 1667019
35301A667019k55644R7390m4480k86492k4971N65088P59421L52366j16118k11540
$$ 1667019 1411375 1508765 1464285 1177793 1152822 1717910 2477331 2829697 2713579 2502039
35291B502039q5416q490n85p2276k83001m15825j78608J30084j58778r67555j320761
$$ 2502039 2416623 2408133 2407548 2335272 2052271 1636446 1457838 1587922 1429144 461589 -859172
35280h59172o75127L35329R34181J206556J448188J278787L08105q21726j063983
$$ -859172 -1534299 -1198970 -264789 941767 2389955 3668742 3976847 3155121 2091138
35271B091138m49651o3583n54842j386540j627932r40710K47505J077710P99679
$$ 2091138 1641487 1577904 1023062 -363478 -1991410 -2932120 -2684615 -1606905 -807226
35262h07226n17498j773891j775686m83651R58003J448157R26264J83678l6780
$$ -807226 -1324724 -3098615 -4874301 -5357952 -4399949 -2951792 -2025528 -1841850 -1878630
35253a878630K97144O08563M45601M1172n7475J91733L03461M7702k96283n33116
$$ -1878630 -1581486 -972923 -527322 -486150 -543625 -351892 -48431 -729 -297012 -830128
$$ [...]
##END NTUPLES=NMR SPECTRUM
##END=
