##TITLE=31Pdec_AP2712
 CDCl3, 24 sc
 28.12.2024
##JCAMPDX= 6.0         $$ Bruker NMR JCAMP-DX V2.0
##DATA TYPE= NMR SPECTRUM
##DATA CLASS= NTUPLES
##ORIGIN= UXNMR, Bruker Analytische Messtechnik GmbH
##OWNER= root
$$ XWIN-NMR		Version 3.5
$$ Sat Dec 28 13:53:16 2024 Russian Standard Time (UT+4h)  she@DPX200
##.OBSERVE FREQUENCY= 81.013821
##.OBSERVE NUCLEUS= ^31P
##.ACQUISITION MODE= SIMULTANEOUS
##.ACQUISITION SCHEME= undefined
##.AVERAGES= 24
##.DIGITISER RES= 17
##SPECTROMETER/DATA SYSTEM= spect
##.PULSE SEQUENCE= zgpg30
##.SOLVENT NAME= D2O
##.SHIFT REFERENCE= (INTERNAL, D2O, 0, 198.062)
##AUDIT TRAIL= $$ (NUMBER, WHEN, WHO, WHERE, WHAT)
$$ ##TITLE= Audit trail, XWIN-NMR		Version 3.5
$$ ##JCAMPDX= 5.01
$$ ##ORIGIN= Bruker BioSpin GmbH
$$ ##OWNER= she
$$ F:/spectra/data/she/nmr/P31/2/pdata/1/auditp.txt
$$ ##AUDIT TRAIL=  $$ (NUMBER, WHEN, WHO, WHERE, WHAT)
(   1,<2024-12-28 13:52:07.76 +0400>,<she>,<DPX200>,
      <created by zg, POWCHK disabled, PULCHK disabled
       configuration hash MD5:
       00 E9 B6 7A A2 85 ED C7 34 08 36 98 17 FE 4E 26
       data hash MD5: 32K
       A4 89 CF 55 00 E7 9D 15 E0 DC 17 36 DE DB 2B A0>)
(   2,<2024-12-28 13:52:17.01 +0400>,<she>,<DPX200>,
      <Start of raw data processing
       efp BC_mod = 2 LB = 1.5 FT_mod = 6 PKNL = 1 PHC0 = 1993.13 PHC1 = 326.8864 SI = 64K 
       data hash MD5: 64K
       61 A4 56 19 C2 15 DF EC 20 0B 3B 6F 70 8A 39 BF>)
(   3,<2024-12-28 13:52:37.96 +0400>,<she>,<DPX200>,
      <pk PHC0 = 102.2021 PHC1 = -165.8 
       data hash MD5: 64K
       24 E1 34 B2 85 B1 BE E2 CE 38 4E 3F B0 D6 4C 5A>)
(   4,<2024-12-28 13:52:46.06 +0400>,<she>,<DPX200>,
      <abs ABSG = 5 
       data hash MD5: 64K
       25 2A B5 88 E5 DD F0 16 D7 49 E9 96 6F 83 7B E0>)
$$ ##END=
$$ 
$$ hash MD5
$$ 2B E9 F1 E5 2B CE DE 0C A2 D4 21 89 DE 13 D3 6D
##$RELAX= 
##$RELAX= 
##$RELAX= 
##$RELAX= 
##$RELAX= 
##$RELAX= 
##$RELAX= 
##$RELAX= 
$$ Bruker specific parameters
$$ --------------------------
##$DU= <F:/spectra>
##$EXPNO= 2
##$NAME= <P31>
##$PROCNO= 1
##$TYPE= <nmr>
##$USER= <she>
##$AMP= (0..31)
100 100 100 100 100 100 100 100 100 100 100 100 100 100 100 100 100 100 
100 100 100 100 100 100 100 100 100 100 100 100 100 100 
##$AQSEQ= 0
##$AQ_mod= 1
##$AUNM= <au_zg>
##$AUTOPOS= <>
##$BF1= 81.014009
##$BF2= 200.13
##$BF3= 200.13
##$BF4= 200.13
##$BF5= 200.13
##$BF6= 200.13
##$BF7= 200.13
##$BF8= 200.13
##$BYTORDA= 1
##$CFDGTYP= 0
##$CFRGTYP= 5
##$CHEMSTR= <none>
##$CNST= (0..31)
1 1 145 1 1 1 1 1 1 1 1 1 1 1 1 1 1 1 1 1 1 1 1 1 1 1 1 1 1 1 1 1 
##$CPDPRG= <waltz16>
##$CPDPRG1= <>
##$CPDPRG2= <waltz16>
##$CPDPRG3= <>
##$CPDPRG4= <mlev>
##$CPDPRG5= <mlev>
##$CPDPRG6= <mlev>
##$CPDPRG7= <mlev>
##$CPDPRG8= <mlev>
##$CPDPRGB= <>
##$CPDPRGT= <>
##$D= (0..31)
0 1 0 0 0 0 0 0 0 0.06 0 0.03 2e-05 3e-06 0 0 0.0002 0 0 0 0 0 0 0 0 0 
0 0 0 0 0 0 
##$DATE= 1735379527
##$DBL= (0..7)
120 120 120 11 120 120 24 19 
##$DBP= (0..7)
150 150 150 150 150 150 150 150 
##$DBP07= 0
##$DBPNAM0= <>
##$DBPNAM1= <>
##$DBPNAM2= <>
$$ [...]
##$SUBNAM3= <"">
##$SUBNAM4= <"">
##$SUBNAM5= <"">
##$SUBNAM6= <"">
##$SUBNAM7= <"">
##$SUBNAM8= <"">
##$SUBNAM9= <"">
##$SW= 400.765351723535
##$SWIBOX= (0..15)
0 1 3 0 0 0 0 0 0 0 0 0 0 0 0 0 
##$SW_h= 32467.5324675325
##$TD= 32768
##$TD0= 1
##$TE= 0
##$TE2= 300
##$TE3= 300
##$TEG= 300
##$TL= (0..7)
0 120 53 12 22 120 120 120 
##$TP= (0..7)
150 150 150 150 150 150 150 150 
##$TP07= 0
##$TPNAME0= <>
##$TPNAME1= <>
##$TPNAME2= <>
##$TPNAME3= <>
##$TPNAME4= <>
##$TPNAME5= <>
##$TPNAME6= <>
##$TPNAME7= <>
##$TPOAL= (0..7)
0.5 0.5 0.5 0.5 0.5 0.5 0.5 0.5 
##$TPOFFS= (0..7)
0 0 0 0 0 0 0 0 
##$TUNHIN= 0
##$TUNHOUT= 0
##$TUNXOUT= 0
##$USERA1= <user>
##$USERA2= <user>
##$USERA3= <user>
##$USERA4= <user>
##$USERA5= <user>
##$V9= 5
##$VALIST= <valist>
##$VCLIST= <CCCCCCCCCCCCCCC>
##$VD= 0
##$VDLIST= <DDDDDDDDDDDDDDD>
##$VPLIST= <PPPPPPPPPPPPPPP>
##$VTLIST= <TTTTTTTTTTTTTTT>
##$WBST= 1024
##$WBSW= 4
##$XGAIN= (0..3)
0 0 0 0 
##$XL= 0
##$YL= 0
##$YMAX_a= 18062
##$YMIN_a= -19670
##$ZGOPTNS= <>
##$ZL1= 120
##$ZL2= 120
##$ZL3= 120
##$ZL4= 120
##$ABSF1= 198.0616
##$ABSF2= -202.7028
##$ABSG= 5
##$ABSL= 3
##$ALPHA= 0
##$AQORDER= 0
##$ASSFAC= 0
##$ASSFACI= 0
##$ASSFACX= 0
##$ASSWID= 0
##$AUNMP= <proc_1d>
##$AZFE= 0.1
##$AZFW= 0.5
##$BCFW= 0
##$BC_mod= 2
##$BYTORDP= 0
##$COROFFS= 0
##$CY= -3
##$DATMOD= 1
##$DC= 0
##$DFILT= <>
##$DTYPP= 0
##$F1P= 0
##$F2P= 0
##$FCOR= 1
##$FTSIZE= 65536
##$FT_mod= 6
##$GAMMA= 0
##$GB= 0
##$INTBC= 1
##$INTSCL= 9.790993e-09
##$ISEN= 30
##$LB= 1.5
##$LEV0= 0
##$LPBIN= 0
##$MAXI= 10000
##$MC2= 0
##$MEAN= 0
##$ME_mod= 0
##$MI= 50
##$NCOEF= 0
##$NC_proc= -5
##$NLEV= 6
##$NOISF1= 182.463
##$NOISF2= 159.3651
##$NSP= 0
##$NTH_PI= 0
##$NZP= 0
##$OFFSET= 198.0616
##$PC= 4
##$PHC0= 2095.332
##$PHC1= 161.0864
##$PH_mod= 1
##$PKNL= yes
##$PPARMOD= 0
##$PSCAL= 0
##$PSIGN= 0
##$REVERSE= no
##$SF= 81.0140089999434
##$SI= 65536
##$SIGF1= 159.3651
##$SIGF2= -187.1042
##$SINO= 113.3802
##$SIOLD= 16384
##$SREGLST= <1H.CDCl3>
##$SSB= 0
##$STSI= 65536
##$STSR= 0
##$SW_p= 32467.5324675325
##$SYMM= 0
##$S_DEV= 0
##$TDeff= 32768
##$TDoff= 0
##$TI= <>
##$TILT= no
##$TM1= 0
##$TM2= 0
##$TOPLEV= 0
##$USERP1= <user>
##$USERP2= <user>
##$USERP3= <user>
##$USERP4= <user>
##$USERP5= <user>
##$WDW= 1
##$XDIM= 65536
##$YMAX_p= 543732437
##$YMIN_p= -4285136
$$ End of Bruker specific parameters
$$ ---------------------------------
##NTUPLES= NMR SPECTRUM
##VAR_NAME=  FREQUENCY,     SPECTRUM/REAL,   SPECTRUM/IMAG
##SYMBOL=    X,             R,               I
##VAR_TYPE=  INDEPENDENT,   DEPENDENT,       DEPENDENT
##VAR_FORM=  AFFN,          ASDF,            ASDF
##VAR_DIM=   65536,         65536,           65536
##UNITS=     HZ,            ARBITRARY UNITS, ARBITRARY UNITS
##FACTOR=    0.49542278885378, 1,            1
##FIRST=     16045.7642231865, 0,            0
##LAST=      -16421.768244346, 0,            0
##MIN=       -16421.768244346, -4285136,     0
##MAX=       16045.7642231865, 543732437,    0
$$ Real data points
##PAGE= N=1
##DATA TABLE= (X++(R..R)), XYDATA
$$ [...]
41833H9801p0095N5195J37259N0033j57273l00514k68015j06266J00686L18751
41823a50438M80311M44069J72106j23084j76249j2346P3198p7983k71633k67025
41813I0926j40597j38597k51359k04915Q3734L07199J82958j20417k00415K5359
41803c66124K28164J39974j02559j77991J606K17788K31882M0989j51428j69435
41793a07134m6284L8166o962p6058m2615L9502K8010o0797n8160Q8203K14030
41782I901J80159P8742Q7011K06993K77164J98002K9197j22908k09788k21408
41772E13065j53991m3035K2907k0045j23019j53792l8881J37027K08204J13026
41762D61466l2819p0400L0599J67125K30297J85429N6313j01148k16992k56006
$$ plain form
41833 89801 19706 74901 212160 262193 104920 -195594 -463609 -569875 -469189 -150438
41823 -150438 329873 773942 946048 822964 646715 634369 707567 629584 357951 90926
41813 90926 -49671 -188268 -439627 -644542 -560808 -253609 -70651 -191068 -391483 -366124
41803 -366124 -137960 2014 -100545 -278536 -276930 -59142 172740 213729 62301 -107134
41793 -107134 -153418 -115252 -122214 -198272 -240887 -201385 -173375 -234172 -292332 -204129 9901
41782 9901 190060 268802 355813 562806 839970 1037972 1067169 944261 734473 513065
41772 513065 359074 316039 338946 318901 195882 42090 3209 140236 348440 461466
41762 461466 428647 358247 388846 555971 786268 971697 1028010 926862 709870 453864
41752D53864k44957k09923j17350N5057K17979K39887J25320L3150Q3028K11013
41742H47068K58907J61752L796r3942j07732j14370j57888j59328l6116J10453
41732G12600O9173j68193l24374j91534O3901J28674j7133j01451K8715K11656
41722D12034K15943J3323k34470l37175k09821L9960J69184O2110j05970j06521
41712h1403J7045O0251J4857M3504J31391Q6483p5361q5451J26420K60377R9662
41701E97775j51062j91750m7714O3851P9419O3845J5539o5758o5393O5105J50635
41690E14492L7239j38848j48429p457J03181J24686R9002j55j64828k19140o4067
41679A35676P7014l1608k03881p5935K84083M20633J67604j21408j24848K6308
$$ plain form
41752 453864 208907 -1016 -118366 -63309 154670 394557 519877 553027 636055 847068
41742 847068 1105975 1267727 1271523 1177581 1069849 955479 797591 638263 602147 712600
41732 712600 781773 613580 289206 97672 161573 290247 273114 171663 200378 412034
41722 412034 627977 641300 406830 69655 -140166 -100206 68978 131088 25118 -81403
41712 -81403 -64358 -4107 10750 54254 185645 272128 196767 111316 237736 498113 597775
41701 597775 446713 254963 207249 271100 350519 414364 429903 364145 298752 363857 514492
41690 514492 551731 412883 264454 256997 360178 484864 583866 583711 418883 199743 135676
41679 135676 212690 181082 -22799 -98734 185349 605982 773586 652178 527330 553638
41669E53638N0472n9773j30433j15097r5559r5534o4562J7708J19666J81812J30474
41658D92812l7739j78929j42716K459M1424p8624j90154j78914j13838n6670M1051
41647c99838J64333J68140J1000j17045l7253J78349L24653L00807J38093p7198
41637F54041k15519j73236k4083L0656n6292j05079r596P8217J0784q6159n120
41626I8614K04163K93307J49845r5581k50049k13870j6976J74869J62080n2858
41616D53544k09567j04326J23670J75039j4613k34067k99011k15779o8803P3974
41606c19939J33435N7811p3602j03439J6373J79364K70988K67596J92689P8056
41596F99332j8347m4512k3385k8229q9411j76322k45835k51945j53678J4083J34234
$$ plain form
41669 553638 604110 544337 413904 298807 203248 107714 43152 60860 180526 362338 492812
41658 492812 455073 276144 133428 135887 177311 98687 -91467 -270381 -384219 -440889 -399838
41647 -399838 -235505 -67365 -56365 -173410 -210663 -32314 292339 593146 731239 654041
41637 654041 438522 265286 241203 271859 215567 110488 100892 179109 189893 103734 98614
41626 98614 302777 596084 745929 650348 400299 186429 169453 344322 506402 453544
41616 453544 243977 139651 263321 438360 423747 189680 -109331 -325110 -393913 -319939
41606 -319939 -186504 -128693 -202295 -305734 -289361 -109997 160991 428587 621276 699332
41596 699332 680985 636473 613088 584859 495448 319126 73291 -178654 -332332 -318249 -184015
41585a84015J56823J79459K62702K56174l874l63346m43629j18349K90356L90750
41575D23051J64811p4543p8527R7449K13080J19567r1643k00441j17603J1154
41565D66355J0080q3930r6791R720R7953Q6099M7294L8292K046q5095j34348j12466
41553B45209j28629k27283k54677j02569O1293L1470p2824L8929L44639M81456
41543D17014K65818l6629j03293J3141M4677o7642j51390j20377o9814o0728k3189
41532A07588Q0350J65009J63326J23567J00281N9281l5454j36206j86148j94041
41522B47553j66064n9237J06755J85339P7250r2231j13322J2577O4195q4781k66977
41511h8943k13956J09633M34435M51189J29752k36715l29033j38751N2791M4158
$$ plain form
41585 -184015 -27192 152267 414969 671143 667269 303923 -139706 -258055 32301 423051
41575 423051 587862 513319 434792 532241 745321 864888 773245 572804 455201 466355
41565 466355 476435 392505 295714 305434 403387 489486 536780 575072 577118 492023 357675 245209
41553 245209 116580 -110703 -365380 -467949 -406656 -375186 -448010 -409081 -64442 417014
41543 417014 682832 646203 542910 556051 600728 533086 381696 261319 191505 130777 107588
41532 107588 187938 352947 516273 639840 740121 799402 763948 627742 441594 247553
41522 247553 81489 22252 129007 314346 391596 299365 186043 198620 262815 178034 -88943
41511 -88943 -302899 -193266 241169 692358 822110 585395 256362 117611 170402 214560
41501B14560n0777k2687R3261P3949j29782k84106j77899J07671L11638K74065
41491D09893L9561k24475l39426k27118P840J62116J60613J33178J99803K64721
41481E86706J43155j45341l47050k72692l3037R5882P155j22017p9976Q5742J31738
41470E0265k7544j79698j22967K2671K703j49271j35344J28797L27142J77607
41460I4361j54940k85324j16377J02183J55033P7619p70k7422N15P3110J23236
41449D1224P2223l0841l6381Q2558J56259N0442j32493j93120j02858r409j0502
41438a12898m9748m6706j8906k6060o5474q0598l4706O7000J91305K66917K00876
41427B91002k1916k65324l41602k03041J4524J48141J52966Q3657N930l4900j7299
$$ plain form
41501 214560 163783 141096 234357 308306 178524 -105582 -283481 -175810 135828 409893
41491 409893 449454 224979 -114447 -341565 -333725 -171609 -10996 122182 321985 586706
41481 586706 729861 584520 237470 -35222 -68259 27623 34778 -87239 -167215 -81473 50265
41470 50265 22721 -156977 -279944 -257273 -254570 -403841 -539185 -410388 -83246 94361
41460 94361 -60579 -345903 -462280 -360097 -205064 -127445 -128215 -155637 -155122 -82012 41224
41449 41224 113447 82606 46225 128783 285042 335484 202991 9871 -92987 -102396 -112898
41438 -112898 -162646 -209352 -228258 -254318 -319792 -400390 -435096 -368096 -176791 90126 291002
41427 291002 269086 3762 -337840 -540881 -526357 -378216 -225250 -141593 -135663 -170563 -187862
41416a87862L6944Q5409J30178K01498K58349J98900J8006j48228k08148k38891
41406A46155l29415m10788l72596k47896j28886P702K08997L62223L19430J56580
41396b88494P9706J03326O8020l8181n6844K2169K3942o3513k8517J53774J85575
41385A60963p5370l09883j83328J52001L08308K17080R9864L8586n9483j49816
41375A98922p4593J07023J49389J7206n6587K6667O9822o3539j96349j11564J13734
41364A80131K29785J49513L328o5861k9205O1855J26380Q7037o5358k29788k63215
41353A84602j22451N9334P5192j19247k96269j94190J25454L14100J89646l1372
41343A84799p7864R1O553k4662Q0506K64263K67052K1950k51430l57386k83785
$$ plain form
41416 -187862 -150918 -65509 64669 266167 524516 723416 741422 593194 385046 146155
41406 146155 -183260 -594048 -966644 -1214540 -1343426 -1335724 -1126727 -764504 -445074 -288494
41396 -288494 -208788 -105462 -37442 -75623 -132467 -110298 -86356 -149869 -178386 -24612 160963
41385 160963 85593 -224290 -407618 -255617 52691 269771 369635 408221 348738 198922
41375 198922 124329 231352 380741 397947 341360 368027 437849 374310 177961 66397 180131
41364 180131 409916 559429 562757 496896 467691 529546 655926 742963 677605 447817 184602
41353 184602 62151 121485 196677 77430 -218839 -413029 -287575 26525 216171 184799
41343 184799 106935 107026 113579 88917 169423 433686 700738 722688 471258 113872 -169913
41332a69913o2485K48094M26462K48450j39239l03473r0033J80665K05423Q1237
41322F25188J9525j7429j33162j95576l3179K19802K80538J30126j0563n8030
41312H27240j41682l09786m15863l50823j98108q9726l3567O2417K63173N08193
41302A21468N98809L58134j07601m08174k78145Q9420K86104J96167N3618K9070
41292I38870J4229j25162l04276l49097k27475l7097J31764K23265J97820Q6321
41282E49162m678k4254m7535j37442k12592j57302p334R2866Q9453N2730J9227
41271B12301n9938j74251j96303o7759O0598J6819j18664j00926J08924K49613
41261f9586J29041p4431m9546K02123L63458K31963m4877k10486j99671j07504
$$ plain form
41332 -169913 -232398 15696 442158 690608 551369 247896 157863 338528 543951 625188
41322 625188 644713 627284 494122 298546 265367 485169 765707 895833 885270 827240
41312 827240 685558 375772 -40091 -390914 -589022 -678748 -712315 -649898 -386725 121468
41302 121468 720277 1078411 970810 562636 284491 373911 660015 856182 909800 938870
41292 938870 953099 827937 523661 174564 -52911 -90008 41756 265021 462841 549162
41282 549162 544484 520230 472695 335253 122661 -34641 -41975 50891 140344 193074 212301
41271 212301 152363 -21888 -218191 -285950 -225352 -208533 -327197 -428123 -319199 -69586
41261 -69586 59455 -14976 -64522 137601 501059 733022 688145 477659 277988 170484
41251A70484o524P0299O1152n7156j70355j29344M8732J84784J52034L690j21140
41240B06656j41343p0265J7519L2443n0517j30394o6691J28431K51950J39707
41230C17496j08737k30860j16695Q1089J71440J39514O9352k5592j56528k24743
41220h4264j21419N2937P0474q3351j58049j7697J39574J01102j4200L6087J98211
41209A19405J97355j5797j85451j44594j8630M3930R4608K00576K42425Q8923
41199F22750j44603k04253k6538J83129K00843K3516j51891j46303P517R2959
41189D57126l7460k63959l30689j58698P5984J79468J36515M5033k0855k6150
41179E6315M0520J25791J28976K1805j01637j31873n5751M8163P4594l0105j85412
$$ plain form
41251 170484 163960 234259 295411 238255 67900 -61444 -12712 172072 324106 327796 206656
41240 206656 65313 -4952 12567 45010 -5507 -135901 -202592 -74161 177789 317496
41230 317496 208759 -22101 -138796 -57707 113733 253247 322599 297007 140479 -84264
41220 -84264 -205683 -152746 -82272 -165623 -323672 -341369 -201795 -100693 -114893 -78806 119405
41209 119405 316760 300963 115512 -29082 -47712 -3782 90826 291402 533827 622750
41199 622750 478147 273894 247356 430485 631328 654844 502953 356650 364167 457126
41189 457126 419666 155707 -174982 -333680 -257696 -78228 58287 103320 82465 56315
41179 56315 96835 222626 351602 373407 271770 139897 84146 132309 206903 176798 -8614
41168h614k13056n3463J11136Q6113m5825n0616Q7352J57760Q5013L1056Q1675
41157B68531R6350j8348j27666j04341l4844l5088m7794J4362Q9957R1813N6838
41146B49770K8018n3921j94476k48787j39459m169L4478O4952J73746K33744J27551
41135B71447r90K6896J08114M7191p5643m0501R8729P1452j60427l24468k43967
41124b22167n6073L7670K2609M046N2448J66446K70901K47212P7559p8148p8635
41113D43868j3170n9369j95519k42626j46598k1625O0370J32689K01909K27173
41103C87102K11773J60505J576k68506m33425k80526N6100K11729N4517j77894
41093g7049k14372k7433K31499L85428L12071M3056k13391k86603k31661j64367
$$ plain form
41168 -8614 -221670 -275133 -163997 -77884 -123709 -174325 -86973 70787 155800 186856 268531
41157 268531 364881 346533 218867 114526 79682 44594 -3200 11162 101119 192932 249770
41146 249770 277788 223867 29391 -219396 -358855 -363024 -328546 -263594 -89848 143896 271447
41135 271447 270457 297353 405467 452658 377015 336514 435243 506695 346268 21800 -222167
41124 -222167 -278240 -240570 -217961 -213915 -161467 4979 275880 523092 600651 522503 443868
41113 443868 430698 371329 175810 -66816 -213414 -235039 -174669 -41980 159929 387102
41103 387102 598875 759380 760956 492450 59025 -221501 -165401 46328 100845 -77049
41093 -77049 -291421 -318854 -87355 298073 610144 653200 439809 153206 -78455 -242822
41083b42822l6978J94085L16352J08510k27729k53244P8510L38015K30229n5158
41073D49770k07612j85012r4298K6589J28550Q5993j06453k44667j69169L3310
41063b82999J81226K05349J35881M0019K2394J25407K11403J29798j7891k4715
41053G25872L9089q4407l54027m17057j75922L2520j2042p9589N5742J97368P4437
41042A984j88302k83982j76959k3872J46306L38198L61171O5142l04158l41274
41032d05746k6986K67415K93776J63181P2363N3026L3352l9607j71293k87534
41022d8053k53739m7388J44289J33794k2446j25652j04343l1456N1216J51465
41012a52313K13667J52954o047j41108j69677j03338j2847J1847n0707p5378O4687
$$ plain form
41083 -242822 -279800 -85715 230637 339147 111418 -141826 -63316 274699 504928 449770
41073 449770 242158 57146 -37152 -10563 117987 203980 97527 -147140 -316309 -282999
41063 -282999 -101773 103576 239457 279476 301870 427277 638680 768478 750587 725872
41053 725872 764961 680554 326527 -90530 -266452 -233932 -245974 -325563 -269821 -72453 1984
41042 1984 -186318 -470300 -647259 -671131 -524825 -186627 174544 239686 -64472 -405746
41032 -405746 -432732 -165317 128459 291640 364003 417029 450381 410774 239481 -48053
41022 -48053 -301792 -349180 -204891 -71097 -93543 -219195 -323538 -354994 -303778 -152313
41012 -152313 61354 214308 208261 67153 -102524 -205862 -218709 -206862 -257569 -332947 -268260
41001b68260K46874K02757m9337j37602J31558M32488L54765l3317l40302m01829
40991A37795l56205k80539r6601J68127L16267K34718L3841r0359j9131K12331
40981B60244L87854K67781q6574k91962j27865J28308R2905j62941k55532p6433
40971A35785J13675J35417Q5160O0617J4500n5246m8708K1146m596j65993k92065
40960c08k49047j01254L5240J29730J76438J56289J06267Q9701P7605k307j02381
40949C15973r8653O296Q9143J09232J33174J59229J01027l8374j48030j81584
40939D47433j89632j76258q9006L9085R6295N1191l2150j17881j92093j75776
40929c38792j6459J68742K16705J46871R9441J12880J45393K15849K97039J94135
$$ plain form
41001 -268260 -21386 181371 132034 -5568 125990 558478 913243 879926 539624 137795
40991 137795 -218410 -498949 -595550 -427423 -111156 123562 157403 67044 47913 260244
40981 260244 648098 915879 829305 537343 409478 537786 630691 467750 212218 135785
40971 135785 249460 384877 470037 530654 545154 489908 441200 462346 457750 291757 -308
40960 -308 -249355 -350609 -315369 -185639 -9201 147088 253355 343056 420661 418354 315973
40949 315973 217320 223616 312759 421991 555165 714394 815421 777047 629017 447433
40939 447433 257801 81543 -7463 31622 127917 179108 146958 29077 -163016 -338792
40929 -338792 -355251 -186509 30196 177067 276508 389388 534781 750630 1047669 1241804
40919A241804j71986m72455l34333O3500J82939p9953k61322q5851J29789N2328
40909B64460j28917p2441J36789J66271q790j05015O758J55063J58518K3002j47120
40898D48578k55367k33526q9544O8525J39553J31275J04538Q2930O8919O8378
40888E34259N2227j6761q9673p9947k8919o9186j79921j60729O2653K78345K52623
40877E54971J8612k07097k70959j53657O4067K04678J08714j36527k25218j8679
40867f1095K38327K39044K4487j09193k3999J32914J81478J13511L0090m06J4592
40856G79750K4494r626o6465q2485l4736K9058O3320Q3209J21057J62172J61005
40845A230753J12760R0117J82776L62795M37415K39221j24029l45304k92833j49967
$$ plain form
40919 1241804 1069818 597363 263030 326530 509469 429516 168194 82343 212132 264460
40909 264460 135543 63102 199891 366162 357372 252357 259115 414178 572696 595698 448578
40898 448578 193211 -40315 -129859 -61334 78219 209494 314032 396962 465881 534259
40888 534259 586486 569725 480052 400105 371186 302000 122079 -38650 24003 302348 554971
40877 554971 573583 366486 95527 -58130 5937 210615 319329 182802 -42416 -61095
40867 -61095 177232 416276 440763 331570 307571 440485 621963 735474 765564 765158 779750
40856 779750 804244 794618 728153 645668 610932 639990 703310 786519 907576 1069748 1230753
40845 1230753 1343513 1433630 1616406 1979201 2416616 2655837 2531808 2186504 1893671 1743704
40835A743704j05551j06495n7863m9880j66757k56911j53798K7430Q2487N4523
40825A010889Q7844J07195j8905j44324n4884J18855J10938J4861R8906K37169
40815A568544P9512k51893k53631J11355K94415N3140j61993K4263L36177L83224
40805B183113K67464K65096L22260K70285K03472K64816L38603K88646K44625
40796D648380L63470N55617O89233Q02432R11332R03356Q03810Q36454J077998
40787A1592082J393648J781374K345119K919224L301513L842703N043847O616315
40779C8835825Q004712R790158J2810257J5238996J2697414L289760q648085j6129212
40771G5889825j6520388j3066938r849131p723467n717126l870965k967026k783943
$$ plain form
40835 1743704 1638153 1531658 1473795 1423915 1257158 1000247 846449 873879 956366 1010889
40825 1010889 1098733 1205928 1187023 1042699 987815 1106670 1217608 1232469 1331375 1568544
40815 1568544 1648056 1396163 1142532 1253887 1548302 1601442 1439449 1463712 1799889 2183113
40805 2183113 2450577 2715673 3037933 3308218 3511690 3776506 4115109 4403755 4648380
40796 4648380 5011850 5567467 6256700 7059132 7970464 8873820 9677630 10514084 11592082
40787 11592082 12985730 14767104 17112223 20031447 23332960 27175663 32219510 38835825
40779 38835825 46840537 56630695 69440952 84679948 97377362 100667122 92019037 75889825
40771 75889825 59369437 46302499 36453368 28729901 23012775 19141810 16174784 13390841
40763A3390841k364650j536688r47010q69227r24524q25144o64646n62383n30576
40754D165993n73913n81001l45272L6725J32467j76042m20990k56654R277j8460
40744A972130j80522j52218n9951j80341l55715k52773L8042J62988O7868m4675
40734A014833j20645j96824j50634O8560J72528o6260l55224k72441P4523K47892
40724D16308J68993J20851J88815J90880R1143K0767n3178k37065l58166j67047
40714C82301J55412J81992p2417j47475J20218L51161K55813N0734K8649R6092
40704A402480J997k40843m03477l37530o9621K40923L47596J15506k40083l26470
40694D90478p1139J86818K03393J53797K68837M02611K47364j56693m25026l29263
$$ plain form
40763 13390841 11026191 9489503 8542493 7673266 6748742 5923598 5258952 4696569 4165993
40754 4165993 3592080 3011079 2665807 2702532 2834999 2658957 2237967 1981313 1990590 1972130
40744 1972130 1791608 1639390 1579439 1399098 1043383 790610 828652 991640 1059508 1014833
40734 1014833 894188 697364 546730 615290 787818 721558 366334 93893 168416 416308
40724 416308 585301 706152 894967 1085847 1176990 1197757 1144579 907514 549348 382301
40714 382301 537713 719705 647288 499813 620031 971192 1227005 1277739 1306388 1402480
40704 1402480 1404477 1163634 760157 422627 353006 593929 941525 1057031 816948 490478
40694 490478 419339 606157 809550 963347 1232184 1634795 1882159 1725466 1300440 971177
40684I71177n7746P4595l8j16844j55827j63844k06958k26715j27687M9223J52143
40673A91479J10940m171j25505k57307l61430l23484j26438O9766J33893J33782
40663e58475J81185K28452J75474P5345M7887N6627k8826j74724j87219j380J98307
40652A2653K08633N1253q0001o1999J8557k2587k12490l29454j67525J32471K01403
40641b49086n2517k71002j29407J97162K81067L2545k24945k29936o9664M5964
40631f69819P0172P5553P6399K6910n8914q5912J3068J84535K97977K84492J94918
40620D09379R3365l5412j86775k30212o9679J39782J54596J6165P069J92407K90464
40609G81149J08647j75603l26051l61363l56829k10276J22452L86879L37193J25879
$$ plain form
40684 971177 913431 988026 987988 871144 715317 551473 344515 117800 -9887 39336 191479
40673 191479 302419 298248 172743 -84564 -445994 -769478 -895916 -826150 -692257 -558475
40663 -558475 -377290 -148838 26636 101981 149868 206495 177669 2945 -184274 -185654 12653
40652 12653 221286 272539 192538 130539 149096 126509 -85981 -415435 -582960 -450489 -249086
40641 -249086 -301603 -572605 -702012 -504850 -223783 -191238 -416183 -646119 -715783 -669819
40631 -669819 -599647 -524094 -447695 -420785 -479699 -565611 -552543 -368008 -70031 214461 409379
40620 409379 502744 467332 280557 50345 -19334 120448 275044 291209 298278 490685 781149
40609 781149 889796 714193 388142 26779 -330050 -540326 -417874 -30995 306198 432077
40599D32077Q6580K50569L63392K79608P2898j50362k96072k50671n3783K5881
40589G60117j50905l14773j73712Q5351O0256k18015l28944j16503J29063J73018
40579i5047J17096R8817P2021K959j6103L9030O5798M0919M7016O1721k1648j45829
40567B66750j42288m2714l4290r8938m2667R4095M7436j79398k48294l1894J82324
40556b29878J92643J70220K39848K02747l7884j78501j008J94016N5976k01535
40546D06644j28490K11492L25157O1029j82379p8671J88452K42830m032l29747
40536G12285m76245l42350l3006K04282J81877m3156k42414k63507j35746K7130
40526d10850J22929Q6625o1610j85379j39330O7916K61255K57151K9500k48175
$$ plain form
40599 432077 518657 769226 1132618 1412226 1485124 1334762 1038690 788019 734236 760117
40589 760117 609212 294439 120727 206078 266334 48319 -280625 -397128 -268065 -95047
40579 -95047 22049 120866 192887 195846 179743 218773 284571 325490 372506 434227 412579 266750
40567 266750 124462 81748 47458 -51480 -94147 -52 47384 -132014 -380308 -412202 -229878
40556 -229878 -37235 132985 372833 575580 537696 359195 358187 552203 608179 406644
40546 406644 278154 489646 814803 875832 693453 614782 803234 1046064 1042032 712285
40536 712285 236040 -106310 -139316 64966 246843 203687 -38727 -302234 -437980 -410850
40526 -410850 -287921 -201296 -262906 -448285 -587615 -519699 -258444 -1293 28207 -219968
40516b19968l31389j49141P9250P8237j17897j76075R8748M84267O03888L56196
40506G06116l1259k84649l02903j64612l4427l2320j20612j49906n0717Q4972
40496c80317J42522J16589O4507K1823Q854K8799K2188p6471k06261k18228p7914
40485e53909Q9055J72166J57020K5940k30044m57670m14542r0875K26333L05948
40475g70578K10728J00490J0937n3245k1549R1566J30152M3708j896Q2699J19106
40464e7882m1895k36135k30651q1150j688k0366q417O7786J53501K45397L05925
40453I4425J81184j46954l70916k11794J43111K60660M4139k09015k73965k04820
40443f93945r7325L4142J20271P0450j7385N2142K34877K72212J04429j6814Q2688
$$ plain form
40516 -219968 -551357 -700498 -621248 -543011 -660908 -836983 -738235 -253968 349920 706116
40506 706116 674857 390208 87305 -77307 -111734 -144054 -264666 -414572 -465289 -380317
40496 -380317 -237795 -121206 -56699 -34876 -26022 2777 24965 -51506 -257767 -475995 -553909
40485 -553909 -464854 -292688 -135668 -109728 -339772 -797442 -1211984 -1302859 -1076526 -770578
40475 -770578 -559850 -459360 -448423 -501668 -523217 -431651 -301499 -257791 -259687 -176988 -57882
40464 -57882 -99777 -335912 -566563 -647713 -649401 -669767 -678184 -610398 -456897 -211500 94425
40453 94425 275609 128655 -242261 -454055 -310944 -50284 -6145 -215160 -489125 -693945
40443 -693945 -791270 -757128 -636857 -566407 -583792 -531650 -296773 -24561 79868 63054 145742
40432A45742K51872K70349J35367k8115j57989k33876k18345j29386n1334k782
40422a8497Q1208J88048J99376Q4636k3214j3326O8106J18292R1764r232j22669
40411F44492j08407Q2324K29224O9998k70122l58656n8887K42079J77178j04395
40401E44828k24417j28104m6373n7832k3131R5623J60375J21089R3572J24501
40391F60131J05053j1559j06947r7408n5865l8009L0058J55948J51024r9720l63044
40380C29662l10907p373J37382m8886k39572r0525K45689L41839J07631j16349
40370C48591o5707J27190K00824J20758K5001k3082n7813p5345k4903R9197K50557
40359I25268L73299L88913K20379q3200l22153l49218k42969j88989k45056l15570
$$ plain form
40432 145742 397614 667963 803330 775215 617226 383350 165005 35619 -15715 -18497
40422 -18497 62711 250759 450135 534771 511557 498231 566337 684629 776393 767161 644492
40411 644492 536085 618409 847633 917631 647509 288853 229966 472045 649223 544828
40401 544828 320411 192307 145934 88102 64971 160594 320969 442058 535630 660131
40391 660131 765184 753625 646678 549270 493405 455396 485454 641402 792426 692706 329662
40380 329662 18755 11382 148764 99878 -139694 -230219 15470 357309 464940 348591
40370 348591 282884 410074 610898 731656 756657 733575 675762 600417 575514 674711 925268
40359 925268 1298567 1687480 1907859 1824659 1502506 1153288 910319 721330 476274 160704
40349A60704l05271k04712o5172L2236K7851l1419k0589Q7312J59104R6306j707
40338f5357K1755J50879K22805J36468n3563k07498k04704m2807J25011J42511
40328B25500O0655N1642R5126k1987l10397m54316k53168O9676K20427K43419
40318g3423K98746K82284L7618k34044j96347P8029J92652K0613j76193k12904
40308A7031j80517j49780m7674J07811J84213K00346K91163L75457K21186j05707
40298I13529k50915j23128l1358j39423k04350n5636P4754l3269k03848j92311
40288b45955p9998k9754O0883L11974N08195L69834J4632j98280j65308o8734
40278D77489k6591j9076o7814j85225k14101p113K78332L34052J27415o3005k3360
$$ plain form
40349 160704 -144567 -349279 -414451 -382215 -354364 -385783 -406372 -319060 -159956 -63650 -65357
40338 -65357 -43602 107277 330082 466550 412987 205489 785 -42022 82989 225500
40328 225500 286155 337797 432923 410936 100539 -353777 -606945 -537269 -316842 -73423
40318 -73423 225323 507607 545225 311181 114834 192863 385515 406128 229935 17031
40308 17031 -163486 -313266 -360940 -253129 -68916 131430 422593 798050 1019236 913529
40298 913529 662614 539486 508128 368705 164355 108719 183473 150204 -53644 -245955
40288 -245955 -325953 -355707 -294824 17150 525345 895179 909811 711531 546223 477489
40278 477489 450898 431822 364008 178783 -35318 -42431 235901 569953 697368 634363 611003
40267F11003J83961L57126L29059N8455k86893m16306k53660q0886j58422l41192
40257B245l12367o9920J09673J08005O2900P6362J17000J84587K84199K64728
40247H27412o757l17206k90871O0167L07657K11005Q769k7286R006p7865k07200
40236D96831j91410r4322j23504k63482k93299j43061Q198J8530l2207j6248L5058
40225e98916J5405m6524l085J77262L13726K36766L3293o1662Q280O7881J3803
40214A56229k0406R0236K29464K22952J15189N9621M0085o2930j97581j92711
40204D40148o8428l5836j57412k47867j69219l985J29970K19038K31801Q7182
40194D25392j39386j97050m145J74506P6293j84354k87152j38893P0881J76001
$$ plain form
40267 611003 794964 1152090 1481149 1539604 1252711 836405 582745 501859 343437 2245
40257 2245 -310122 -380042 -270369 -162364 -99464 -23102 93898 278485 562684 827412
40247 827412 820655 503449 212578 272745 580402 791407 800176 772890 781896 704031 496831
40236 496831 305421 211099 87595 -175887 -469186 -612247 -604049 -585519 -617726 -633974 -598916
40225 -598916 -583511 -630035 -633120 -455858 -142132 94634 127927 66265 74545 142426 156229
40214 156229 135823 226059 455523 678475 793664 853285 893370 830440 632859 440148
40204 440148 371720 335884 178472 -69395 -238614 -242599 -112629 106409 338210 425392
40194 425392 286006 88956 84811 259317 335610 151256 -135896 -274789 -203908 -27907
40184b7907J88526J66568J11583K6992m8107r9513j54368k23253k79006k81837
40174f20322j85796K8903K69635L51829K11113L5984N2782K10966K44480N5145
40164F54719j47345j64248r4950j49659k88462k63620q074K38251K65831J67739
40154B10182J31066J16279l0689k30916k17178M6133K53667J77943l1266j18339
40144C06882q2221n9990l2640Q5054J81609P9256j21830j38875M2533J18236o2374
40133C15640k61122k17301o061J29191J05249o172j40339k18929j15668J63042
40123b52470L71121K87647J6445j48454r6002K1450K9397r5394k50761k81837
40113c98858q5064K36091L95582K44046k4116j40460j26723j71667k47970j53504
$$ plain form
40184 -27907 160619 327187 438770 465762 417655 318142 163774 -59479 -338485 -620322
40174 -620322 -806118 -777215 -507580 -155751 55362 91346 144128 355094 599574 654719
40164 654719 507374 343126 248176 98517 -189945 -453565 -461639 -223388 42443 210182
40154 210182 341248 457527 426838 195922 -21256 24877 278544 456487 425221 306882
40144 306882 224661 164671 132031 217085 398694 477950 356120 217245 259778 378014 315640
40133 315640 54518 -162783 -168844 -39653 65596 59424 -80915 -299844 -415512 -252470
40123 -252470 118651 406298 422743 274289 178287 199737 229134 133740 -117021 -398858
40113 -398858 -483922 -247831 147751 391797 367681 227221 100498 -71169 -319139 -472643
40103d72643Q8952K07038J20158P9228K19253K78521O833l77091m41129j32569
40093d23449J80691K18164O7814m5143k5438J02638K57450K76884K4341l76808
40083B57144n73688l77487q873J79213J24174N0112J10441K12466K07330J05277
40073B86109L2730N4720J13383J18563M7528n3261j36602j89474j92685r7522
40063a6511R4309K52580K14666j7826k53692l09913j69860N7666K33056K25586
40053C10061L341k54757k83541n9895J39919J18150J5549L4363R3239O950j39429
40042a6050j11491N4749R1932n0288j38914q1115o3702j64144j65382O0929K81135
40031c02341K32961r7j70995k26556k57585k63876j95920r6957j0608J16531K75892
$$ plain form
40103 -472643 -383691 -176653 -56495 22733 241986 520507 527340 150249 -290880 -423449
40093 -423449 -242758 -24594 43220 -1923 -27361 75277 332727 609611 633952 257144
40083 257144 -316544 -694031 -702904 -523691 -399517 -349405 -238964 -26498 180832 286109
40073 286109 318839 373559 486942 605505 653033 599772 463170 273696 81011 -16511
40063 -16511 77798 330378 545044 527218 273526 -36387 -206247 -148581 84475 310061
40053 310061 313402 58645 -224896 -284791 -144872 -26722 -11173 23190 116429 123379 -16050
40042 -16050 -127541 -72792 19140 -31148 -170062 -251177 -314879 -479023 -644405 -583476 -302341
40031 -302341 -69380 -69477 -240472 -467028 -724613 -988489 -1184409 -1281366 -1291974 -1175443 -899551
40020h99551L16134J95597J06942J50209J28162p7091j97291O352K75100K31495
40010B36058K0418O4020L08758K93307n1543k71189j54985n3447k22621l91237
40000b22461k82710r9706j19449j90005l4310K43639L63758L39276L36331K72053
39990F06416j2152l17296k78946N5571K56190J24203r4308j48018q5210l5659
39980G0791P607P0189R8602R0433J28514K04957J96323P9064j8736l9572p1619
39969H16553j38801j32199l7317m040p1864n6553J24420K35352N6078k44114l31241
39958B16274j86888p7981j08707j09035J1180R3010J5727q7392m9443P2849J24898
39947h5508J01614R5404R2802N254j45313k37842k27424j63817n8548J09888K66126
$$ plain form
40020 -899551 -583417 -387820 -280878 -130669 -2507 -79598 -276889 -270537 4563 236058
40010 236058 256476 320496 629254 922561 871018 599829 444844 391397 168776 -222461
40000 -222461 -505171 -604877 -724326 -914331 -948641 -705002 -341244 -1968 334363 606416
39990 606416 594264 276968 -1978 53593 309783 433986 339678 191660 106450 70791
39980 70791 78398 148587 247189 337622 466136 671093 867416 946480 927744 888172 816553
39969 816553 677752 545553 508236 504196 432332 375779 500199 735551 791629 547515 216274
39958 216274 29386 -48595 -157302 -266337 -255157 -162147 -146420 -233812 -283255 -210406 -85508
39947 -85508 16106 111510 204312 209566 64253 -173589 -401013 -564830 -623378 -513490 -247364
39936b47364K82808J76069R0342N6342m9211k33854k82674n9817K47702L59590
39926C39933K52185J00540j5722j33193k07831j43547p235J6101q9771j44872
39916c3412p8134m0395j26477j97950j22266r240k8843j21678r3555P0425J87499
39905e94026J56581P1882L1482k297p9849j31105o7048N4421Q4047p202p4376
39894e57490J1423J90848K86549K02806L813j68468j93608l5038K01144K96500
39884B38479J33638j17328j63936L2144K05039J67401M9718L5293N5348m1963
39874E93833j69333j19883N4583O5447j92000m73245m94700k29927J39690L97625
39864d27910L88388J26582j42929j64036J2553J03946R623p2690p882N3855m2757
$$ plain form
39936 -247364 35444 211513 301855 358197 308986 75132 -207542 -267359 -19657 339933
39926 339933 592118 692658 676936 543743 335912 192365 185130 201231 111460 -33412
39916 -33412 -111546 -151941 -278418 -476368 -598634 -607874 -636717 -758395 -851950 -781525 -594026
39905 -594026 -437445 -365563 -334081 -336378 -416227 -547332 -614380 -559959 -475912 -483114 -557490
39894 -557490 -546067 -355219 -68670 134136 137949 -30519 -224127 -259165 -58021 238479
39884 238479 372117 254789 90853 122997 328036 495437 545155 580448 635796 593833
39874 593833 424500 304617 359200 424647 232647 -240598 -735298 -965225 -825535 -427910
39864 -427910 -39522 87060 -55869 -219905 -207352 -103406 -93783 -166473 -174355 -120500 -163257
39853a63257j77758j53820j1696O9617P8402J47737K74166K79607Q3399j53082
39843B73315k24195j24724k0247j8113n1678j5162N2424J4974j30828k03918q9950
39832e38102P8820J16007M4273Q737K5347J3265N734J00328K32451K30283Q6835
39821D03978m3047j01256j50700j69311q7051r323j00199k43406j58905J17237
39811e41983K45023J30412M7141J05793O7123j28168j39978J59223L29038L1855
39801C05479l52051k79215J10670K58832P1350n3698L2228O1720o1355o9903J44234
39790A68291K85612J25659j40043k06344o2916R5299J56158J34406P8930M9746
39780F84798P5897Q2786k3223j80203k14582p7204Q5422J04333n5046k68554l07380
$$ plain form
39853 -163257 -341015 -494835 -506531 -436914 -358512 -210775 63391 342998 426397 273315
39843 273315 49120 -75604 -95851 -113964 -165642 -180804 -128380 -113406 -244234 -448152 -538102
39832 -538102 -459282 -343275 -299002 -290265 -264918 -251653 -245919 -145591 86860 317143 403978
39821 403978 360931 259675 108975 -60336 -147387 -156710 -256909 -500315 -659220 -541983
39811 -541983 -296960 -166548 -119407 -13614 53509 -74659 -214637 -55414 273624 305479
39801 305479 -46572 -325787 -215117 43715 115065 61367 93595 155315 93960 24057 168291
39790 168291 453903 579562 439519 233175 170259 265558 421716 556122 635052 684798
39780 684798 760695 843481 820258 640055 425473 348269 433691 538024 482978 214424 -92956
39769i2956k8509L71578M57597R7182k75531j94115K13827M63046M26796L93418
39759A832333M57660L34759j05394n27864n69452l06277p7593m4274j12305j55191
39749G26402j44745j27370j61733k37119k47794j26534L1093R1144P9065J08179
39739i412J65966J41100K1242r9153j57305j22696L9809K38325K32270l4095k42617
39728A73434j24206J08711J00810n6155j7967J58822R2446k22436l51537j35758
39718b73836P6085N3757J3795J11112J17767r7583k30759l8413K07559J41061
39708H0545j26740k30669j02830N2299J33142J62311J01491n3898j39948m4284
39698a68581Q9354J04815R5666J81008K25160O7023j49936j80589o6198k1166
$$ plain form
39769 -92956 -121465 250113 707710 804892 529361 335246 549073 1012119 1438915 1832333
39759 1832333 2289993 2624752 2519358 1991494 1422042 1115765 1038172 993898 881593 726402
39749 726402 581657 454287 292554 55435 -192359 -318893 -287800 -196656 -117591 -9412
39739 -9412 156554 297654 318896 219743 62438 -60258 -20449 217876 450146 416051 173434
39728 173434 49228 157939 258749 202594 184627 343449 435895 213459 -138078 -273836
39718 -273836 -197751 -143994 -130199 -19087 98680 1097 -229662 -268075 -60516 80545
39708 80545 -46195 -276864 -379694 -327395 -194253 -31942 69549 15651 -124297 -168581
39698 -168581 -79227 25588 121254 302262 527422 594445 444509 263920 197722 176556
39688A76556o0366m3790J0572l0407j22478q9826O2740J44363P6318k8493p3577
39677B1612o5416o328J09724J99420J54531L553j22647j65325j57748j08427N649
39666a31402J44447K06774J28704n7665k27428k26870l1777J59839J31120n7310
39656C8432j49189o7679K0295K8652N2954Q6086l4692k66441k89535K117K63776
39645c15224J99858j207k0351Q2277M9226j02465j49870n7458K4952M8605P0661
39634a70996Q0412O1739R6777J85659J39495j06431k78975j44725J08242J71770
39624A42967Q5765O2216N4788r7086k66351k07210m939O0386l615K4561J20693
39613b7825P5519n2789j4762J29819P0063j76732k34677n254J38602m8726l08501
$$ plain form
39688 176556 116190 72400 82972 52565 -69913 -159739 -96999 47364 123682 95189 21612
39677 21612 -43804 -50132 59592 259012 413543 417096 294449 129124 -28624 -137051 -131402
39666 -131402 13045 219819 348523 290858 63430 -163440 -195217 -35378 95742 38432
39656 38432 -110757 -178436 -158141 -129489 -76535 9551 -25141 -291582 -581117 -579000 -315224
39645 -315224 -115366 -116573 -136924 -54647 -5421 -107886 -257756 -315214 -290262 -241657 -170996
39634 -170996 -90584 -28845 67932 253591 393086 286655 7680 -137045 -28803 142967
39624 142967 228732 290948 345736 248650 -17701 -224911 -229850 -169464 -173079 -148518 -27825
39613 -27825 47694 -5095 -19857 109962 180025 3293 -231384 -236638 -98036 -146762 -455263
39602d55263k98400m9619J95594L19558L17296J89712J9219l6249M9614J27559
39592C79021R4660j0669j41946k59679k29994K4138K74996K02544j16020k57100
39582d0049n5475J79903J64108J8844p524Q2681J35101J05966M6605k1318q7917
39571E20925j36777j99912k89964k85124q3724J50920J63287J0797j5560J14721
39561e0411J24295n8117j37288M1740K10800J26670l8871l1386N1520k4132j85182
39550B9638j54793J06106L43306L53705J74415m9354k23015l24475l57308k96194
39540c97969r8077J69669K80977R6164j82357k11152M0616K64890K52499J11465
39530C26725K0188K2325J12710K61841L03892Q2331k34809k92904p9099K7424
$$ plain form
39602 -455263 -753663 -803282 -607688 -288130 29166 218878 238097 201848 251462 379021
39592 379021 473681 463012 321066 61387 -168607 -144469 130527 333071 217051 -40049
39582 -40049 -95524 84379 248487 267331 259807 342488 477589 583555 630160 608842 520925
39571 520925 384148 184236 -105728 -390852 -474576 -323656 -160369 -149572 -165132 -50411
39561 -50411 73884 15767 -121521 -79781 131019 257689 218818 187432 238952 214820 29638
39550 29638 -125155 -19049 324257 677962 852377 803023 580008 255533 -101775 -397969
39540 -397969 -496046 -326377 -45400 50764 -131593 -342745 -302129 -37239 215260 326725
39530 326725 346913 369238 481948 743789 1047681 1130012 895203 602299 523200 550624
39520E50624j52137l21140k09511N148L6056n2235k0027J28407J90643Q6768r5469
39509A47127k53015k95107j62083M2415J04074K420l5623J01688K34349K05840
39499I2085J08993M8310l0957j00196M1286L76214N14309K26099j55992k02433
39489I17718K595P4505o7991k01559k36849k64137k62555j31557M5301Q8206J9607
39478a6716q870j2383j06894k23821j91822m9565J6195J813O6055K05333K36519
39467h4156J08522k4734n4765j6967O0692J87011K78217K05248o865j89716k44286
39456B18201k07291j36010o3829l0333l5957k6956j4901q6278j91662j21064J45327
39445e50753K89413J01936j45005r0856J37890J37235j07963k08827j3553J68081
$$ plain form
39520 550624 398487 77347 -132164 -127016 -90960 -143195 -163222 -34815 155828 242596 147127
39509 147127 -105888 -400995 -563078 -520663 -416589 -414169 -449792 -348104 -113755 92085
39499 92085 201078 249388 218431 118235 159521 535735 1050044 1276143 1120151 917718
39489 917718 920313 994818 926827 725268 488419 224282 -38273 -169830 -124529 -36323 -16716
39478 -16716 -25586 -37969 -144863 -368684 -560506 -610071 -593876 -592063 -526008 -320675 -84156
39467 -84156 24366 -368 -55133 -72100 -11408 175603 453820 659068 652203 462487 218201
39456 218201 10910 -125100 -188929 -219262 -255219 -282175 -297076 -383354 -575016 -696080 -550753
39445 -550753 -261340 -159404 -304409 -395265 -257375 -120140 -228103 -436930 -450483 -282402
39435b82402P5149j38424k07566j40056j04502j23422o7416J24054L34009L64116
39425a66460J31916j93006l10930j29128J09451J40884Q759o8727l1216K4503
39415d83954O9389J32789J43024K2014j06272m7975J39478K00543O4125n7856
39405G5305K666J41603J52054j0738j93852k09169k3189J85414K13982R5423L7585
39394D67084Q1322M2723j20201j69755O177J48881M4403j03696l9900P8117k3380
39383D11775k05207j45243P0741Q8200q5671j09589O5627J25048j7607p2437P2339
39372A97976J37671l0337j70155n3727J42487J55084K2156p3351r5846q3142J266
39361A50082J47736K11773J09025m9629j30273j32918j04937o6204o7189j33939
$$ plain form
39435 -282402 -207253 -345677 -553243 -693299 -797801 -921223 -988639 -864585 -530576 -166460
39425 -166460 -34544 -227550 -538480 -667608 -558157 -417273 -408514 -477241 -508457 -483954
39415 -483954 -414565 -281776 -138752 -116738 -223010 -270985 -131507 69036 133161 75305
39405 75305 77971 219574 371628 360890 167038 -42131 -65320 120094 334076 429499 467084
39394 467084 548406 591129 470928 301173 307350 456231 500634 396938 357038 435155 411775
39383 411775 206568 61325 132066 220266 134595 25006 90633 215681 198074 125637 197976
39372 197976 335647 305310 135155 81428 223915 378999 401155 327804 231958 148816 150082
39361 150082 297818 509591 618616 568987 438714 305796 200859 134655 67466 -66473
39351f6473j35105O5972L09557K72530l9854k37782q9627J70240K20969P5785
39341E46212n3674q9813r0333p3954j8980N4837J04717R3729j3140j71430k13947
39330G4224n3776J23642Q7424q1305j21543k0890M407q1062j01022m0606o5085
39319b75592j42059n5636J47647J65371j4495l7863J98310L33808J62773j5159
39309D67105N4436J34446m2974k71718k39018p1338q2469k26092k20424l2645
39299e30691J45228K45153K95361K02733q3356l26647k71890m6811K8495p5474
39289d17899j29669o1637n769o972O072j121j12169k11803r1189J98418L61845
39278d71893K46614o930k02447k68923k11508p8649J8504J8378K2377J44374K95129
$$ plain form
39351 -66473 -201578 -135606 173951 446481 406627 168845 79218 249458 470427 546212
39341 546212 492538 402725 312392 238438 219458 274295 379012 472741 459601 288171 74224
39330 74224 20448 144090 231514 150209 28666 7776 12183 -68879 -169901 -210507 -275592
39319 -275592 -417651 -473287 -325640 -160269 -174764 -212627 -14317 319491 482264 467105
39309 467105 521541 655987 613013 341295 102277 30939 -51530 -277622 -498046 -530691
39299 -530691 -385463 -140310 155051 357784 274428 -52219 -324109 -370920 -342425 -417899
39289 -417899 -547568 -609205 -614974 -621946 -615874 -616995 -729164 -940967 -1032156 -833738 -471893
39278 -471893 -225279 -232209 -434656 -703579 -915087 -993736 -975232 -956854 -934477 -790103 -494974
39267d94974K91189J37751J7732J6115L0675l3085j19946j04357O2758K75391
39257G9249L14854O5202k67903l07736K1460L38258K71028p1959k87115k02145
39247d6807q1J04017Q7799L7125J1087J3134M505m8018j02555q5348k3584j6807
39235f5533n3152k0860N9519K9665j08677j42445j0471O0646m1164o9180J63850
39224a97802L85792K25572j96941m01315j90324J57056L10574K29146O4004n6679
39214C29083j05366j43170k27574k75276j20331K12565M51727M13355K18080M3111
39204G96204j24505l07790l49481j52470Q2685J24503M3564J8652k193j44285
39194a5116k80553k05752j3836M4350j1594M4694K19117K87406J91041J05658
$$ plain form
39267 -494974 -203785 -66034 -48302 -32187 -1512 -34597 -154543 -258900 -196142 79249
39257 79249 394103 459305 191402 -116334 -94874 243384 514412 442453 155338 -46807
39247 -46807 -46888 57129 144928 182053 193140 206274 210779 162761 60206 -25142 -48726 -65533
39235 -65533 -118685 -139545 -80026 -50361 -159038 -301483 -311954 -251308 -292472 -361652 -197802
39224 -197802 187990 413562 216621 -184694 -375018 -217962 92612 321758 385762 329083
39214 329083 223717 80547 -147027 -422303 -542634 -330069 121658 535013 753093 796204
39204 796204 671699 363909 14428 -138042 -55357 69146 112710 131362 129169 -15116
39194 -15116 -295669 -501421 -515257 -470907 -482501 -437807 -218690 68716 259757 365415
39184C65415J03745O2514n6988j24790r2508q6520j90101l22834l69870k76653
39174i88590l6736K49120L57519J82711o1837q6134R2669K23160K03676J46780
39164B82338J12085L8768o6339j13118j02390j09669j14708m8526K8463P508n5482
39153a41070l2883K0014m4422j52040n8344K60575N12677M47835J34937j57776
39143G89503k22791n3862J48266J38206r7706k99395k73527j41512r7236q8214
39133a98268L7567K12486K39126J00672o1308j81950k53698j93319J4464J60215
39123a24013P1475q4361m6376J10741J14706l6293r0649K5619J31689J23434P6061
39112B72033L5414j1410N864J33121J96200P853k79309l33290j24723N2028K4913
$$ plain form
39184 365415 469160 531674 474686 349896 257388 170868 -19233 -342067 -711937 -988590
39174 -988590 -1025326 -776206 -418687 -235976 -297813 -383947 -291278 -68118 135558 282338
39164 282338 394423 433191 366852 253734 151344 41675 -73033 -121559 -93096 -85588 -141070
39153 -141070 -173953 -153939 -198361 -350401 -408745 -148170 364507 812342 947279 789503
39143 789503 566712 512850 661116 799322 701616 402221 128694 -12818 -110054 -198268
39133 -198268 -160701 51785 290911 391583 330275 148325 -105373 -298692 -284228 -124013
39123 -124013 -52538 -136899 -183275 -72534 42172 5879 -84770 -59151 72538 195972 272033
39112 272033 307447 296037 301901 435022 631222 639075 359766 26476 -98247 -46219 -21306
39101b1306p0144m9813J04398K78112K95230N3091k51729k28625J61390M30354
39091G00958K29892j09457r8637J55994K14543N1684l5710o4538k71844n09647
39081B63238l95725k4138J25006j8679o0344R6424J09473q7973j14853J47397
39071C9826L12445J69510J0756N0354Q7180p817k1170J20302J29247r5199k13165
39060E82269m0398R6497o4703k52832j34991J39457K28502J03000n2157j47592
39050D57052j42935J4568J96431J52495o7581j09375J17893K76942J70465K1599
39040A087554p241q9758k86267l12350n4016J53785Q0895k0063P8510J48428m4480
39029G34997k81700k74638j27262m3554N3123K35807K84400P0605j22186n4101
$$ plain form
39101 -21306 -91450 -141263 -36865 241247 536477 589568 337839 109214 270604 700958
39091 700958 930850 821393 722756 878750 1093293 1144977 1109267 1044729 772885 263238
39081 263238 -132487 -156625 -31619 -50298 -110642 -14218 95255 7282 -107571 39826
39071 39826 352271 521781 532537 582891 670071 662254 641084 761386 890633 795434 582269
39060 582269 541871 638368 573665 320833 185842 325299 553801 656801 604644 457052
39050 457052 314117 328685 525116 677611 610030 500655 618548 895490 1065955 1087554
39040 1087554 1080313 990555 704288 391938 337922 491707 572602 552539 631049 779477 734997
39029 734997 453297 178659 51397 7843 60966 296773 581173 651778 529592 475491
39019D75491M2715j11928l32662k96542p9740M6618P9994J50814J86878R2696
39009B54334J4905P9420J21232J828q9822J9208J47871J03831M1185J20094J43661
38998I57747p5516l05620k59838p3207j2876j1550R2032J44047m0903k43548j44897
38987B5871J38232K46861J24159k0700j04592j58779j08900R1569K81818L29955
38977H45494L34589L49963K06043j27434l34141k15837k4258k0480p3941k5972
38967I14026m0724k16379k65008k580K44545J64636o726O0085K00987J15469o4991
38956A103340o9119O070l2070m8262R3823J60667j4296j33536K8850J47645n5344
38945A187768k19773K9801L49778K52991l4002k8966J10204n5720l52811k89283
$$ plain form
39019 475491 518206 406278 73616 -222926 -302666 -256048 -176054 -25240 161638 254334
39009 254334 269239 348659 469891 471719 381897 401105 548976 652807 693992 814086 957747
38998 957747 882231 576611 316773 243566 230690 219140 311172 455219 414316 170768 25871
38987 25871 164103 410964 535123 514423 409831 251052 142152 233721 515539 845494
38977 845494 1180083 1530046 1736089 1608655 1274514 1058677 1034419 1013939 939998 914026
38967 914026 873302 656923 391915 389335 633880 798516 791790 851875 1052862 1168331 1103340
38956 1103340 1034221 1040291 1008221 959959 1053782 1214449 1200153 1066617 1095467 1243112 1187768
38945 1187768 967995 997796 1347574 1600565 1566563 1537597 1647801 1592081 1239270 949987
38935I49987L7894J50754O7874J73589M20511M50023L17430L24309L21557l1832
38925C182096m89680n01216j39829K8988j12374j87548r9856r0376j23875M3561
38915A509891K80358K65970J25850J81793K58112j4644m04711l87106o4755L9018
38905A789776o9980K6689K54561J58755j83816k62076o6729m9540k22440j83535
38895A191665K6735n361j99970r1778K44656K90313N5733L4870K33112J94639
38885A974614l1963O0935M24539M69351J30201n2211N4750M9976r0607L2708L50599
38874C372892L85039K22647L99421Q02098P77491L86255M02153R43640J269495
38865H961131J127861J147846J614343J972603J906014J890023K302609K891050
$$ plain form
38935 949987 987881 1138635 1206509 1380098 1800609 2250632 2568062 2892371 3213928 3182096
38925 3182096 2692416 2191200 2051371 2080359 1967985 1780437 1680581 1590205 1466330 1509891
38915 1509891 1790249 2056219 2182069 2363862 2621974 2607330 2202619 1815513 1750758 1789776
38905 1789776 1719796 1746485 2001046 2159801 1975985 1713909 1647180 1597640 1375200 1191665
38895 1191665 1218400 1213039 1013069 921291 1165947 1456260 1511993 1546863 1779975 1974614
38885 1974614 1942651 2003586 2428125 2897476 3027677 2975466 3030216 3080192 2989585 3022293 3372892
38874 3372892 3757931 3980578 4379999 5182097 5959588 6345843 6747996 7691636 8961131
38865 8961131 10088992 11236838 12851181 14823784 16729798 18619821 20922430 23813480
38857B3813480L457619M251651N396096O671945Q112029J0173347J3081097J6192705
38849I1149969J7679044J4796534N922813o504717j6409221j9342261j6686002
38842G0606159j3039345j0588438q348810n863952m336233m009354l477731k255287
38834A8687009j510616j647587j572654r71980r11130j520003j484724n37292
38826H531023n0161m57767n40906K9784K0706p44397p89875J48771M60206k51846
38816F355538l54495N63435P59348k21062m75248N87882R80149N794k52704J001290
38806H949927J572647N39983J84275J507968K113042R82166Q03679K752973L857345
38797B3264005K751622K778091N662629P833533P330998Q073538J2174399J5104974
$$ plain form
38857 23813480 27271099 31522750 36918846 43590791 51702820 61876167 74957264 91149969
38849 91149969 108829013 123625547 129548360 123043643 106634422 87292161 70606159
38842 70606159 57566814 46978376 38629566 32765614 28429381 24420027 20942296 18687009
38834 18687009 17176393 15528806 13956152 12984172 12073042 10553039 9068315 8531023
38826 8531023 8480862 8023095 7482189 7511973 7532679 6788282 5998407 6147178 6607384 6355538
38816 6355538 6001043 6564478 7323826 7102764 6627516 7215398 8195547 8201341 7948637 8949927
38806 8949927 10522574 11062557 11246832 12754800 14867842 15850008 16653687 19406660 23264005
38797 23264005 26015627 28793718 34456347 42289880 49620878 57694416 69868815 84973789
38789H4973789J4701917J6898188K4778128L1864027L7336610N5617911R1121728
38782C57292298J11622887P4817252j3776228r4172080j15305786q6479099n2593903
38775A81405341l7149689l0425501k1253025j3796425j2644285j2423596q580229
38768D5132591n027508n270327n859655l653839j501475k149034l179166k113743
38760A6377844q61797j381164j894837q22192k9546j004029j806682q08793K14874
38751G983678m39170j240391n16154M01837j21223r47072m80885L69471J17878
38742E127969n56618l96599J5492l28450p58213l29243K40883k8849n12178k84598
38732B189596J04846j51196m86771j46594K92020R6725j74406J51103M71668J01178
$$ plain form
38789 84973789 99675706 116573894 141352022 173216049 210552659 266170570 357292298
38782 357292298 468915185 543732437 529956209 435784129 320478343 233999244 181405341
38775 181405341 144255652 113830151 92577126 78780701 66136416 53712820 45132591
38768 45132591 40105083 34834756 28975101 25321262 23819787 21670753 18491587 16377844
38760 16377844 15516047 14134883 12240046 11417854 11388308 10384279 8577597 7768804 7983678
38751 7983678 7544508 6304117 5787963 6189800 6068577 5121505 4640620 5010091 5127969
38742 5127969 4571351 4174752 4190244 3861794 3103581 2774338 3015221 2986372 2474194 2189596
38732 2189596 2294442 2143246 1656475 1509881 1801901 1898626 1724220 1875323 2346991 2448169
38722B448169l54519j74497R7705k16145n72984l01111P4777r1996k69288J67474
38712H07585O06673K85059k84624k72571J4058r4070l03020o5700K37351N8875
38702I89616j92515K1764K49570o2748l97697j02632L13999P9122m14058l50157
38692A34264L9509M2999j50563N4669L69323J42107l21629k63255J34756J27433
38682C09613j95490j47747K23456K72073j5576r1819M6136n6571k89076j37091
38672h2092K56543K57373j13932k17421O7176K09937L3064p5344K2959L7998p0826
38661C25435k3778J37142O7819j87324k08389P3446K88284K59501J42494j3440
38651H61190k69075m37425k78710L8801J85685K15919L43274M11778J86873o6199
$$ plain form
38722 2448169 2093650 1919153 2016858 1800713 1227729 926618 1001395 909399 640111 807585
38712 807585 1414258 1699317 1414693 1142122 1156180 1062110 759090 693390 930741 989616
38702 989616 797101 818865 1068435 1005687 607990 505358 819357 898479 484421 134264
38692 134264 173773 216772 66209 120878 490201 632308 310679 47424 182180 309613
38682 309613 114123 -33624 189832 461905 446329 354510 400646 344075 54999 -82092
38672 -82092 174451 431824 317892 100471 167647 377584 410648 335304 358263 396261 325435
38661 325435 301657 438799 506618 319294 110905 184351 472635 732136 874630 861190
38651 861190 592115 154690 -124020 -85219 100466 316385 659659 1071437 1258310 1192111
38641A192111M9301L31531L03742O6158R1906L28332K73793j20505l80871l36140
38631A799358k99263l92615l64404j48579j786j0264j952K0995j07828k73368
38621B20294j78114J08717K21268J05470L7057N9146m8469k42016k15539L0515
38611I8329J49968L4806n4527N825L8448m1035r9765r5607j12669r8575M4655
38600a30147J70417R9543J2371J67910L70440K55908j6607J6631K82463K33552
38590A462481k14226m99169l00018M5965J98682K68577L69846L05822J7069j62659
38580A492370m2145P3680q0673k37083k8599M00591O39326O36970O61872P75417
38570D291726Q11253Q96771J520533K762282L688364L013696N69777k185882l492924
$$ plain form
38641 1192111 1241412 1572943 1876685 1942843 2034749 2363081 2636874 2516369 2135498 1799358
38631 1799358 1500095 1107480 743076 594497 592711 582447 580495 601490 493662 220294
38621 220294 42180 150897 372165 477635 514692 573838 525369 283353 67814 98329
38611 98329 248297 283103 228576 234401 272849 231814 132049 36442 -76227 -174802 -130147
38600 -130147 40270 139813 152184 320094 690534 946442 929835 946466 1228929 1462481
38590 1462481 1248255 749086 449068 495033 693715 962292 1332138 1637960 1655029 1492370
38580 1492370 1450225 1523905 1443232 1206149 1177550 1578141 2217467 2854437 3516309 4291726
38570 4291726 5102979 5999750 7520283 10282565 13970929 16984625 17554402 15368520 11875596
38561A1875596l017572j904238j230406r98315p48746m56338l49868l46376k42048
38552B581689j69123l37335n50107m73507j93059l7563l9269k1054j2405j09976
38542F38291j37754O5959K43187J07134j01875j0141J87814N7326k62896k83433
38532E03612m9849n1224l14961l68784j17924J1055j13691j19094J25914K71905
38522b23041J77580J43803K51301J54474k01274l28321N499L40187K54618j3070
38512E61756o2709M2079M9003p95L9093R0379M7435J800J167r3998k76790k72321
38500A26099L911K26556J54875r647k0231J9055o3489j64196j39206q3823r9229
38489d9325o2720J04233K09297Q8756j11059j77927j21649l1877Q9492J80921
$$ plain form
38561 11875596 8858024 6953786 5723380 4725065 3976319 3519981 3170113 2823737 2581689
38552 2581689 2412566 2075231 1525124 1051617 858558 820995 781726 760672 748267 638291
38542 638291 500537 566496 809683 916817 814942 804801 992615 1049941 787045 503612
38532 503612 453763 402539 87578 -281206 -399130 -388075 -501766 -620860 -494946 -223041
38522 -223041 -45461 98342 349643 504117 302843 -25478 -19979 320208 574826 561756
38512 561756 499047 541126 590129 589334 628427 718806 766241 768041 769208 675210 398420 126099
38500 126099 130010 356566 511441 501794 481563 500618 437129 272933 133727 49904 -49325
38489 -49325 -112045 -7812 201485 290241 179182 1255 -120394 -152271 -62779 118142
38479A18142R2037j22894j76240J8517J90516J50310M8262K4612k9209j54219
38469A59834j48382M8722J62809M1381n8882O6364J75959o456k95773l26285r7515
38458b78224J00087J24018N5311n836J0731J36759K37573J04910j77921k35842
38448G1566O8374M03308M49569K93100J41742o148j73335k22171j19111o2682
38438H44212j11610l9512J90710K17263j29457m33125k92118M4946R1012j34962
38428B47359k45049j22573M2314J68963K88560K80972M0618k08123j61745Q5004
38418D16300J75324K0573j43855j58386q1531P552P6069O3176m6070j51347j93458
38407a5653k30157k32450n4885K29619K83931K3119j67504j1764K24548K16564
$$ plain form
38479 118142 210179 87285 -88955 -70438 120078 270388 318650 343262 314053 159834
38469 159834 11452 60174 222983 264364 205482 271846 447805 441349 145576 -180709 -278224
38458 -278224 -178137 -54119 1192 -4644 6087 142846 380419 485329 307408 71566
38448 71566 139940 543248 992817 1285917 1427659 1421511 1248176 1026005 906894 844212
38438 844212 732602 693090 883800 1101063 971606 538481 246363 291309 382321 247359
38428 247359 2310 -120263 -77949 91014 379574 660546 701164 493041 331296 416300
38418 416300 591624 612197 468342 309956 228425 235977 312046 375222 329152 177805 -15653
38407 -15653 -245810 -478260 -533145 -303526 -19595 3524 -163980 -175744 48804 265368
38397B65368J07517J32397R9234k25578n31388l65541R1565K68072Q6060n546
38387g7840J75214L17809K17070N0500k9367j08098k08644j83065j1088J31295
38377B73786J68521J82413J52596l4017k93052l84052k68593j31115m3212Q6872
38367b89853K35764K53881J46388P3228O5956K0607n0655m5499j1640o6763j28397
38356B03017l8962R0469N727k45738l46352j92018j1935J8597k3022k7221J386
38345e66052M2550P9968M7764l8764j329K15967L38603J40496j44594j51579M8544
38334A1574J21531M4555L8939O8600p0215k49007j52173J18539J53005n7566j06512
38323g8730R5341J81067J6790q2325K3729O3916n5456k8129K22105K71746r9365
$$ plain form
38397 265368 372885 505282 604516 378938 -152450 -517991 -426426 -158354 -72294 -77840
38387 -77840 97374 415183 632253 682753 653386 545288 336644 153579 142491 273786
38377 273786 442307 624720 777316 743299 450247 66195 -202398 -333513 -376725 -289853
38367 -289853 -54089 199792 346180 419408 485364 505971 455316 409817 398177 331414 203017
38356 203017 164055 254524 260251 14513 -331839 -523857 -535792 -517195 -540217 -567438 -566052
38345 -566052 -523502 -443534 -395770 -434534 -435863 -219896 118707 259203 114609 -36970 11574
38334 11574 133105 177660 216599 285199 214984 -34023 -186196 -67657 85348 27782 -78730
38323 -78730 16611 197678 214468 132143 155872 219788 164332 136203 358308 630054 530689
38312E30689m55349l44929M2015K47136J90379O6333n7062j58682r2068J42345
38302A10807K32213M325k30261j22956J81809L11937K22244J23832O6160m4740
38292H55370j62332j68644j17389j33995j85373j77912j45974j32114m4094J56164
38282b56293K94010K20732L5012j16689k42851l20995j80952J73835L96240K45522
38272B47571l5243j09141o9787k03368m31663m20258j35262J16192J64113J39990
38262g36856J73189K32834K79001L12741K77846J31291k1481o5416q2485k02239
38252B98425l29416k66427m2504J27926J64654J60154J49948Q6346j85m5097j06041
38241A97783k41303k98054r4866K23267L07957R4765j15089r9615K7261P2638
$$ plain form
38312 530689 75340 -269589 -227574 19562 209941 276274 219212 60530 -31538 110807
38302 110807 343020 347345 117084 -5872 175937 487874 710118 833950 900110 855370
38292 855370 693038 524394 407005 273010 87637 -90275 -236249 -368363 -412457 -256293
38282 -256293 37717 258449 293461 176772 -66079 -387074 -568026 -394191 2049 247571
38272 247571 212328 103187 33400 -169968 -601631 -1021889 -1157151 -1040959 -876846 -736856
38262 -736856 -563667 -330833 -51832 260909 538755 670046 648565 583149 500664 298425
38252 298425 -30991 -297418 -339922 -211996 -47342 112812 262760 349106 348921 303824 197783
38241 197783 -43520 -341574 -436440 -213173 94784 189549 74460 -25155 2106 74744
38231G4744K4858m7037j35516k08672j57186L5477J98416J78368M6755j5799K6868
38220B1276M8975k5892j07463o7813P5104J69953J21714k787r1834j29873j43934
38209a32574r6553L0252J10884J9692j37960j51742m3862j9838p0155N1869L55261
38198h4726M66577J72031k02218k36113j503J17785J0709j01518q3648k5202J264
38187C3438K4312K1686o1909j44402q2019Q1612J51975P2432k4333o0766j11283
38176i9257k19922k90933k17360j2360K09411L08070K08093k324j15032l6589
38166b68203R3778J14559O1878N1186N8424q721j11529j33760p1594p699L9622
38155a82059Q7272Q2806j1572j04281r7096l9994j5577K3491J35429K27297K00898
$$ plain form
38231 74744 99602 52565 -82951 -291623 -448809 -413332 -214916 -36548 10207 -5592 21276
38220 21276 70251 44359 -63104 -130917 -55813 114140 235854 233067 141233 11360 -132574
38209 -132574 -229127 -198875 -87991 -68299 -206259 -358001 -401863 -421701 -491856 -439987 -84726
38198 -84726 381851 553882 351664 115551 114048 231833 242542 141024 57376 32174 33438
38187 33438 57750 79436 17527 -126875 -208894 -127282 24693 97125 72792 12026 -99257
38176 -99257 -319179 -610112 -827472 -839832 -630421 -322351 -114258 -116582 -231614 -268203
38166 -268203 -174425 -59866 2012 53198 111622 102901 -8628 -142388 -213982 -221681 -182059
38155 -182059 -94787 -11981 -23553 -127834 -224930 -264924 -280501 -257010 -121581 105716 306614
38144C06614J41138J56482J59971L8350r1213n8997L8129q462j37087j16351K3537
38133D52111J1422j98941l23354j86768J8452K6995j59319l24841k81240q736
38123i74219L10822M08386K15333j3528k3370R5671J01425Q375M408O3023N479
38112B01805r9985j0122K10621K16146k7658j24133J06260K93602J07670j94717
38102F79489j73974J04961J94920n2512l11703k83087o0289Q0399N1965r36N5637
38091B84870J66230J69439K0010j47140k03455j79496j44282m4673J74309L73280
38081D69092L48812J26197p4723j38742j25279q3086k0742k4241j53920k54208
38071F9160j38220O8637Q2706n7447l1123K13855L51676K13289K4223l5403r6132
$$ plain form
38144 306614 447752 604234 764205 802555 711342 652345 690474 682012 544925 428574 452111
38133 452111 463533 264592 -58762 -245530 -227078 -200083 -359402 -684243 -965483 -974219
38123 -974219 -663397 -255011 -39678 -53206 -76576 19095 120520 128895 133303 196326 201805
38112 201805 101820 91698 302319 518465 490807 366674 472934 766536 874206 679489
38102 679489 505515 610476 805396 752884 441181 158094 97805 178204 230169 229233 284870
38091 284870 451100 620539 640549 493409 289954 110458 -33824 -78497 95812 469092
38081 469092 817904 944101 869378 730636 605357 522271 501529 477288 323368 69160
38071 69160 -69060 -423 82283 24836 -6287 207568 559244 772533 796756 761353 665221
38060F65221k28785k26489k3643O4186j48530l27772j33824J89514J91951n8597
38050c6768j24560P5277J97561Q5900l6527k8817m5796j72240k18347n3917J38865
38039b19369J34984j5320j10678r1791m9895l5668r63R5841K09776K44237J58157
38028C19311L6596O013N5219L0932j22927k33290j25740J06837K11897R4487j17216
38017B62119k72419l15243k42639r7869J3714L4090M8039J41362K16156J12404
38007a00286j15384k26482j12766P4448J51075J11228O1719O1513Q7303Q8720
37997H1088L8920l1856n9855m2207n6868j25261j36969k2677Q2497J5740j24406
37986c81854p4764J89561L58440J85277j74317l51466k01150P8047K20672J65463
$$ plain form
38060 665221 436436 209947 186304 250490 101960 -225812 -359636 -170122 21829 -36768
38050 -36768 -161328 -86051 111510 197410 160883 132066 86270 -85970 -304317 -358234 -219369
38039 -219369 -84385 -99705 -210383 -302174 -352069 -387737 -388700 -292859 -83083 161154 319311
38028 319311 355907 361920 417139 448071 325144 91854 -33886 72951 284848 379335 262119
38017 262119 -10300 -325543 -568182 -666051 -652337 -618247 -570208 -428846 -212690 -100286
38007 -100286 -215670 -442152 -554918 -480470 -329395 -218167 -156448 -94935 -7632 81088
37997 81088 120008 88152 28297 -13910 -70778 -196039 -333008 -355685 -273188 -257448 -381854
37986 -381854 -456618 -267057 91383 276660 102343 -249123 -450273 -372226 -151554 13909
37976A3909K6939j05571k40128l55783l20455m9862K91291M02220J99234q3226
37966b21432k11133k18111k37448k22084l3862K66584M37989L60489J39031r5714
37956c5691l01953m15850l32271r4077O7722K5683l1896J43711M55892N23493
37946D763J90803k10766k55583L0881K23740Q0667j63028j81682k3252K9439q0471
37935c54489j48506r3179o8871j39952j31675N9182K45202K20314P1321K8690
37925c11963J37914K54997K64756J51250m5188j99160j40645J28046L61902L56141
37915I58050J81234P917j40800k92776l51946k40504q0698j4923J9167J06376
37905A51097J14083p3067k30475o8699K55518K98064j6433k91635k59225r6314
$$ plain form
37976 13909 40848 -64723 -304851 -660634 -981089 -1030951 -739660 -337440 -138206 -221432
37966 -221432 -432565 -650676 -888124 -1110208 -1144070 -877486 -439497 -79008 60023 -35691
37956 -35691 -337644 -753494 -1085765 -1179842 -1112120 -1086437 -1118333 -974622 -518730 4763
37946 4763 195566 -15200 -270783 -239902 -16162 64505 -98523 -280205 -303457 -274018 -354489
37935 -354489 -502995 -596174 -665045 -804997 -936672 -877490 -632288 -411974 -340653 -311963
37925 -311963 -174049 80948 345704 496954 451766 252606 111961 240007 601909 958050
37915 958050 1139284 1147201 1006401 713625 361679 121175 40477 25554 44721 151097
37905 151097 265180 192113 -38362 -107061 148457 446521 430088 138453 -120772 -217086
37895b17086l6557k7989M5648J03135L4905q5415j42097j48624j28910j3310J91830
37884d24470L02293J85065m6779j97173k06466j03453Q7685K61767K33532r452
37874H2549k06180j47337L4104P8132j9906n1299N6534J44688P1479j00908j93340
37863b51484j01112J01904K16136J18341p2422j22334N369J06013M7772m4715
37853C468j9282O8251R3778Q4061J17264J28795J5553j48432j93669r9983J1962
37842F1766Q2436J34246J37010L2343j18046j72019r5941J7613J00375J40638
37832C20421R9027m5027j76633j46385K600P3313k62p6426n0256N262J7784O2532
37820H5950K04913L27234K70703Q3805k2094N1923J88024K32924J73453Q8120
$$ plain form
37895 -217086 -253643 -281632 -235984 -132849 -97944 -183359 -325456 -474080 -602990 -616300 -424470
37884 -424470 -122177 62888 16109 -181064 -387530 -490983 -403298 -141531 92001 82549
37874 82549 -123631 -270968 -236864 -158732 -178638 -229937 -173403 -28715 42764 -58144 -251484
37863 -251484 -352596 -250692 -34556 83785 11363 -110971 -105602 411 48183 3468
37853 3468 -15814 52437 146215 230276 347540 476335 491888 343456 149787 49804 61766
37842 61766 144202 278448 415458 447801 329755 157736 61795 79408 179783 320421
37832 320421 419448 374421 197788 51403 54003 127316 127054 50628 372 5634 23418 85950
37820 85950 290863 618097 888800 972605 950511 1002434 1190458 1423382 1596835 1684955
37810A684955O355j09366k71501m25820n04555m72442l15711n0713K18712L18620
37800G8534J69256q3001j86339n3445J55451K32193J29996m7721j81700k06525
37790F699j13376M2047J57530J60728O5361n4271j18052q1047K1978P6701M700
37779A68998j22411j64871j00921k2990M1703J52188K72965K62003J19977N6684
37769F63325J67899K23627j8796m14653n79145l81390p1831P4016M0779k1016
37759c17185o606P5280J37911R5505k1633o7420J3937O6554m2846j63740o0240
37748b90483J83393K36650K2481j52336o1711J25046J51834N0208q305l2955j29520
37737I4302k27701j60514M6967K04430K29984J79171N2160j73063l34551k09103
$$ plain form
37810 1684955 1691310 1581944 1310443 884623 380068 -92374 -408085 -458798 -240086 78534
37800 78534 247790 164789 -21550 -74995 80456 312649 442645 394924 213224 6699
37790 6699 -106677 -64630 92900 253628 318989 264718 146666 65619 87597 164298 168998
37779 168998 46587 -118284 -219205 -242195 -200492 -48304 224661 486664 606641 663325
37769 663325 831224 1054851 1036055 621402 42257 -339133 -410964 -336948 -296169 -317185
37759 -317185 -323791 -248511 -110600 -15095 -36728 -104148 -90211 -23657 -66503 -230243 -290483
37748 -290483 -107090 129560 152041 -295 -62006 63040 214874 265082 256777 223822 94302
37737 94302 -133399 -293913 -246946 -42516 187468 366639 418799 245736 -88815 -297918
37727b97918J01539K01509m8247k79389j24459K45914L72222J51757q5350j03452
37717A34126l2848m6205o4126M2053J65650J11171p9650j68078n6634R6944J18179
37706B20582J9506p2075p4219J1781J32525K05109J73037P5092N449p862j6821
37695F72104m0029l2147M087j6607j22327k07924j84212j19991j30903j90552
37685c68501j71655l7399J28698K58720L33439K87432M5364k87860m21610j93202
37675d26574J84564L22207Q8555k55814l69429j84870P7999J77090O5974j10226
37665d30524j64621j6745K50419M55229M64470K98450Q8026o4780j59346k36291
37655D84287k89937k67325j34803P1485K48289K82490J46163n5548j77623j89786
$$ plain form
37727 -297918 -196379 5130 -43117 -322506 -446965 -201051 171171 322928 237578 134126
37717 134126 101278 55073 -9053 33000 198650 309821 230171 62093 5459 102403 220582
37706 220582 240088 168013 93794 105575 238100 443209 616246 691338 696787 688925 672104
37695 672104 632075 599928 604015 587408 465081 257157 72945 -47046 -177949 -368501
37685 -368501 -540156 -577555 -448857 -190137 143302 430734 476098 188238 -233372 -426574
37675 -426574 -242010 80197 168752 -87062 -456491 -641361 -563362 -386272 -320298 -430524
37665 -430524 -595145 -611890 -361471 93758 558228 856678 944704 879924 720578 484287
37655 484287 194350 -72975 -207778 -136293 111996 394486 540649 485101 307478 117692
37645A17692j79848j86809j26130N1978K21486K13536M0820j31776k09617k29952
37635d18620k14336j13379O2881J91830J84442R3410J8159j6255l0897k1681K0998
37624b43448P5112J13639J23638Q5145l330p6020o6007k0959l9057q5850k4089
37613a61226J44875K40883J67525L5406n9252j73209l03182k58389M0302L16885
37603i382K62898j9723j78094j17824m1038k4769P9592K76884L09360N8846k10261
37592C86489k06399n559J11364O1318q837P966P2556J09350O6884q5176k84102
37581B25854l50797j78885R1768K27842J94553J46519J49472R2253q1186k19574
37571B97819j55551M9040J76066J32381L8846K7994O3641L3999m4776l7832R1458
$$ plain form
37645 117692 -62156 -248965 -375095 -323117 -101631 111905 152725 20949 -188668 -418620
37635 -418620 -632956 -746335 -683454 -491624 -307182 -213772 -195613 -211868 -242765 -264446 -243448
37624 -243448 -168336 -54697 68941 154086 150756 74736 8729 -12230 -51287 -137137 -161226
37613 -161226 -16351 224532 392057 427463 368211 195002 -108180 -366569 -326267 -9382
37603 -9382 253516 233793 55699 -62125 -103163 -127932 -48340 228544 537904 596750 386489
37592 386489 180090 174531 285895 347213 338376 346342 418898 528248 595132 509956 225854
37581 225854 -124943 -303828 -212060 15782 210335 356854 506326 598579 517393 297819
37571 297819 142268 191308 367374 499755 538601 566595 630236 664235 619459 581627 673085
37560F73085J97092J54099M8053L9918J02448N2807j53602l34023l39856k50465
37550A89556k04721j75620n9805J00666J59060Q9743Q006l1613r2920j82242j76039
37539c75929j0197J78335K11755J01972J0454J9520N7026M4274J4028M2721J28169
37528D22128J84598J41819K3765p1758p5100k9472m4762j44977k09838j28614
37518F7789L1275J08296P9266P3152J30522J13591m8280j79246r4229R2113J14778
37507D89027k9552p5452P4683J72404N619k69231l68799k84522k11197j92091
37497f89111j03810M7682R4891J1361n942J42819K68743J71348m6326j09385P2760
37486a44970L34575M75157M07676J43460k07496m30744l65873j09385O8577N3608
$$ plain form
37560 673085 870177 1024276 1072329 1112247 1214695 1267502 1113900 779877 440021 189556
37550 189556 -15165 -190785 -250590 -149924 9136 98879 106885 75272 -17648 -199890 -375929
37539 -375929 -386126 -207791 3964 105936 116390 135910 192936 237210 251238 293959 422128
37528 422128 606726 748545 772310 700552 625452 595980 551218 406241 196403 67789
37518 67789 99064 207360 286626 359778 490300 603891 555611 376365 282136 374249 489027
37507 489027 459475 384023 458706 631110 636729 367498 -1301 -285823 -497020 -689111
37497 -689111 -792921 -745239 -650348 -638987 -644929 -502110 -233367 -62019 -108345 -217730 -144970
37486 -144970 189605 664762 1072438 1215898 1008402 577658 211785 102400 170977 224585
37476B24585N544Q0696J74547Q3351j58464k84686j49252Q6403J78993R1747l3932
37465B99532r7144j05643q3485m7710o0859j71194k85834k36674k0130J50933
37455f58208J11529m2121j02420l0745L7999K7472J4590P3443J39139R5452n1108
37444c84978j53683r2453P1729J52766O4677n6588k2628J47137K45038J68007
37434A39024N8811P9928J60163R5312j50282l73125l68776j57177N0929P4309
37424c90884o1674j68067j28251m5869o7895j11175M0490L38155M16895R5331
37414h2944k94022l16136k1340J70550Q8307k1680M3977J50177J12439J4016L8118
37403a18538J48241J43992k9942j99814j89384k7058J02320P2949m8222j04648
$$ plain form
37476 224585 230129 310825 485372 568723 410259 125573 -23679 62724 241717 333464 299532
37465 299532 202388 96745 13260 -34450 -95309 -266503 -552337 -789011 -809141 -658208
37455 -658208 -546679 -588800 -691220 -721965 -683966 -656494 -641904 -568461 -429322 -333870 -384978
37444 -384978 -538661 -631114 -559385 -406619 -341942 -398530 -421158 -274021 -28983 139024
37434 139024 197835 277763 437926 533238 382956 9831 -358945 -516122 -465193 -390884
37424 -390884 -452558 -620625 -748876 -794745 -862640 -973815 -933325 -595170 -178275 -82944
37414 -82944 -376966 -693102 -714442 -543892 -455585 -477265 -433288 -283111 -170672 -156656 -118538
37403 -118538 29703 173695 143753 -56061 -245445 -272503 -170183 -97234 -145456 -250104
37393b50104o4441m0156o7257p908K04598L64656K41309n5677j93741p2431Q4927
37382A43775J02333N7988O3232P6875L6804k7111j04135k31850l32575k41874
37372d56538p622Q0008q5225k06620j1428L02287L21014r31k96704k86236o8817
37361g16812R8924J09484L0077l5514l6283J0785N2878O1115M6098J7659j1340
37350c72929J5308J30573K27247J49518n7316j52965l5986R9868N6650q6328j29281
37339a55641m5489M7898R4477J05951O0448n0512j55822k08842k47220k40429
37329g95181n4502K65744L85020J03095k74579l02099j7303J43759O110j42798
37319f82734n2807J42675K14685J87141K06588K54317J89056j1658k02850k36397
$$ plain form
37393 -250104 -314545 -354701 -421958 -429866 -225268 139388 380697 325020 131279 58848 143775
37382 143775 246108 304096 367328 444203 481007 453896 349761 117911 -214664 -456538
37372 -456538 -464160 -384152 -469377 -675997 -687425 -385138 -64124 -65055 -361759 -647995 -716812
37361 -716812 -617888 -508404 -478327 -513841 -550124 -539339 -486461 -425346 -379248 -361589 -372929
37350 -372929 -357621 -227048 199 149717 92401 -60564 -96550 3318 59968 -26360 -155641
37339 -155641 -201130 -153232 -58755 47196 107644 57132 -98690 -307532 -554752 -795181
37329 -795181 -849683 -583939 -198919 -95824 -370403 -672502 -689805 -546046 -539936 -682734
37319 -682734 -735541 -592866 -378181 -191040 15548 269865 458921 447263 244413 8016
37309H016r9799Q6121J81506J60259J09370P4640l440j28115j53274m912J25496
37298C55868K6683j75777j69705O4793K10047Q5009j05859j00842O5658J75033
37288D30908J26322j1745j41367k10561k09423j65113j07506l4254M0914N1962
37278b29863j6169n6658J211N0767j0473o5863K6851J33593L8625j28238l3889
37267b90106K80178L75473Q0682k23377j76098O5056J48180L5774r7816k09410
37257a1464l04417k29641R3945L76874K65491j24252l13260r0209K59962L83722
37247C06751K52034O1115m5422n7302l3848m2053r4721j27083q1992L079M5816
37236A86374J3571p5842j75035j87382m1840J50135J61271l1243j63804o4768
$$ plain form
37309 8016 -91783 -5662 175844 336103 445473 520113 516673 388558 235284 230372 355868
37298 355868 382551 206774 37069 101862 311909 396918 291059 190217 255875 430908
37288 430908 557230 545485 404118 193557 -15866 -180979 -288485 -322739 -281825 -229863
37278 -229863 -246032 -302690 -301479 -250712 -261185 -327048 -300197 -166604 -127979 -256217 -290106
37267 -290106 -9928 365545 446227 222850 46752 111808 259988 295762 197946 -11464
37257 -11464 -315881 -545522 -451577 -74703 190788 66536 -246724 -336933 -76971 306751
37247 306751 558785 619900 574478 517176 483328 441275 346554 219471 137479 140558 186374
37236 186374 199945 124103 -50932 -238314 -280154 -130019 31252 9 -163795 -228563
37226b28563P3027O456j37796l8901L05396N31835L79200k8227l81959m84214
37216c746l35086j01692q890j12359j99358n9406K05080L20579K29481J09994
37206D4597N3908j5808j09129j22830p0100r3589j82606j37844Q3144K40874J74965
37195a34418N7898J07744K37632K00014m5202k99100l77141k41041L4295K74046
37185a85273K69998L506k48509j88907J42993M23892M29866K32214K3885j02251
37175H01414j62481j79441j43851m7659P7639J52141R4131r3607k94345l62814
37165a58873k40632P657K37248L03034J64102n8371j82886j65424j41836k30322
37155d66303l52973l23596q1439K25793L80528K83579L6229j28596m0493K27430
$$ plain form
37226 -228563 -155536 -149080 -286876 -325777 -20381 511454 890654 862427 480468 -3746
37216 -3746 -338832 -440524 -449414 -561773 -761131 -820537 -615457 -294878 -65397 44597
37206 44597 98505 82697 -26432 -149262 -219362 -312951 -495557 -633401 -550257 -309383 -134418
37195 -134418 -76520 31224 268856 468870 423668 124568 -252573 -493614 -459319 -185273
37185 -185273 84725 88231 -160278 -349185 -206192 217700 647566 879780 903665 801414
37175 801414 638933 459492 315641 267982 345621 497762 591893 498286 203941 -158873
37165 -158873 -399505 -391848 -154600 148434 312536 254165 71279 -94145 -235981 -466303
37155 -466303 -819276 -1142872 -1224311 -998518 -617990 -334411 -298182 -426778 -467271 -239841
37145b39841M01813K87298k6130k85194l57903l08166k13129m2966K14477M12201
37135a57540L60192P8199j80944k10306p1800L0629K8191J5701L4102q977j48414
37124b30967k43156j68298k3824n894j24732j99953j17625M9569J82063K40848
37114f41969K34606J79454J22868J05553P9756k3681j29504o1280J89147L69615
37104D24565K51008q1059l23111k97149j11643j042o6518j80533j42944N8850
37094d69576J97910R1440j26515j66487R279J44628Q6983p087K3310O1956n9523
37083b13682k26116j86691M5195J95595J25726m562n653R9489J70475J47769Q0022
37072B27567L6402L7982L0322o1098j90403j79578L1219K07770R6673j73328k28622
$$ plain form
37145 -239841 161972 449270 423140 137946 -219957 -528123 -741252 -784218 -569741 -157540
37135 -157540 202652 280851 99907 -110399 -182199 -151570 -123379 -107678 -73576 -82553 -230967
37124 -230967 -474123 -642421 -666245 -672139 -796871 -996824 -1114449 -1064880 -882817 -641969
37114 -641969 -407363 -227909 -105041 512 80268 56587 -72917 -134197 54950 424565
37104 424565 675573 594514 271403 -25746 -137389 -138431 -204949 -385482 -528426 -469576
37094 -469576 -271666 -180226 -306741 -473228 -463949 -319321 -232338 -239425 -216115 -154159 -213682
37083 -213682 -439798 -626489 -581294 -385699 -259973 -264535 -270188 -170699 -224 147545 227567
37072 227567 263969 301951 332273 271175 80772 -98806 -67587 140183 236856 63528 -165094
37061a65094j0358J08749j05023l56729k51583J05397K65483Q8977j07681p1633
37051d99495M8677J2616j21996j22359M7713J90142J57769Q535j18847j48238
37041e45483p0207P9194J97809J62872l2100k23071k19530k789K47659L25154
37031h0492J79304n9784k12229j93557n1426J04728J88649J72272Q4237m595k3417
37020A03690L4711R6616P9597k5485j56043k46122k66380k10873q7091O7086J76745
37009d33549J58751k0111k73947l90730j87959K47169N44981M16352J6158k02231
36999a25116k6964K67587K92294J4753k71022l34759j99388j793J46368J59993
36989g8047J9522j43714j37579N7745K54041K96119K23991J43665O6088l4371
$$ plain form
37061 -165094 -175452 -66703 -171726 -528455 -780038 -674641 -409158 -320181 -427862 -499495
37051 -499495 -450818 -438202 -560198 -682557 -634844 -444702 -286933 -278398 -397245 -545483
37041 -545483 -615690 -536496 -338687 -175815 -207915 -430986 -650516 -653305 -405646 -80492
37031 -80492 98812 39028 -173201 -366758 -418184 -313456 -124807 47465 131702 127107 103690
37020 103690 138401 235017 314614 289129 133086 -113036 -379416 -590289 -677380 -610294 -433549
37009 -433549 -274798 -294909 -568856 -959586 -1147545 -900376 -355395 60957 77115 -125116
36999 -125116 -152080 115507 407801 422554 151532 -183227 -382615 -384408 -238040 -78047
36989 -78047 -58525 -202239 -339818 -282073 -28032 268087 492078 635743 701831 667460
36979F67460j09093r8615l8987k296J1874K9279N542j09194k48722k86255j94719
36968c73726o1087L4549O8264M0564l226L7074J88358L07751K52365J04994N8202
36957F54082J00156L6030j56423k45928j16558L1044N710p5839l1680M9481m556
36946B45519q6483K1524K00015J03955k58187m48704k22096J34144K63672K16041
36936A69400K01008J62001n3581k89694k39051O7484K85313K53510J38049O7084
36926G61523l7826j95940k57885j88405j67189k49841k08377P7635L22267K05502
36916F1464j31576k71692j03563Q9823R6044K3082L0561O9833J6127j09661j83958
36905d13516j52232n9491L0846P9441P6986N4639N4287O8109N2169J0627O896
$$ plain form
36979 667460 558367 459752 420765 418469 430343 459622 465164 355970 107248 -179007 -373726
36968 -373726 -434813 -400264 -332000 -291436 -294662 -257588 -69230 238521 490886 595880 654082
36957 654082 754238 790268 633845 387917 271359 302403 308113 232274 200594 250075 245519
36946 245519 159036 180560 380575 484530 226343 -222361 -444457 -310313 -46641 169400
36936 169400 370408 532409 478828 189134 -49917 17567 302880 556390 694439 761523
36926 761523 723697 527757 269872 81467 -85722 -335563 -543940 -466305 -144038 61464
36916 61464 -70112 -341804 -445367 -355544 -259500 -236418 -205857 -136024 -119897 -229558 -413516
36905 -413516 -565748 -625239 -594393 -514952 -437966 -383327 -329040 -260931 -208762 -198135 -191239
36894a91239O8491J36100J39148Q1610K2250k529q333k6702n6229n6454p44P2234
36882A77603R6235P2157P1832J22328J48106P9243l3893p9841k9127M4061O4881
36871G33585K7893k8619p7505j25768j85667k16081j33297N8284J92451J16524
36861C61800p9792j63109q7470l9378j14014j70182j04738l5465n1450j1834J84164
36850c11468L29744J92129q7788j80612n2385M6264O563m5979n8820j24297k19896
36839e06545j79191K0953K00308K41578J78211K1698k14265l25774j04042K49532
36829d17537K74218q0488l24984j34152K03582K77616J40041R3665J80796K20058
36819D32815J52448M2452j02438k41640k04975L9447K02240N6858j68015j15858
$$ plain form
36894 -191239 -122748 13352 152500 234110 256360 253831 245498 218796 162567 106113 105369 177603
36882 177603 273838 345995 417827 540155 688261 767504 733611 653770 624643 668704 733585
36871 733585 761478 732859 655354 529586 343919 127838 -5459 52825 245276 361800
36861 361800 282008 118899 31429 -7949 -121963 -292145 -396883 -432348 -483798 -495632 -311468
36850 -311468 18276 210405 122617 -57995 -110380 -64116 -57553 -103532 -162352 -286649 -506545
36839 -506545 -685736 -664783 -464475 -222897 -44686 -22988 -237253 -563027 -667069 -417537
36829 -417537 -143319 -223807 -548791 -682943 -479361 -201745 -61704 31961 212757 432815
36819 432815 585263 627715 525277 283637 78662 118109 320349 377207 209192 93334
36809I3334J29065J83689j2155j25693J2672J66621R5760j08899k18461j73212
36799D2721p7291l7023q3761j53016j20750L9968J71790J27366q381m6164K2637
36788a21904N1644p259p3812j13218j36160p7594J00384K31749J24169j07469
36778a29470j48845O3215K58601K32827P0948p6808j85781k41773j73041o467
36768c36594J00533P8368K5226M629m7575j41744j55065k6044J41757K49236L06987
36757A99714L07808J84893k0305j37663j09055o8630r4464p7817M6556J35273
36747C66310M7256j37684k47728k25971r4135J29924L46631L67408J50510q7392
36737F15129j44975r3093j03153j51031q7713P5953J57325O4822p4431o9973J23466
$$ plain form
36809 93334 222399 406088 393933 268240 280912 447533 543293 434394 215933 42721
36799 42721 -34570 -71593 -155354 -308370 -429120 -389152 -217362 -89996 -98377 -144541 -121904
36788 -121904 -70260 -77519 -151331 -264549 -400709 -478303 -377919 -146170 -22001 -129470
36778 -129470 -278315 -215100 43501 276328 347276 270468 84687 -157086 -330127 -336594
36768 -336594 -236061 -157693 -132467 -127838 -175413 -317157 -472222 -498266 -356509 -107273 199714
36757 199714 507522 692415 672110 534447 425392 356762 262298 184481 231037 366310
36747 366310 413566 275882 28154 -197817 -291952 -162028 184603 552011 702521 615129
36737 615129 470154 377061 273908 122877 35164 111117 268442 333264 258833 188860 312326
36726C12326L52782L93972J69687j51116l30162l18656k43528j80354j06295n4227
36716a55571r2518j33032o302K16968K49667L0845j40123n7520R2243Q4033K0193
36705A08883Q2972J77932J41892J01135K65207N02736M93407K32685L5942P3474
36695B216265K37207M54909P71912J052519R44848L16549m89687r89781j011995
36686C502746p33573m20935k40833k12088k31465j91628j13594j09023k06700
36677A042907k95584k57674j00121N1073O3751n7723j32231r6K18103K24550k8263
36666G28692k31995j84296j02160k28367l68479j87138J91406L14991R2190r4661
36656f9817j6973Q9637j1086j65740j33734J3928O1573J4356M0517J65135K38798
$$ plain form
36726 312326 665108 1059080 1228767 1077651 747489 428833 185305 4951 -101344 -155571
36716 -155571 -248089 -381121 -387423 -170455 79212 110057 -30066 -87586 4657 88690 108883
36705 108883 191855 369787 511679 612814 878021 1380757 1874164 2106849 2142791 2216265
36695 2216265 2453472 2908381 3680293 4732812 5677660 5994209 5504522 4514741 3502746
36686 3502746 2769173 2348238 2107405 1895317 1663852 1472224 1358630 1249607 1042907
36677 1042907 747323 489649 389528 440601 504352 446629 314398 314302 532405 756955 728692
36666 728692 496697 312401 210241 -18126 -386605 -573743 -382337 -67346 24844 -69817
36656 -69817 -86790 2847 -8239 -173979 -307713 -293785 -232212 -217856 -177339 -12204 226594
36645B26594J59625j8734j65882j83330q2219K1693O2371J40365L44800N10826
36635A016109L87693M5542j65009j13728n1665j63938k78278k06692q6345j22748
36625B60941k21589j64239J0927Q8540L0240j5061J7637O4037J01100J51406J64714
36614D88653Q4622j5230l1378k574j6517k7900M9278J51259J57726R2986L8563
36603I69488n8075k58993m11537l18748q3464j04j16375j85662p4440O7004J00401
36592c70505R9703J57828K16241J92764R8717m9213k54330m13829l62871j20558
36582h06053R7261J77952K18583K67262K11612M7425l991J58580K75636P4009
36572G18276l01933m56949k50791Q3974K67009K19705L9748j01294p3327O4272
$$ plain form
36645 226594 386219 367485 201603 18273 -63946 -42253 20118 160483 505283 1016109
36635 1016109 1403802 1449344 1284335 1170607 1118942 955004 676726 470034 383689 260941
36625 260941 39352 -124887 -113960 -25420 4820 -10241 7396 71433 172533 323939 488653
36614 488653 573275 558045 526667 524093 507576 479676 528954 680213 837939 930925 969488
36603 969488 911413 652420 240883 -77865 -161329 -161433 -277808 -463470 -537910 -470906 -370505
36592 -370505 -270802 -112974 103267 296031 394748 345535 91205 -322624 -685495 -806053
36582 -806053 -708792 -530840 -312257 -44995 166617 214042 210051 368631 644267 718276
36572 718276 416343 -40606 -291397 -207423 59586 279291 319039 217745 144418 208690
36562B08690R3178o4003j83662m3130K31039L22286J46908j00037k52243k89575
36552F9451j98733J8829K01353J48982p0723j74939o8195M4316Q764n8509j2047
36541i1451Q7058J15685Q3578M4214k2176r7053n7276J24657K59146J81309j2511
36530F15180j30391j59119j94022k12740j28330P199N9969L4005M5596J06773
36520D4120J15893N3220J7210N9173J21823J43343J04429l997j38927j78019p6960
36509B61308Q61j14946l15666l27123r0594J77899L07793L29940K86168J22639
36499F38279j40102l31201l30632j98556l7808J10395J81893J02600l1544k692
36489c9368J86174K42200J9183k00637r6165J94959K57363r442k76164k67080
$$ plain form
36562 208690 301868 237865 54203 11073 242112 564398 711306 611269 359026 69451
36552 69451 -129282 -110453 90900 239882 169159 -5780 -73975 -29659 -20895 -79404 -91451
36541 -91451 -4393 111292 194870 239084 216908 119855 62579 187236 446382 627691 615180
36530 615180 484789 325670 131648 -81092 -209422 -202223 -142254 -108249 -62653 44120
36520 44120 160013 213233 230443 289616 411439 554782 659211 655214 516287 338268 261308
36509 261308 262169 147223 -168443 -495566 -586160 -408261 -100468 229472 515640 638279
36499 638279 498177 166976 -163656 -362212 -400020 -289625 -107732 -5132 -36676 -39368
36489 -39368 146806 389006 408189 207552 111387 306346 563709 554267 278103 11023
36479A1023r5158k8919j15491j72194o8748J09151J91674J56079J51582K65023
36469D04022L46108J90482j37164l36478k56798p0124Q616j1887k3555l0017p5304
36458G901j03084n8082j8657o6704j26594r2248j3218P784j612K5674L1051m7070
36446d54859q3453P7025L33231M20577K60832K2550j38973k11410k17535j61004
36436a53019p5035J2731J23499K17529J50932r2567k63835j65251K8285L2450
36426a84281r1896p3829P7173J00569k9209n4755R0150J62713O1244M047J12470
36415A74396J77819L9425j20639q4649N6732Q9333m561j08220j69687j71983p9956
36404b01990M2607M3688p3131j17471k6004K8948m5967j07408o2231l0223p2581
$$ plain form
36479 11023 -84135 -113054 -228545 -400739 -469487 -360336 -168662 -12583 138999 404022
36469 404022 750130 940612 803448 466970 210172 140048 148664 136777 113222 83205 7901
36458 7901 -95183 -153265 -171922 -238626 -365220 -457468 -470686 -462902 -464514 -438840 -407789 -454859
36446 -454859 -538312 -461287 -128056 292521 553353 575903 436930 225520 7985 -153019
36436 -153019 -228054 -215323 -91824 125705 276637 184070 -79765 -245016 -216731 -184281
36426 -184281 -276177 -350006 -272833 -172264 -201473 -256228 -166078 -3365 57879 61926 174396
36415 174396 352215 391640 271001 186352 243084 332417 327856 219636 49949 -122034 -201990
36404 -201990 -159383 -115695 -188826 -306297 -332301 -303353 -349320 -456728 -518959 -549182 -621763
36393f21763n6124N0180O9319j1134O7042L29605L75126J8224k82648q0889L32968
36382A89906L82244R2402n5348M1497M7898j20129j76991n7541l8800j81368j87764
36371f3994M4191K20849J71053J02125J47120J02442j44348l31714k46090p6168
36361g4534n9041q7702K2163J49123Q0185j01981j65159r9475m8957j2736R2670
36350c05444J81189R9055p7267j03537R0120L20715L93487K59497j6642k84105
36340E57068l57863k07082l7729l6244j09362n6067Q7564J07018k6027j05420
36330a84144l9360l37j21789k49180j60966Q7880K35121J81757J04836J60773
36320A4591K40360J47272p3895j73346o1701N3674j3999j53278j58044o9535q1873
$$ plain form
36393 -621763 -677887 -627707 -558388 -569522 -502480 -172875 202251 220475 -62173 -143062 189906
36382 189906 572150 664552 609204 650701 698599 578470 401479 343938 305138 123770 -63994
36371 -63994 -19803 201046 372099 474224 621344 723786 579438 247724 1634 -74534
36361 -74534 -133575 -221277 -199114 -49991 30194 -71787 -236946 -336421 -385378 -398114 -305444
36350 -305444 -124255 -25200 -102467 -206004 -115884 204831 598318 857815 841173 557068
36340 557068 199205 -7877 -45606 -81850 -191212 -247279 -159715 -52697 -78724 -184144
36330 -184144 -223504 -223841 -345630 -594810 -755776 -667896 -432775 -251018 -146182 14591
36320 14591 254951 402223 328328 154982 93281 146955 132956 -20322 -178366 -247901 -329774
36309c29774j79382j48051L4224J06128o6134k31610r3309K60408M67550L47331
36299A67381N9699j47200j85899j24509n8838l0490j8239J8398Q7884J66980K26861
36288A62028K20557R4684j03250j89461n2576J45780J54921m670q2211l768K7408
36277C69442q8179j49501r39J75603J39204k8156o6396O5834J84969J90430J50106
36266I42417J23780R4855M6821l9961k06360l94620m16098k03914K5247O3665
36256C5832L3199J52903L04691J72820k12047m31916k57469N4267J63871P2845
36246H8996k4237p5096j41106j83896r7862J02665K77871L11327J85901k0893
36236D23670j54611r6539O5082Q8235j04942k83851k09864K8476J46333N8195
$$ plain form
36309 -329774 -509156 -657207 -622983 -516855 -582989 -814599 -907908 -647500 -179950 167381
36299 167381 227080 79880 -106019 -230528 -289366 -319856 -338095 -319697 -231813 -64833 162028
36288 162028 382585 477269 374019 184558 131982 277762 432683 428013 345802 342034 369442
36277 369442 281263 131762 130823 306426 445630 417474 351078 416912 601881 792311 942417
36266 942417 1066197 1161052 1207873 1167912 961552 566932 150834 -53080 -27833 35832
36256 35832 69031 221934 526625 699445 487398 55482 -201987 -147720 16151 88996
36246 88996 64759 -10337 -151443 -335339 -433201 -330536 -52665 258662 444563 423670
36236 423670 269059 172520 237602 325837 220895 -62956 -272820 -244344 -98011 -39816
36226c9816m7419j9422N4284J5170j29326k29107j82980k6799J36333K24355K02027
36215d2700Q2435o5272j41871j03166k5566l8872j62245k51343j66473L9496J83757
36204f91820J91127J62485J84481J94238J11632P18k4107J5824J9110N466P5296
36193B44450J56273J5661l60211o06173m13381J0430J90870M1477n4047J38929
36183f35722L49067K45368m9474j76376p5006K3406K3331M0530R1887N3681n0146
36172a59454m5627N3774L8323q6356l7661K40654L77384J20671k36178k84833
36162a9303q6179L4931N4539J79788L41154K19538k05092n34398m73541j64941
36152f53504Q7094J57531Q3049m8649j00624R231J41068Q3842q9709q3577J38683
$$ plain form
36226 -39816 -87235 -106657 -52373 -37203 -166529 -395636 -578616 -605415 -469082 -244727 -42700
36215 -42700 39735 -25537 -167408 -270574 -296140 -335012 -497257 -748600 -915073 -875577 -691820
36204 -691820 -500693 -338208 -153727 40511 152143 152861 128754 144578 163688 169154 244450
36193 244450 400723 416384 56173 -550000 -963381 -952951 -762081 -720604 -774651 -635722
36183 -635722 -286655 -41287 -90761 -267137 -342143 -318737 -295406 -254876 -162989 -109308 -159454
36172 -159454 -205081 -151307 -112984 -199340 -237001 3653 381037 501708 265530 -19303
36162 -19303 -105482 -70551 -16012 163776 504930 724468 519376 -15022 -488563 -653504
36152 -653504 -566410 -408879 -325830 -374479 -475103 -465872 -324804 -240962 -330671 -414248 -275565
36141b75565K37337J1003k60099k08858J03122L20933K94696J77439J04959L1130
36131E36097j09280k52364k71740j25289P6523J49782M8637k2155J50453M32072
36121F12736M44044Q9533k71173l09942j41962m0314O985J46578K60542J08012
36111I05039k11346l29555j57852N961k3148q1628m8393j00014l38365m75000
36101h54301k18149K21936L73243J56492n1505k66J31896J07487K176K2883J51533
36090D3425J85838M3008j55008k54315j93355j771J98306K38298Q6389n8022l286
36079A29507J41764J04511j31553k77837j74670l2647r2839k52129k43040m7022
36069h75955J19788J62756J97069K85184L21663K31773R6936J3360k6909n6269
$$ plain form
36141 -275565 -38228 -27225 -287324 -496182 -393060 -72127 222569 400008 504967 536097
36131 536097 426817 174453 -97287 -222576 -146053 3729 52366 30211 180664 612736
36121 612736 1056780 1146313 875140 565198 423236 382922 389907 536485 797027 905039
36111 905039 693693 364138 206286 212247 189099 107471 59078 -40936 -379301 -854301
36101 -854301 -1072450 -850514 -477271 -320779 -372284 -372550 -240654 -133167 -130991 -108108 43425
36090 43425 229263 272271 117263 -137052 -330407 -332178 -133872 104426 190815 132793 129507
36079 129507 271271 375782 244229 -33608 -208278 -240925 -333764 -585893 -828933 -875955
36069 -875955 -756167 -593411 -396342 -111158 210505 442278 539214 552574 525665 469396
36059D69396p0184r7469j90616k84978k13701M8823K86949K92661J16031l3770
36049C23142n5161k1712m2905j43328k42419k10217l979K23287K45985L9427j77813
36038f5693k22769j38674m1218O2093J73413J78821P898j76985j52916M4718J65000
36027a66312R1397l2183m6719J6381L5675j7435p1932o2484J2333R2390R3474
36016e5415q264j15407r0494P4775K16644J64624o1754k48029j94898O5395K96398
36005D3575L27115K33426J72716J16724p4054l29089l65277r8645J69380J48506
35995C44377m6582j22087p3211j37706l42366m00932j17930L33012O18036N75503
35985F30114K83506o3930k86081l21602k47682j45202m71J62668J72093o3181
$$ plain form
36059 469396 399212 301743 111127 -173851 -387552 -338729 -51780 240881 356912 323142
36049 323142 267981 246269 203364 60036 -182383 -392600 -396579 -173292 72693 112120 -65693
36038 -65693 -288462 -427136 -468354 -406261 -232848 -54027 -46129 -223114 -376030 -331312 -166312
36027 -166312 -74915 -107098 -153817 -137436 -101761 -119196 -191128 -253612 -241279 -148889 -55415
36016 -55415 -63679 -179086 -269580 -194805 21839 186463 124709 -123320 -318218 -252823 43575
36005 43575 370690 604116 776832 893556 819502 490413 125136 26491 195871 344377
35995 344377 297795 175708 102497 -35209 -377575 -778507 -896437 -563425 54611 630114
35985 630114 913620 849690 563609 242007 -5675 -150877 -151348 11320 183413 120232
35975A20232k97320k00987J46562L23113J60081m9092l7166P1812O3608p550p339
35964B85954q741j01993j29784O1599K66747J75393j10180j84158N4040K61711
35954E70588J76015n3448j62721j23758n3901M57L5279J1025o2732r7271p1141
35943A68392o3290p2141J2889J69563J88715J646j55055r1508K2877n5948k20444
35932i4304j73905P7530K17152Q3573j51435k88410l00086j82658R7364M03629
35922c11550M52945J98285l8481M007J66457J43175o4358k16674k26207j97231
35912h9632j46585J5536K14364K06547n6847k88732k26881K2587J53793O4316
35902a31534p3218r3332l0982q335m2810m2254M7787J65422K18933K02189J71079
$$ plain form
35975 120232 -177088 -378075 -231513 91600 251681 202589 165423 237235 300843 293293 285954
35964 285954 277213 175220 45436 107035 373782 549175 438995 254837 308877 570588
35954 570588 746603 693155 530434 406676 352775 353232 388511 399536 336804 239533 168392
35943 168392 105102 32961 45850 215413 404128 405774 250719 159211 182088 126140 -94304
35932 -94304 -268209 -190679 26473 110046 -41389 -329799 -629885 -812543 -715179 -311550
35922 -311550 141395 339680 301199 305206 471663 614838 550480 333806 107599 -89632
35912 -89632 -236217 -220681 -6317 200230 143383 -145349 -372230 -349643 -195850 -131534
35902 -131534 -204752 -298084 -329066 -337401 -380211 -422465 -374678 -209256 9677 211866 382945
35891C82945J31115L1867j15472k09641j95288j38524j01978l7841J01118K30960
35881G9261K35996J31993J2386r3071j73043j44081J1626J05219k7214k11684
35871g2612j41007J22450J88943m8258k15748m8347J81008J06645j45166j90746
35861b62838j6921M6559r5051j76700n9760M5287l9419j81583k08288j78782j88285
35850a315781j31376R4385L16602K92073Q9832k185Q0279J07127l4523j33118
35840f36685J630K02930J79967l1434j08782P9638K88248K65252R4334R568L1136
35829C75802J658j01038j32624n7708j7998o8409o5325P4105J97308J54438M9204
35818D09413N8441J16248M074k84085m80148l69183k1809L24423M80515L83926
$$ plain form
35891 382945 514060 545927 430455 220814 25526 -112998 -214976 -252817 -151699 79261
35881 79261 315257 447250 459636 366565 193522 49441 61067 166286 139072 -72612
35871 -72612 -213619 -91169 97774 49516 -166232 -214579 -33571 73074 -72092 -262838
35861 -262838 -279759 -233200 -328251 -504951 -564711 -519424 -558843 -740426 -948714 -1127496 -1315781
35850 -1315781 -1447157 -1352772 -1036170 -744097 -654265 -656450 -576171 -469044 -503567 -636685
35840 -636685 -635055 -432125 -252158 -283592 -392374 -312736 -24488 240764 335098 344666 375802
35829 375802 377460 276422 143798 86090 68092 -317 -65642 8463 205771 360209 409413
35818 409413 467854 584102 588176 304091 -176057 -545240 -567049 -242626 237889 621815
35808F21815J07768j50257k04276p8540Q345q4625k39037k38424n6606J07207
35798b06630Q1036o8107j26926j4289J12726P3356q6939j65461q9573R577L0844
35787d50386M5295J21759J67946Q8279j8792K635J05848J06796k0626j04229m4541
35776a6M5674L1063m8348m9738P7084K34875K86697J83183m00j40917j79633j42047
35764B97477o8411N415J1314q6201j73625r5460P5188P6190j27191k02814O9328
35753b18790L99289L62924J8839k01464j41085p0932j79164k86613j90820J6425
35743d91391J41073J62385J52977J10564K6400k6158j1055j6703j07662j98066
35733b57636j73957m8986P6676J24768O4830o1027j12959J7536K25875K80754
$$ plain form
35808 621815 729583 579326 375050 296510 304855 220230 -18807 -257231 -313837 -206630
35798 -206630 -125594 -193701 -320627 -334916 -222190 -148834 -235773 -401234 -490807 -481230 -450386
35787 -450386 -405091 -283332 -115386 -27107 -45899 -43264 62584 169380 148754 44525 -16
35776 -16 45658 76721 28373 -21365 55719 290594 577291 760474 760074 619157 439524 297477
35764 297477 229066 234481 245795 159594 -14031 -109491 -34303 41887 -85304 -288118 -218790
35753 -218790 180499 543423 562262 360798 219713 148781 -30383 -316996 -507816 -491391
35743 -491391 -350318 -187933 -34956 75608 102008 75850 64795 48092 -59570 -257636
35733 -257636 -431593 -480579 -403903 -279135 -214305 -275332 -388291 -370755 -144880 135874
35723A35874J17207j01976k27098k51406j91034m3124R7314R1957j1111q685J41094
35712b50988K50941K08817J10322J9502j34680l21646l47609j70908j3255r86
35702f50490L4255K14358L47729K32648o972j27138j00525k5470R0086K20377
$$ plain form
35723 135874 253081 151105 -75993 -327399 -518433 -561557 -464243 -372286 -383397 -392082 -250988
35712 -250988 -47 208770 319092 338594 203914 -117732 -465341 -636249 -649504 -650490
35702 -650490 -616235 -401877 -54148 178500 171528 44390 -56135 -81605 8481 228858
$$ [...]
##END NTUPLES=NMR SPECTRUM
##END=
