##TITLE=31Pdec_AP2712-2
 CDCl3, 24 sc
 13.12.2024
##JCAMPDX= 6.0         $$ Bruker NMR JCAMP-DX V2.0
##DATA TYPE= NMR SPECTRUM
##DATA CLASS= NTUPLES
##ORIGIN= UXNMR, Bruker Analytische Messtechnik GmbH
##OWNER= root
$$ XWIN-NMR		Version 3.5
$$ Mon Jan 13 14:06:51 2025 Russian Standard Time (UT+4h)  she@DPX200
##.OBSERVE FREQUENCY= 81.013821
##.OBSERVE NUCLEUS= ^31P
##.ACQUISITION MODE= SIMULTANEOUS
##.ACQUISITION SCHEME= undefined
##.AVERAGES= 24
##.DIGITISER RES= 17
##SPECTROMETER/DATA SYSTEM= spect
##.PULSE SEQUENCE= zgpg30
##.SOLVENT NAME= CDCl3
##.SHIFT REFERENCE= (INTERNAL, CDCl3, 0, 198.062)
##AUDIT TRAIL= $$ (NUMBER, WHEN, WHO, WHERE, WHAT)
$$ ##TITLE= Audit trail, XWIN-NMR		Version 3.5
$$ ##JCAMPDX= 5.01
$$ ##ORIGIN= Bruker BioSpin GmbH
$$ ##OWNER= she
$$ F:/spectra/data/she/nmr/P31/2/pdata/1/auditp.txt
$$ ##AUDIT TRAIL=  $$ (NUMBER, WHEN, WHO, WHERE, WHAT)
(   1,<2025-01-13 14:05:45.76 +0400>,<she>,<DPX200>,
      <created by zg, POWCHK disabled, PULCHK disabled
       configuration hash MD5:
       00 E9 B6 7A A2 85 ED C7 34 08 36 98 17 FE 4E 26
       data hash MD5: 32K
       6A AC 4B D2 B9 F6 85 41 C6 61 3F 42 14 06 55 58>)
(   2,<2025-01-13 14:05:48.29 +0400>,<she>,<DPX200>,
      <Start of raw data processing
       efp BC_mod = 2 LB = 1.5 FT_mod = 6 PKNL = 1 PHC0 = 2028.692 PHC1 = 326.0856 SI = 64K 
       data hash MD5: 64K
       55 1A 20 8C 68 E8 71 4C E8 66 74 31 BC FB 7C AB>)
(   3,<2025-01-13 14:06:16.21 +0400>,<she>,<DPX200>,
      <pk PHC0 = 91.88762 PHC1 = -237 
       data hash MD5: 64K
       FE 78 CA 2B 67 61 59 0B 60 3D 00 8A 07 63 78 4B>)
$$ ##END=
$$ 
$$ hash MD5
$$ F0 23 1D 2D 99 B7 C7 01 24 05 59 43 F2 95 C4 B8
##$RELAX= 
##$RELAX= 
##$RELAX= 
##$RELAX= 
##$RELAX= 
##$RELAX= 
##$RELAX= 
##$RELAX= 
$$ Bruker specific parameters
$$ --------------------------
##$DU= <F:/spectra>
##$EXPNO= 2
##$NAME= <P31>
##$PROCNO= 1
##$TYPE= <nmr>
##$USER= <she>
##$AMP= (0..31)
100 100 100 100 100 100 100 100 100 100 100 100 100 100 100 100 100 100 
100 100 100 100 100 100 100 100 100 100 100 100 100 100 
##$AQSEQ= 0
##$AQ_mod= 1
##$AUNM= <au_zg>
##$AUTOPOS= <>
##$BF1= 81.014009
##$BF2= 200.13
##$BF3= 200.13
##$BF4= 200.13
##$BF5= 200.13
##$BF6= 200.13
##$BF7= 200.13
##$BF8= 200.13
##$BYTORDA= 1
##$CFDGTYP= 0
##$CFRGTYP= 5
##$CHEMSTR= <none>
##$CNST= (0..31)
1 1 145 1 1 1 1 1 1 1 1 1 1 1 1 1 1 1 1 1 1 1 1 1 1 1 1 1 1 1 1 1 
##$CPDPRG= <waltz16>
##$CPDPRG1= <>
##$CPDPRG2= <waltz16>
##$CPDPRG3= <>
##$CPDPRG4= <mlev>
##$CPDPRG5= <mlev>
##$CPDPRG6= <mlev>
##$CPDPRG7= <mlev>
##$CPDPRG8= <mlev>
##$CPDPRGB= <>
##$CPDPRGT= <>
##$D= (0..31)
0 1 0 0 0 0 0 0 0 0.06 0 0.03 2e-05 3e-06 0 0 0.0002 0 0 0 0 0 0 0 0 0 
0 0 0 0 0 0 
##$DATE= 1736762745
##$DBL= (0..7)
120 120 120 11 120 120 24 19 
##$DBP= (0..7)
150 150 150 150 150 150 150 150 
##$DBP07= 0
##$DBPNAM0= <>
##$DBPNAM1= <>
##$DBPNAM2= <>
##$DBPNAM3= <>
##$DBPNAM4= <>
##$DBPNAM5= <>
##$DBPNAM6= <>
##$DBPNAM7= <>
##$DBPOAL= (0..7)
0.5 0.5 0.5 0.5 0.5 0.5 0.5 0.5 
##$DBPOFFS= (0..7)
$$ [...]
##$SUBNAM2= <"">
##$SUBNAM3= <"">
##$SUBNAM4= <"">
##$SUBNAM5= <"">
##$SUBNAM6= <"">
##$SUBNAM7= <"">
##$SUBNAM8= <"">
##$SUBNAM9= <"">
##$SW= 400.765351723535
##$SWIBOX= (0..15)
0 1 3 0 0 0 0 0 0 0 0 0 0 0 0 0 
##$SW_h= 32467.5324675325
##$TD= 32768
##$TD0= 1
##$TE= 0
##$TE2= 300
##$TE3= 300
##$TEG= 300
##$TL= (0..7)
0 120 53 12 22 120 120 120 
##$TP= (0..7)
150 150 150 150 150 150 150 150 
##$TP07= 0
##$TPNAME0= <>
##$TPNAME1= <>
##$TPNAME2= <>
##$TPNAME3= <>
##$TPNAME4= <>
##$TPNAME5= <>
##$TPNAME6= <>
##$TPNAME7= <>
##$TPOAL= (0..7)
0.5 0.5 0.5 0.5 0.5 0.5 0.5 0.5 
##$TPOFFS= (0..7)
0 0 0 0 0 0 0 0 
##$TUNHIN= 0
##$TUNHOUT= 0
##$TUNXOUT= 0
##$USERA1= <user>
##$USERA2= <user>
##$USERA3= <user>
##$USERA4= <user>
##$USERA5= <user>
##$V9= 5
##$VALIST= <valist>
##$VCLIST= <CCCCCCCCCCCCCCC>
##$VD= 0
##$VDLIST= <DDDDDDDDDDDDDDD>
##$VPLIST= <PPPPPPPPPPPPPPP>
##$VTLIST= <TTTTTTTTTTTTTTT>
##$WBST= 1024
##$WBSW= 4
##$XGAIN= (0..3)
0 0 0 0 
##$XL= 0
##$YL= 0
##$YMAX_a= 20705
##$YMIN_a= -20924
##$ZGOPTNS= <>
##$ZL1= 120
##$ZL2= 120
##$ZL3= 120
##$ZL4= 120
##$ABSF1= 0
##$ABSF2= 0
##$ABSG= 0
##$ABSL= 0
##$ALPHA= 0
##$AQORDER= 0
##$ASSFAC= 0
##$ASSFACI= 0
##$ASSFACX= 0
##$ASSWID= 0
##$AUNMP= <proc_1d>
##$AZFE= 0.1
##$AZFW= 0.5
##$BCFW= 0
##$BC_mod= 2
##$BYTORDP= 0
##$COROFFS= 0
##$CY= -3
##$DATMOD= 1
##$DC= 0
##$DFILT= <>
##$DTYPP= 0
##$F1P= 0
##$F2P= 0
##$FCOR= 1
##$FTSIZE= 65536
##$FT_mod= 6
##$GAMMA= 0
##$GB= 0
##$INTBC= 1
##$INTSCL= 9.790993e-09
##$ISEN= 30
##$LB= 1.5
##$LEV0= 0
##$LPBIN= 0
##$MAXI= 10000
##$MC2= 0
##$MEAN= 0
##$ME_mod= 0
##$MI= 50
##$NCOEF= 0
##$NC_proc= -4
##$NLEV= 6
##$NOISF1= 182.463
##$NOISF2= 159.3651
##$NSP= 0
##$NTH_PI= 0
##$NZP= 0
##$OFFSET= 198.0616
##$PC= 4
##$PHC0= 2120.58
##$PHC1= 89.0856
##$PH_mod= 1
##$PKNL= yes
##$PPARMOD= 0
##$PSCAL= 0
##$PSIGN= 0
##$REVERSE= no
##$SF= 81.0140089999434
##$SI= 65536
##$SIGF1= 159.3651
##$SIGF2= -187.1042
##$SINO= 113.3802
##$SIOLD= 16384
##$SREGLST= <1H.CDCl3>
##$SSB= 0
##$STSI= 65536
##$STSR= 0
##$SW_p= 32467.5324675325
##$SYMM= 0
##$S_DEV= 0
##$TDeff= 32768
##$TDoff= 0
##$TI= <>
##$TILT= no
##$TM1= 0
##$TM2= 0
##$TOPLEV= 0
##$USERP1= <user>
##$USERP2= <user>
##$USERP3= <user>
##$USERP4= <user>
##$USERP5= <user>
##$WDW= 1
##$XDIM= 65536
##$YMAX_p= 527123506
##$YMIN_p= -1828355
$$ End of Bruker specific parameters
$$ ---------------------------------
##NTUPLES= NMR SPECTRUM
##VAR_NAME=  FREQUENCY,     SPECTRUM/REAL,   SPECTRUM/IMAG
##SYMBOL=    X,             R,               I
##VAR_TYPE=  INDEPENDENT,   DEPENDENT,       DEPENDENT
##VAR_FORM=  AFFN,          ASDF,            ASDF
##VAR_DIM=   65536,         65536,           65536
##UNITS=     HZ,            ARBITRARY UNITS, ARBITRARY UNITS
##FACTOR=    0.49542278885378, 1,            1
##FIRST=     16045.7642231865, 0,            0
##LAST=      -16421.768244346, 0,            0
##MIN=       -16421.768244346, -1828355,     0
##MAX=       16045.7642231865, 527123506,    0
$$ Real data points
##PAGE= N=1
##DATA TABLE= (X++(R..R)), XYDATA
$$ [...]
$$ plain form
41630 -67361 -123720 -177810 -196497 -116718 12579 32991 -128648 -350503 -456978 -405096 -272289
41619 -272289 -123297 23357 128994 134586 41932 -74294 -157041 -211266 -237245 -194107 -88562
41608 -88562 -37641 -142556 -316363 -348829 -173130 33852 81941 10675 3879 123264 254576
41597 254576 299629 285837 260294 200341 90802 -5181 -26730 4 22547 45238 83792
41586 83792 95709 37181 -48250 -72641 -9382 103322 228147 331355 356977 278730 159217
41575 159217 84068 50180 -11553 -113829 -185114 -165750 -73014 32346 97244 98180 55537
41564 55537 19060 8306 -4364 -15794 49382 230168 418961 450420 289656 57362 -117940
41553 -117940 -196326 -192853 -139549 -87320 -70753 -64562 -35003 -18147 -68697 -147773 -159402 -99309
$$ packed form
41630f7361n6359n4090j8687P9779J29297K0412j61639k21855j06475N1882J32807
41619b72289J48992J46654J05637N592r2654j16226q2747n4225k5979M3138J05545
41608h8562N0921j04915j73807l2466J75699K06982M8089p1266o796J19385J31312
41597B54576M5053j3792k5543n9953j09539r5983k1549K6734K2543K2691L8554
41586H3792J1917n8528q5431k4391O3259J12704J24825J03208K5622p8247j19513
41575A59217p5149l3888o1733j02276p1285J9364R2736J05360O4898R36m2643
41564E5537l6477j0754j2670j1430O5176J80786J88793L1459j60764k32294j75302
41553a17940p8386L473N3304N2229J6567O191K9559J6856n0550p9076j1629O0093
$$ plain form
41541 -99309 -66697 -112519 -172508 -175662 -127953 -58526 27522 103761 112713 47895 -22071 -48585
41529 -48585 -54141 -57426 -31260 14387 -10437 -158371 -336460 -393761 -295890 -152708 -80449
41518 -80449 -80385 -62089 28857 122941 99892 -35528 -115979 -20352 137829 147922 -1873 -116641
41506 -116641 -96303 -75931 -188736 -338270 -337858 -186496 -64416 -87321 -182335 -208980 -123383
41495 -123383 -10046 10801 -89296 -200416 -189132 -66782 20551 -12284 -89830 -110335 -79261
41484 -79261 -39001 34182 156128 233207 163280 2462 -88342 -49163 31633 65843 56385
41473 56385 34662 5091 -25784 -42033 -60371 -113593 -178232 -185094 -119616 -51287 -46363 -108362
41461 -108362 -215701 -347841 -448223 -433970 -292473 -117602 -131 72628 151815 208663
$$ packed form
41541i9309L2612m5822n9989l154M7709O9427Q6048P6239Q952o4818o9966k6514
41529d8585n556l285K6166M5647k4824j47934j78089n7301R7871J43182P2259
41518h0449O4J8296R0946R4084k3049j35420q0451R5627J58181J0093j49795j14768
41506a16641K0338K0372j12805j49534M12J51362J22080k2905r5014k6645Q5597
41495a23383J13337K0847j00097j11120J1284J22350Q7333l2835p7546k0505L1074
41484g9261M0260P3183J21946P7079o9927j60818r0804L9179Q0796L4210r458
41473E6385k1723k9571l0875j6249j8338n3222o4639o862O5478O8329M924o1999
41461a08362j07339j32140j00382J4253J41497J74871J17471P2759P9187N6848
$$ plain form
41451 208663 172167 78188 79312 256225 487544 581089 498424 367670 291665 245910 186071
41440 186071 146403 162705 182912 147550 99457 111672 152536 136420 74155 42007 17831
41429 17831 -100780 -298089 -413962 -365222 -251102 -173649 -98530 11012 62985 -21580 -136514
41418 -136514 -114793 32214 143902 144970 114242 130059 169668 172972 114084 4050 -104391
41407 -104391 -128782 -51769 18252 -28946 -140887 -162961 -53069 74933 127602 133017 132924 89238
41395 89238 -28758 -139864 -120095 46533 240041 317212 225911 29397 -148785 -209221
41385 -209221 -133121 24735 184189 281828 295186 250443 194161 142483 74342 -19812 -118257
41374 -118257 -210373 -311825 -411307 -453402 -412087 -330167 -241979 -115523 67637 231899 289392
$$ packed form
41451B08663l6496r3979J124J76913K31319R3545q2665j30754p6005m5755n9839
41440A86071l9668J6302K0207l5362m8093J2215M0864j6116o2265l2148k4176
41429A7831j18611j97309j15873M8740J14120P7453P5119J09542N1973q4565j14934
41418a36514K1721J47007J11688J068l0728J5817L9609L304n8888j10034j08441
41407a04391k4391P7013P0021m7198j11941k2074J09892J28002N2669N415r3m3686
41395H9238j17996j11106J9769J66628J93508P7171r1301j96514j78182o0436
41385b09221P6100J57856J59454R7639J3358m4743n6282n1678o8141r4154r8445
41374a18257r2116j01452r9482m2095M1315Q1920Q8188J26456J83160J64262N7493
$$ plain form
41363 289392 265143 253899 271978 236691 92298 -110024 -259109 -264254 -108333 123983 289248
41352 289248 309643 234539 137122 1675 -212550 -442286 -556249 -508842 -375811 -247386
41342 -247386 -160079 -117076 -97449 -57416 10433 49140 39773 74888 219011 346492 268299
41331 268299 7968 -204056 -226298 -144447 -83358 -43250 6972 21580 -30728 -76463 -48783
41320 -48783 -8047 -43885 -121685 -136649 -78107 -32399 -42120 -62183 -58891 -67077 -120146 -177344
41308 -177344 -160226 -49210 78692 120695 59895 -11896 -3850 62323 89014 33216 -52968
41297 -52968 -103329 -97189 -39574 47607 103479 71286 -10286 -26181 72196 205679 283918 317755
41285 317755 364430 416449 412208 331964 227597 165309 174118 241013 327039 389722 404105 362861
$$ packed form
41363B89392k4249j1244J8079l5287j44393k02322j49085n145J55921K32316J65265
41352B89248K0395p5104r7417j35447k14225k29736j13963M7407J33031J28425
41342b47386Q7307M3003J9627M0033O7849L8707r367L5115J44123J27481p8193
41331B68299k60331k12024k2242Q1851O1089M0108N0222J4608n2308m5735K7680
41320d8783M0736l5838p7800j4964N8542M5708r721k0063L292q186n3069n7198
41308a77344J7118J11016J27902M2003o0800p1791Q046O6173K6691n5798q6184
41297e2968n0361O140N7615Q7181N5872l2193q1572j5895R8377J33483P8239L3837
41285C17755M6675N2019m241q0244j04367o2288Q809O6895Q6026O2683J4383m1244
$$ plain form
41273 362861 265710 128461 -7681 -105015 -160687 -184174 -166131 -111674 -80455 -134157 -255355
41262 -255355 -374278 -457325 -501999 -470083 -325055 -136735 -42194 -73874 -121097 -100185 -69054
41251 -69054 -115115 -211684 -265617 -257425 -252064 -284748 -298561 -209636 -14562 177487 234763 139125
41239 139125 7711 -45423 -24070 20933 110890 285463 467296 507705 371329 164223
41229 164223 -26119 -199586 -342936 -401288 -395592 -438411 -563369 -646744 -574098 -396586 -251461
41218 -251461 -203180 -220984 -237699 -182656 -41590 70531 -4247 -250286 -449276 -435501 -283810
41207 -283810 -175140 -177926 -243107 -313109 -339609 -282057 -186662 -188804 -343593 -526008 -581648
41196 -581648 -499573 -364145 -235574 -161302 -190992 -276699 -274995 -163033 -122262 -265012 -415097
$$ packed form
41273C62861r7151j37249j36142r7334n5672k3487J8043N4457L1219n3702j21198
41262b55355j18923q3047m4674L1916J45028J88320R4541l1680m7223K0912L1131
41251f9054m6061r6569n3933Q192N361l2684j3813Q8925J95074J92049N7276r5638
41239A39125j31414n3134K1353M5003Q9957J74573J81833M0409j36376k07106
41229A64223j90342j73467j43350n8352N696m2819j24958q3375P2646J77512J45125
41218b51461M8281j7804j6715N5043J41066J12121p4778k46039j98990J3775J51691
41207b83810J08670k786o5181p0002k6500N7552R5395k142j54789j82415n5640
41196e81648Q2075J35428J28571P4272k9690q5707J704J11962M0771j42750j50085
$$ plain form
41185 -415097 -347566 -130698 -9649 -36011 -58577 -33194 -72214 -175930 -180775 -46378 33995
41174 33995 -84556 -287588 -383866 -348886 -274223 -204122 -143832 -131233 -181390 -227856 -215971
41163 -215971 -193757 -224067 -266246 -234884 -130969 -29302 32312 72992 100817 100361 83762
41152 83762 92371 137138 177906 176094 144160 125724 133731 130537 89982 64558 138922 300160
41140 300160 414896 382734 261683 180158 172113 178071 169668 173391 185240 163107 111493 85343
41128 85343 95886 91735 46581 -10801 -65945 -138468 -214833 -240890 -208563 -179253 -192728 -217451
41116 -217451 -218036 -208922 -211149 -211147 -189785 -146199 -79217 3654 54342 26271 -43227 -64850 -26148
41103 -26148 -11018 -67376 -134101 -132736 -58435 52793 166726 218863 130422 -70054 -212175
$$ packed form
41185d15097O7531K16868J21049k6362k2566K5383l9020j03716m845J34397Q0373
41174C3995j18551k03032r6278L4980P4663P0101O0290J2599n0157m6466J1885
41163b15971K2214l0310m2179L1362J03915J01667O1614M0680K7825m56j6599
41152H3762Q609M4767M0768j812l1934j8436Q007l194m0555k5424P4364J61238
41140C00160J14736l2162j21051q1525q045N958q403L723J1849k2133n1614k6150
41128H5343J0543m151m5154n7382n5144p2523p6365k6057L2327K9310j3475k4723
41116b17451n85R114k227KK1362M3586O6982Q2871N0688k8071o9498k1623L8702
41103b6148J5130n6358o6725J365P4301J11228J13933N2137q8441k00476j42121
$$ plain form
41092 -212175 -163411 -5916 54397 -59434 -214674 -246846 -146944 -37585 -6930 -18599 13530
41081 13530 104761 190421 221030 211136 177086 86056 -80585 -251273 -316738 -247450 -112810
41070 -112810 -3753 17910 -70525 -221644 -318809 -285706 -186067 -143920 -179560 -203718 -159823
41059 -159823 -80442 -9519 29348 -15170 -184142 -392164 -463337 -340825 -169243 -106163 -132136
41048 -132136 -119112 -20102 94686 156230 174071 196841 236972 240400 130868 -93656 -318113
41037 -318113 -409912 -360727 -278532 -243297 -236811 -218221 -189695 -164683 -142357 -140640 -189524 -266723
41025 -266723 -305243 -288728 -272088 -284862 -288172 -255752 -220467 -205622 -187354 -163214 -175421 -217017
41013 -217017 -199682 -82783 36944 42009 -53817 -147462 -197165 -247095 -319931 -362891 -315124
$$ packed form
41092b12175M8764J57495O0313j13831j55240l2172R9902J09359L0655j1669L2129
41081A3530R1231Q5660L0609r894l4050r1030j66641j70688o5465O9288J34640
41070a12810J09057K1663q8435j51119r7165L3103R9639M2147l5640k4158M3895
41059a59823P9381P0923L8867m4518j68972k08022p1173J22512J71582O3080k5973
41048a32136J3024R9010J14788O1544J7841K2770M0131L428j09532k24524k24457
41037c18113r1799M9185Q2195L5235O486J8590K8526K5012K2326J717m8884p7199
41025b66723l8520J6515J6640j2774l310L2420L5285J4845J8268K4140j2207m1596
41013b17017J7335J16899J19727N065r5826r3645m9703m9930p2836m2960M7767
$$ plain form
41002 -315124 -188834 -68342 -36048 -94905 -165204 -168442 -98606 6617 122469 215147 211983
40991 211983 80705 -87416 -167300 -155280 -139537 -145171 -131870 -120944 -166060 -194411 -58011
40980 -58011 212950 387269 337030 196511 128699 105009 34836 -51039 -95651 -151511 -256620
40969 -256620 -300938 -197108 -75189 -108027 -229878 -247196 -170364 -193487 -350759 -435336 -315169
40958 -315169 -123707 -46498 -82064 -121658 -139849 -183910 -249707 -280879 -261299 -229015 -211389
40947 -211389 -200203 -186098 -180007 -190728 -192371 -131174 10995 163069 221737 178769 133339
40936 133339 144935 145630 57813 -73297 -150601 -168153 -179593 -170257 -83713 42899 97540 58517
40924 58517 27114 68143 120916 110919 60446 30589 20640 -8504 -49785 -53119 -5378 38573
$$ packed form
41002c15124J26290J20492L2294n8857p0299l238O9836J05223J15852R2678l164
40991B11983j31278j68121p9884J2020J5743n634J3301J0926m5116k8351J36400
40980e8011K70961J74319n0239j40519o7812k3690p0173q5875m4612n5860j05109
40969b56620m4318J03830J21919l2838j21851j7318P6832k3123j57272q4577J20167
40958c15169J91462P7209l5566l9594j8191m4061o5797l1172J9580L2284J7626
40947b11389J1186J4105O091j0721j643O1197J42169J52074N8668m2968m5430
40936A33339J1596O95q7817j31110p7304j7552j1440R336Q6544J26612N4641l9023
40924E8517l1403M1029N2773r997n0473k9857r949k9144m1281l334M7741M3951
$$ plain form
40912 38573 19423 -49210 -86731 -35108 75228 170044 219868 239572 218841 127553 -4762
40901 -4762 -97976 -131503 -159924 -191514 -152124 -17064 126013 206166 249702 261254 158883
40890 158883 -59845 -217260 -172545 -34016 12740 -7548 56046 179681 182943 37232 -72029
40879 -72029 -26622 81343 139948 165065 185458 151264 53150 -6599 36163 96168 68467
40868 68467 -25315 -100400 -125812 -99900 -3004 134881 198933 119975 -15147 -70179 -31526
40857 -31526 5596 -14123 -50035 -41787 20261 97973 142277 130729 83023 28769 -33468 -115382
40845 -115382 -191601 -221653 -209867 -191745 -176415 -161865 -177928 -230177 -231123 -102143 67287
40834 67287 97083 -29690 -130510 -83606 14895 24742 -36564 -64532 -39314 -16769 -18022 -30673
$$ packed form
40912C8573j9150o8633l7521N1623J10336R4816M9824J9704k0731r1288j32315
40901d762r3214l3527k8421l1590L9390J35060J43077Q0153M3536J1552j02371
40890A58883k18728j57415M4715J38529M6756k0288O3594J23635L262j45711j09261
40879g2029M5407J07965N8605K5117K0393l4194r8114n9749M2762O0005k7701
40868F8467r3782p5085k5412K5912R6896J37885O4052p8958j35122n5032L8653
40857c1526L7122j9719l5912Q248O2048P7712M4304j1548m7706n4254o2237q1914
40845a15382p6219l0052J1786J8122J5330J4550j6063n2249r46J28980J69430
40834F7287K9796j26773j00820M6904R8501R847o1306k7968K5218K2545j253j2651
$$ plain form
40822 -30673 -68433 -135681 -172546 -123017 -32235 -1814 -64232 -156355 -199188 -162702 -75854 -4430
40810 -4430 8779 -2844 19327 53362 23602 -47998 -28817 122616 246840 176700 -32768
40799 -32768 -178211 -163649 -69972 4428 56345 120043 186698 213119 164747 38995 -117578
40788 -117578 -216317 -189417 -53510 104674 194549 165954 27873 -142112 -237267 -211867 -118862
40777 -118862 -37125 10868 47754 88044 131663 178374 213512 207431 158234 101875 51403 -31092
40765 -31092 -161817 -276138 -296637 -236002 -178824 -170314 -167339 -102080 33060 168967 221751
40754 221751 177385 107950 82457 77012 18195 -93910 -172116 -165784 -133093 -155909 -230572 -279602
40742 -279602 -241554 -127929 -17708 2156 -70383 -126505 -68684 52999 104719 64839 54392
$$ packed form
40822c0673l7760o7248l6865M9529R0782L0421o2418r2123m2833L6486Q6848P1424
40810d430J3209j1623K2171L4035k9760p1600J9181J51433J24224p0140k09468
40799c2768j45443J4562R3677P4400N1917O3698O6655K6421m8372j25752j56573
40788a17578r8739K6900J35907J58184Q9875k8595j38081j69985r5155K5400R3005
40777a18862Q1737M7993L6886M0290M3619M6711L5138o081m9197n6359n0472q2495
40765c1092j30725j14321k0499O0635N7178Q510K975O5259J35140J35907N2784
40754B21751m4366o9435k5493n445n8817j12105p8206O332L2691k2816p4663m9030
40742b79602L8048J13625J10221J9864p2539n6122N7821J21683N1720l9880j0447
$$ plain form
40731 54392 149105 266585 290515 215163 105804 -3133 -101361 -161325 -173107 -170625 -170632 -141702
40719 -141702 -80781 -52655 -96643 -160778 -189135 -206719 -250543 -283088 -251432 -177934 -119132
40708 -119132 -86185 -74716 -115441 -217411 -313958 -344566 -339837 -345700 -322000 -216300 -92439
40697 -92439 -69033 -143456 -182850 -98618 54031 163882 182028 134264 67089 5700 -53813
40686 -53813 -117278 -160409 -152166 -114020 -109415 -158816 -215484 -238820 -228822 -174144 -48298 115261
40674 115261 232919 286966 330637 343852 218301 -43110 -253141 -273948 -195903 -159138 -130718
40663 -130718 -25483 68990 2308 -165845 -224378 -130840 -66922 -153714 -299246 -374088 -370288
40652 -370288 -323176 -225178 -100854 -49642 -123184 -239140 -287122 -253133 -182734 -90224 28877
$$ packed form
40731E4392R4713J17480K3930p5352j09359j08937r8228n9964j1782K482pK8930
40719a41702O0921K8126m3988o4135k8357j7584m3824l2545L1656P3498N8802
40708a19132L2947J1469m0725j01970r6547l0608M729n863K3700J05700J23861
40697i2439K3406p4423l9394Q4232J52649J09851J8146m7764o7175o1389n9513
40686e3813o3465m3131Q243L8146M605m9401n6668k3336R998N4678J25846J63559
40674A15261J17658N4047M3671J3215j25551k61411k10031k0807P8045L6765K8420
40663a30718J05235R4473o6682j68153n8533R3538O3918q6792j45532p4842L800
40652c70288M7112R7998J24324N1212p3542j15956m7982L3989P0399R2510J19101
$$ plain form
40641 28877 140801 188633 147156 40628 -66996 -96389 -17534 93837 111612 -4834 -160287
40630 -160287 -222335 -147798 -12536 58594 -1551 -139980 -237617 -239034 -196916 -173183 -155940
40619 -155940 -114603 -71473 -55786 -44551 -18760 -20319 -74042 -111912 -67888 4028 7395 -47969
40607 -47969 -83667 -97776 -152275 -241981 -297856 -308620 -323396 -340373 -306768 -230797 -186160 -196400
40595 -196400 -206542 -172217 -97591 -305 81648 84832 16485 3124 122262 241620 180475
40584 180475 -10073 -109805 -57666 -17217 -91287 -175490 -163064 -110942 -103227 -102423 -50582 192
40572 192 -27118 -105543 -158999 -174559 -173344 -132399 -20330 127555 231475 240412 159998 49665
40560 49665 455 55795 146605 167684 112790 57961 28798 -11618 -51322 -28590 44013 70822
$$ packed form
40641B8877J11924M7832m1477j06528j07624k9393P8855J11371J7775j16446j55453
40630a60287o2048P4537J35262P1130o0145j38429r7637j417M2118K3733J7243
40619a55940M1337M3130J5687J1235K5791j559n3723l7870M4024P1916L367n5364
40607d7969l5698j4109n4499q9706n5875j0764j4776j6977L3605P5971M4637j0240
40595a96400j0142L4325P4626R7286Q1953L184o8347j3361J19138J19358o1145
40584A80475j90548r9732N2139M0449p4070q4203J2426N2122P715Q04N1841N0774
40572A92k7310p8425n3456j5560J215M0945J12069J47885J03920Q937q0414j10333
40560D9665m9210N5340R0810K1079n4894n4829k9163m0416l9704K2732P2603K6809
$$ plain form
40548 70822 8260 -94061 -186585 -235270 -157624 98625 399429 515083 408997 289565
40538 289565 350789 624326 1093119 1714951 2260932 2383378 2003704 1449171 1052461 790639
40528 790639 482057 150965 -34264 -61362 -72354 -124288 -161922 -189939 -276882 -399049 -448868
40517 -448868 -402024 -340695 -315697 -309112 -325323 -398947 -507937 -573670 -547030 -428531 -238326
40506 -238326 -40767 53689 3610 -93246 -133761 -155591 -251330 -401637 -510164 -546878 -532284
40495 -532284 -436239 -236197 -35608 30118 -10383 -8764 72295 124154 94233 64604 88729
40484 88729 92016 4104 -117380 -172529 -155923 -136209 -140201 -113624 12125 230581 430728
40473 430728 478243 357577 203745 148263 170764 162977 95208 29943 -4123 -46760 -109458
$$ packed form
40548G0822o2562j02321r2524m8685P7646K56249L00804J15654j06086j19432
40538B89565O1224K73537M68793O21832N45981J22446l79674n54533l96710k61822
40528G90639l08582l31092j85229k7098j0992n1934l7634k8017q6943j22167m9819
40517d48868M6844O1329K4998O585j6211p3624j08990o5733K6640J18499J90205
40506b38326J97559R4456n0079r6856m0515k1830r5739j50307j08527l6714J4594
40495e32284R6045K00042K00589O5726m0501J619Q1059N1859k9921k9629K4125
40484H8729L287q7912j21484n5149J6606J9714l992K6577J25749K18456K00147
40473D30728M7515j20666j53832n5482K2501p787o7769o5265l4066m2637o2698
$$ plain form
40462 -109458 -139469 -109723 -73780 -95142 -165931 -222317 -214147 -148760 -84384 -74760 -103242 -91553
40450 -91553 5412 142113 240644 265042 211443 82482 -79847 -188858 -201489 -173272 -173287
40439 -173287 -188223 -164539 -99429 -34952 -9822 -66002 -235820 -456537 -569514 -489952 -318839
40428 -318839 -204289 -160047 -117393 -81939 -110379 -182059 -232734 -290320 -437932 -643895 -758242
40417 -758242 -697538 -528269 -350185 -194422 -58668 45033 109538 140882 134752 94514 65361
40406 65361 92362 152842 182678 150332 55592 -103283 -290785 -405089 -375086 -260162 -175738
40395 -175738 -152760 -148480 -147661 -153644 -122738 -23256 67851 44955 -66188 -141858 -139984 -130292
40383 -130292 -152520 -164141 -136814 -96096 -53487 4200 52457 50263 23768 34553 68905 56671
$$ packed form
40462a09458l0011K9746L5943k1362p0789n6386Q170O5387O4376R624k8482J1689
40450i1553R6965J36701R8531K4398n3599j28961j62329j09011j2631K8217j5
40439a73287j4936K3684O5110O4477K5130n6180j69818k20717j12977P9562J71113
40428c18839J14550M4242M2654L5454k8440p1680n0675n7586j47612k05963j14347
40417g58242O0704J69269J78084J55763J35754J03701O4505L1344o130m0238k9153
40406F5361K7001O0480K9836l2346r4740j58875j87502j14304L0003J14924Q4424
40395a75738K2978M280Q19n983L0906R9482R1107k2896j11143p5670J874R692
40383a30292k2228j1621K7327M0718M2609N7687M8257k194k6495J0785L4352j2234
$$ plain form
40371 56671 -6441 -59777 -96559 -172269 -289168 -374530 -379324 -308221 -168246 4188 87626
40360 87626 -17298 -223395 -330950 -273935 -164157 -91778 -37124 -2364 -61528 -213996 -329561
40349 -329561 -317537 -238034 -179381 -136429 -79507 -36607 -29211 -19546 3664 -24790 -132438 -223386
40337 -223386 -190382 -55509 71663 126401 117331 69808 3393 -61964 -120896 -183995 -247668
40326 -247668 -294656 -328273 -358585 -351001 -245801 -42773 176771 315024 313865 179949 9817
40315 9817 -55323 18966 97180 54747 -33238 -10921 97132 106640 -51184 -239373 -322701
40304 -322701 -315530 -289513 -275646 -300708 -390952 -493874 -511693 -445826 -393588 -383448 -345251
40293 -345251 -262363 -204160 -176400 -97403 30210 81923 4051 -105890 -167895 -212285 -245127
$$ packed form
40371E6671o3112n3336l6782p5710j16899q5362m794P1103J39975J72434Q3438
40360H7626j04924k06097j07555N7015J09778P2379N4654L4760n9164j52468j15565
40349c29561J2024P9503N8653M2952N6922M2900P396R665K3210k8454j07648r0948
40337b23386L3004J34873J27172N4738r070m7523o6415o5357n8932o3099o3673
40326b47668m6988l3617l0312P584J05200K03028K19544J38253j159j33916j70132
40315I817o5140P4289P8214m2433q7985K2317J08053R508j57824j88189q3328
40304c22701P171K6017J3867k5062r0244j02922j7819O5867N2238J0140L8197
40293c45251Q2888N8203K7760P8997J27613N1713p7872j09941o2005m4390l2842
$$ plain form
40282 -245127 -193803 -69820 -15143 -82832 -130862 -46957 75369 110864 104992 158625 237151
40271 237151 247726 207597 189462 179333 121621 37219 -19631 -57898 -106531 -147263 -173676
40260 -173676 -228469 -300704 -291158 -168854 -47455 -10575 11230 80244 111341 34375 -36095
40249 -36095 36461 182763 236568 185241 138250 121122 81058 40821 63769 95820 11955
40238 11955 -190366 -386515 -497300 -535485 -503584 -382751 -218713 -101147 -57627 -55657 -83246
40227 -83246 -136447 -163937 -122146 -54900 -33416 -56284 -81332 -95614 -81661 -1776 96974 71968
40215 71968 -103149 -230126 -139638 48341 89987 -40307 -161153 -174877 -147439 -130198 -98476
40204 -98476 -67184 -96391 -172879 -229908 -277694 -372014 -468289 -457454 -339419 -215340 -116763
$$ packed form
40282b45127N1324J23983N4677o7689m8030Q3905J22326L5495n872N3633P8526
40271B37151J0575m0129j8135j0129n7712q4402n6850l8267m8633m0732k6413
40260a73676n4793p2235R546J22304J21399L6880K1805O9014L1097p6966p0470
40249c6095P2556J46302N3805n1327m6991j7128m0064m0237K2948L2051q3865
40238A1955k02321j96149j10785l8185L1901J20833J64038J17566M3520J970k7589
40227h3246n3201k7490M1791O7246K1484k2868k5048j4282J3953P9885R8750k5006
40215G1968j75117j26977R0488J87979M1646j30294j20846j3724K7438J7241L1722
40204i8476L1292k9207p6488n7029m7786r4320r6275J0835J18035J24079R8577
$$ plain form
40193 -116763 9385 152437 227480 220797 207156 213984 193387 126891 38913 -74253 -203073
40182 -203073 -248799 -137631 22146 59801 -11142 -43570 -25301 -86096 -232547 -300510 -220627
40171 -220627 -124055 -111834 -110964 -52165 -14999 -78040 -163616 -155744 -73143 -17064 -24301 -63239
40159 -63239 -113066 -168901 -213235 -236504 -249478 -249137 -216028 -156928 -105587 -87494 -125492 -236411
40147 -236411 -355813 -338922 -150372 16938 -35246 -221831 -286916 -169595 -49845 -33199
40137 -33199 -22271 45527 58159 -65693 -212199 -240272 -178980 -138154 -132189 -109678 -77542
40126 -77542 -89546 -158137 -247355 -316988 -343382 -344221 -385216 -494152 -582226 -541511 -399450 -268416
40114 -268416 -175255 -78836 -20541 -78034 -179767 -163290 -33310 40751 8887 -1703 37787
$$ packed form
40193a16763J26148J43052P5043o683j3641O828k0597o6496q7978j13166j28820
40182b03073m5726J11168J59777L7655p0943l2428J8269o0795j46451o7963P9883
40171b20627R6572J2221Q70N8799L7166o3041q5576P872Q2601N6079p237l8938
40159f3239m9827n5835m4334k3269j2974L41L3109N9100N1341J8093l7998j10919
40147b36411j19402J6891J88550J67310n2184j86585o5085J17321J19750J6646
40137c3199J0928O7798J2632j23852j46506k8073O1292M0826N965K2511L2136
40126g7542j2004o8591q9218o9633k6394q39m0995j08936q8074M0715J42061J31034
40114b68416R3161R6419N8295n7493j01733J6477J29980P4061l1864j0590L9490
$$ plain form
40103 37787 -30522 -262352 -462184 -459493 -339002 -256397 -211742 -158538 -156822 -239405 -281265
40092 -281265 -190656 -98020 -161467 -297967 -311566 -204411 -153750 -226123 -304554 -285768 -193201
40081 -193201 -95795 -36954 -39309 -85151 -107989 -75196 -40889 -55862 -89923 -109802 -148420 -214443
40069 -214443 -228755 -154763 -102215 -183384 -339709 -425890 -398192 -311447 -204722 -105524 -73192
40058 -73192 -115448 -129335 -46571 32847 -17685 -143339 -183544 -104294 -12304 24037 27511 12806
40046 12806 -29651 -62144 -31517 33402 55376 24289 -8622 -20287 -8595 61894 203215
40035 203215 328834 339384 252900 156219 72972 -14900 -66301 -29353 42262 49693 4748
40024 4748 -1257 27607 -20284 -186386 -362452 -418748 -338123 -207204 -127145 -127053 -124310 -4663
$$ packed form
40103C7787o8309k31830j99832K691J20491Q2605M4655N3204J716q2583m1860
40092b81265R0609R2636o3447j36500j3599J07155N0661p2373p8431J8786R2567
40081a93201R7406N8841k355m5842k2838L2793L4307j4973l4061j9879l8618o6023
40069b14443j4312P3992N2548q1169j56325q6181K7698Q6745J06725R9198L2332
40058g3192m2256j3887Q2764P9418n0532j25654m0205P9250R1990L6341L474j4705
40046A2806m2457l2493L0627O4919K1974l1087l2911j1665J1692P0489J41321
40035B03215J25619J0550q6484r6681q3247q7872n1401L6948P1615P431m4945
40024D748o005K8864m7891j66102j76066n6296Q0625J30919Q0059R2K743J19647
$$ plain form
40012 -4663 213808 358659 309970 155975 58439 45553 48918 63055 121379 168376 116925
40001 116925 12801 -8576 72842 137215 108890 34296 -34484 -105784 -172295 -182252 -123194
39990 -123194 -49371 -2639 21437 25534 9170 15126 91571 202608 256284 224134 156507 83138
39978 83138 -16580 -137987 -225365 -240115 -202055 -160031 -161285 -228811 -323070 -357922 -301885 -218798
39966 -218798 -159916 -84311 44561 160698 185162 142827 93855 28098 -61010 -84253 22125
39955 22125 156945 187468 152647 163703 168543 23752 -224079 -347231 -247121 -62234 63931
39944 63931 133136 164242 104900 -44300 -170915 -206501 -219800 -278403 -333661 -322955 -285032
39933 -285032 -291484 -337422 -361422 -312484 -166957 43723 201366 190697 48928 -63843 -62058
$$ packed form
40012d663K18471J44851m8689j53995r7536j2886L365J4137N8324M6997n1451
40001A16925j04124k1377Q1418O4373k8325p4594o8780p1300o6511r957N9058
39990a23194P3823M6732K4076M097j6364N956P6445J11037N3676l2150o7627p3369
39978H3138r9718j21407q7378j4750L8060M2024j254o7526r4259l4852N6037Q3087
39966b18798N8882P5605J28872J16137K4464m2335m8972o5757q9108k3243J06378
39955B2125J34820L0523l4821J1056M840j44791k47831j23152J00110J84887J26165
39944F3931O9205L1106n9342j49200j26615l5586j3299n8603n5258J0706L7923
39933b85032o452m5938k4000M8938J45527K10680J57643j0669j41769j12771J785
$$ plain form
39922 -62058 -5304 34313 48131 11477 -124404 -300378 -344696 -187090 26867 117858 76346
39911 76346 5511 -44815 -89523 -123037 -123788 -109295 -112538 -128885 -137399 -144084 -163178 -188324 -214716
39898 -214716 -255084 -307563 -341873 -335750 -293664 -226486 -150617 -98707 -84596 -75754 -54900 -74298
39886 -74298 -171072 -267823 -262610 -188780 -161199 -180667 -137353 -17815 46202 -22282 -139125
39875 -139125 -213110 -275638 -375811 -453938 -415462 -266697 -105114 -18585 -30009 -86737 -84720
39864 -84720 31033 181914 249628 247388 287298 375902 383288 253752 108498 71867 111282
39853 111282 120295 59748 -48740 -172303 -245749 -195212 -47943 65052 68218 17341 -20889
39842 -20889 -56609 -96281 -93767 -48184 -39175 -95130 -136759 -122645 -132327 -218208 -290263 -250970
$$ packed form
39922f2058N6754L9617J3818l6654j35881j75974m4318J57606K13957R0991m1512
39911G6346p0835n0326m4708l3514p51J4493l243j6347q514o685j9094k5146k6392
39898b14716m0368n2479l4310O123M2086O7178P5869N1910J4111Q842K0854j9398
39886g4298r6774r6751N213P3830K7581j9468M3314J19538O4017o8484j16843
39875a39125p3985o2528j00173p8127L8476J48765J61583Q6529j1424n6728K017
39864h4720J15753J50881O7714k240L9910Q8604P386j29536j45254l6631L9415
39853A11282R013o0547j08488j23563p3446N0537J47269J12995L166n0877l8230
39842b0889l5720l9672K514M5583R009n5955m1629J4114r682q5881p2055L9293
$$ plain form
39830 -250970 -147042 -84137 -77043 -81444 -91002 -108982 -104650 -84623 -117849 -202156 -211549 -85007
39818 -85007 37259 -610 -134406 -175354 -79643 24662 43288 10172 -9275 6558 51183
39807 51183 92203 75534 3701 -25131 62091 193769 241423 186281 108388 52386 5246
39796 5246 -25351 -18684 -14926 -84865 -223276 -342420 -364534 -267201 -70096 153554 285928
39785 285928 267379 175104 133005 164544 197196 182088 136442 89110 54187 44838 55607 48415
39773 48415 4523 -37245 -41037 -35275 -60348 -92263 -72527 19716 166931 333984 446339
39762 446339 418272 269400 146419 151960 214941 211443 141235 79424 19118 -104445 -266733
39751 -266733 -366613 -380330 -377916 -378507 -315128 -179672 -90393 -146006 -283760 -356659 -318513 -268045
$$ packed form
39830b50970J03928O2905P094m401r558j7980M332K0027l3226q4307r393J26542
39818h5007J22266l7869j33796m0948R5711J04305J8626l3116j9447J5833M4625
39807E1183M1020j6669p1833k8832Q7222J31678M7654n5142p7893n6002m7140
39796E246l0597O667L758o9939j38411j19144k2114R7333J97105K23650J32374
39785B85928j8549r2275m2099L1539L2652j5108m5646m7332l4923r349J0769p192
39773D8415m3892m1768l792N762k5073l1915J9736R2243J47215J67053J12355
39762D46339k8067j48872j22981N541O2981l498p0208o1811o0306j23563j62288
39751b66733r9880j3717K414n91O3379J35456Q9279n5613j37754p2899L8146N0468
$$ plain form
39739 -268045 -311799 -428942 -494549 -421645 -250894 -90146 4399 53536 85147 92971 65847
39728 65847 12997 -43533 -69543 -31003 48345 74424 -4187 -107013 -133575 -122540 -178615
39717 -178615 -275057 -286475 -212513 -187411 -234435 -199814 -3996 217099 316949 320687 294170
39706 294170 195716 1949 -156780 -151271 -50157 -17657 -94942 -207126 -297386 -328009 -244230
39695 -244230 -75587 15070 -73792 -220260 -252625 -200978 -222759 -354121 -498688 -602444
39685 -602444 -674872 -684135 -594994 -478194 -430584 -417775 -342481 -235741 -226134 -335744 -449706
39674 -449706 -479346 -430607 -331092 -215905 -166253 -236734 -355961 -403862 -357638 -262071 -116237
39663 -116237 78576 213953 173629 14726 -89789 -72557 -12761 13645 -2849 -60755 -139099
$$ packed form
39739b68045m3754j17143o5607P2904J70751J60748R4545M9137L1611P824k7124
39728F5847n2850n6530k6010L8540P9348K6079p8611j02826k6562J1035n6075
39717a78615r6442j1418P3962K5102m7024L4621J95818K21095R9850L738k6517
39706B94170r8454j93767j58729N509J01114L2500p7285j12184r0260l0623Q3779
39695b44230J68643R0657q8862j46468l2365N1647k1781j31362j44567j03756
39685f02444p2428r263Q9141J16800M7610J2809P5294J06740R607j09610j13962
39674d49706k9640M8739R9515J15187M9652p0481j19227m7901M6224R5567J45834
39663a16237J94813J35377m0324j58903j04515J7232N9796K6406j6494n7906p8344
$$ plain form
39652 -139099 -163803 -100258 -34794 -44816 -53408 45833 190189 238727 198198 176771 167045 76408
39640 76408 -59334 -102539 -45689 -14586 -37420 -13225 71185 92875 556 -109757 -170504
39629 -170504 -227410 -303766 -335692 -291568 -222498 -162319 -104474 -87898 -162853 -261340 -250092
39618 -250092 -124804 -7668 46175 82038 94908 27337 -74754 -90906 -27952 -7235 -36999
39607 -36999 -2118 93535 97893 -20017 -92268 -24751 60766 53897 26391 61826 96801 61443
39595 61443 24342 70691 167413 258973 364341 470532 466719 310333 143389 115266 179702
39584 179702 183075 79903 -40953 -86112 -36522 51461 78094 -4919 -112004 -119941 -49706
39573 -49706 -36510 -113636 -172369 -160912 -159601 -208546 -226813 -177944 -160514 -241398 -332887 -330267
$$ packed form
39652a39099k4704O3545O5464j0022q592R9241J44356M8538m0529k1427r726r0637
39640G6408j35742m3205N6850L1103k2834K4195Q4410K1690r2319j10313o0747
39629a70504n6906p6356l1926M4124O9070O0179N7845J6576p4955r8487J1248
39618b50092J25288J17136N3843L5863J2870o7571j02091j6152O2954K0717k9764
39607c6999L4881R5653M358j17910p2251O7517Q5517o869k7506L5435L4975l5358
39595F1443l7101M6349R6722R1560J05368J06191l813j56386j66944k8123O4436
39584A79702L373j03172j20856m5159M9590Q7983K6633q3013j07085p937P0235
39573d9706J3196p7126n8733J1457J311m8945j8267M8869J7430q0884r1489K620
$$ plain form
39561 -330267 -256527 -184250 -119158 -40492 35744 96301 147484 158492 87902 -17275 -71215
39550 -71215 -106611 -234330 -429848 -526520 -453866 -315576 -199493 -89455 -494 -5836 -79019
39539 -79019 -103804 -88844 -165010 -323194 -390635 -332698 -320592 -406240 -402612 -220051 -53617
39528 -53617 -69561 -155121 -162280 -159459 -240344 -313338 -301055 -333173 -506061 -651074 -588759 -429488
39516 -429488 -370463 -374952 -321848 -297292 -431046 -582060 -510851 -272328 -123428 -110146 -64155
39505 -64155 31197 2428 -167291 -256311 -141963 22593 53229 -35794 -127502 -173485 -193658
39494 -193658 -212484 -245995 -281270 -263890 -172482 -77051 -48488 -56762 -36566 10625 62424 141300
39482 141300 243345 293605 266183 242006 254297 215792 112503 98919 240857 337516 203898
$$ packed form
39561c30267P3740P2277O5092P8666P6236O0557N1183J1008p0590j05177n3940
39550g1215l5396j27719j95518r6672P2654J38290J16083J10038Q8961n342p3183
39539g9019k4785J4960p6166j58184o7441N7937J2106q5648L628J82561J66434
39528e3617j5944q5560p159K821q0885p2994J2283l2118j72888j45013O2315J59271
39516d29488N9025m489N3104K4556j33754j51014P1209K38523J48900J3282M5991
39505f4155R5352k8769j69719q9020J14348J64556L0636q9023r1708m5983k0173
39494a93658j8826l3511l5275J7380R1408R5431K8563q274K0196M7191N1799P8876
39482A41300J02045N0260k7422k4177J2291l8505j03289j3584J41938R6659j33618
$$ plain form
39471 203898 -25443 -107144 -65397 -97738 -213977 -250457 -178498 -120941 -95134 -5893 113845
39460 113845 105730 -56033 -225443 -313909 -363456 -394231 -372934 -332545 -343870 -377940 -361972
39449 -361972 -332575 -355030 -351459 -219898 -65844 -75282 -195401 -196793 -39305 82559 63847
39438 63847 88 -46395 -129733 -224854 -202377 -69462 -4725 -74686 -130670 -68887 17941
39427 17941 44696 90454 230438 372100 384771 281605 174627 131579 138515 132778 49072
39416 49072 -94703 -173504 -110861 -17921 -56213 -212157 -347632 -409694 -424050 -358205 -199188
39405 -199188 -98182 -193846 -340023 -278765 -57513 22505 -120456 -243711 -197572 -125624
39395 -125624 -150090 -168335 -108449 -106025 -245227 -363024 -309263 -205851 -247443 -399947 -485038
$$ packed form
39471B03898k29341q1701M1747l2341j16239l6480P1959N7557K5807Q9241J19738
39460A13845q115j61763j69410q8466m9547l0775K1297M0389j1325l4070J5968
39449c61972K9397k2455L571J31561J54054r438j20119j392J57488J21864j8712
39438F3847o3759m6483q3338r5121K2477J32915O4737o9961n5984O1783Q6828
39427A7941K6755M5758J39984J41662J2671j03166j06978m3048O936n737q3706
39416D9072j43775p8801O2643R2940l8292j55944j35475o2062j4356O5845J59017
39405a99188J01006r5664j46177O1258K21252Q0018j42961j23255M6139P1948
39395a25624k4466j8245N9886K424j39202j17797N3761J03412m1592j52504q5091
$$ plain form
39384 -485038 -439600 -324342 -184911 -57203 -13274 -62105 -88970 -14824 64485 6583 -186510
39373 -186510 -401284 -559430 -639987 -624489 -511467 -348749 -200416 -112604 -109948 -157547 -146000
39362 -146000 -16799 117710 105725 -12532 -55208 29294 109271 92372 21580 -69322 -207612
39351 -207612 -349137 -374689 -271706 -160695 -105246 -59163 -22751 -61350 -133665 -101252 38993
39340 38993 124861 85548 36808 64347 104201 95648 63367 -1813 -146313 -295015 -300530 -192281
39328 -192281 -149117 -185758 -127028 48873 131058 35214 -51235 -9691 16828 -69337 -105261
39317 -105261 45601 244544 321349 336711 395245 417844 318936 210812 214447 249973 217529
39306 217529 194162 242667 225724 43272 -132087 -103343 34700 73315 21702 3810 -22280
$$ packed form
39384d85038M5438J15258J39431J27708M3929m8831k6865P4146P9309n7902j93093
39373a86510k14774j58146q0557J5498J13022J62718J48333Q7812K656m7599J1547
39362a46000J29201J34509j1985j18257m2676Q4502P9977j6899p0792r0902j38290
39351b07612j41525k5552J02983J11011N5449M6083L6412l8599p2315L2413J40245
39340C8993Q5868l9313m8740K7539L9854q553l2281o5180j44500j48702n515J08249
39328a92281M3164l6641N8730J75901Q2185r5844q6449M1544K6519q6165l5924
39317a05261J50862J98943P6805J5362N8534K2599r8908j08124L635L5526l2444
39306B17529k3367M8505j6943j82452j75359K8744J38043L8615n1613j7892k6090
$$ plain form
39295 -22280 -158492 -297437 -247699 -58998 35982 -45682 -187281 -296668 -363294 -347648 -227610
39284 -227610 -115629 -140649 -254554 -320660 -329246 -355184 -376049 -316552 -213964 -162487 -143459
39273 -143459 -69051 60549 185570 300870 407961 445732 408169 420559 544222 626613
39263 626613 522444 346308 310474 416973 516357 580772 704165 895952 1073096 1202394
39253 1202394 1274525 1207545 958399 663413 490399 418785 335116 259427 283541 357538 341551
39242 341551 229520 144009 141404 168454 167019 101927 -40140 -171251 -137105 48628 151122
39231 151122 37828 -113156 -97412 9998 41306 36190 99311 131216 -3704 -173793 -149561
39220 -149561 23227 116540 97110 108907 153631 100621 -27962 -80510 -55867 -79518 -133880
$$ packed form
39295b2280j36212j38945M9738J88701R4980q1664j41599j09387o6626J5646J20038
39284b27610J11981k5020j13905o6106q586k5938k0865N9497J02588N1477J9028
39273a43459P4408J29600J25021J15300J07091L7771l7563J2390J23663Q2391
39263F26613j04169j76136l5834J06499R9384O4415J23393J91787J77144J29298
39253A202394P2131o6980k49146k94986j73014p1614q3669p5689K4114P3997j5987
39242C41551j12031q5511k605K7050j435o5092j42067j31111L4146J85733J02494
39231A51122j13294j50984J5744J07410L1308n116O3121L1905j34920j70089K4232
39220a49561J72788R3313j9430J1797M4724n3010j28583n2548K4643k3651n4362
$$ plain form
39209 -133880 -95752 -13230 -52614 -179690 -184152 -33390 70713 11271 -113869 -196369 -219846
39198 -219846 -158126 -724 126492 87923 -38274 -83708 -79851 -169170 -287632 -233088 -21335
39187 -21335 128950 154745 187399 237724 162404 -31791 -162660 -188299 -246000 -341778 -317108
39176 -317108 -177551 -132477 -228793 -258806 -129382 -16739 -36869 -55081 37975 129595 114950
39165 114950 85981 140166 205826 192403 132074 64543 -38894 -149443 -164635 -92992 -68612
39154 -68612 -126869 -166960 -174817 -244473 -327513 -230764 45982 233233 168689 8137 -59658
39143 -59658 -70108 -120487 -174332 -176195 -172551 -189115 -163233 -100689 -110742 -190750 -182155 -43624
39131 -43624 45787 -27875 -136008 -140948 -101901 -113635 -135575 -124428 -157777 -281674 -393317
$$ packed form
39209a33880L8128Q2522l9384j27076m462J50762J04103n9442j25140q2500k3477
39198b19846O1720J57402J27216l8569j26197m5434L857q9319j18462N4544K11753
39187b1335J50285K5795L2654N0325p5320j94195j30869k5639n7701r5778K4670
39176c17108J39557M5074r6316l0013J29424J12643k0130j8212R3056R1620j4645
39165A14950k8969N4185O5660j3423o0329o7531j03437j10549j5192P1643K4380
39154f8612n8257m0091p857o9656q3040R6749K76746J87251o4544j60552o7795
39143e9658j0450n0379n3845j863L644j6564K5882O2544j0053q0008Q595J38531
39131d3624Q9411p3662j08133m940L9047j1734k1940J1147l3349j23897j11643
$$ plain form
39120 -393317 -405130 -378407 -384034 -381189 -332127 -279861 -221875 -75292 139474 252408 179258
39109 179258 41713 -33276 -68722 -112727 -129897 -100992 -74675 -60529 -29450 -43455 -185695
39098 -185695 -343164 -298452 -73506 78562 70408 78455 173281 172584 -9376 -173941 -166496
39087 -166496 -116077 -168327 -233774 -187031 -84886 -7692 96513 243286 310181 268047 287363
39076 287363 443805 542621 414825 177043 26510 -14075 9100 115832 255455 259545
39066 259545 96205 -48769 -88563 -177389 -379129 -482152 -349206 -175053 -164267 -210065
39056 -210065 -133985 2370 73442 139189 263452 309899 177010 23195 11552 49954 23532
39045 23532 37152 161148 197214 6247 -174895 -81810 131121 148842 8294 -21084 81535
$$ packed form
39120c93317j1813K6723n627K845M9062N2266N7986J46583K14766J12934p3150
39109A79258j37545p4989l5446m4005j7170K8905K6317J4146L1079j4005j42240
39098a85695j57469M4712K24946J52068q154Q047R4826o97j81960j64565P445
39087a66496N0419n2250o5447M6743J02145P7194J04205J46773O6895m2134J9316
39076B87363J56442R8816j27796k37782j50533m0585K3175J06732J39623M090
39066B59545j63340j44974l9794q8826k01740j03023J32946J74153J0786m5798
39056b10065P6080J36355P1072O5747J24263M6447j32889j53815j1643L8402k6422
39045B3532J3620J23996L6066j90967j81142R3085K12931J7721j40548k9378J02619
$$ plain form
39034 81535 103645 -4804 -94994 -101287 -58622 69929 294148 427496 303611 58633 -76287
39023 -76287 -135411 -277826 -425429 -375113 -170304 -28197 21422 98673 152682 20364 -232657
39012 -232657 -353697 -273220 -148537 -62777 39247 135917 126379 42084 15945 46711 15098
39001 15098 -85601 -143133 -120447 -68132 6414 108214 171781 174289 214151 305680 263179
38990 263179 4183 -221984 -174425 -3757 9172 -80182 -25243 144427 182207 57992
38980 57992 -41970 -84252 -188322 -298805 -221966 19245 199388 250229 288975 306140 154545
38969 154545 -142790 -380054 -475108 -511002 -488320 -328166 -110806 -20022 -53408 -60113 -38950
38958 -38950 -111584 -232190 -231830 -135609 -127352 -205197 -179860 -20151 99755 108766 109062 134937
$$ packed form
39034H1535K2110j08449r0190o293M2665J28551K24219J33348j23885k44978j34920
39023g6287n9124j42415j47603N0316K04809J42107M9619P7251N4009j32318k53021
39012b32657j21040Q0477J24683Q5760J02024R6670r538q4295k6139L0766l1613
39001A5098j00699n7532K2686N2315P4546J01800O3567K508L9862R1529m2501
38990B63179k58996k26167M7559J70668J2929q9354N4939J69670L7780j24215
38980E7992r9962m2282j04070j10483P6839K41211J80143N0841L8746J7165j51595
38969A54545k97335k37264r5054l5894K2682J60154K17360R0784l3386o705K1163
38958c8950p2634j20606L60R6221Q257p7845K5337J59709J19906R011K96K5875
$$ plain form
38946 134937 124183 128577 267674 469609 534002 450266 385192 375677 315247 220716 218018 279040
38934 279040 260045 178605 167386 194367 129114 34784 72124 167017 117508 -19258 -14553
38923 -14553 101124 89675 -34359 -14739 159686 205645 41660 -75511 3092 118469
38913 118469 142101 146867 141229 -8509 -275229 -421006 -362408 -282605 -291790 -281098 -193988
38902 -193988 -136995 -141969 -111338 -57443 -98975 -180932 -112026 88070 204548 207184 263477
38891 263477 359464 295065 95198 22625 119297 139665 14437 -33159 74652 133092 64802
38880 64802 53911 149622 147287 -2391 -73251 9609 32647 -73833 -88226 52978 82300
38869 82300 -128974 -332908 -338259 -288636 -303758 -238695 -27334 113564 63490 27108 149118
$$ packed form
38946A34937j0754M394J39097K01935O4393q3736o5074r515o0430r4531k698O1022
38934B79040j8995q1440j1219K6981o5253r4330L7340R4893m9509j36766M705
38923a4553J15677j1449j24034J9620J74425M5959j63985j17171P8603J15377
38913A18469K3632M766n638j49738k66720j45777N8598P9803r185J0692Q7110
38902a93988N6993m974L0631N3895m1532q1957O8906K00096J16478K636N6293
38891B63477R5987o4399j99867p2573R6672K0368j25228m7596J07811N8440o8290
38880F4802j0891R5711k335j49678p0860Q2860K3038j06480j4393J41204K9322
38869H2300k11274k03934n351M9623j5122O5063K11361J40898n0074l6382J22010
$$ plain form
38858 149118 241310 127942 -61524 -168361 -256496 -378359 -407592 -313458 -289866 -412741
38848 -412741 -478457 -365867 -241101 -230532 -218887 -133021 -80015 -53850 114918 360418 347824
38837 347824 26308 -207918 -111795 67952 80563 48112 99514 72957 -120553 -253640
38827 -253640 -202210 -201285 -382002 -470911 -276509 -66678 -114513 -257522 -260164 -230606 -310062
38816 -310062 -320000 -104616 114829 103598 11358 54569 127349 74731 20350 74372 52277
38805 52277 -166584 -342596 -286558 -214315 -339018 -477760 -434622 -397208 -553731 -685312
38795 -685312 -553309 -333995 -255386 -174200 52118 156000 -98755 -419894 -424986 -251979
38785 -251979 -241773 -328829 -251999 -77597 -9037 48134 241156 368648 211296 -15285
$$ packed form
38858A49118R2192j13368j89466j06837q8135j21863k9233R4134K3592j22875
38848d12741o5716J12590J24766J0569J1645Q5866N3006K6165J68768K45500j2594
38837C47824l21516k34226R6123J79747J2611l2451N1402k6557j93510j33087
38827b53640N1430R25j80717q8909J94402K09831m7835j43009k642K9558p9456
38816c10062r938K15384K19445j1231r2240M3211P2780n2618n4381N4022k2095
38805E2277k18861j76012N6038P2243j24703j38742M3138L7414j56523j31581
38795f85312J32003K19314P8609Q1186K26318J03882k54755l21139n092J73007
38785b51979J0206q7056P6830J74402O8560N7171J93022J27492j57352k26581
$$ plain form
38775 -15285 -21926 30964 -134209 -358499 -346949 -233797 -311087 -465543 -423411 -286459 -281903
38764 -281903 -257869 4424 250744 123615 -178162 -214704 -41201 -10795 -74242 67391
38754 67391 299406 250898 -21736 -151077 -135092 -261540 -466145 -412144 -147082 -61018
38744 -61018 -221648 -322718 -259842 -219177 -239709 -197723 -156655 -244005 -292909 -99726 114945
38733 114945 24033 -205666 -188536 -6173 -15914 -154186 -79432 133079 108523 -118384 -174082
38722 -174082 -45040 -52481 -199736 -196057 -71976 -125962 -312452 -318469 -183068 -200050 -289674
38711 -289674 -139105 116089 59300 -221170 -243701 5878 72949 -110752 -130221 113944
38701 113944 254260 173723 155302 238817 136498 -127181 -189073 -41142 -58367 -263566
$$ packed form
38775a5285o641N2890j65173k24290J1550J13152p7290j54456M2132J36952M556
38764b81903K4034K62293K46320j27129l01777l6542J73503L0406o3447J41633
38754F7391K32015m8508k72634j29341J5985j26448k04605N4001K65062Q6064
38744f1018j60630j01070O2876M0665k0532M1986M1068q7350m8904J93183K14671
38733A14945r0912k29699J7130J82363r741j38272P4754K12511k4556k26907n5698
38722a74082J29042p441j47255L679J24081n3986j86490o017J35401j6982q9624
38711b89674J50569K55194n6789k80470k2531K49579O7071j83701j9469K44165
38701A13944J40316q0537j8421Q3515j02319k63679o1892J47931j7225k05199
$$ plain form
38691 -263566 -274625 -63081 -32978 -235407 -239671 72093 298729 258956 233041 311821 209655
38680 209655 -90378 -182512 75661 347022 432263 484185 506100 295258 -16282 -41696
38670 -41696 152909 117832 -139885 -141949 153114 236337 -22516 -156538 6633 57810 -169018
38659 -169018 -292231 -146815 -68599 -171453 -120900 129347 165759 -72307 -109908 175462
38649 175462 297341 64374 -84988 59054 123680 -32249 -4345 314028 430656 168943
38639 168943 32205 259415 369493 75406 -187216 -96549 11591 -104058 -108274 165524
38629 165524 288763 40983 -140138 18684 139648 -12542 -65473 159555 219944 -71866
38619 -71866 -195372 120631 344717 114854 -95142 109925 312895 114404 -119249 -8393
$$ packed form
38691b63566j1059K11544L0103k02429m264L11764K26636l9773k5915P8780j02166
38680B09655l00033r2134K58173K71361Q5241N1922K1915k10842l11540k5414
38670d1696J94605l5077k57717k064K95063Q3223k58853j34022J63171N1177k26828
38659a69018j23213J45416P8216j02854N0553K50247L6412k38066l7601K85370
38649A75462J21879k32967j49362J44042O4626j55929K7904L18373J16628k61713
38639A68943j36738K27210J10078k94087k62622R0667J08140j15649m216K73798
38629A65524J23239k47780j81121J58822J20964j52190n2931K25028O0389k91810
38619g1866j23506L16003K24086k29863k09996K05067K02970j98491k33653J10856
$$ plain form
38609 -8393 124586 -32978 -121291 161886 406553 236264 -11025 13712 27806 -192007
38599 -192007 -249646 84606 308328 73597 -146839 50885 259737 103306 -15341 259865
38589 259865 496562 322488 189125 508366 853742 813741 799222 1191892 1561972 1582962
38579 1582962 1814418 2635574 3292199 3024043 2317918 2010354 1946696 1591952 1192927 1214562
38569 1214562 1315065 982673 558843 591299 812631 762898 741916 1130390 1477493 1305646
38559 1305646 1106580 1477676 1993582 2028275 1986512 2603663 3684319 4580793 5205430 5554426
38549 5554426 5076934 3651580 2352329 2068046 2188266 1809902 1298432 1369011 1592307
38540 1592307 1246569 766936 878982 1140532 832172 445213 748969 1227609 1033423
$$ packed form
38609h393J32979j57564q8313K83177K44667j70289k47289K4737J4094k19813
38599a92007n7639L34252K23722k34731k20436J97724K08852j56431j18647K75206
38589B59865K36697j74074j33363L19241L45376m0001j4519L92670L70080K0990
38579A582962K31456Q21156O56625k68156p06125l07564o3658l54744l99025K1635
38569A214562J00503l32392m23830L2456K21332m9733k0982L88474L47103j71847
38559A305646j99066L71096N15906L4693m1763O17151J080656Q96474O24637L48996
38549E554426m77492j425354j299251k84283J20220l78364n11470P0579K23296
38540A592307l45738m79633J12046K61550l08360l86959L03756M78640j94186
$$ plain form
38531 1033423 649959 956325 1472123 1255210 738593 890072 1319534 1065222 524117
38522 524117 700140 1222474 1049865 495160 579197 994484 723382 96118 193151 752586
38512 752586 724295 353082 621031 1171137 933275 285126 405308 1003364 923537 466688
38502 466688 797885 1565547 1500757 897827 1052987 1707482 1559241 859314 918872 1480569
38492 1480569 1235786 515522 723705 1526384 1440617 784635 1083714 1962639 1733010 707509
38482 707509 713638 1629693 1724612 1135785 1536434 2609111 2477732 1444157 1537160 2526431
38472 2526431 2320912 1183855 1400355 2821322 3083744 2253313 2675906 4157064 4132722
38463 4132722 2803946 3010368 4736541 5112788 4200524 5034223 7473170 8167713 7225175
$$ packed form
38531A033423l83464L06366N15798k16913n16617J51479M29462k54312n41105
38522E24117J76023N22334j72609n54705Q4037M15287k71102o27264R7033N59435
38512G52586k8291l71213K67949N50106k37862o48149J20182N98056p9827m56849
38502D66688L31197P67662o4790o02930J55160O54495j48241o99927N9558N61697
38492A480569k44783p20264K08183Q02679q5767o55982K99079Q78925k29629j025501
38482G07509O129R16055R4919n88827M00649J072677j31379j033575R3003R89271
38472B526431k05519j137057K16500J420967K62422q30431M22593J481158k4342
38463D132722j328776K06422J726173L76247r12264Q33699K438947O94543r42538
$$ plain form
38454 7225175 8301450 11335343 12370369 11549979 13465989 18338852 21429806 22735768
38446 22735768 27681258 36159682 41690964 44270774 51949872 66019695 78614440 89879149
38438 89879149 110759346 141874321 171467122 207655910 285431033 411539138 520582335
38431 520582335 527123506 422470788 285858196 193953800 151741319 123027772 92787922
38424 92787922 71861648 62735477 53786870 41605433 34270435 33254980 30557633 23935508
38416 23935508 19726559 19787583 18622159 14569255 12447076 13657825 13683768 10985106 9463168
38407 9463168 10455469 10354872 7878955 6371503 7146107 7232126 5459311 4612760 5799588
38398 5799588 6353878 5062101 4227640 4891248 4919590 3470783 2739591 3649805 4128848
$$ packed form
38454G225175J076275L033893J035026q20390J916010M872863L090954J305962
38446B2735768M945490Q478424N531282K579810P679098J4069823J2594745J1264709
38438H9879149K0880197L1114975K9592801L6188788P7775123J26108105J09043197
38431E20582335O541171j04652718j36612592r1904396m2212481k8713547l0239850
38424I2787922k0926274r126171q948607j2181437p334998j015455k697347o622125
38416B3935508m208949O1024j165424m052904k122179J210749K5943k698662j521938
38407I463168R92301j00597k475917j507452P74604Q6019j772815q46551J186828
38398E799588N54290j291777q34461O63608K8342j448807p31192R10214M79043
$$ plain form
38389 4128848 3208699 2741267 3534739 3718807 2475754 1671065 2257113 2586620 1786807
38380 1786807 1420925 2296954 2847867 2183716 1706396 2233314 2439271 1593508 1036859
38371 1036859 1513876 1731041 973466 557016 1272803 1873612 1487414 1149058 1578441
38362 1578441 1760292 1091184 697686 1263938 1695615 1263351 975397 1508453 1835189
38353 1835189 1247767 759397 1147640 1515622 1135605 860730 1351474 1698904 1185532
38344 1185532 700233 1031614 1392380 997899 538994 739530 961235 575931 272480
38335 272480 680555 1086547 805774 478193 740033 951170 516657 160641 585879 1112360
38325 1112360 943464 594729 781219 1036350 727287 353322 553064 846774 617834
$$ packed form
38389D128848r20149m67432P93472J84068j243053q04689N86048L29507p99813
38380A786807l65882Q76029N50913o64151m77320N26918K05957q45763n56649
38371A036859M77017K17165p57575m16450P15787O00809l86198l38356M29383
38362A578441J81851o69108l93498N66252M31677m32264k87954N33056L26736
38353A835189n87422m88370L88243L67982l80017k74875M90744L47430n13372
38344A185532m85299L31381L60766l94481m58905K00536K21705l85304l03451
38335B72480M08075M05992k80773l27581K61840K11137m34513l56016M25238N26481
38325A112360j68896l48735J86490K55131l09063l73965J99742K93710k28940
$$ plain form
38316 617834 359733 710632 1182345 1062010 698395 727182 868927 621720 317695 406704
38306 406704 511114 233931 67180 468067 881206 705452 382334 505969 720332 536298
38296 536298 369440 700903 1062416 926139 750984 1068513 1409143 1266826 1239364 1975385
38286 1975385 2807689 2733149 2041264 1677361 1642671 1339789 924000 967162 1228915 1047933
38276 1047933 591206 517521 742105 682294 405918 425043 647864 599728 397910 489485
38266 489485 718643 644074 465786 646365 933080 761965 334452 284647 547041 554371
38256 554371 315799 305387 488011 429767 205106 259987 524800 552267 382204 410331
38246 410331 563875 457754 209378 261693 545621 626632 526854 606258 786614 683357
$$ packed form
38316F17834k58101L50899M71713j20335l63615K8787J41745k47207l04025Q9009
38306D06704J04410k77183j66751M00887M13139j75754l23118J23635K14363j84034
38296E36298j66858L31463L61513j36277j75155L17529L40630j42317k7462P36021
38286A975385Q32304p4540o91885l63903l4690l02882m15789M3162K61753j80982
38276A047933m56727p3685K24584n9811k76376J9125K22821m8136k01818R1575
38266D89485K29158p4569j78288J80579K86715j71115m27513m9805K62394P330
38256E54371k38572j0412J82624n8244k24661N4881K64813K7467j70063K8127
38246D10331J53544j06121k48376N2315K83928Q1011r9778P9404J80356j03257
$$ plain form
38236 683357 364809 223695 247661 147861 31345 211067 530392 599717 514842 636267
38226 636267 872257 888944 799828 938397 1193905 1274102 1349615 1743217 2317148 2878117
38216 2878117 3737795 5013061 5829502 5258315 3742323 2554476 2086286 1728256 1222835
38207 1222835 965254 1005586 884603 557266 477807 662185 605314 238119 65697 236455
38197 236455 335453 217697 210427 372615 368852 195563 241635 519254 606139 437769 380706
38186 380706 451257 270975 -114324 -202739 53222 128639 -129137 -253220 -38207 129589
38176 129589 39439 -8617 133693 191348 85754 126167 360654 418531 213601 131441 310361
38165 310361 407581 283619 242497 381327 380300 163999 100495 309287 431183 317964
$$ packed form
38236F83357l18548j41114K3966r9800j16516J79722L19325O9325q4875J21425
38226F36267K35990J6687q9116J38569K55508Q0197P5513L93602N73931N60969
38216B878117Q59678J275266Q16441n71187j515992j187847m68190l58030n05421
38207A222835k57581M0332j20983l27337p9459J84378n6871l67195j72422J70758
38197B36455R8998j17756p270J62188l763j73289M6072K77619Q6885j68370n7063
38186C80706P0551j80282l85299q8415K55961P5417k57776j24083K15013J67796
38176A29589r0150m8056J42310N7655j05594M0413K34487N7877k04930q2160J78920
38165C10361R7220j23962m1122J38830j027k16301o3504K08792J21896j13219
$$ plain form
38155 317964 287449 453063 470120 213882 53986 177019 276951 196377 229079 485408
38145 485408 596428 379919 195822 304984 452494 414562 391514 528900 598746 478168
38135 478168 407519 471948 378059 47086 -139480 -5734 82311 -112594 -267457 -113809
38125 -113809 72680 4143 -115266 -31060 97817 85211 110692 325262 497338 437886
38115 437886 360133 449736 498384 326179 145353 143102 125344 -62072 -179485 -26939 180590
38104 180590 226390 259528 396991 404610 162009 5915 192913 435812 399953 253575
38094 253575 280585 343347 210529 62974 174986 390948 401233 280093 292085 396767
38084 396767 379036 261457 186732 94466 -110495 -270553 -210070 -62865 -50183 -143965 -237582
$$ packed form
38155C17964l0515J65614J7057k56238j59896J23033R9932q0574L2702K56329
38145D85408J11020k16509j84097J09162J47510l7932k3048J37386O9846j20578
38135D78168p0649O4429r3889l30973j86566J33746Q8045j94905j54863J53648
38125a13809J86489o8537j19409Q4206J28877j2606K5481K14570J72076n9452
38115D37886p7753Q9603M8648j72205j80826k251j7758j87416j17413J52546K07529
38104A80590M5800L3138J37463P619k42601j56094J86998K42899l5859j46378
38094B53575K7010O2762j32818j47555J12012K15962J0285j21140J1992J04682
38084C96767j7731j17579p4725r2266k04961j60058O0483J47205J2682r3782r3617
$$ plain form
38073 -237582 -396673 -637652 -726565 -522163 -262553 -195798 -191346 -38248 146041 148394 50592
38062 50592 49824 116055 133850 152096 212099 184193 43100 15495 183268 269483 115450
38051 115450 9976 197252 419109 344058 118352 67568 153335 159547 137646 224639 275085
38040 275085 119638 -40936 63816 294048 339850 227356 170457 139205 9386 -64594
38030 -64594 125058 410516 469359 317746 187477 89928 -89567 -237545 -170092 5859
38020 5859 76042 95983 207693 281891 152800 6656 98296 270183 208024 -4766 -62905
38009 -62905 -581 -70259 -191461 -49526 320586 552184 522119 449280 444716 408319 358106
37998 358106 429742 543637 472048 241443 101523 115333 138846 159969 279324 401462
$$ packed form
38073b37582j59091k40979q8913K04402K59610O6755M452J53098J84289K353r7802
38062E0592p68O6231J7795J8246O0003k7906j41093k7605J67773Q6215j54033
38051A15450j05474J87276K21857p5051k25706n0784Q5767O212k1901Q6993N0446
38040B75085j55447j60574J04752K30232M5802j12494n6899l1252j29819p3980
38030f4594J89652K85458N8843j51613j30269r7549j79495j47978O7453J75951
38020E859P0183J9941J11710P4198j29091j46144R1640J71887o2159k12790n8139
38009f2905O2324o9678j21202J41935L70112K31598l0065p2839m564l6397n0213
37998C58106P1636J13895p1589k30605j39920J3810K3513K1123J19355J22138
$$ plain form
37988 401462 337274 178662 181135 307618 288396 110517 35437 127082 171520 99608 100263
37977 100263 253249 397631 425988 400989 344979 211134 82850 112030 249085 304891
37967 304891 260661 244300 249205 169678 55693 25336 -4624 -174344 -348155 -283821 -66039
37956 -66039 7702 -75186 -51000 140265 279396 272057 244540 224751 103186 -65569 -84573
37945 -84573 37118 100834 87595 157928 285136 263868 102270 31779 97698 109804 33160
37934 33160 54791 214644 332664 351407 397083 460407 379292 182413 85369 101610 27572
37923 27572 -144831 -193468 -100858 -119252 -315292 -448849 -412665 -400150 -507047 -546718 -414340
37912 -414340 -283627 -281239 -282869 -178048 -39608 90420 282638 481813 494308 317013
$$ packed form
37988D01462o4188j58612K473J26483j9222j77879p5080R1645M4438p1912O55
37977A00263J52986J44382K8357k4999n6010j33845j28284K9180J37055N5806
37967C04891m4230j6361M905p9527j13985l0357k9960j69720j73811O4334K17782
37956f6039P3741q2888K4186J91265J39131p339k7517j9789j21565j68755j9004
37945h4573J21691O3716j3239P0333J27208k1268j61598p0491O5919J2106p6644
37934C3160K1631J59853J18020J8743M5676O3324q1115j96879r7044J6241p4038
37923B7572j72403m8637R2610j8394j96040j33557L6184J2515j06897l9671J32378
37912d14340J30713K388j630J04821J38440J30028J92218J99175J2495j77295
$$ plain form
37902 317013 177238 164640 143334 92654 168961 340108 346149 145998 19227 88259 132456
37891 132456 33060 -3381 139716 247344 172381 97966 151267 119492 -164492 -480736 -566819
37880 -566819 -517202 -540784 -582437 -493219 -354096 -326788 -360394 -317712 -235233 -216536 -219601
37869 -219601 -167703 -119742 -133826 -123523 -38037 -12786 -145526 -289824 -270987 -157984 -131800
37858 -131800 -220100 -333458 -431115 -493881 -463166 -347668 -264247 -261432 -244733 -167139 -119159
37847 -119159 -134922 -103548 15991 87125 19738 -85840 -128523 -152718 -205130 -235890 -229621
37836 -229621 -238541 -221793 -79105 99345 81939 -134088 -286127 -258068 -215559 -238561 -175385
37825 -175385 -4974 25650 -174921 -330266 -236304 -84634 -97192 -152933 -54586 116464
$$ packed form
37902C17013j39775j2598k1306n0680P6307J71147O041k00151j26771O9032M4197
37891A32456r9396l6441J43097J07628p4963p4415N3301l1775k83984l16244q6083
37880e66819M9617k3582m1653Q9218J39123K7308l3606M2682Q2479J8697l065
37869b19601N1898M7961j4084J0303Q5486K5251j32740j44298J8837J13003K6184
37858a31800q8300j13358r7657o2766L0715J15498Q3421K815J6699P7594M7980
37847a19159j5763L1374J19539P1134o7387j05578m2683k4195n2412l0760O269
37836b29621q920J6748J42688J78450j7406k16027j52039K8059M2509k3002O3176
37825a75385J70411L0624k00571j55345R3962J51670j2558n5741R8347J71050
$$ plain form
37815 116464 194353 219111 258067 189054 -56291 -268503 -258486 -155986 -143824 -129981 33265
37804 33265 234153 303018 316952 406958 464921 344254 164520 119128 153458 110690 12200
37793 12200 -75866 -242566 -508803 -628144 -432332 -161928 -111796 -158387 -15646 230844
37783 230844 263452 71874 -63963 -45592 -19447 -32249 2126 36704 -49919 -162603 -99382
37772 -99382 76699 111706 -12432 -59671 50500 140597 111321 81107 137722 203587 199539
37761 199539 137746 32417 -100510 -173859 -140036 -120880 -234276 -362902 -310451 -112706
37751 -112706 37478 99729 174616 250833 223743 122902 75153 77882 35728 -29742 -32931
37740 -32931 -18130 -65851 -85179 47839 225935 255997 192661 236945 365079 366967 218753
$$ packed form
37815A16464P7889K4758L8956o9013k45345k12212J0017J02500J2162J3843J63246
37804C3265K00888O8865J3934R0006N7963j20667j79734m5392L4330m2768r8490
37793A2200q8066j66700k66237j19341J95812K70404N0132m6591J42741K46490
37783B30844L2608j91578j35837J8371K6145j2802L4375L4578q6623j12684O3221
37772i9382J76081L5007j24138m7239J10171R0097k9276l0214N6615O5865m048
37761A99539o1793j05329j32927p3349L3823J9156j13396j28626N2451J97745
37751a12706J50184O2251P4887P6217k7090j00841m7749K729m2154o5470l189
37740c2931J4801m7721j9328J33018J78096L0062o3336M4284J28134J888j48214
$$ plain form
37729 218753 106053 86449 30966 -91090 -158284 -145114 -151084 -168142 -90202 30329 14950
37718 14950 -118155 -138622 31266 191114 175347 65953 13517 37691 78195 88259 30073
37707 30073 -91958 -184242 -172765 -125628 -132537 -130523 -16156 144771 207912 179292 167907
37696 167907 196326 246473 374269 560555 589593 341621 69872 84714 288706 360377
37686 360377 282227 300722 437047 455391 308077 209034 235855 239225 193009 264116 467324
37675 467324 598628 585005 572467 605298 552719 421289 399840 510143 543238 430843 354498
37664 354498 396422 408925 325717 274423 277139 168391 -76515 -253586 -277863 -290971 -319854
37653 -319854 -188512 95712 238371 114733 -23755 7744 30914 -122292 -276064 -219738
$$ packed form
37729B18753j12700j9604n5483j22056o7194J3170n970j7058P7940J20531j5379
37718A4950j33105k0467J69888J59848j5767j09394n2436K4174M0504J0064n8186
37707C0073j22031r2284J1477M7137o909K014J14367J60927O3141k8620j1385
37696A67907K8419N0147J27796J86286K9038k47972k71749J4842K03992P1671
37686C60377p8150J8495J36325J8344j47314r9043K6821L370m6216P1107K03208
37675D67324J31304j3623j2538L2831n2579j31430k1449J10303L3095j12395p6345
37664C54498M1924J2503q3208n1294K716j08748k44906j77071k4277j3108k8883
37653c19854J31342K84224J42659j23638j38488L1499K3170j53206j53772N6326
$$ plain form
37643 -219738 -64884 -19682 -51562 -38636 -36249 -132996 -233659 -228882 -208640 -286546 -379939
37632 -379939 -371601 -325687 -346188 -379470 -338850 -265261 -197200 -53167 188641 367227 362344
37621 362344 275030 236174 214018 155918 129063 173059 208476 226835 349110 554307 603601
37610 603601 408220 212956 213843 256823 147572 52 2523 63947 -10220 -171825 -245077
37599 -245077 -231307 -231997 -217349 -128774 -63215 -101710 -106250 53204 221983 184349 21980
37588 21980 -35463 7840 -22714 -124890 -133278 -24076 58917 46247 -7611 -61960 -85863
37577 -85863 -3945 163642 222602 70598 -91944 -45312 98108 85759 -66777 -149224 -127172
37566 -127172 -131312 -156722 -86651 29991 27088 -77083 -109179 -51748 -49823 -121201 -132604 -61517
$$ packed form
37643b19738J54854M5202l1880J2926K387r6747j00663M777K0242p7906r3393
37632c79939Q338M5914k0501l3282M0620P3589O8061J44033K41808J78586m883
37621C62344q7314l8856k2156n8100k6855M3996L5417J8359J22275K05197M9294
37610F03601j95381j95264Q87M2980j09251j47520K471O1424p4167j61605p3252
37599b45077J3770o90J4648Q8575O5559l8495m540J59454J68779l7634j62369
37588B1980n7443M3303l0554j02176q388J09202Q2993j2670n3858n4349k3903
37577h5863Q1918J67587N8960j52004j62542M6632J43420j2349j52536q2447K2052
37566a27172m140k5410P0071J16642k903j04171l2096N7431J925p1378j1403P1087
$$ plain form
37554 -61517 -17400 -1510 89251 207954 173764 -22744 -175503 -163724 -69054 38203 192709
37543 192709 363182 414248 313520 191003 134538 97688 49175 32471 32372 -38595 -165496
37532 -165496 -205007 -91011 72608 166455 177274 145376 117016 152281 248283 268583 99561
37521 99561 -142324 -230480 -141121 -57073 -61425 -40831 68630 150248 103016 -1276 -49368
37510 -49368 -43561 -46806 -77907 -128045 -195141 -257593 -290376 -324425 -406989 -502576 -527297 -474986
37498 -474986 -408914 -344803 -257496 -189023 -220049 -328921 -396178 -356171 -245094 -113418 144
37487 144 29061 -64108 -200370 -263123 -245969 -218817 -186938 -105911 2030 75672 120352 158278
37475 158278 127862 -18458 -168653 -171154 -61287 4004 322 36735 124719 146032 60107
$$ packed form
37554f1517M4117J5890R0761J18703l4190j96508j52759J1779R4670J07257J54506
37543A92709J70473N1066j00728j22517n6465l6850m8513j6704r9p0967j26901
37532a65496l9511J13996J63619R3847J0819l1898k8360L5265R6002K0300j69022
37521I9561k41885q8156Q9359Q4048m352K0594J09461Q1618m7232j04292m8092
37510d9368N807l245l1101n0138o7096o2452l2783l4049q2564r5587k4721N2311
37498d74986O6072O4111Q7307O8473l1026j08872o7257M0007J11077J31676J13562
37487A44K8917r3169j36262o2753J7154K7152L1879Q1027J07941P3642M4680L7926
37475A58278l0416j46320j50195k501J09867O5291l682L6413Q7984K1313q5925
$$ plain form
37464 60107 -40177 -98598 -152217 -199245 -174395 -83984 -21546 -28451 -65769 -119576 -200631 -260987
37452 -260987 -258919 -275819 -401647 -537414 -503001 -321774 -191567 -176033 -144251 -39928 12002
37441 12002 -73075 -204419 -270127 -262178 -194216 -56640 90175 129143 51383 -18228 5278
37430 5278 88689 182059 258458 252612 115822 -58686 -112879 -23160 119645 286686 482482
37419 482482 588344 471082 238434 140869 207999 234301 146401 104449 176673 197574 61666
37408 61666 -93433 -125525 -86032 -51692 30132 189137 313952 324359 296945 300963 273865
37397 273865 170576 68166 11597 -76640 -224782 -321436 -308296 -291415 -345174 -376804 -307170
37386 -307170 -218037 -191857 -164688 -66469 42612 96721 138836 201473 224771 195233 203307
$$ packed form
37464F0107j00284n8421n3619m7028K4850R0411O2438o905l7318n3807q1055o0356
37452b60987K068j6900j25828j35767L4413J81227J30207J5534L1782J04323N1930
37441A2002q5077j31344o5708P949O7962J37576J46815L8968p7760o9611K3506
37430E278Q3411R3370P6399n846j36790j74508n4193Q9719J42805J67041J95796
37419D82482J05862j17262k32648r7565O7130K6302q7900m1952P2224K0901j35908
37408F1666j55099l2092L9493L4340Q1824J59005J24815J0407k7414M018k7098
37397B73865j03289j02410n6569q8237j48142r6654J3140J6881n3759l1630O9634
37386c07170Q9133K6180K7169R8219J09081N4109M2115O2637K3298k9538Q074
$$ plain form
37375 203307 263124 250675 122754 6024 -37711 -118333 -262584 -290629 -118107 49034
37365 49034 25341 -63018 -25093 59862 18378 -72429 -4210 206311 350175 340916 256810
37354 256810 141659 -655 -73235 18841 176432 215540 131707 65210 51995 8815 -73011
37343 -73011 -118173 -125653 -151015 -156956 -63070 79844 146488 148794 209267 331658 380695 304823
37331 304823 214614 208682 255247 276223 245050 186378 157822 216134 327853 361049 252413
37320 252413 115576 78125 89344 21387 -111004 -183133 -158002 -98083 -23456 87411 187914
37309 187914 205087 168451 160229 167911 125683 67414 86087 161987 182025 122040 71336 81447
37297 81447 116445 141594 143372 88550 -11752 -34758 114139 325457 404174 343586 315961
$$ packed form
37375B03307N9817j2449j27921j16730m3735q0622j44251k8045J72522J67141
37365D9034k3693q8359L7925Q4955m1484r0807O8219K10521J43864r259q4106
37354B56810j15151j42314p2580R2076J57591L9108q3833o6497j3215m3180q1826
37343g3011m5162p480k5362n941R3886J42914O6644K306O0473J22391M9037p5872
37331C04823r0209n932M6565K0976l1173n8672k8556N8312J11719L3196j08636
37320B52413j36837l7451J1219o7957j32391p2129K5131N9919P4627J10867J00503
37309A87914J7173l6636q222P682m2228n8269J8673P5900K0038n9985n0704J0111
37297H1447L4998K5149J778n4822j00302k3006J48897K11318P8717o0588k7625
$$ plain form
37286 315961 392788 447282 368044 216722 116139 96175 105855 96733 54809 4551 -8821
37275 -8821 17817 29901 11190 28405 100064 106928 -42148 -228193 -259764 -146501 -73537
37264 -73537 -127852 -215556 -250899 -267656 -314893 -371138 -393449 -357714 -248750 -102719 -36998
37253 -36998 -127100 -274640 -311272 -208355 -66871 59203 184595 270541 250087 177213 190514
37242 190514 307215 395588 373902 300091 237621 164542 55461 -54598 -123070 -135775 -89545
37231 -89545 -23359 -37184 -166783 -272924 -192872 20552 161559 158475 132243 161936 165404
37220 165404 53188 -148189 -370934 -571624 -685222 -644125 -486232 -331394 -223561 -110067
37210 -110067 11568 63491 30582 -2074 9370 13575 -19298 -54354 -92779 -182052 -291278
$$ packed form
37286C15961P6827N4494p9238j51322j00583j9964R680r122m1924n0258j3372
37275h821K6638J2084j8711J7215P1659O864j49076j86045l1571J13263P2964
37264g3537n4315q7704l5343j6757m7237n6245k2311L5735J08964J46031O5721
37253c6998r0102j47540l6632J02917J41484J26074J25392Q5946k0454p2874J3301
37242A90514J16701Q8373k1686p3811o2470p3079j09081j10059o8472j2705M6230
37231h9545O6186j3825j29599j06141Q0052K13424J41007l084k6232K9693L468
37220A65404j12216k01377k22745k00690j13598M1097J57893J54838J07833J13494
37210a10067J21635N1923l2909l2656J1444M205l2873l5056l8425q9273j09226
$$ plain form
37199 -291278 -309217 -206503 -76047 16766 90817 131515 71704 -59832 -119578 -42871 75302
37188 75302 146228 193280 232957 202057 89085 2342 9984 27716 -39928 -150294 -205383
37177 -205383 -190435 -145330 -83985 -19408 12120 19029 65112 155742 203339 160263 88311 41430
37165 41430 -12686 -91088 -129721 -96634 -64156 -85464 -101325 -55340 147 6724 8612 53645
37153 53645 77155 3871 -104941 -128147 -61254 -5564 -16769 -67564 -135449 -226489 -313310
37142 -313310 -329853 -244523 -98991 28003 78765 59040 36369 67725 124328 130831 77617
37131 77617 31948 31502 40060 26909 16377 30958 50106 50937 33556 -5237 -62674 -96044 -71757
37118 -71757 -41131 -77736 -145355 -133869 -29533 64953 92301 102827 135181 159579 171208
$$ packed form
37199b91278j7939J02714J30456R2813P4051M0698n9811j31536n9746P6707J18173
37188G5302P0926M7052L9677l0900j12972q6743P642J7732o7644j10366n5089
37177b05383J4948M5105O1345O4577L1528O909M6083R0630M7597m3076p1952m6881
37165D1430n4116p8402l8633L3087L2478k1308j5861M5985N5487O577J888M5033
37153E3645K3510p3284j08812k3206O6893N5690j1205n0795o7885r1040q6821
37142c13310j6543Q5330J45532J26994N0762j9725k2671L1356N6603O503n3214
37131G7617m5669m46Q558j3151j0532J4581J9148Q31j7381l8793n7437l3370K4287
37118g1757L0626l6605o7619J1486J04336R4486K7348J0526L2354K4398J1629
$$ plain form
37107 171208 216858 289103 312352 275700 264163 316440 364259 349402 287558 191566 60709
37096 60709 -30952 13994 141830 185091 117732 97949 197731 280462 236908 154535 137941
37085 137941 138464 91115 51200 54107 6049 -126747 -180508 -28257 188157 256234 201999
37074 201999 191565 222303 141353 -76176 -279583 -359891 -341149 -267304 -153634 -41868 30497
37063 30497 97940 186177 210604 96139 -45983 -25137 158984 309951 302390 211775 158044
37052 158044 151421 132589 66914 -40209 -154868 -221720 -210471 -156925 -119352 -116567 -146414
37041 -146414 -217733 -309745 -352089 -309210 -238078 -207726 -217985 -244899 -286730 -308442 -237834
37030 -237834 -90495 5597 -5452 -14977 56103 101335 7547 -128197 -130262 -5845 98072
$$ packed form
37107A71208M5650P2245K3249l6652j1537N2277M7819j4857o1844r5992j30857
37096F0709r1661M4946J27836M3261o7359j9783R9782Q2731m3554q2373j6594
37085A37941N23m7349l9915K907m8058j32796n3761J52251K16414O8077n4235
37074B01999j0434L0738q0950k17529k03407q0308J8742P3845J13670J11766P2365
37063C0497O7443Q8237K4427j14465j42122K0846J84121J50967p561r0615n3731
37052A58044o623j8832o5675j07123j14659o6852J1249N3546L7573K785k9847
37041a46414p1319r2012m2344M2879P1132L0352j0259k6914m1831k1712P0608
37030b37834J47339R6092j1049r525P1080M5232r3788j35744k065J24417J03917
$$ plain form
37019 98072 129197 147185 163362 140891 118349 166328 247709 271192 247803 247343 250613 207243
37007 207243 185245 277664 402898 398313 288458 251694 324658 353047 254674 122028 24916
36996 24916 -85855 -218358 -269723 -190207 -58612 65065 200854 306911 257582 53031
36986 53031 -114579 -113121 -46148 -65278 -143347 -167288 -144028 -160072 -201859 -162872 -9146
36975 -9146 173842 295799 342756 344770 324754 289295 238532 179326 133522 121495 140810 178241
36963 178241 224943 252916 210604 91127 -27996 -73507 -72922 -96474 -140389 -148668 -118375 -96597
36951 -96597 -102022 -133676 -214810 -330043 -371328 -270742 -142466 -150211 -267915 -329842 -292536
36940 -292536 -266190 -289165 -269843 -183691 -128350 -119947 -28436 188502 361579 340990 208539
$$ packed form
37019I8072L1125J7988J6177k2471k2542M7979Q1381K3483k3389m60L270m3370
37007B07243k1998R2419J25234m585j09855l6764P2964K8389r8373j32646r7112
36996B4916j10771j32503n1365P9516J31595J23677J35789J06057m9329k04551
36986E3031j67610J458O6973j9130p8069k3941K3260j6044m1787L8987J53726
36975i146J82988J21957M6957K014k0016l5459n0763n9206m5804j2027J9315L7431
36963A78241M6702K7973m2312j19477j19123m5511N85k3552m3915q279L0293K1778
36951i6597n425l1654q1134j15233m1285J00586J28276p745j17704o1927L7306
36940b92536K6346k2975J9322Q6152N5341Q403R1511K16938J73077k0589j32451
$$ plain form
36929 208539 132487 134117 134128 128580 168894 226638 212265 101462 -50947 -188590 -268121 -245534
36917 -245534 -133349 -31569 -19524 -48040 -12342 98593 197847 222601 192885 160884 157253
36906 157253 182162 209754 205862 162839 104090 47205 -6033 -34915 15 100420 211038
36895 211038 277780 294932 284380 261649 229412 173913 74701 -43509 -88319 10924 201326
36884 201326 357989 428970 460351 486028 474814 396915 272054 138920 31530 -19396 -18594
36873 -18594 -19955 -45328 -30411 61585 124890 37313 -131384 -188013 -87809 19478 30248
36862 30248 7554 16149 794 -89204 -187759 -217778 -206921 -214246 -229919 -223149 -208776 -197760
36850 -197760 -157989 -85868 -40122 -44290 -30563 58478 179801 257831 282164 290102 306718 337640
$$ packed form
36929B08539p6052J630J1n548M0314N7744j4373j10803j52409j37643p9531K2587
36917b45534J12185J01780J2045k8516L5698J10935R9254K4754k9716l2001l631
36906A57253K4909K7592l892m3023n8749n6885n3238k8882L4930J00405J10618
36895B11038O6742J7152j0552k2731l2237n5499r9212j18210m4810R9243J90402
36884B01326J56663P0981L1381K5677j1214p7899j24861j33134j07390n0926Q02
36873a8594j361k5373J4917R1996O3305q7577j68697n6629J00204J07287J0770
36862C0248k2694Q595j5355q9998r8555l0019J0857p325j5673O770J4373J1016
36850a97760L9771P2121M5746m168J3727Q9041J21323P8030K4333P938J6616L0922
$$ plain form
36838 337640 369042 356920 274585 172146 120017 110900 107452 149045 274166 364501 249669
36827 249669 -15597 -171955 -106966 2113 -22441 -111271 -105327 -2368 90230 129926 138797
36816 138797 123847 105366 138514 220085 266825 257431 282617 380082 449340 417832 357913 343367
36804 343367 330035 285985 293407 393492 469196 420063 320409 261390 176369 -9856 -187823
36793 -187823 -207385 -112686 -49709 -32978 8112 37341 -32905 -157047 -220648 -235743 -282875
36782 -282875 -313078 -215291 -51430 -12724 -137597 -263175 -274328 -226387 -194171 -162516 -111855
36771 -111855 -79893 -90709 -117639 -137359 -139356 -90693 17769 111189 114985 71368 68794 92146
36759 92146 59962 -22898 -72876 -59672 -12433 67839 174974 220630 136204 18117 18221 114310
$$ packed form
36838C37640L1402j2122q2335j02439n2129r117l448M1593J25121R0335j14832
36827B49669k65266j56358O4989J09079k4554q8830N944J02959R2598L9696Q871
36816A38797j4950j8481L3148Q1571M6740r394K5186R7465O9258l1508n9919j4546
36804C43367j3332m4050P422J00085P5704m9133r9654n9019q5021j86225j77967
36793a87823j9562R4699O2977J6731M1090K9229p0246j24142o3601j5095m7132
36782b82875l0203R7787J63861L8706j24873j25578j1153M7941L2216L1655N0661
36771a11855L1962j0816k6930j9720j997M8663J08462R3420L796m3617k574K3352
36759I2146l2184q2860m9978J3204M7239Q0272J07135M5656q4426j18087J04R6089
$$ plain form
36747 114310 148899 78514 14823 19754 34258 30438 65647 144741 178714 129645 69270 52722
36735 52722 53189 53781 81816 117027 87312 -1229 -40557 28879 138836 197158 181650 110587
36723 110587 14295 -47135 -33492 -4659 -55408 -165483 -218870 -175383 -110028 -75479 -44842
36712 -44842 -3206 26652 67787 174103 306653 344482 246608 91241 -59705 -204594 -293315
36701 -293315 -232084 -56792 39139 -63428 -252452 -336897 -270840 -158510 -111085 -159859 -251519
36690 -251519 -284839 -204941 -82620 -38673 -84163 -114613 -65364 20687 88155 132808 157739
36679 157739 163822 191304 266739 308114 207731 20604 -69728 -6528 58625 -8300 -148395
36668 -148395 -229559 -226431 -200129 -186214 -177764 -159055 -108067 -19714 55502 63226 34557 37546
$$ packed form
36747A14310L4589p0385o3691M931J4504l820L5209P9094L3973m9069o0375j6548
36735E2722M67N92K8035L5211k9715q8541l9328O9436J09957N8322j5508p1063
36723A10587r6292o1430J3643K8833n0749j10075n3387M3487O5355L4549L0637
36712d4842M1636K9858M1135J06316J32550L7829r7874j55367j50946j44889q8721
36701b93315O1231J75292R5931j02567j89024q4445O6057J12330M7425m8774r1660
36690b51519l3320P9898J22321M3947m5490l0450M9249Q6051O7468M4653K4931
36679A57739O083K7482P5435M1375j00383j87127r0332O3200O5153o6925j40095
36668a48395q1164L128K6302J3915Q450J8709N0988Q8353P5216P724k8669K989
$$ plain form
36656 37546 53360 15692 -37008 7899 143394 232271 219535 198868 222057 201691 71965
36645 71965 -99403 -235505 -351420 -455271 -482077 -413339 -343733 -343957 -364479 -347626 -323599
36634 -323599 -326170 -327355 -321266 -354034 -410571 -402749 -329079 -296145 -312596 -233737 -8918 191555
36622 191555 222902 172106 170895 164323 45480 -113861 -167674 -134887 -137794 -172533 -135425 -34596
36610 -34596 10537 -32807 -72566 -49600 382 42755 86453 128244 147603 154282 169233 175495
36598 175495 146337 89237 15157 -79675 -156905 -143337 -51758 2754 -24554 -30120 60158 157798
36586 157798 161015 112002 82924 34676 -63134 -98892 14124 142096 99576 -63896 -147219
36575 -147219 -105636 -63998 -61977 -8153 110677 180852 153114 107770 92624 50353 -51354
$$ packed form
36656C7546J5814l7668n2700M4907J35495Q8877j2736k0667K3189k0366j29726
36645G1965j71368j36102j15915j03851k6806O8738O9606k24k0522J6853K4027
36634c23599k571j185O089l2768n6537P822P3670L2934j6451P8859K24819K00473
36622A91555L1347n0796j211o572j18843j59341n3813L2787k907l4739L7108J00829
36610c4596M5133m3344l9759K2966M9982M2373M3698M1791J9359O679J4951O262
36598A75495k9158n7100p4080r4832p7230J3568R1579N4512k7308n566R0278R7640
36586A57798L217m9013k9078m8248r7810l5758J13016J27972m2520j63472q3323
36575a47219M1583M1638K021N3824J18830P0175k7738m5344j5146m2271j01707
$$ plain form
36564 -51354 -150218 -191392 -194027 -193117 -205775 -253592 -325653 -340487 -248349 -137820 -123425 -169431
36552 -169431 -160954 -104215 -94293 -118931 -79738 240 -16950 -150846 -258018 -254255 -210214 -189637
36540 -189637 -165140 -140323 -179289 -251036 -214606 -38626 121214 147853 113792 115215 111482
36529 111482 50998 21134 126049 305099 409150 397593 345811 307332 268734 201420 78947
36518 78947 -111784 -308747 -381913 -277740 -106419 -16016 -31174 -80645 -121025 -152203 -163581
36507 -163581 -152531 -159501 -207716 -245035 -221634 -185889 -216759 -290490 -308621 -246993 -183041 -166375
36495 -166375 -148975 -73693 36999 123246 169623 195284 193093 136806 44823 -21972 -51205
36484 -51205 -117418 -273267 -430365 -430685 -248335 -38520 53589 53919 65574 90777 53238 -39279
$$ packed form
36564e1354r8864m1174k635R10j2658m7817p2061j4834R2138J10529J4395m6006
36552a69431Q477N6739R922k4638L9193P9978j7190j33896j07172L763M4041K0577
36540a89637K4497K4817l8966p1747L6430J75980J59840K6639l4061J423l733
36529A11482o0484k9864J04915J79050J04051j1557n1782l8479l8598o7314j22473
36518G8947j90731j96963p3166J04173J71321R0403j5158m9471m0380l1178j1378
36507a63581J1050o970m8215l7319K3401L5745l0870p3731j8131O1628O3952J6666
36495a66375J7400P5282J10692Q6247M6377K5661k191n6287r1983o6795k9233
36484e1205o6213j55849j57098l20J82350K09815R2109L30J1655K5203l7539r2517
$$ plain form
36472 -39279 -74435 13418 164655 285780 340838 331579 263872 171259 116192 129476 179192
36461 179192 214520 207458 149710 53837 -35372 -73011 -62143 -31390 27155 142103 281915
36450 281915 349779 284923 137141 22881 18601 90449 120045 27706 -118297 -167090 -81224
36439 -81224 12930 19555 14976 97669 196270 175385 67767 25762 66153 48863 -74560 -172335
36427 -172335 -143940 -58484 -9005 25575 78829 82394 -29745 -185286 -252724 -205887 -120261
36416 -120261 -45491 38269 157940 297171 394481 371655 204363 -18865 -164901 -204441
36406 -204441 -227956 -293208 -341975 -313331 -254786 -249372 -294050 -327751 -336989 -352576 -359605 -288002
36394 -288002 -110886 90266 190627 151836 66411 46324 78757 53092 -54803 -118592 -48464
$$ packed form
36472c9279l5156Q7853J51237J21125N5058r259o7707r2613n5067J3284M9716
36461A79192L5328p062n7748r5873q9209l7639J0868L0753N8545J14948J39812
36450B81915O7864o4856j47782j14260m280P1848K9596r2339j46003m8793Q5866
36439h1224R4154O625m579Q2693R8601k0885j07618m2005M0391j7290j23423r7775
36427a72335K8395Q5456M9479L4580N3254L565j12139j55541o7438M6837Q5626
36416a20261P4770Q3760J19671J39231R7310k2826j67292k23228j46036l9540
36406b04441k3515o5252m8767K8644N8545N414m4678l3701r238j5587p029P1603
36394b88002J77116K01152J00361l8791q5425k0087L2433k5665j07895o3789P0128
$$ plain form
36383 -48464 50102 20488 -107915 -170522 -120125 -69674 -85767 -102305 -70896 -48081 -79021
36372 -79021 -117863 -118175 -98456 -79444 -61382 -87735 -208067 -349255 -361954 -237157 -133280
36361 -133280 -136561 -146424 -67048 41143 86012 70424 2589 -163997 -386450 -480631 -354886
36350 -354886 -168033 -110286 -146279 -128133 -48310 -5350 -8908 504 5132 -40731 -70762 7064
36338 7064 125346 136778 54974 38434 136400 220207 186945 80730 -16225 -75267 -69843 37122
36326 37122 199823 283935 211187 44132 -103977 -181515 -202290 -202980 -221442 -269418 -311569
36315 -311569 -303472 -243162 -155437 -54913 36830 82569 88055 113199 164007 145852 10860
36304 10860 -125246 -130859 -56113 -39466 -68341 -10895 121166 135776 -54205 -268527 -281896
$$ packed form
36383d8464R8566k9614j28403o2607N0397N0451j6093j6538L1409K2815l0940
36372g9021l8842l12J9719J9012J8062k6353j20332j41188j2699J24797J03877
36361a33280l281r863P9376J08191M4869j5588o7835j66586k22453r4181J25745
36350c54886J86853N7747l5993J8146P9823M2960l558R412M628m5863l0031P7826
36338G064J18282J1432q1804j6540R7966Q3807l3262j06215r6955n9042N424J06965
36326C7122J62701Q4112p2748j67055j48109p7538k0775o90j8462m7976m2151
36315c11569Q097O0310Q7725J00524R1743M5739N486K5144N0808j8155j34992
36304A0860j36106n613P4746J6647k8875N7446J32061J4610j89981k14322j3369
$$ plain form
36293 -281896 -104855 57585 63225 -42158 -122308 -94849 18893 137434 193932 179527 131681
36282 131681 104335 147008 265319 381617 391309 295630 215971 226490 248879 190557 107329
36271 107329 114115 192333 222338 177464 142003 141054 101084 7205 -38977 24384 117224 140784
36259 140784 117188 133419 206733 274331 281400 228908 158366 121757 143039 187619 193266 144668
36247 144668 93040 92786 140013 177533 147595 51515 -30756 -12002 87585 140004 60189 -93605
36235 -93605 -219563 -311560 -422801 -543310 -611606 -618683 -600589 -543223 -396359 -186754 -27328
36224 -27328 4866 -61413 -144946 -179944 -143738 -76593 -56952 -102414 -129919 -75339 2032 17139
36212 17139 -4860 -5465 -43836 -216692 -454067 -561353 -474231 -316465 -183431 -32314 160330
$$ packed form
36293b81896J77041J62440N640j05383q0150K7459J13742J18541N6498j4405m7846
36282A31681k7346M2673J18311J16298R692r5679p9659J0519K2389n8322q3228
36271A07329O786P8218L0005m4874l5461r49l9970r3879m6182O3361R2840K3560
36259A40784k3596J6231P3314O7598P069n2492p0542l6609K1282M4580N647m8598
36247A44668n1628k54M7227L7520k9938r6080q2271J8754R9587N2419p9815j53794
36235i3605j25958r1997j11241j20509o8296p077J8094N7366J46864K09605J59426
36224b7328L2194o6279q3533l4998L6206O7145J9641m5462k7505N4580P7371J5107
36212A7139k1999o05l8371j72856k37375j07286Q7122J57766J33034J51117J92644
$$ plain form
36201 160330 290782 272816 177224 130424 152061 174450 159400 122344 87107 74635 101462
36190 101462 152533 188917 198059 195533 180252 147541 136360 183341 236451 210753 133624 126864
36178 126864 225139 320965 321837 256911 188832 123365 56308 15905 4084 -24564 -80722 -115478
36166 -115478 -111890 -114076 -130967 -108744 -42561 -15245 -70117 -139337 -155342 -141493 -134515 -112441
36154 -112441 -66032 -50057 -90242 -122593 -97096 -58842 -51217 -22404 84524 219133 290307
36143 290307 289585 269171 250505 230059 225653 243055 237732 171372 65976 -43110 -150821 -234334
36131 -234334 -234207 -143912 -50381 -20937 -12745 43152 131673 190161 193631 148252 67525 4763
36119 4763 25129 88798 63085 -72855 -145633 -17242 199916 286449 199034 70470 -19222
$$ packed form
36201A60330J30452j7966r5592m6800K1637K2389j5050l7056l5237j2472K6827
36190A01462N1071L6384R142k526j5281l2711j1181M6981N3110k5698p7129o760
36178A26864R8275R5826Q72o4926o8079o5467o7057m0403j1821k8648n6158l4756
36166a15478L588k186j6891K2223O6183K7316n4872o9220j6005J3849O978K2074
36154a12441M6409J5975m0185l2351K5497L8254P625K8813J06928J34609P1174
36143B90307p22k0414j8666k0446m406J7402n323o6360j05396j09086j07711q3513
36131b34334J27R0295R3531K9444Q192N5897Q8521N8488L470m5379q0727o2762
36119D763K0366O3669k5713j35940p2778J28391K17158Q6533q7415j28564q9692
$$ plain form
36108 -19222 -119132 -265297 -394258 -421505 -326463 -152996 20176 127852 184908 266223 377850
36097 377850 420802 349043 273733 308809 393451 389986 287625 169810 41858 -140823 -306236
36086 -306236 -315751 -197781 -157485 -297079 -469374 -485429 -356910 -248055 -265275 -374048
36076 -374048 -472472 -476858 -362524 -173731 11567 143379 213850 219613 152896 36448 -72484
36065 -72484 -126847 -118346 -70633 -33574 -66303 -181062 -311810 -379243 -376296 -348497 -308560 -228936
36053 -228936 -116904 -37098 -36815 -81802 -89383 -19288 74393 90506 -3624 -117423 -135300 -54997
36041 -54997 32833 89767 157472 226984 199954 38767 -152141 -272429 -351101 -430203 -425818
36030 -425818 -240173 48921 245417 252583 129414 -24484 -128982 -120074 -19137 28210
$$ packed form
36108a9222r9910j46165j28961k7247R5042J73467J73172J07676N7056Q1315J11627
36097C77850M2952p1759p5310L5076Q4642l465j02361j17815j27952j82681j65413
36086c06236r515J17970M0296j39594j72295j6055J28519J08855j7220j08773
36076c74048r8424m386J14334J88793J85298J31812P0471N763o6717j16448j08932
36065g2484n4363Q501M7713L7059l2729j14759j30748o7433K947K7799L9937P9624
36053b28936J12032P9806K83m4987p581P0095R3681J6113r4130j13799j7877Q0303
36041e4997Q7830N6934O7705O9512k7030j61187j90908j20288p8672p9102M385
36030d25818J85645K89094J96496P166j23169j53898j04498Q908J00937M7347
$$ plain form
36020 28210 -82204 -233039 -212486 -8232 175433 200031 137663 101054 79453 14314 -74971
36009 -74971 -122136 -101591 -30883 54459 93803 35979 -82348 -151997 -116431 -30721 22030
35998 22030 16834 -23995 -67148 -77676 -45498 -9787 -6153 -1878 46200 86465 23344 -121808
35986 -121808 -206866 -156261 -54931 -9538 -3909 41143 126352 167824 110308 -6138 -91181
35975 -91181 -92352 -36049 18476 60025 127761 220846 261448 193467 69664 -17664 -50080 -67463
35963 -67463 -88008 -111650 -150779 -183338 -137565 -10929 68705 12609 -71383 -28831 98575
35952 98575 142780 74504 17517 24158 31141 35724 109335 208652 181216 18206 -93211 -45898
35940 -45898 45728 71803 107693 239434 366335 333951 162737 8709 -32858 14991 74275
$$ packed form
36020B8210j10414j50835K0553K04254J83665K4598o2368l6609k1601o5139q9285
36009g4971m7165K0545P0708Q5342L9344n7824j18327o9649L5566Q5710N2751
35998B2030n196m0829m3153j0528L2178L5711L634M275M8078M0265o3121j45152
35986a21808q5058N0605J01330M5393N629M5052Q5209M1472n7516j16446q5043
35975i1181j171N6303N4525M1549O7736R3085M0602o7981j23803q7328l2416j7383
35963f7463k0545k3642l9129l2559M5773J26636P9634n6096q3992M2552J27406
35952I8575M4205o8276n6987O641O983M583P3611R9317k7436j63010j11417M7313
35940d5898R1626K6075L5890J31741J26901l2384j71214j54028m1567M7849N9284
$$ plain form
35929 74275 51161 -105099 -309399 -396149 -327158 -235444 -206833 -163078 -45851 47756 44128
35918 44128 56586 204120 385833 417769 309299 222595 218798 222605 198902 190014 190228 137242
35906 137242 30357 -68645 -147483 -244199 -350537 -421685 -461721 -496655 -496035 -432618 -378239
35895 -378239 -410508 -460170 -398086 -253463 -185053 -228881 -236619 -104500 79435 176955 172894
35884 172894 139452 116158 93218 57060 3484 -55861 -81198 -43360 22034 52439 44710 41648
35872 41648 45358 21005 -22806 -45430 -63093 -129554 -218257 -225146 -118890 -169 24964 -42477
35860 -42477 -136113 -201276 -197805 -102196 45830 151328 154124 72543 -47582 -165851 -225220
35849 -225220 -179307 -66911 14400 32625 42623 63271 31135 -78756 -183874 -214225 -217277
$$ packed form
35929G4275k3114j56260k04300q6750O8991R1714K8611M3755J17227R3607l628
35918D4128J2458J47534J81713L1936j08470q6704l797L807k3703q888K14n2986
35906A37242j06885r9002p8838r6716j06338p1148m0036l4934O20O3417N4379
35895c78239l2269m9662O2084J44623O8410m3828p738J32119J83935R7520m061
35884A72894l3442k3294k2940l6158n3576n9345k5337L7838O5394L0405p729l062
35872D1648L710k4353m3811k2624j7663o6461q8703o889J06256J18721K5133o7441
35860d2477r3636o5163L471R5609J48026J05498K796q1581j20125j18269n9369
35849b25220M5913J12396Q1311J8225R998K0648l2136j09891j05118l0351l052
$$ plain form
35838 -217277 -262223 -312621 -290563 -214791 -171147 -175736 -169870 -138928 -135029 -171661 -187311 -142637
35826 -142637 -80019 -50178 -40633 -19098 3068 1605 -2574 29152 86903 124317 125844 112780
35814 112780 89531 41803 -5774 3916 66917 92639 24628 -60277 -43571 70035 156261
35803 156261 135650 60566 27199 67750 148419 210799 191246 63315 -104794 -194330 -177399
35792 -177399 -158890 -233226 -355710 -411668 -361709 -250406 -111378 54394 217358 308123
35782 308123 280812 155103 -465 -109082 -140458 -152027 -230686 -355683 -380879 -220585
35772 -220585 5905 113587 98557 126570 276689 420924 403073 239832 78436 20109
35762 20109 53519 118717 165897 169461 144141 143381 194365 237408 181795 34396 -79695 -61117
$$ packed form
35838b17277m4946n0398K2058P5772M3644m589N866L0942L899l6632j5650M4674
35826a42637O2618K9841R545K1535K2166j463m179L1726N7751L7414J527j3064
35814A12780k3249m7728m7577R690O3001K5722o8011q4905J6706J13606Q6226
35803A56261k0611p5084l3367M0551Q0669O2380j9553j27931j68109q9536J6931
35792a77399J8509p4336j22484n5958M9959J11303J39028J65772J62964R0765
35782C08123k7311j25709j55568j08617l1376j1569p8659j24997k5196J60294
35772b20585K26490J07682j5030K8013J50119J44235j7851j63241j61396n8327
35762B0109L3410O5198M7180L564k5320p60N0984M3043n5613j47399j14091J8578
$$ plain form
35750 -61117 38759 91722 66959 53094 100329 133565 73429 -37413 -109881 -145214 -191325
35739 -191325 -211539 -130236 6019 58103 4676 -17738 71697 179528 195222 137366 62957
35728 62957 -43650 -186239 -267804 -206004 -61492 51763 105660 110479 28124 -138282 -254697
35717 -254697 -204579 -67412 -8124 -45282 -73912 -60743 -54026 -44541 7141 32893 -67656
35706 -67656 -220049 -232149 -77289 59832 51888 -34108 -113273 -212981 -348525 -432724 -411041
35695 -411041 -358499 -348389 -340527 -289883 -252890 -286098 -336608 -331811 -291712 -258357 -199612 -86273
35683 -86273 9042 28 -76962 -112985 -72749 -5190 50988 85640 74222 4127 -69925 -67610
35671 -67610 25010 151000 250972 294404 270412 196176 118116 67146 27201 -28165 -89460
$$ packed form
35750f1117R9876N2963k4763j3865M7235L3236o0136j10842p2468l5333m6111
35739a91325k0214Q1303J36255N2084n3427k2414Q9435J07831J5694n7856p4409
35728F2957j06607j42589q1565O1800J44512J13255N3897M819q2355j66406j16415
35717b54697N0118J37167N9288l7158k8630J3169O717R485N1682K5752j00549
35706f7656j52393j2100J54860J37121p944q5996p9165r9708j35544q4199K1683
35695d11041N2542J0110P862N0644L6993l3208n0510M797M0099L3355N8745J13339
35683h6273R5315r014p6990l6023M0236O7559N6178L4652j1418p0095p4052K315
35671f7610R2620J25990R9972M3432k3992p4236p8060n0970l9945n5366o1295
$$ plain form
35660 -89460 -119841 -89855 -4366 70641 24737 -185317 -441671 -562022 -499729 -366635 -254610
35649 -254610 -147300 -36067 9319 -39300 -86674 -44729 39823 79102 84926 113113 133320
35638 133320 69109 -70179 -201339 -285638 -342049 -363294 -311900 -197772 -85746 -23677 -14097
35627 -14097 -42280 -80228 -83588 -40500 -5000 -29188 -83840 -101500 -77968 -72830 -122261 -205261
35615 -205261 -287826 -351361 -380411 -363277 -307970 -235279 -160188 -89127 -20156 52866 107776
35604 107776 80769 -55602 -209030 -244734 -155936 -63604 -26343 33818 166799 280587 281596
35593 281596 223966 209320 222416 186993 118219 90526 99403 83589 55373 82025 151005 175526
35581 175526 136808 109395 130808 144644 97039 10735 -58446 -76005 -29482 65858 155677
$$ packed form
35660h9460l0381K9986Q5489P5007m5904k10054k56354j20351O2293J33094J12025
35649b54610J07310J11233M5386m8619m7374M1945Q4552L9279N824K8187K0207
35638A33320o4211j39288j31160q4299n6411k1245N1394J14128J12026O2069R580
35627a4097k8183l7948l360M3088L5500k4188n4652j7660K3532N138m9431q3000
35615b05261q2565o3535k9050J7134N5307P2691P5091P1061O8971P3022N4910
35604A07776k7007j36371j53428l5704Q8798R2332L7261O0161J32981J13788J009
35593B81596n7630j4646J3096l5423o8774k7693Q877j5814k8216K6652O8980K4521
35581A75526l8718k7413K1413J3836m7605q6304o9181j7559M6523R5340Q9819
$$ plain form
35570 155677 192930 193896 201151 207014 169807 88857 4089 -62553 -110148 -128424 -122039 -131940 -169263
35557 -169263 -171607 -102549 -45324 -97883 -215182 -269288 -235721 -195417 -175865 -137964 -120121
35546 -120121 -227325 -429393 -526101 -402179 -198151 -125244 -199057 -264906 -225879 -132002 -65562
35535 -65562 -36215 -958 72461 177194 271012 304771 266596 194288 132663 89226 41100
35524 41100 -26508 -95407 -120671 -69937 29051 98780 96887 68460 74387 92161 46766 -71130
35512 -71130 -185435 -238023 -246137 -241094 -215539 -164403 -123436 -120586 -121814 -70191 35079 132117
35500 132117 161936 115427 20337 -87923 -167944 -170447 -82038 15814 -14819 -212479 -427772
35489 -427772 -469387 -332710 -194959 -175962 -213324 -211570 -191643 -208423 -224533 -180793 -120946
$$ packed form
35570A55677L7253R66P255N863l7207q0950q4768o6642m7595j8276O385r901l7323
35557a69263k344O9058N7225n2559j17299n4106L3567M0304J9552L7901J7843
35546a20121j07204k02068r6708J23922K04028P2907p3813o5849L9027R3877O6440
35535f5562K9347L5257P3419J04733R3818L3759l8175p2308o1625m3437m8126
35524D1100o7608o8899k5264N0734R8988O9729j893k8427N927J7774m5395j17896
35512g1130j14305n2588q114N043K5555N1136M0967K850j228N1623J05270R7038
35500A32117K9819m6509r5090j08260q0021k503Q8409R7852l0633j97660k15293
35489d27772m1615J36677J37751J8997l7362J754J9927j6780j6110M3740N9847
$$ plain form
35478 -120946 -126816 -175359 -171203 -87015 27942 141285 242430 299050 310804 355136 466809
35467 466809 530976 431393 249629 158683 163467 128709 36579 5915 45358 10940 -132454
35456 -132454 -218903 -145604 -41331 -50765 -111802 -86374 16321 92096 118955 144409 170207
35445 170207 171952 169759 171899 115363 -29441 -159899 -159414 -60366 18116 42134 61061 78889
35433 78889 47033 -35066 -115751 -176057 -234616 -285756 -310916 -330344 -369642 -400640 -386406 -350472
35421 -350472 -324807 -269898 -138727 13315 86937 91474 132862 245006 330942 295721 163236
35410 163236 34204 -19873 -4502 16563 -15292 -79079 -82875 15084 130370 155548 102586
35399 102586 67204 81891 95428 83513 80637 98030 106880 119807 191304 302847 341682 251564
$$ packed form
35478a20946n870m8543M156Q4188J14957J13343J01145N6620J1754M4332J11673
35467D66809O4167r9583j81764r0946M784l4758r2130l0664L9443l4418j43394
35456a32454q6449P3299J04273r434o1037K5428J02695P5775K6859K5454K5798
35445A70207J745k193K140n6536j44804j30458M85R9048P8482K4018J8927J7828
35433G8889l1856q2099q0685o0306n8559n1140k5160j9428l9298l0998J4234L5934
35421c50472K5665N4909J31171J52042P3622M537M1388J12144Q5936l5221j32485
35410A63236j29032n4077J5371K1065l1855o3787l796R7959J15286K5178n2962
35399A02586l5382J4687J3537j1915k876J7393Q850J2927P1497J11543L8835r0118
$$ plain form
35387 251564 128665 96678 142764 156580 94878 18043 -27842 -72736 -138634 -172247 -124030
35376 -124030 -47377 -36770 -79350 -61233 50874 127815 51966 -96034 -133533 -28397 68366
35365 68366 51213 -4306 16583 99578 154378 157702 154421 166150 182068 208287 255407 304822
35353 304822 347512 419261 531182 605213 558569 423188 298013 207059 98968 -23920
35343 -23920 -82420 -44572 22667 63059 110513 206668 306244 334652 301102 279200 284484 243425
35331 243425 108015 -51943 -121030 -83367 -40037 -72177 -139579 -149363 -80731 13083 94308
35320 94308 159630 185772 143657 78005 84972 174788 232703 165667 24352 -76609 -106837
35309 -106837 -126578 -183177 -264183 -336392 -383029 -404326 -398679 -334743 -161595 100064 296010
$$ packed form
35387B51564j22899l1987M6086J3816o1702p6835m5885m4894o5898l3613M8217
35376a24030P6653J0607m2580J8117J12107P6941p5849j48000l7499J05136R6763
35365F8366j7153n5519K0889Q2995N4800L324l281J1729J5918K6219M7120M9415
35353C04822M2690P1749J11921P4031m6644j35381j25175r0954j08091j22888
35343b3920n8500L7848O7239M0392M7454R6155R9576K8408l3550k1902N284m1059
35331B43425j35410j59958o9087L7663M3330l2140o7402r784O8632R3814Q1225
35320I4308O5322K6142m2115o5652O967Q9816N7915o7036j41315j00961l0228
35309a06837j9741n6599q1006p2209m6637k1297N647O3936J73148K61659J95946
$$ plain form
35298 296010 266806 56311 -115000 -127277 -99315 -183471 -341615 -432596 -428155 -412281 -427289
35287 -427289 -448328 -468441 -485922 -440262 -285896 -110331 -53957 -113533 -139520 -36844 134736
35276 134736 271043 334516 333117 275478 181867 86914 14881 -16510 9156 62332 62155 -13835
35264 -13835 -62311 14873 159163 240081 247491 272329 324942 316686 220317 108028 16834 -87483
35252 -87483 -189889 -205976 -120905 -27338 10761 14686 -12928 -107900 -218428 -213303 -90040
35241 -90040 -27261 -127780 -241313 -170708 46828 201363 182152 54995 -83026 -193168
35231 -193168 -255761 -254880 -212688 -169360 -132352 -96685 -91531 -149156 -248307 -336525 -382194 -367585
$$ packed form
35298B96010k9204k10495j71311j2277K7962q4156j58144r0981M441J5874j5008
35287d27289k1039k0113j7481M5660J54366J75565N6374n9576k5987J02676J71580
35276A34736J36307O3473j399n7639r3611r4953p2033l1391K5666N3176j77p5990
35264a3835m8476P7184J44290Q0918P410K4838N2613q256r6369j12289r1194j04317
35252h7483j02406j6087Q5071R3567L8099L925k7614r4972j10528N125J23263
35241i0040O2779j00519j13533P0605K17536J54535j9211j27157j38021j10142
35231a93168o2593Q81M2192M3328L7008L5667N154n7625r9151q8218m5669J4609
$$ [...]
##END NTUPLES=NMR SPECTRUM
##END=
