##TITLE=31Pdec_AP17HK2_HCl
 D2O 
  24 sc
 26.10.2023
##JCAMPDX= 6.0         $$ Bruker NMR JCAMP-DX V2.0
##DATA TYPE= NMR SPECTRUM
##DATA CLASS= NTUPLES
##ORIGIN= UXNMR, Bruker Analytische Messtechnik GmbH
##OWNER= root
$$ XWIN-NMR		Version 3.5
$$ Thu Oct 26 16:15:52 2023 Russian Standard Time (UT+4h)  she@DPX200
##.OBSERVE FREQUENCY= 81.013821
##.OBSERVE NUCLEUS= ^31P
##.ACQUISITION MODE= SIMULTANEOUS
##.ACQUISITION SCHEME= undefined
##.AVERAGES= 24
##.DIGITISER RES= 16
##SPECTROMETER/DATA SYSTEM= spect
##.PULSE SEQUENCE= zgpg30
##.SOLVENT NAME= CDCl3
##.SHIFT REFERENCE= (INTERNAL, CDCl3, 0, 248.564)
##AUDIT TRAIL= $$ (NUMBER, WHEN, WHO, WHERE, WHAT)
$$ ##TITLE= Audit trail, XWIN-NMR		Version 3.5
$$ ##JCAMPDX= 5.01
$$ ##ORIGIN= Bruker BioSpin GmbH
$$ ##OWNER= she
$$ F:/spectra/data/she/nmr/P31/1/pdata/1/auditp.txt
$$ ##AUDIT TRAIL=  $$ (NUMBER, WHEN, WHO, WHERE, WHAT)
(   1,<2023-10-26 16:14:31.48 +0400>,<she>,<DPX200>,
      <created by zg, POWCHK disabled, PULCHK disabled
       configuration hash MD5:
       00 E9 B6 7A A2 85 ED C7 34 08 36 98 17 FE 4E 26
       data hash MD5: 32K
       D7 E3 92 03 A9 14 FF CB 06 40 18 B5 CA E1 40 DF>)
(   2,<2023-10-26 16:14:35.39 +0400>,<she>,<DPX200>,
      <Start of raw data processing
       efp BC_mod = 2 LB = 5 FT_mod = 6 PKNL = 1 PHC0 = -10633.11 PHC1 = 40.08972 SI = 64K 
       data hash MD5: 64K
       A0 14 5E A2 40 AF 78 05 36 26 23 8E 8A D8 E6 11>)
(   3,<2023-10-26 16:14:53.95 +0400>,<she>,<DPX200>,
      <pk PHC0 = -26.55391 PHC1 = 0 
       data hash MD5: 64K
       69 D2 E4 6E 7B CF 5A 51 AB E6 47 EA C8 FF 0D EE>)
(   4,<2023-10-26 16:14:58.09 +0400>,<she>,<DPX200>,
      <abs ABSG = 5 
       data hash MD5: 64K
       53 0D 0B 67 AE 2B 95 3B 72 DA 06 C5 34 2B 4A 3D>)
(   5,<2023-10-26 16:15:14.54 +0400>,<she>,<DPX200>,
      <pk PHC0 = 76.78133 PHC1 = -180.6 
       data hash MD5: 64K
       98 C2 81 E0 C5 4F B0 95 07 3D F6 F8 FD 0F 81 8A>)
$$ ##END=
$$ 
$$ hash MD5
$$ 4B 63 95 F6 D7 F2 FE 8F A4 39 23 1F 48 EB FC CF
##$RELAX= 
##$RELAX= 
##$RELAX= 
##$RELAX= 
##$RELAX= 
##$RELAX= 
##$RELAX= 
##$RELAX= 
##$RELAX= 
$$ Bruker specific parameters
$$ --------------------------
##$DU= <F:/spectra>
##$EXPNO= 1
##$NAME= <P31>
##$PROCNO= 1
##$TYPE= <nmr>
##$USER= <she>
##$AMP= (0..31)
100 100 100 100 100 100 100 100 100 100 100 100 100 100 100 100 100 100 
100 100 100 100 100 100 100 100 100 100 100 100 100 100 
##$AQSEQ= 0
##$AQ_mod= 1
##$AUNM= <au_zg>
##$AUTOPOS= <>
##$BF1= 81.014009
##$BF2= 200.13
##$BF3= 200.13
##$BF4= 200.13
##$BF5= 200.13
##$BF6= 200.13
##$BF7= 200.13
##$BF8= 200.13
##$BYTORDA= 1
##$CFDGTYP= 0
##$CFRGTYP= 5
##$CHEMSTR= <none>
##$CNST= (0..31)
1 1 145 1 1 1 1 1 1 1 1 1 1 1 1 1 1 1 1 1 1 1 1 1 1 1 1 1 1 1 1 1 
##$CPDPRG= <waltz16>
##$CPDPRG1= <>
##$CPDPRG2= <waltz16>
##$CPDPRG3= <>
##$CPDPRG4= <mlev>
##$CPDPRG5= <mlev>
##$CPDPRG6= <mlev>
##$CPDPRG7= <mlev>
##$CPDPRG8= <mlev>
##$CPDPRGB= <>
##$CPDPRGT= <>
##$D= (0..31)
$$ [...]
##$SUBNAM3= <"">
##$SUBNAM4= <"">
##$SUBNAM5= <"">
##$SUBNAM6= <"">
##$SUBNAM7= <"">
##$SUBNAM8= <"">
##$SUBNAM9= <"">
##$SW= 501.771253377433
##$SWIBOX= (0..15)
0 1 3 0 0 0 0 0 0 0 0 0 0 0 0 0 
##$SW_h= 40650.406504065
##$TD= 32768
##$TD0= 1
##$TE= 0
##$TE2= 300
##$TE3= 300
##$TEG= 300
##$TL= (0..7)
0 120 53 12 22 120 120 120 
##$TP= (0..7)
150 150 150 150 150 150 150 150 
##$TP07= 0
##$TPNAME0= <>
##$TPNAME1= <>
##$TPNAME2= <>
##$TPNAME3= <>
##$TPNAME4= <>
##$TPNAME5= <>
##$TPNAME6= <>
##$TPNAME7= <>
##$TPOAL= (0..7)
0.5 0.5 0.5 0.5 0.5 0.5 0.5 0.5 
##$TPOFFS= (0..7)
0 0 0 0 0 0 0 0 
##$TUNHIN= 0
##$TUNHOUT= 0
##$TUNXOUT= 0
##$USERA1= <user>
##$USERA2= <user>
##$USERA3= <user>
##$USERA4= <user>
##$USERA5= <user>
##$V9= 5
##$VALIST= <valist>
##$VCLIST= <CCCCCCCCCCCCCCC>
##$VD= 0
##$VDLIST= <DDDDDDDDDDDDDDD>
##$VPLIST= <PPPPPPPPPPPPPPP>
##$VTLIST= <TTTTTTTTTTTTTTT>
##$WBST= 1024
##$WBSW= 4
##$XGAIN= (0..3)
0 0 0 0 
##$XL= 0
##$YL= 0
##$YMAX_a= 2045
##$YMIN_a= -2070
##$ZGOPTNS= <>
##$ZL1= 120
##$ZL2= 120
##$ZL3= 120
##$ZL4= 120
##$ABSF1= 248.5645
##$ABSF2= -253.2056
##$ABSG= 5
##$ABSL= 3
##$ALPHA= 0
##$AQORDER= 0
##$ASSFAC= 0
##$ASSFACI= 0
##$ASSFACX= 0
##$ASSWID= 0
##$AUNMP= <proc_1d>
##$AZFE= 0.1
##$AZFW= 0.5
##$BCFW= 0
##$BC_mod= 2
##$BYTORDP= 0
##$COROFFS= 0
##$CY= -3
##$DATMOD= 1
##$DC= 0
##$DFILT= <>
##$DTYPP= 0
##$F1P= 0
##$F2P= 0
##$FCOR= 1
##$FTSIZE= 65536
##$FT_mod= 6
##$GAMMA= 0
##$GB= 0
##$INTBC= 1
##$INTSCL= 6.047779e-11
##$ISEN= 30
##$LB= 5
##$LEV0= 0
##$LPBIN= 0
##$MAXI= 10000
##$MC2= 0
##$MEAN= 0
##$ME_mod= 0
##$MI= 50
##$NCOEF= 0
##$NC_proc= -7
##$NLEV= 6
##$NOISF1= 182.463
##$NOISF2= 159.3651
##$NSP= 0
##$NTH_PI= 0
##$NZP= 0
##$OFFSET= 248.5645
##$PC= 4
##$PHC0= -10582.88
##$PHC1= -140.5103
##$PH_mod= 1
##$PKNL= yes
##$PPARMOD= 0
##$PSCAL= 0
##$PSIGN= 0
##$REVERSE= no
##$SF= 81.0140089999694
##$SI= 65536
##$SIGF1= 159.3651
##$SIGF2= -187.1042
##$SINO= 113.3802
##$SIOLD= 16384
##$SREGLST= <1H.CDCl3>
##$SSB= 0
##$STSI= 65536
##$STSR= 0
##$SW_p= 40650.406504065
##$SYMM= 0
##$S_DEV= 0
##$TDeff= 32768
##$TDoff= 0
##$TI= <>
##$TILT= no
##$TM1= 0
##$TM2= 0
##$TOPLEV= 0
##$USERP1= <user>
##$USERP2= <user>
##$USERP3= <user>
##$USERP4= <user>
##$USERP5= <user>
##$WDW= 1
##$XDIM= 65536
##$YMAX_p= 390996037
##$YMIN_p= -14294640
$$ End of Bruker specific parameters
$$ ---------------------------------
##NTUPLES= NMR SPECTRUM
##VAR_NAME=  FREQUENCY,     SPECTRUM/REAL,   SPECTRUM/IMAG
##SYMBOL=    X,             R,               I
##VAR_TYPE=  INDEPENDENT,   DEPENDENT,       DEPENDENT
##VAR_FORM=  AFFN,          ASDF,            ASDF
##VAR_DIM=   65536,         65536,           65536
##UNITS=     HZ,            ARBITRARY UNITS, ARBITRARY UNITS
##FACTOR=    0.620285442955139, 1,           1
##FIRST=     20137.2065510682, 0,            0
##LAST=      -20513.1999529968, 0,           0
##MIN=       -20513.1999529968, -14294640,   0
##MAX=       20137.2065510682, 390996037,    0
$$ Real data points
##PAGE= N=1
##DATA TABLE= (X++(R..R)), XYDATA
$$ [...]
42012 299963 226702 164930 141344 161603 223247 328215 471878 636205 807306 988770
42002 988770 1183064 1364894 1485675 1503831 1405254 1202245 927405 629578 363154 172689
41992 172689 85539 110645 230699 394514 533195 599026 591198 543028 490087 455142 456397
41981 456397 516638 656676 877543 1145807 1396172 1559620 1604942 1557379 1468702 1364111
41971 1364111 1224667 1027114 792978 584859 452259 391390 363514 341538 324138 309196
41961 309196 278015 221966 171811 175157 239931 318173 356684 353401 356282 421050 583294 855028
41949 855028 1218882 1623531 2007714 2335957 2594218 2748504 2735923 2516689 2120658 1625395
41939 1625395 1102274 604375 191532 -71132 -152680 -77525 101369 338919 604193 867098
41929 867098 1092898 1248649 1315376 1304062 1262099 1250613 1303971 1411735 1537172 1641073
41919 1641073 1686444 1640255 1490035 1258803 997616 765440 613095 567064 611539 690858
41909 690858 742397 728293 635939 465489 234445 -16318 -247674 -458850 -681924 -931976
41899 -931976 -1173329 -1339882 -1378243 -1268213 -1019348 -665328 -259453 133942 443397 586610
41889 586610 483434 103163 -486517 -1125798 -1634119 -1892306 -1876663 -1638229 -1261202 -828742
41879 -828742 -400936 -4637 357463 677853 916816 1006187 889533 569512 123931 -324381
41869 -324381 -666266 -857180 -926655 -938562 -933970 -906407 -828116 -693384 -532878 -392316 -303703
41858 -303703 -269149 -257286 -215774 -106916 53461 196271 248909 187892 43532 -138304
41848 -138304 -331562 -535646 -761476 -1015029 -1285123 -1542495 -1755782 -1910882 -2010135 -2052725
41838 -2052725 -2025751 -1920424 -1749152 -1537335 -1302111 -1048194 -781254 -513511 -257262 -29097
41828 -29097 134777 189997 135706 48086 31559 121181 246873 305958 258705 140963 1453
41817 1453 -145559 -312142 -514390 -765859 -1063172 -1359188 -1573199 -1656799 -1643845 -1613563
41807 -1613563 -1606969 -1597205 -1537318 -1415051 -1260093 -1119446 -1030253 -993691 -961749 -865061 -672231
41796 -672231 -423976 -211036 -127508 -234847 -531867 -932290 -1288877 -1476820 -1471837 -1349437
41786 -1349437 -1214422 -1129899 -1091053 -1045619 -947351 -807654 -691008 -647879 -663270 -687060 -698264
41775 -698264 -710212 -722141 -703548 -631870 -514476 -366780 -203050 -63546 -15353 -96032 -274223
41764 -274223 -487123 -693079 -859068 -926179 -847233 -668437 -526636 -530211 -652036 -755722
41754 -755722 -717880 -514044 -202486 144564 482823 788473 1036994 1203607 1278316 1266526
41744 1266526 1173740 1002097 765408 492648 207144 -84649 -372134 -623183 -807378 -927980
41734 -927980 -1010240 -1065272 -1091754 -1111612 -1170307 -1284523 -1408840 -1472638 -1441810 -1336824 -1208095
41723 -1208095 -1110656 -1086985 -1143812 -1238050 -1300552 -1283754 -1185844 -1035453 -868506 -724142 -645637
41712 -645637 -660440 -747585 -833397 -839449 -748662 -622355 -545494 -558046 -642715 -761913 -880039
41701 -880039 -954232 -943867 -855208 -753965 -698763 -666554 -574914 -383689 -149108 32668 112323
41690 112323 103707 40249 -50040 -131627 -161911 -126749 -62255 -23332 -35341 -89395 -177559 -309573
41678 -309573 -486528 -672946 -809371 -851236 -793809 -672147 -547688 -481302 -493661 -545352
41668 -545352 -569388 -529339 -437968 -322534 -193931 -59811 54074 123069 164700 243831 429161
41657 429161 743182 1142519 1531895 1803368 1887827 1787720 1562306 1279425 978688 667444
41647 667444 333605 -37501 -437696 -813008 -1076163 -1160693 -1072028 -887758 -709226 -606120
41637 -606120 -591799 -641430 -734826 -878814 -1075455 -1269269 -1353407 -1254643 -1006877 -718540
41627 -718540 -465990 -236234 25701 336936 653831 905743 1030684 992768 799452 515707
41617 515707 244459 69043 3460 -292 7763 29027 107321 266976 469743 643101 744589
41606 744589 782117 774132 715884 597593 434449 255990 76734 -99273 -249456 -331517
41596 -331517 -313779 -192175 16090 268582 484706 570459 484252 275629 51194 -92070
41586 -92070 -105655 5082 188319 369234 492141 551348 587670 668895 870056 1234588
41576 1234588 1720115 2192850 2508825 2611643 2545768 2388304 2189321 1967434 1728559 1478561
41566 1478561 1235916 1036645 909076 841248 792928 742310 698088 662386 613454 541321 471916
41555 471916 429073 392315 323439 223679 130933 61702 -12192 -121298 -257550 -383066 -455309
41544 -455309 -435742 -309899 -131738 -26710 -103057 -349449 -647209 -891055 -1069712 -1217016
41534 -1217016 -1323137 -1334750 -1227907 -1036460 -802328 -531406 -211784 151165 534495 910444
41524 910444 1239951 1471908 1575488 1569973 1507627 1431665 1359174 1289634 1211092 1108034 983576
41513 983576 869009 796490 771486 787209 848629 953786 1063204 1124548 1128721 1109033 1080500
41502 1080500 1012880 874096 670076 427458 165540 -94757 -318028 -475649 -568471 -612334
41492 -612334 -614416 -578253 -515944 -437112 -338747 -223630 -115904 -37752 20296 85706 166825
41481 166825 249072 325384 412299 532894 691966 863614 992784 1015697 896719 653711
41471 653711 349385 63238 -133969 -206503 -178730 -125771 -116219 -156254 -191046 -152688 -4426
41460 -4426 239556 514544 733810 842029 848054 800040 735534 664873 589258 512250 434103
41449 434103 350349 256067 141641 -9028 -199931 -403583 -571914 -665390 -666049 -574108 -407144
41438 -407144 -194639 42931 303241 576000 818846 981997 1053740 1062162 1035232 978456
41428 978456 888526 767486 622447 468412 329905 223435 142193 73978 23720 -4737
41418 -4737 -34725 -86239 -122314 -71449 80100 251827 344019 325182 233882 129137 63975
41407 63975 76189 164135 280084 377952 464903 583725 749081 922755 1047316 1079965 992997
41396 992997 770497 427970 33379 -306474 -499537 -529133 -470490 -436191 -489474 -606411
41386 -606411 -719551 -785944 -806879 -797960 -760711 -683684 -559301 -397368 -227284 -84590 12457
41375 12457 75790 138594 237677 401543 641151 941437 1264565 1565362 1801464 1934119
41365 1934119 1937165 1814828 1602630 1345009 1077708 827119 604517 393917 170695 -47738
41355 -47738 -186776 -175893 -21248 199631 409276 579434 718429 836274 926483 962627
41345 962627 905713 730814 457066 142473 -161022 -445304 -735457 -1044454 -1341182 -1560968
41335 -1560968 -1644416 -1567139 -1342157 -1014198 -665092 -406524 -327622 -431118 -637091 -861296
41325 -861296 -1073530 -1270963 -1425677 -1491971 -1452408 -1323526 -1121094 -853894 -555606 -288605
41315 -288605 -95757 36832 154766 280015 386345 422381 356358 204168 10062 -207477
41305 -207477 -476833 -816350 -1161667 -1381745 -1379130 -1157177 -788296 -348798 99602 497585
41295 497585 796648 979616 1058617 1062465 1038888 1048907 1124141 1223626 1252310 1135284 879520
41284 879520 577209 356426 304888 408375 562051 666268 720244 811680 1017146 1327264
41274 1327264 1659961 1914343 2006446 1893732 1604257 1236155 899766 649004 470604 327057
41264 327057 191715 50602 -98406 -233460 -314693 -325380 -304372 -316875 -382729 -443957 -418248
41253 -418248 -286194 -115826 4002 46907 58723 93008 154649 211465 243119 258326 266450
41242 266450 255181 212511 161656 151043 198859 258993 257101 157559 -18338 -234530 -472653
41231 -472653 -711776 -905454 -1011998 -1035669 -1001750 -895402 -673751 -357828 -68297 71832
41221 71832 48460 -66517 -224269 -425790 -640587 -767248 -717763 -512043 -255063 -41551
41211 -41551 85430 105719 5887 -196157 -440774 -657404 -795756 -829512 -758088 -623137
41201 -623137 -508841 -499445 -620039 -810382 -954791 -952294 -783193 -521036 -274826 -110143
41191 -110143 -17854 55372 158698 309877 493143 676475 840356 988805 1117714 1173972
41181 1173972 1071992 768744 312849 -192161 -663792 -1071340 -1409968 -1672952 -1852963
41172 -1852963 -1950220 -1965467 -1889873 -1711990 -1439907 -1119310 -827572 -637260 -569715 -580611
41162 -580611 -598419 -582097 -541168 -504588 -481108 -453100 -398489 -309585 -197623 -93079 -41770
41151 -41770 -83928 -222669 -413078 -586377 -683150 -667898 -533937 -313220 -67468 161416
41141 161416 393895 676038 990394 1235374 1318706 1250347 1114646 969339 811191 634519
41131 634519 477044 391201 400400 501582 685053 926616 1173877 1364287 1455537 1431381
41121 1431381 1295525 1083602 874355 757964 773091 876145 978758 1017891 993037 943981
41111 943981 906035 897939 945588 1085427 1317226 1563989 1712244 1704679 1580804 1427211 1308003
41100 1308003 1242883 1218834 1200965 1149653 1049203 914659 763687 598104 423613 265730
41090 265730 143691 41031 -76232 -218882 -366951 -490672 -560117 -546570 -440526 -265896
41080 -265896 -56462 177829 440904 711319 936737 1069568 1089425 992720 789178 522026
41070 522026 270964 110591 59451 68292 51580 -67070 -322219 -698183 -1140035 -1566782
41060 -1566782 -1881233 -1994172 -1868320 -1546835 -1131133 -725459 -394754 -153387 24750
41051 24750 177553 316764 417645 453216 425823 347878 207810 -9693 -267656 -475823
41041 -475823 -566822 -560492 -540180 -574066 -664200 -755703 -781706 -709825 -563348 -401482 -273697
41030 -273697 -190096 -131611 -79374 -27749 27652 103088 211733 324222 353885 211464 -105915
41019 -105915 -489228 -792738 -928269 -887196 -706278 -447531 -196444 -35469 -4085 -97182
41009 -97182 -295552 -575222 -896460 -1221174 -1550834 -1920967 -2345593 -2779094 -3129436 -3291231
40999 -3291231 -3184454 -2812449 -2296434 -1811971 -1461606 -1223173 -1025220 -835504 -658240
40990 -658240 -486556 -299784 -94439 109234 279782 375323 352844 204314 -28261 -293621
40980 -293621 -568802 -832446 -1024677 -1076792 -982767 -814886 -666940 -596262 -605576 -647345 -645355
40969 -645355 -542436 -341074 -91942 148718 337348 440033 448327 396685 330472 249344
40959 249344 110206 -102812 -333882 -493594 -527322 -441175 -281869 -104939 51137 176229
40949 176229 275561 347446 382522 380695 351610 297409 214351 118031 50122 50323 131788 285916
40937 285916 490837 703612 863742 930344 918831 891137 908704 997758 1152097 1353680
40927 1353680 1580072 1793096 1934130 1951741 1844134 1662560 1459028 1238897 979795 686605
40917 686605 402377 163901 -31959 -213853 -405552 -609427 -796097 -905908 -888067 -753760
40907 -753760 -573035 -408190 -269292 -145552 -54365 -36209 -116432 -291085 -533469 -792930
40897 -792930 -1005778 -1139760 -1222943 -1303887 -1389359 -1446274 -1456581 -1436234 -1398386 -1332288 -1231346
40886 -1231346 -1116272 -1014851 -935832 -873674 -823621 -786737 -782325 -863226 -1086547 -1440472 -1815093
40875 -1815093 -2074029 -2154661 -2090314 -1956653 -1823653 -1741534 -1724554 -1730994 -1684918 -1539716 -1317226
40864 -1317226 -1083917 -902271 -804794 -789823 -824233 -859641 -860555 -816372 -726000 -584679 -395316
40853 -395316 -183821 5656 125742 136810 23273 -183968 -408570 -566323 -603120 -500345
40843 -500345 -266893 56084 400009 709427 981386 1246320 1505715 1701332 1750160 1606264
40833 1606264 1299094 928318 615422 435974 387429 423971 510390 625910 733443 788401
40823 788401 790700 798107 866156 986341 1091680 1105938 982736 727913 408227 118405 -88768
40812 -88768 -232333 -346732 -414525 -386991 -264035 -118068 -30695 -29375 -92063 -186774 -287602
40801 -287602 -366687 -393954 -352733 -257751 -162478 -141838 -244462 -445004 -647582 -747027 -689880
40790 -689880 -480590 -147185 278665 747968 1182618 1498293 1642859 1606080 1397615 1038846
40780 1038846 589914 162557 -132000 -258641 -265127 -213211 -130082 -34074 33919 44557 29288
40769 29288 54748 145821 262661 355766 413947 448139 453721 408330 298744 141870 -14852
40758 -14852 -118402 -155569 -176017 -246853 -373149 -481454 -493236 -398077 -245220 -87566 45029
40747 45029 140277 209344 294787 435313 607228 725006 724959 644094 599405 686151 903025
40736 903025 1171470 1407662 1563664 1616759 1555952 1398107 1199720 1024013 891263 776802
40726 776802 663005 580003 584444 700448 883929 1042596 1096430 1033370 914289 821259 798968
40715 798968 842112 919544 988726 996443 902212 718098 505855 317279 148586 -35249 -247388
40704 -247388 -467664 -669697 -834383 -938889 -954313 -861940 -664625 -384702 -62792 241937
40694 241937 465340 563839 532093 403765 239012 98620 12458 -29782 -49950 -44651 17965
40683 17965 169124 411759 710725 997482 1194903 1263038 1228735 1156781 1082856 980911
40673 980911 801802 540367 262269 65629 9391 67248 148818 172351 122073 42382 -6739
40662 -6739 19137 137896 326476 515412 626137 630433 565499 489544 438347 425799 459712
40651 459712 539200 651826 790205 959844 1154273 1332403 1438248 1438787 1332765 1137736
40641 1137736 890971 653076 479224 379721 329279 321991 399441 616790 995640 1514354
40631 1514354 2122385 2747618 3303960 3713862 3928394 3928855 3729222 3391103 3017296 2700302
40621 2700302 2471960 2313360 2204079 2139185 2103206 2060722 1988726 1900263 1820934 1754716 1686998
40610 1686998 1608701 1516821 1392844 1196718 889298 463068 -37050 -514569 -859774 -1015876
40600 -1015876 -1015050 -937645 -834942 -704730 -538691 -365067 -225228 -121315 -9102 157046
40590 157046 385164 649817 918471 1166428 1377693 1545792 1673797 1762702 1795810 1745844
40580 1745844 1611456 1444565 1323711 1288147 1302850 1293655 1207854 1035446 793135 517308
40570 517308 268187 104856 38194 27996 43598 110383 274151 528813 802423 1013658
40560 1013658 1126889 1159402 1160277 1184089 1256496 1347155 1391202 1357409 1292639 1286851 1394104
40549 1394104 1592041 1809649 1980287 2070023 2074743 2007967 1893070 1756586 1619135 1492107
40539 1492107 1387441 1326762 1326076 1364386 1384784 1351160 1302142 1322240 1445870 1605642 1690518
40528 1690518 1645264 1501151 1323368 1148639 965594 731836 412786 31369 -313004 -500264
40518 -500264 -484966 -330098 -140879 21274 155892 285265 428275 598751 794012 976700
40508 976700 1088565 1092180 989175 798153 534684 221980 -95926 -369749 -572787 -707785
40498 -707785 -790385 -829307 -817699 -741310 -599029 -412746 -209759 -4189 186024 312761
40488 312761 325833 240361 140539 86040 38740 -79249 -266779 -424925 -459361 -366561 -213515
40477 -213515 -69272 30624 92776 172077 343375 624526 929061 1125088 1147819 1039982
40467 1039982 888176 747280 634009 565946 576120 683661 861529 1044569 1176435 1249809
40457 1249809 1294992 1327021 1314906 1214690 1028006 815163 650779 575128 581623 629498 661618
40446 661618 629751 523047 372048 218879 88672 -6788 -53933 -45644 -399 45896 69802
40435 69802 68539 40952 -14480 -71209 -67630 45320 254706 499353 722015 886163 955255
40424 955255 899289 735940 531410 335022 134651 -95922 -324491 -475074 -517774 -513120
40414 -513120 -552482 -668971 -817279 -932572 -1001079 -1073028 -1202506 -1371577 -1485778 -1457252
40404 -1457252 -1282933 -1029850 -765966 -536119 -386198 -352879 -410762 -470065 -457572 -382802
40394 -382802 -308918 -282270 -308683 -371879 -446340 -509090 -566076 -654269 -793857 -952126 -1078805
40383 -1078805 -1161725 -1219930 -1258683 -1268758 -1263311 -1278602 -1339407 -1456453 -1650921 -1931873 -2234602
40372 -2234602 -2423958 -2391215 -2135396 -1743553 -1322666 -965811 -742259 -668788 -688288 -703751
40362 -703751 -643836 -495842 -291202 -73854 128537 318647 507952 671956 744280 675986
40352 675986 490010 256884 29520 -170401 -311407 -341129 -236672 -47252 130046 209034
40342 209034 147301 -51419 -338019 -625331 -823881 -891322 -849885 -756324 -661609 -601241 -610185
40331 -610185 -723411 -946187 -1225197 -1461213 -1564348 -1511492 -1363925 -1231874 -1204426 -1288225
40321 -1288225 -1404283 -1453532 -1394252 -1256354 -1088616 -913614 -743587 -617058 -584748 -650408
40311 -650408 -745909 -782100 -718015 -567185 -344834 -38472 351843 761852 1084341 1251143
40301 1251143 1277801 1223475 1132212 1028899 942895 895156 867911 825498 772508 760639 828330
40290 828330 963119 1134845 1328727 1516814 1627010 1587795 1404922 1166118 968404 858380
40280 858380 832322 857385 881046 846159 722464 528128 321047 168104 105294 106363 95815
40269 95815 14803 -125096 -268249 -383461 -474363 -524532 -478892 -307854 -65186 148316
40259 148316 269484 302856 283566 241182 197275 168870 160678 162536 157027 122750 36992 -104928
40247 -104928 -266801 -380316 -386211 -268079 -55388 189941 392056 493771 493587 446951 417657
40236 417657 427470 457740 490020 527055 572805 610194 611614 565920 487005 401377 335162 304410
40224 304410 300217 282153 204460 61009 -101189 -217288 -244637 -167924 9033 251032 483316
40213 483316 633055 694377 734401 819601 944600 1041723 1047914 949303 772653 557152 337988
40202 337988 138724 -35169 -192428 -335833 -442833 -471832 -396984 -242539 -80517 12477
40192 12477 1262 -98393 -242544 -381284 -469211 -479527 -419570 -320722 -201584 -48260 158524
40181 158524 401712 624588 771072 828463 836906 860342 935746 1033795 1067178 948185 647855
40170 647855 207315 -295670 -783855 -1197215 -1497744 -1674767 -1747987 -1757770 -1738172 -1686008
40160 -1686008 -1557779 -1311457 -957387 -559595 -186359 126319 363940 518857 609672 693680
40150 693680 823604 989464 1123228 1160468 1084539 926006 752403 654507 697533 859323
40140 859323 1033629 1111910 1054773 886091 649427 388561 142682 -73679 -280200 -496530
40130 -496530 -701280 -844408 -899825 -891821 -873358 -893501 -980626 -1132566 -1309875 -1445579 -1471186
40119 -1471186 -1341750 -1051436 -637970 -165737 310093 762862 1171722 1490860 1662914
40110 1662914 1666867 1539783 1349067 1153826 988988 862014 749750 610956 421149 198074
40100 198074 -13462 -181403 -305755 -397705 -444252 -400972 -229369 52257 358988 589533
40090 589533 690172 669028 555381 359929 80418 -265350 -628022 -954267 -1221861 -1440762
40080 -1440762 -1618527 -1734887 -1763907 -1718995 -1655895 -1619403 -1601209 -1567245 -1515763 -1483655 -1496439
40069 -1496439 -1539166 -1588177 -1648052 -1731425 -1808230 -1801956 -1651717 -1372974 -1047777 -755674 -520704
40058 -520704 -324398 -154213 -22029 60673 103248 121510 119095 98129 77911 86340 137778
40047 137778 231240 358994 496984 597341 624741 611668 654754 834281 1133544 1433629
40037 1433629 1580333 1470562 1107992 592863 47577 -457363 -904354 -1272276 -1509214
40028 -1509214 -1567136 -1442007 -1177330 -855878 -590310 -473903 -502721 -567509 -556637 -457271
40018 -457271 -333498 -229520 -137172 -49420 5488 1483 -43867 -86379 -99646 -88886 -68964
40007 -68964 -37557 30218 153237 300222 386763 343073 187573 13788 -97719 -137996 -150178
39996 -150178 -188824 -306651 -539278 -866141 -1199140 -1439799 -1550890 -1564509 -1533694 -1493022
39986 -1493022 -1452788 -1402646 -1315964 -1168121 -959879 -719613 -484674 -283895 -126703 5756
39976 5756 151664 329961 507849 623578 647980 611503 566999 543590 548605 595040 695857
39965 695857 827187 924590 940506 902754 899949 1006353 1230500 1532272 1862682 2169553
39955 2169553 2386145 2452810 2358706 2139960 1827893 1421037 922624 383530 -119559 -541155
39945 -541155 -878863 -1136501 -1309110 -1412572 -1495669 -1596047 -1696537 -1748086 -1730868 -1672744
39935 -1672744 -1610399 -1556052 -1509230 -1480198 -1484450 -1522844 -1582208 -1651492 -1723563 -1781069 -1791568
39924 -1791568 -1718587 -1531460 -1211975 -775191 -296571 97598 295731 273695 104486 -105982
39914 -105982 -296358 -474423 -678219 -917745 -1150814 -1310521 -1353005 -1277643 -1105342 -848181
39904 -848181 -509944 -116973 258888 519368 597150 509231 355325 249768 239581 282896
39894 282896 302787 253347 133753 -41792 -264538 -520668 -777605 -991998 -1128478 -1168113
39884 -1168113 -1107503 -963615 -784420 -642040 -590769 -615906 -633738 -564591 -410746 -247454
39874 -247454 -133641 -49916 67177 249844 471556 672626 789391 776814 641507 457752
39864 457752 323001 282455 304119 323544 295993 211803 93718 -6810 -32352 40472 184047
39853 184047 341037 450128 457373 334808 105775 -165194 -423001 -650362 -836989 -941743
39843 -941743 -907947 -709844 -371902 46438 473079 848291 1152447 1404168 1613859 1748097
39833 1748097 1763494 1674332 1564922 1529588 1610342 1784437 1984379 2121193 2113557 1923216
39823 1923216 1570726 1116892 634172 196340 -120569 -252287 -179122 51483 344638 615076
39813 615076 832037 1004954 1126246 1141748 989387 665137 245195 -156700 -458692 -655209
39803 -655209 -804356 -964365 -1133310 -1255391 -1287712 -1246398 -1180556 -1121251 -1074232 -1046382 -1052179
39792 -1052179 -1098309 -1183501 -1308629 -1462541 -1600006 -1662031 -1625462 -1510101 -1330642 -1069707
39782 -1069707 -717989 -321859 35957 302520 488098 636710 776128 897736 975726 999728
39772 999728 986033 953834 893030 766128 548250 259142 -52098 -351177 -637958 -916174
39762 -916174 -1147439 -1248947 -1153860 -879937 -529441 -215301 6450 136234 196190 221666
39752 221666 264844 360998 483174 561191 556567 493188 404919 286854 124016 -56410 -197385
39741 -197385 -271164 -300552 -324741 -368309 -443378 -555203 -692617 -827011 -933318 -1007513 -1057929
39730 -1057929 -1082866 -1058998 -948859 -723277 -389323 -4800 338965 560304 625793 556410
39720 556410 400258 197718 -29812 -263631 -476392 -652677 -814581 -1002478 -1221458 -1425557
39710 -1425557 -1567834 -1648527 -1696831 -1725238 -1733326 -1747832 -1816928 -1946489 -2064784 -2072110 -1920265
39699 -1920265 -1638113 -1297792 -973836 -721125 -559374 -461582 -364149 -202204 51286 365719
39689 365719 663676 864287 942020 956724 1016371 1191369 1455029 1707752 1860736 1897387
39679 1897387 1862442 1810529 1779568 1805276 1933033 2193167 2565704 2981583 3360722 3642609
39669 3642609 3784413 3750702 3525355 3135577 2652638 2159474 1715163 1346884 1062578 853924
39659 853924 683441 487571 219181 -102001 -389312 -548786 -540366 -385596 -132647 173443
39649 173443 497228 813035 1105738 1359650 1541205 1606221 1541460 1401852 1295901 1318747
39639 1318747 1483536 1708009 1872598 1908816 1846135 1776098 1767659 1813542 1849819 1813194 1673774
39628 1673774 1427992 1085850 677410 260699 -96697 -354312 -516460 -612992 -669126 -699854
39618 -699854 -726512 -779849 -873133 -975227 -1022240 -963817 -801246 -584764 -377354 -216317
39608 -216317 -99058 -83 95292 168066 172544 66687 -156365 -452964 -738551 -925924
39598 -925924 -976157 -919869 -819813 -706976 -558354 -337656 -46781 265517 528129 665811
39588 665811 609354 324596 -146811 -681803 -1127205 -1370176 -1376057 -1182746 -874322 -550802
39578 -550802 -296151 -150953 -104586 -112347 -124338 -105981 -40103 82489 266537 500508 742859
39567 742859 931965 1024114 1028001 998751 992668 1024125 1063196 1072149 1044575 1012874 1020550 1085450
39555 1085450 1184002 1263832 1268011 1153509 903056 535045 105045 -310072 -638635 -835582
39545 -835582 -894363 -851079 -769142 -695780 -621775 -496779 -297055 -67848 118209 239356
39535 239356 341322 472083 616286 702569 664349 485026 196033 -150559 -504490 -825359
39525 -825359 -1083431 -1263522 -1371768 -1430108 -1450843 -1417214 -1303221 -1116859 -909375 -733040
39515 -733040 -601898 -504142 -438847 -422135 -463150 -549656 -650680 -715240 -676544 -489988 -184103
39504 -184103 137031 353795 397730 277231 66281 -132479 -251050 -309298 -390907 -547137
39494 -547137 -736267 -874115 -926607 -927066 -917031 -907973 -903956 -925040 -985796 -1064378 -1106979 -1056499
39482 -1056499 -876948 -572005 -195287 170537 462408 663481 778510 799304 713338 541831
39472 541831 349692 205814 128281 61117 -93867 -402770 -836814 -1282519 -1621492 -1800496
39462 -1800496 -1831634 -1756146 -1635254 -1559079 -1617976 -1840208 -2165262 -2484682 -2704247 -2777432
39452 -2777432 -2709846 -2547049 -2341077 -2109845 -1832854 -1493744 -1117994 -761593 -475141 -289959
39442 -289959 -224185 -278740 -426017 -617412 -806539 -960781 -1057679 -1085603 -1048779 -959746 -826522
39431 -826522 -660915 -501603 -409487 -421209 -507172 -584185 -571266 -432510 -175773 170580
39421 170580 567151 957476 1274824 1474745 1566581 1608282 1665493 1770518 1908638 2031552
39411 2031552 2089144 2069048 2015245 1995694 2041348 2126260 2214516 2306942 2417232 2510835 2500231
39400 2500231 2315337 1968082 1544646 1148814 854825 689675 635268 645358 668449 657473
39390 657473 568159 373579 95014 -196410 -428219 -572947 -636681 -617140 -500372 -299413
39380 -299413 -72647 104540 172542 94022 -139639 -484230 -841175 -1110897 -1254662 -1296145
39370 -1296145 -1273620 -1213648 -1144790 -1097036 -1063408 -983023 -794189 -505114 -193836 60549
39360 60549 227754 308638 296737 178855 -34752 -300309 -566022 -803757 -1016514 -1217450
39350 -1217450 -1399728 -1527280 -1561184 -1495130 -1354785 -1161173 -913282 -621875 -348323 -185306
39340 -185306 -191443 -352403 -605535 -891919 -1182050 -1459695 -1687473 -1792869 -1702401 -1406608
39330 -1406608 -991291 -589254 -290557 -96641 48607 196033 351620 475123 510065 432230
39320 432230 281633 138704 58926 33360 12516 -45885 -160560 -340607 -592494 -908645
39310 -908645 -1257532 -1587649 -1839340 -1958687 -1913894 -1712814 -1416594 -1137846 -1003853 -1083234
39300 -1083234 -1324793 -1575755 -1680669 -1575671 -1298469 -928397 -532752 -159743 147859
39291 147859 355995 459032 486975 483402 472424 448851 398391 315925 198735 39014 -155942
39280 -155942 -343687 -472431 -528111 -532021 -491493 -387932 -228804 -76234 9145 34499 53661
39269 53661 92716 129705 141586 135834 131203 135822 152201 180828 210528 224066 220882 221290 250027
39256 250027 334313 509314 785961 1100508 1329325 1377453 1235718 944511 543382 89483
39246 89483 -311781 -559290 -648488 -673891 -729456 -833370 -953419 -1065172 -1160412 -1227686 -1262201
39235 -1262201 -1288373 -1342149 -1426199 -1503025 -1539704 -1543754 -1542984 -1537887 -1487232 -1344706 -1108141 -831820
39223 -831820 -587612 -407749 -262875 -100036 94434 271910 362965 338923 231499 100599
39213 100599 -6246 -66108 -72434 -33036 21578 38176 -39017 -237518 -535416 -864975 -1141931
39202 -1141931 -1305107 -1342945 -1292382 -1213486 -1154463 -1123549 -1082978 -971885 -746395 -411076
39192 -411076 -22969 332336 580954 697478 711951 676599 622983 556244 487625 453215 485329
39181 485329 571607 656362 683744 634931 529795 404337 283701 160754 -8546 -282260
39171 -282260 -690886 -1204525 -1732722 -2163370 -2423094 -2516007 -2502837 -2438811 -2337179 -2189295
39161 -2189295 -1995027 -1757072 -1466927 -1127642 -784768 -504367 -315181 -193863 -109845 -60340
39151 -60340 -53546 -81335 -122996 -158953 -167228 -122726 -19908 106657 193363 179027 35275
39140 35275 -207854 -457097 -601774 -588981 -450519 -252992 -42261 153526 299950 373156
39130 373156 391638 400049 422094 450857 477213 495429 478261 380089 184871 -59466 -260636
39119 -260636 -326744 -201270 108908 516794 883191 1091526 1110134 988888 805241 612504
39109 612504 424283 239421 84432 21744 91124 238820 334267 279356 87948 -155680
39099 -155680 -391534 -605569 -774549 -841495 -768157 -586304 -371381 -173100 11163 200103
39089 200103 384613 526097 592733 596691 599877 679113 871581 1141860 1399893 1557018 1574697
39078 1574697 1471096 1291963 1080272 868356 684803 556314 503329 543746 701053 990103
39068 990103 1377555 1766581 2049872 2189400 2226747 2203751 2096033 1853747 1497156 1131471
39058 1131471 852626 666283 521680 403700 358038 428339 597136 797180 962605 1059198
39048 1059198 1077294 1010323 848537 605363 355802 225111 299389 536310 788297 927472
39038 927472 933830 862666 766384 676847 633890 680101 819019 1001993 1160183 1237422 1206941
39027 1206941 1091471 971314 940675 1036756 1221245 1432044 1631453 1797545 1895357 1880472
39017 1880472 1726758 1443045 1071271 672474 300732 -17279 -269203 -428580 -466981 -405014
39007 -405014 -323874 -300880 -343827 -403346 -431512 -405464 -310537 -136069 108301 394522 697806
38996 697806 1001462 1284303 1526004 1728242 1910693 2079465 2213996 2288609 2291019 2215103
38986 2215103 2053983 1812578 1517634 1206596 912169 658529 458621 307743 191706
38977 191706 113031 104632 208781 438572 751262 1047962 1207583 1151302 895517 538904
38967 538904 190069 -92852 -305472 -472401 -632704 -825792 -1064465 -1323730 -1565966 -1766322
38957 -1766322 -1903951 -1951220 -1901282 -1796676 -1695894 -1606501 -1481142 -1294438 -1101245 -995180
38947 -995180 -1014334 -1102802 -1165080 -1151915 -1096860 -1077932 -1144870 -1278677 -1417025 -1513881 -1571126
38936 -1571126 -1616212 -1655379 -1646773 -1515551 -1206437 -742246 -237017 161957 359252 348201
38926 348201 181499 -72242 -345305 -578996 -746181 -864686 -970714 -1072300 -1132721 -1100722
38916 -1100722 -957986 -743201 -531770 -383785 -305373 -261778 -222019 -175818 -109144 7848
38906 7848 188432 399964 588324 723874 805958 835740 817171 788027 819161 960864 1195067
38895 1195067 1447063 1637183 1718441 1677407 1515153 1238313 876835 505582 218696 52532
38885 52532 -58953 -221932 -472357 -751560 -991108 -1185919 -1368649 -1545927 -1688646 -1763414
38875 -1763414 -1742714 -1598385 -1319170 -934087 -496828 -52917 356044 668858 826032 825836
38865 825836 733409 621138 516060 411376 306398 218493 168007 165189 205547 270730 340627
38854 340627 406570 460616 469998 383201 179741 -89438 -320460 -419211 -358969 -199689 -56170
38843 -56170 -26198 -131642 -327751 -558485 -778282 -925822 -926252 -753897 -471582 -178973
38833 -178973 61862 226489 284577 207369 13254 -243120 -537626 -893523 -1317342 -1753801
38823 -1753801 -2126144 -2393353 -2545601 -2572112 -2469028 -2268229 -2029504 -1807347 -1642130 -1568778
38813 -1568778 -1601851 -1711275 -1838429 -1942791 -2017845 -2064527 -2075408 -2053295 -2022554 -2005620 -2000476
38802 -2000476 -1994034 -1985545 -1978923 -1955598 -1871180 -1685627 -1396870 -1052000 -731142 -506876 -396040
38791 -396040 -346380 -289081 -219746 -220207 -383794 -715007 -1109154 -1430864 -1607275 -1651694 -1618795
38780 -1618795 -1551295 -1460741 -1342744 -1207297 -1096940 -1064987 -1120854 -1201462 -1216589 -1127875 -969906
38769 -969906 -792559 -605357 -392232 -162022 40050 166376 192994 113296 -73790 -359962
38759 -359962 -718957 -1104869 -1454408 -1695975 -1773073 -1669438 -1412521 -1058076 -679951 -366798
38749 -366798 -202110 -225968 -412311 -684860 -953712 -1143983 -1211185 -1150306 -996521 -812146
38739 -812146 -662831 -590347 -592571 -627640 -647322 -630789 -581607 -495950 -350626 -131401 136580
38728 136580 397201 599526 722581 773907 774264 741563 683566 607817 538720 512861 547260
38717 547260 619359 689206 734345 748725 714667 602305 408084 177783 -24541 -163550
38707 -163550 -236728 -242184 -167972 -22001 145063 264294 292659 224797 74034 -132701 -338706
38696 -338706 -466584 -472233 -388850 -302873 -286274 -358225 -498748 -674401 -849280 -996026 -1110771
38685 -1110771 -1205382 -1273789 -1275411 -1163046 -923198 -585684 -204982 160819 467450 698510
38675 698510 859578 948930 940542 807492 556817 229873 -126114 -474839 -788511 -1051375
38665 -1051375 -1268387 -1451089 -1584997 -1623826 -1529788 -1318490 -1058668 -828283 -669637 -578787
38655 -578787 -530302 -508939 -514689 -537099 -534991 -456504 -283935 -53049 174062 351410 467956
38644 467956 538552 587657 641017 723950 855932 1037345 1242648 1439008 1617452 1791783
38634 1791783 1953265 2040342 1981277 1769367 1470426 1143872 778496 328507 -198220 -714065
38624 -714065 -1116426 -1362331 -1479047 -1525985 -1563032 -1638115 -1769476 -1923728 -2026060 -2013388
38614 -2013388 -1882560 -1682885 -1467174 -1259313 -1061815 -874814 -704053 -569126 -513134 -584852
38604 -584852 -789402 -1059946 -1293661 -1419569 -1432778 -1379249 -1322276 -1311701 -1360962 -1447501 -1540831
38593 -1540831 -1623459 -1678512 -1678658 -1615452 -1531161 -1489427 -1510084 -1555415 -1578682 -1556367 -1472749 -1318253
38581 -1318253 -1130981 -1010903 -1053006 -1263003 -1548255 -1779288 -1851600 -1716820 -1394854 -962709
38571 -962709 -511482 -101545 246322 532044 759010 919959 981617 892686 627213 219833
38561 219833 -250687 -704946 -1083546 -1347478 -1487241 -1527290 -1497985 -1402431 -1226687 -977117
38551 -977117 -687145 -390488 -109979 126993 284097 332095 256263 55301 -239297 -540884
38541 -540884 -738814 -777044 -695130 -583373 -506681 -473218 -456554 -432987 -403444 -384547 -373105
38530 -373105 -326097 -196244 11796 242571 448644 621816 764264 870685 959396 1075703
38520 1075703 1216846 1279409 1142200 807258 414590 106455 -86377 -217944 -342962 -499062
38510 -499062 -733409 -1079715 -1498684 -1884125 -2151982 -2302441 -2375251 -2364001 -2207904 -1871658
38500 -1871658 -1408572 -928089 -509221 -159097 148360 411411 587494 635466 564932 447179
38490 447179 380186 432233 600457 813209 978348 1044732 1029464 988088 954156 905375 791697
38479 791697 597939 372683 187955 70889 -21006 -160787 -394112 -709903 -1045422 -1311168
38469 -1311168 -1428309 -1365789 -1149803 -837691 -489155 -166560 53142 95498 -66666 -388180
38459 -388180 -777462 -1150019 -1461896 -1701640 -1859415 -1909927 -1828616 -1621251 -1326823 -986463
38449 -986463 -621700 -256540 51028 230413 264942 219654 182365 181098 176715 138757 112311
38438 112311 196465 455821 855631 1282175 1624690 1841071 1954940 2006162 2018018 2006602
38428 2006602 1994627 1991696 1965596 1858076 1642932 1360912 1089343 884707 762726 721966
38418 721966 761781 867172 991311 1075535 1095482 1081132 1081981 1110028 1120394 1049907 872383
38407 872383 616654 340082 93829 -93273 -217381 -295531 -346173 -362105 -313839 -197270
38397 -197270 -72273 -30657 -116511 -287679 -456900 -556487 -561913 -478972 -330276 -144042 64965
38386 64965 301740 566791 836535 1089894 1348121 1657072 2019954 2370406 2625158 2744608
38376 2744608 2730647 2593526 2352189 2052307 1745202 1445355 1137933 832029 571394 375400
38366 375400 201802 1205 -207487 -350510 -383587 -330872 -238156 -121781 20856 178135
38356 178135 326954 453942 550554 598733 591328 566815 592704 696372 826265 898769 879070
38345 879070 803668 726211 654125 541957 339439 43219 -290585 -579128 -768101 -873237
38335 -873237 -972464 -1141803 -1382123 -1610298 -1732906 -1726227 -1633548 -1492333 -1290465 -1001454
38325 -1001454 -636478 -239957 150840 516030 829995 1056646 1175426 1196788 1147393 1052253
38315 1052253 932244 802792 668588 530881 404637 318957 298905 357031 498694 713146
38305 713146 952330 1142531 1241529 1282590 1348648 1497722 1709732 1897803 1971273 1899360
38295 1899360 1720467 1490629 1235681 967885 730431 583723 540051 547469 553525 551233 542753
38284 542753 500106 406695 314061 304843 400358 545533 686957 824657 974444 1114202 1190559
38273 1190559 1163749 1037899 868473 749135 763000 917741 1129596 1280702 1290491 1139447
38263 1139447 854064 489927 116954 -201076 -417945 -500458 -433783 -247924 -25570 143870
38253 143870 229011 269745 322544 393914 426856 351168 149296 -124947 -391435 -603008 -757937
38242 -757937 -866301 -925472 -934879 -918858 -918811 -963250 -1051927 -1166497 -1286135 -1385112 -1418783 -1330360
38230 -1330360 -1093237 -748090 -377652 -37118 267931 523721 668393 657725 557258 512995
38220 512995 615680 831336 1074896 1301719 1495647 1614665 1610749 1495574 1336128 1176987
38210 1176987 1004144 799105 596368 460061 414287 416494 397028 310763 150488 -72009
38200 -72009 -340680 -633248 -924996 -1209421 -1503378 -1808058 -2066426 -2189390 -2142364 -1991055
38190 -1991055 -1844105 -1758099 -1709676 -1645503 -1535566 -1379799 -1185660 -952435 -676147 -370535
38180 -370535 -86149 98301 117010 -41016 -323117 -639570 -908837 -1101529 -1250536 -1401560
38170 -1401560 -1541266 -1589468 -1478797 -1231732 -944592 -707552 -556218 -483782 -466772 -474960
38160 -474960 -479527 -463225 -417455 -334787 -217570 -87223 34527 152386 287376 441229
38150 441229 590565 716593 816549 877988 865542 754089 569625 384550 269023 240359
38140 240359 246119 195226 23036 -259463 -578494 -855457 -1047086 -1143270 -1157406 -1131324 -1127915
38129 -1127915 -1194909 -1335062 -1517025 -1707658 -1888165 -2050590 -2190632 -2298528 -2349766 -2314642
38119 -2314642 -2190246 -2019029 -1863968 -1764543 -1720986 -1714320 -1729759 -1760267 -1796212 -1816563 -1792950
38108 -1792950 -1708996 -1577270 -1425765 -1258517 -1040814 -743021 -400463 -111961 35208 39279
38098 39279 -17764 -40723 10415 110039 207668 270885 293723 279352 232778 176081 156292 215447
38086 215447 343563 472164 530566 512808 481230 497458 553523 578478 512552 366055 202216
38075 202216 74149 -6242 -42502 -23757 59698 180201 275610 296127 238786 135219 22925
38064 22925 -63512 -94904 -66686 -8407 51536 128105 254508 403841 467874 343868 31514
38053 31514 -375982 -778841 -1117681 -1350088 -1435940 -1371983 -1213942 -1035650 -872397 -716791
38043 -716791 -557782 -407191 -294278 -246840 -272054 -345240 -422049 -470352 -488148 -491725 -501048
38032 -501048 -540057 -626685 -741231 -817551 -790649 -653655 -454931 -243745 -33303 187313
38022 187313 421571 646393 813975 877314 829271 716393 602650 520445 465877 433863
38012 433863 437520 488572 571696 646179 672500 642334 588194 557376 569898 610267 665021 747933
38000 747933 868513 991541 1058786 1052621 1019420 1030373 1129372 1300826 1458413 1478342 1290444
37989 1290444 949391 586040 281169 21422 -212283 -364351 -352894 -171048 102423 378593
37979 378593 601039 720547 684891 487457 203879 -52106 -210426 -270410 -255742 -173673
37969 -173673 -33104 117606 205457 198137 141251 120890 199393 391795 679399 1017725 1339487
37958 1339487 1580209 1708669 1721661 1621658 1429736 1216579 1079435 1067013 1144649 1242330
37948 1242330 1315733 1354933 1367386 1375363 1407302 1467307 1527427 1565015 1584359 1579274 1498752 1283249
37936 1283249 924847 468641 -26368 -498089 -879409 -1141931 -1344573 -1587117 -1889863
37927 -1889863 -2145586 -2209587 -2020930 -1630973 -1146231 -665737 -249401 87854 355142 549810
37917 549810 649179 643482 558777 427729 246814 -15888 -368232 -760970 -1108802 -1340729
37907 -1340729 -1439340 -1445562 -1424587 -1414835 -1403657 -1351360 -1232497 -1052166 -839212 -642774 -527413
37896 -527413 -542651 -683318 -891003 -1103833 -1298240 -1480838 -1657094 -1819523 -1949738 -2012709
37886 -2012709 -1964005 -1796561 -1582334 -1431555 -1386995 -1376752 -1295630 -1122684 -934536 -809897
37876 -809897 -750669 -702380 -625447 -529538 -452268 -420387 -425626 -427777 -387947 -310724 -251936 -276521
37864 -276521 -406367 -605655 -805089 -935805 -956324 -869089 -717082 -556942 -427788 -337573
37854 -337573 -267531 -186905 -76619 50407 159125 231583 289419 366979 468646 564567 622345
37843 622345 628082 581041 489265 377925 285607 235037 204397 129494 -64589 -422238 -921001
37832 -921001 -1453335 -1846338 -1929572 -1626681 -1013887 -293594 312143 673568 787061 723222
37822 723222 557844 341183 94498 -189744 -528665 -904233 -1245153 -1476669 -1581562 -1585823
37812 -1585823 -1493347 -1279231 -960910 -633733 -401287 -290260 -261839 -283158 -344265 -416315
37802 -416315 -451678 -450562 -492022 -663070 -964708 -1306128 -1581222 -1735465 -1774352 -1737115 -1666026
37791 -1666026 -1582743 -1486781 -1379813 -1280028 -1195865 -1095469 -930357 -694374 -438498 -223017
37781 -223017 -77118 -10827 -37041 -160468 -362449 -617079 -909454 -1220522 -1508305 -1723611
37771 -1723611 -1830290 -1791974 -1566300 -1158022 -673117 -270761 -38403 64968 133741 210844
37761 210844 267476 253897 143762 -52817 -291364 -513800 -687662 -822509 -935224 -1007466
37751 -1007466 -995762 -882729 -704983 -530410 -417854 -397388 -475862 -650549 -912613 -1235539
37741 -1235539 -1565509 -1834974 -1992065 -2016597 -1914350 -1709185 -1441035 -1157947 -904182 -718180
37731 -718180 -628564 -628782 -659582 -646855 -567019 -456342 -356866 -286505 -267653 -335603 -483135
37720 -483135 -629617 -690727 -666509 -624528 -607343 -593319 -539810 -423559 -238983 -238 240448
37709 240448 408160 458557 401520 269324 87198 -116230 -299248 -432731 -526057 -613495
37699 -613495 -722077 -860663 -1030231 -1232958 -1470154 -1727038 -1951663 -2060332 -1992577 -1771979
37689 -1771979 -1498272 -1271777 -1134688 -1079995 -1084856 -1115760 -1121576 -1052250 -891139 -663562 -417999
37678 -417999 -203064 -51319 30400 59141 62044 61730 65642 56457 -5915 -157225 -396668 -687992
37666 -687992 -990420 -1274070 -1504860 -1637748 -1643297 -1536216 -1369106 -1201209 -1072949 -996201
37656 -996201 -956842 -928544 -887588 -813380 -684268 -493180 -272928 -90344 -3703 -28315 -138405
37645 -138405 -283842 -402539 -441653 -387658 -272485 -147096 -61195 -68681 -222420 -534984
37635 -534984 -947714 -1354129 -1656621 -1806238 -1813694 -1743447 -1686492 -1714844 -1852972 -2086212
37625 -2086212 -2374932 -2650177 -2825131 -2851795 -2771902 -2689431 -2681025 -2735142 -2770951 -2705002 -2508526
37614 -2508526 -2220991 -1911549 -1615554 -1306867 -938979 -509756 -79459 266217 463123
37605 463123 497521 412488 277442 125985 -73114 -359842 -704195 -1017335 -1246305 -1422353
37595 -1422353 -1600114 -1783854 -1941856 -2063000 -2151071 -2168296 -2034160 -1705765 -1238251 -742012
37585 -742012 -287686 128124 525644 870612 1072975 1055619 821811 458894 80936 -236108
37575 -236108 -479006 -677594 -869935 -1079396 -1308895 -1543952 -1759566 -1932474 -2055286 -2140404
37565 -2140404 -2209320 -2282509 -2383854 -2544577 -2781075 -3058799 -3289340 -3376350 -3265224 -2953485
37555 -2953485 -2478994 -1919504 -1385814 -974244 -710438 -556137 -476277 -477278 -569166 -716534
37545 -716534 -854002 -940116 -973659 -965763 -924393 -867732 -825226 -812541 -822192 -849426 -909793 -1013435
37533 -1013435 -1133399 -1222428 -1263077 -1284996 -1326007 -1386063 -1427161 -1411170 -1325991 -1174681 -953823
37522 -953823 -659147 -313945 24310 300579 501457 644871 734299 742396 644883 450410
37512 450410 182773 -149858 -544827 -969435 -1358911 -1656962 -1848943 -1956461 -2014121 -2052614
37502 -2052614 -2086097 -2103295 -2076000 -1983371 -1830524 -1651975 -1503744 -1432416 -1417829 -1346870 -1089697
37491 -1089697 -637052 -146318 180961 269982 213272 161645 203068 332517 486547 580696
37481 580696 543058 354609 68449 -220796 -432023 -527818 -510575 -411385 -282290 -176922
37471 -176922 -119640 -92283 -57660 2514 72408 114606 84299 -65703 -368563 -808559 -1307091
37460 -1307091 -1766317 -2136757 -2432893 -2679096 -2854044 -2897903 -2766283 -2469940 -2069406 -1638182
37450 -1638182 -1224957 -845963 -517897 -292714 -237654 -371599 -640584 -969827 -1319396 -1668339
37440 -1668339 -1965585 -2132906 -2116067 -1912533 -1561085 -1137013 -748348 -485654 -352045 -267917
37430 -267917 -158602 -12311 154141 337869 519580 626561 588180 431024 273596 214561
37420 214561 260020 368138 515247 679558 793869 776809 619655 401028 199080 22325
37410 22325 -151733 -307992 -414516 -502348 -667152 -962463 -1317011 -1585012 -1667584 -1570951
37400 -1570951 -1368937 -1142316 -948262 -810688 -720937 -660141 -631589 -663991 -776863 -947734
37390 -947734 -1115973 -1214636 -1200924 -1066820 -828231 -507601 -133963 238884 532134 684228
37380 684228 700146 650426 617546 642725 713366 787043 829329 839695 839555 828363 762572 597160
37368 597160 345592 82128 -112095 -187847 -123872 73019 341106 563825 640411 575565
37358 575565 493278 550142 821942 1258710 1734779 2131937 2375413 2416647 2228889 1845384
37348 1845384 1376985 952177 635725 424656 313407 325907 474397 716989 977603 1198107
37338 1198107 1362433 1483069 1577237 1653577 1716556 1778815 1854470 1931813 1972035 1954376 1901386
37327 1901386 1828218 1687977 1417539 1034467 637050 301081 28125 -192261 -333487 -385709
37317 -385709 -410854 -490857 -644377 -834578 -1032203 -1224299 -1383537 -1487600 -1566810 -1680346
37307 -1680346 -1832745 -1949032 -1942524 -1780874 -1486266 -1111249 -729969 -416748 -197048 -21564
37297 -21564 196294 513499 918207 1334134 1654223 1787915 1700516 1421626 1024602 600618
37287 600618 239354 12114 -42619 71643 302395 551981 713601 727894 605361 393132
37277 393132 141646 -81907 -179767 -74950 210638 553620 817390 936368 923743 830256
37267 830256 711790 616262 572790 584281 636396 721601 859702 1090864 1434851 1851887
37257 1851887 2256848 2580955 2807489 2941434 2971448 2889820 2734475 2574174 2448141 2344309
37247 2344309 2238789 2132175 2041330 1975875 1926717 1855718 1692045 1368741 888006 344608
37237 344608 -127274 -429981 -534438 -466359 -280330 -35546 224378 474501 694759 865285
37227 865285 980555 1053073 1087857 1060551 938354 725644 478268 266788 128325 55021
37217 55021 22947 25233 77090 194837 375233 593355 815628 1015263 1179397 1301299
37207 1301299 1364195 1340907 1222199 1044416 876099 774196 759978 827718 950622 1074802
37197 1074802 1137957 1115468 1035900 942379 859369 806041 806213 854348 899846 907141 913419 975842
37185 975842 1063776 1056336 865117 523975 143825 -180757 -394444 -451235 -315933 -1541
37175 -1541 417344 834884 1159010 1351175 1448308 1538044 1685612 1877395 2043632 2129940
37165 2129940 2132988 2076193 1977921 1850762 1712519 1584944 1489765 1449914 1478550 1553621 1614670
37154 1614670 1604377 1515515 1389633 1275041 1196832 1157778 1143401 1122039 1062900 966295 859714
37143 859714 752883 615749 418868 180349 -47422 -223799 -329617 -345712 -255582 -68915
37133 -68915 184279 482073 807980 1125560 1391841 1601274 1782045 1938338 2029344 2021017
37123 2021017 1929806 1799071 1660025 1532409 1432077 1351514 1256042 1127373 998372 927768
37113 927768 957404 1105911 1373415 1724259 2087121 2405220 2680016 2948602 3232527 3523740
37103 3523740 3800600 4039902 4233368 4407275 4601045 4815284 5020689 5240413 5575666
37094 5575666 6107656 6807928 7577049 8312613 8874084 9039709 8622838 7660734 6424674
37085 6424674 5222627 4231089 3502307 3039978 2817037 2766423 2804762 2858792 2867559 2799602
37075 2799602 2688098 2615972 2640646 2746999 2876959 2980242 3039490 3085717 3193777 3416469
37065 3416469 3706254 3942123 4051722 4067204 4041950 3961016 3772372 3471216 3107222 2726595
37055 2726595 2350302 2005199 1739861 1595769 1568316 1590999 1557170 1384288 1084797 768991
37045 768991 558002 487887 497217 494661 431754 327798 246491 249993 362947 569128 832126
37034 832126 1113326 1379323 1607316 1784221 1893170 1905904 1799179 1578206 1286534 1012627
37024 1012627 890249 1048699 1511923 2146387 2740416 3146846 3350676 3429249 3478093 3552748
37014 3552748 3635856 3659344 3585605 3457755 3344232 3255794 3157216 3039517 2927127 2826087
37004 2826087 2727265 2662597 2695667 2839236 3031279 3208731 3359101 3484910 3569135 3605420
36994 3605420 3624755 3662901 3728414 3826197 3989338 4264082 4669504 5170417 5672261 6054753
36984 6054753 6247235 6271364 6182423 5986456 5665388 5273622 4940332 4753047 4682153 4632400
36974 4632400 4523633 4312634 3996866 3635320 3334041 3178833 3188243 3325903 3528526 3728633
36964 3728633 3889857 4017394 4099428 4061723 3842358 3499733 3173455 2936163 2755416 2603300
36954 2603300 2515841 2518227 2569352 2617358 2650467 2669016 2675334 2720934 2893372 3212268 3587787
36943 3587787 3910308 4129564 4230042 4203451 4084819 3954811 3865972 3812334 3790800 3831300
36933 3831300 3945979 4117356 4360715 4723904 5193234 5669059 6065048 6365293 6567152
36924 6567152 6658368 6687189 6767829 6966059 7241777 7528488 7793897 8009702 8162418 8318896
36914 8318896 8574004 8903831 9184615 9388985 9639162 10030768 10544213 11175737 11995303
36905 11995303 12996835 14042997 15053950 16121927 17362643 18798691 20469002 22490994
36897 22490994 24917031 27686502 30809971 34428340 38603944 43257119 48412137 54286001
36889 54286001 61036308 68699173 77522925 88081294 100926398 116496684 135540102
36882 135540102 159176460 188294078 223316315 264392710 310059958 354120781 384943260
36875 384943260 390996037 369139321 327292551 278478762 232590001 193427231 161172088
36868 161172088 135203581 114635020 98161917 84635218 73503606 64412939 56812542
36861 56812542 50210770 44441708 39443686 35062312 31237192 28091991 25649568 23669547
36853 23669547 21901045 20292041 18841794 17465805 16139314 14985507 14082356 13323704
36845 13323704 12573735 11818115 11074131 10300128 9496006 8767227 8194288 7744573 7379295
36836 7379295 7122493 6948517 6728088 6381096 5983416 5638670 5335382 5006317 4638420
36827 4638420 4246592 3820714 3375518 2984974 2702689 2510907 2394945 2387119 2476497 2549891
36817 2549891 2492336 2297949 2041271 1803617 1664861 1683070 1815484 1920334 1898562 1787002
36807 1787002 1669808 1563379 1448455 1360074 1372175 1512018 1729901 1930575 2014877 1934394
36797 1934394 1735127 1510939 1294784 1038938 716815 389572 149155 45669 87933 256311
36787 256311 488078 701182 854915 943293 930970 772587 511897 278828 154402 109584
36777 109584 103025 150517 252228 339854 366279 384888 474936 642613 857109 1129836 1484808
36766 1484808 1882275 2229540 2442712 2464519 2275317 1944646 1629009 1451397 1399563 1381679
36756 1381679 1347351 1309418 1285473 1274366 1267612 1239127 1147226 985438 804230 646540 491298
36745 491298 291562 30010 -294040 -678104 -1067463 -1345620 -1442152 -1417700 -1378094 -1331755
36735 -1331755 -1196567 -925415 -557283 -156025 235560 580930 846767 1025090 1121775 1123330
36725 1123330 1008077 785871 498018 187898 -103346 -334988 -496930 -621094 -722568
36716 -722568 -748367 -629370 -370615 -48342 270271 563071 823102 1041180 1213602 1323822
36706 1323822 1319531 1151941 843243 481350 144725 -139081 -363785 -508405 -538564 -424599
36696 -424599 -161820 208780 610226 981230 1304859 1565040 1700250 1642443 1395215 1041374
36686 1041374 682517 400523 256170 266661 368928 438499 364554 104885 -312008 -805804
36676 -805804 -1272471 -1631401 -1858644 -1967370 -1971920 -1893918 -1785705 -1710147 -1695785 -1730211 -1785081
36665 -1785081 -1826240 -1821015 -1769168 -1708271 -1650948 -1536572 -1294127 -943285 -583916 -291561
36655 -291561 -75471 65506 114417 83023 25958 -27169 -107096 -229890 -320284 -259327 962
36644 962 402364 845593 1251027 1555523 1693917 1622861 1370490 1050086 805102 720833
36634 720833 778135 889566 976877 1015325 1021041 1016320 1006076 970975 878535 710690 484060
36623 484060 239079 11879 -179246 -329942 -443916 -521881 -542285 -463326 -266425 2617
36613 2617 253726 417192 480056 468210 415637 351774 294146 239154 171077 90725 28703
36602 28703 21338 74717 156694 224223 256669 261003 246379 204786 129814 50218 23528 84475
36590 84475 206754 320258 360352 309293 218212 199249 367734 757658 1284724 1794695
36580 1794695 2148271 2277372 2198972 1995292 1762762 1559388 1400058 1290722 1235375 1205807
36570 1205807 1142252 1002393 782259 479201 78555 -395684 -859571 -1240812 -1543294 -1800506
36560 -1800506 -1994137 -2069580 -2014894 -1872760 -1680201 -1441090 -1153896 -823435 -447624 -37474
36550 -37474 343579 599323 673223 580896 374837 105740 -187438 -487087 -802419 -1137508
36540 -1137508 -1453558 -1691478 -1831745 -1905716 -1954486 -2008875 -2101334 -2252587 -2437979 -2598887
36530 -2598887 -2691840 -2702120 -2625678 -2490118 -2392289 -2447961 -2665850 -2900998 -2960274 -2743675
36520 -2743675 -2290836 -1737687 -1244678 -919649 -766673 -715290 -706401 -729206 -778960 -827714
36510 -827714 -858419 -887799 -926575 -948137 -925039 -870143 -815844 -779033 -770219 -802825 -856586 -859521
36498 -859521 -752385 -561316 -373030 -252528 -222198 -304830 -528912 -873555 -1242978 -1519006
36488 -1519006 -1629508 -1567246 -1371581 -1108303 -846882 -630927 -467648 -353340 -304238 -349776
36478 -349776 -493175 -690977 -884850 -1052377 -1212964 -1381086 -1533254 -1636499 -1693839 -1737825
36468 -1737825 -1788052 -1842118 -1902671 -1977198 -2042767 -2044912 -1953052 -1798994 -1646215 -1537700 -1482239
36457 -1482239 -1464055 -1444117 -1373990 -1238251 -1076032 -940748 -848437 -786969 -765374 -821927 -973050
36446 -973050 -1168856 -1309335 -1303620 -1118436 -781986 -353219 103231 512694 786329 857684
36436 857684 732869 482940 177936 -149227 -464968 -698290 -781153 -718354 -587063 -465128
36426 -465128 -380051 -327527 -313462 -359913 -472683 -608763 -678421 -590396 -312191 104587 557798
36415 557798 957140 1265956 1500726 1697348 1867723 1979513 1979256 1833176 1537359 1096907
36405 1096907 523725 -132342 -769473 -1268683 -1538061 -1528367 -1245347 -780166 -306035 7511
36395 7511 102847 54672 -11229 -7877 84771 235626 384349 470018 469061 409991 339731 273622
36383 273622 187432 60849 -83140 -195561 -254804 -283423 -301004 -277420 -158818 61199
36373 61199 321978 556344 749852 925829 1091168 1222840 1304398 1352921 1400443 1455364
36363 1455364 1485325 1435098 1265135 984076 652110 353196 155574 81557 100541 155935
36353 155935 215970 300535 443884 629995 785303 844751 806365 706312 558263 342079
36343 342079 46565 -299914 -643907 -934005 -1129043 -1199282 -1140554 -988419 -802696 -622083
36333 -622083 -431857 -188548 113790 409512 606953 666253 621607 532876 433545 322231
36323 322231 174515 -52885 -407310 -898811 -1467110 -1997932 -2377464 -2543018 -2507719 -2355259
36313 -2355259 -2200058 -2125806 -2144549 -2207596 -2252454 -2246528 -2204515 -2175362 -2206007 -2306866 -2448645
36302 -2448645 -2589370 -2700580 -2773478 -2811819 -2818131 -2777724 -2661450 -2459468 -2210002 -1978889
36292 -1978889 -1811737 -1718266 -1690129 -1703624 -1708836 -1654838 -1538270 -1399339 -1261554 -1107721
36282 -1107721 -926004 -738523 -558814 -359133 -119945 112364 261775 310037 313449 333504
36272 333504 374676 385942 302332 94114 -198453 -481137 -675687 -770203 -790093 -744490 -636123
36261 -636123 -509816 -443923 -481203 -593831 -722329 -823806 -876087 -863073 -775901 -620149
36251 -620149 -415325 -195242 -6945 107242 131706 73558 -58829 -257612 -496618 -725300
36241 -725300 -881276 -899244 -721757 -336025 185007 694351 1043571 1157785 1060341 843719
36231 843719 609443 410708 240370 72710 -96566 -262699 -441873 -654381 -880690 -1067576
36221 -1067576 -1186202 -1257766 -1310776 -1338088 -1315579 -1248745 -1180503 -1156041 -1191767 -1276466 -1389795
36210 -1389795 -1509232 -1598410 -1604440 -1492474 -1290188 -1075274 -902680 -764721 -644415 -582125
36200 -582125 -644852 -831603 -1048512 -1187574 -1203945 -1114709 -961025 -792132 -657877 -584177
36190 -584177 -556394 -538234 -504689 -455258 -403231 -351168 -268097 -101059 167754 477888 730280
36179 730280 875300 944548 1001889 1093475 1242717 1446686 1652151 1766531 1726737 1551122
36169 1551122 1312153 1074759 872003 714091 593331 490267 396119 326671 307454 356042
36159 356042 479638 663171 846759 943863 909125 774825 602934 420923 226139 30384
36149 30384 -133264 -237699 -268295 -213931 -83291 75327 202277 277248 320270 347701 357186
36138 357186 358457 389036 486454 659924 891568 1144619 1364305 1490690 1483746 1333387 1055999
36127 1055999 703142 363892 116064 -43016 -189687 -377482 -568494 -680987 -682744 -606620
36117 -606620 -487464 -322211 -98528 163668 409501 571909 596365 471355 251841 33359
36107 33359 -121602 -227399 -331986 -440497 -503259 -474809 -358501 -188400 6217 203204
36097 203204 376088 505133 593874 657556 700511 720650 730693 757019 818884 921267 1058074
36086 1058074 1197634 1269059 1198128 975253 671781 376209 127312 -82168 -258054 -383673
36076 -383673 -438873 -423878 -368110 -324146 -341695 -431445 -560344 -697587 -861295 -1103959 -1450183
36065 -1450183 -1858372 -2242356 -2521301 -2652591 -2633817 -2485306 -2232476 -1904057 -1541610 -1195724
36055 -1195724 -901926 -667109 -490633 -392034 -400852 -516495 -691673 -862941 -990580 -1063082
36045 -1063082 -1072634 -1004757 -861129 -682844 -531753 -440639 -392279 -357198 -340933 -378203 -489446
36034 -489446 -666340 -897703 -1179967 -1489247 -1764069 -1933875 -1958598 -1840352 -1619675 -1369316
36024 -1369316 -1161020 -1009603 -864318 -681762 -497103 -395238 -412774 -489266 -514821 -413695
36014 -413695 -195532 46388 189278 164493 5318 -190457 -339334 -405988 -381536 -265193
36004 -265193 -69245 186245 487931 813415 1101202 1273818 1309947 1270295 1234830 1233301
35994 1233301 1249033 1261573 1257158 1215810 1124026 1001325 889908 810015 735237 614832 420033
35983 420033 180540 -15372 -72669 33793 230023 398647 462839 415952 293553 144875
35973 144875 22443 -39546 -55200 -77167 -138568 -211101 -232283 -168844 -43933 91827 202620
35962 202620 282032 341215 393477 445774 492996 514708 482975 381645 218961 17471 -205748
35951 -205748 -439812 -660583 -824479 -894906 -873984 -801815 -726813 -682454 -686685 -747041 -855127
35940 -855127 -978590 -1068617 -1086482 -1032161 -949225 -895036 -898450 -944487 -996981 -1026595 -1012847
35929 -1012847 -932656 -767053 -524836 -252578 -19013 107902 78449 -120005 -444594 -801209
35919 -801209 -1082183 -1214670 -1187453 -1046306 -868188 -727596 -668953 -699231 -802482 -959423
35909 -959423 -1154117 -1367280 -1569581 -1726085 -1811555 -1823945 -1780242 -1695061 -1566206 -1387811
35899 -1387811 -1176309 -974742 -828723 -762229 -773225 -839241 -923746 -992189 -1034150 -1061581 -1073379
35888 -1073379 -1028910 -873273 -591938 -234484 111409 361355 461257 399229 200751 -98658
35878 -98658 -480652 -933560 -1414215 -1840943 -2140753 -2297242 -2345672 -2335470 -2310620 -2307333 -2335614
35867 -2335614 -2355253 -2295174 -2118765 -1869085 -1641148 -1509810 -1484649 -1523726 -1575923 -1606505
35857 -1606505 -1594894 -1528005 -1406733 -1250265 -1077675 -886969 -674110 -480871 -396425 -479520
35847 -479520 -684802 -895553 -1031660 -1096978 -1114710 -1057931 -884099 -625617 -401506 -317654
35837 -317654 -366550 -435496 -406595 -244660 -2323 238619 421973 525638 539630 456011
35827 456011 283883 60789 -165064 -366536 -548242 -726319 -899085 -1034847 -1089029 -1044413
35817 -1044413 -944974 -883311 -935615 -1097765 -1287318 -1410092 -1421190 -1324512 -1131916 -844446
35807 -844446 -477326 -87777 238984 435948 484265 403473 227878 337 -225576 -402494
35797 -402494 -518635 -601841 -687010 -783485 -876422 -949043 -992492 -999592 -964647 -896607 -827363
35786 -827363 -799707 -840896 -940036 -1045532 -1089004 -1025059 -860465 -650265 -463330 -343142
35776 -343142 -292803 -295380 -350405 -485799 -723516 -1031891 -1324673 -1518369 -1589082 -1571466 -1514648
35765 -1514648 -1453241 -1414192 -1426940 -1509985 -1650901 -1810222 -1949396 -2055174 -2140822 -2232466
35755 -2232466 -2359520 -2548142 -2798014 -3045984 -3165587 -3040790 -2665391 -2161862 -1686215
35746 -1686215 -1315910 -1034700 -806061 -630322 -527774 -493226 -484874 -448006 -339006 -138578
35736 -138578 136409 426617 645080 714497 608571 373396 110173 -80500 -159006 -160982
35726 -160982 -149488 -150850 -138161 -74309 37836 153189 226984 250826 247703 244017 254162 280645
35714 280645 310350 312383 263211 186518 149752 196961 288852 332652 278774 172131 97430
35703 97430 85028 84435 23844 -122884 -331458 -567824 -810579 -1035502 -1205859 -1301095 -1349113
35692 -1349113 -1409746 -1522976 -1685333 -1872948 -2063525 -2229517 -2337399 -2375098 -2363627 -2319298
35682 -2319298 -2217517 -2019855 -1731065 -1406820 -1113183 -905111 -834536 -933310 -1168725 -1442195
35672 -1442195 -1651207 -1739582 -1687900 -1495638 -1199693 -878179 -591852 -330604 -55108 211800
35662 211800 375776 365929 210153 -2996 -218810 -454072 -753421 -1129750 -1546076 -1940629
35652 -1940629 -2266294 -2514336 -2705937 -2863943 -2999008 -3122844 -3257214 -3408481 -3533833
35643 -3533833 -3555212 -3423782 -3166396 -2858773 -2558664 -2277411 -2009726 -1765397 -1559981 -1393937
35633 -1393937 -1263239 -1181460 -1163350 -1180627 -1157798 -1030521 -800980 -524447 -250173 9583
35623 9583 258675 488892 683722 839043 965775 1072324 1154869 1210635 1255735 1321390 1429368
35612 1429368 1572257 1715069 1808868 1803063 1660217 1378714 1008067 635993 350440 199724
35602 199724 169207 186035 160878 49360 -120551 -288078 -419966 -516867 -569221 -541861 -420425
35591 -420425 -252424 -116473 -53438 -42497 -41268 -35377 -49281 -121055 -270318 -485966 -744818
35580 -744818 -1043116 -1402158 -1835175 -2311886 -2760392 -3098929 -3264214 -3226618 -3002221 -2657217
35570 -2657217 -2290113 -1995151 -1824503 -1763602 -1737344 -1663527 -1525570 -1389216 -1328659 -1336278
35560 -1336278 -1320890 -1196634 -961292 -689531 -467969 -340763 -295934 -280948 -230477 -98115
35550 -98115 111719 321394 394529 211822 -227518 -777013 -1238051 -1493136 -1542139 -1429129
35540 -1429129 -1178317 -816938 -423852 -111495 48452 72377 44485 59911 174743 384342
35530 384342 636138 866163 1028984 1101603 1077997 977984 859018 798342 841735 958836
35520 958836 1051576 1022242 850343 604654 370159 163286 -68585 -364590 -689651 -971305
35510 -971305 -1184335 -1378185 -1619274 -1918258 -2216735 -2437274 -2540972 -2537911 -2451571 -2295108
35500 -2295108 -2102133 -1966435 -2003514 -2240915 -2564429 -2807198 -2895524 -2891623 -2901723 -2969844
35490 -2969844 -3062027 -3120707 -3111521 -3030381 -2888873 -2700960 -2482729 -2262764 -2080084 -1952023
35480 -1952023 -1842478 -1683741 -1444986 -1169232 -930272 -762252 -646552 -560365 -513177 -522979
35470 -522979 -569527 -593887 -555024 -476850 -419297 -396790 -344095 -182408 91253 406498 707541
35459 707541 1002469 1309341 1588051 1765804 1822414 1814818 1810937 1825610 1832035 1813127 1781472
35448 1781472 1757734 1747449 1742612 1741526 1764072 1838539 1960379 2067825 2081207 1977762 1812778
35437 1812778 1655734 1522657 1389470 1254449 1152835 1105215 1078734 1015636 888667 717925
35427 717925 543622 395298 284415 215998 199493 238992 305460 330035 250829 75879 -115274
35416 -115274 -239665 -264621 -190866 -17798 240705 522450 741442 855658 889230 887258
35406 887258 874094 855760 826234 754084 594248 342050 59581 -175280 -331616 -415249
35396 -415249 -418163 -320448 -139673 66840 268641 501697 814579 1187581 1527240 1737125
35386 1737125 1780592 1682591 1493813 1262073 1026290 821206 677524 612848 622639 682838
35376 682838 761133 822304 824764 723302 488998 136385 -264071 -605529 -795700 -809449
35366 -809449 -696561 -531767 -358113 -186071 -39286 25546 -37406 -202998 -368707 -413107
35356 -413107 -272826 13973 324368 521230 534521 396533 209990 80302 58079 118211
35346 118211 183970 185870 112463 6321 -84536 -138549 -149221 -111875 -39192 31068 71678
35335 71678 103369 171677 282099 373372 359978 196271 -92131 -421878 -698327 -871039
35325 -871039 -956930 -1003611 -1025635 -980733 -809678 -498778 -111714 232446 425750 439675
35315 439675 334455 193920 54357 -95225 -258554 -406387 -506397 -553173 -559114 -534485
35305 -534485 -487670 -431477 -378722 -339526 -324763 -336974 -353565 -337168 -273630 -189026 -124814
35294 -124814 -109697 -154053 -242352 -317861 -305030 -177432 6421 154257 215780 193717 104865
35283 104865 -34897 -197082 -350259 -488918 -626961 -758880 -851327 -876384 -827534 -698442
35273 -698442 -479338 -195590 72574 237000 264817 182447 29029 -172456 -401741 -624893
35263 -624893 -807843 -943049 -1054008 -1168031 -1281721 -1354092 -1338065 -1220029 -1025377 -787965
35253 -787965 -525143 -246274 29090 279619 507098 732969 955536 1117711 1137037 979748
35243 979748 702239 414158 202548 90285 49160 31184 -7641 -83909 -169847 -212273 -180172
35232 -180172 -82962 64000 268593 535537 828680 1090277 1291954 1436829 1513507 1486407
35222 1486407 1350794 1173705 1054206 1044774 1117906 1196652 1204493 1096614 868385 551729
35212 551729 209395 -72881 -209845 -157191 64269 390548 755060 1097959 1354076 1472599
35202 1472599 1462143 1389146 1311568 1228916 1108762 938571 728721 483862 204398 -86732
35192 -86732 -346111 -544473 -684052 -781638 -852319 -913701 -987859 -1083952 -1180320 -1231818 -1203538
35181 -1203538 -1106349 -998113 -934970 -914240 -879973 -796202 -697344 -643964 -638061 -607687 -474162
35170 -474162 -212350 153354 580031 1015466 1396200 1663056 1785571 1770392 1650390 1464912
35160 1464912 1240505 990500 746623 589552 616682 848432 1170425 1398361 1421322 1282842
35150 1282842 1120724 1035452 1021422 1011613 962463 882551 796752 714604 643907 611610 643909
35139 643909 725849 799645 811257 752707 659071 575726 531602 529998 551982 573501 592616 641615
35127 641615 758847 937447 1109465 1201489 1214288 1229135 1313508 1428538 1457003 1324474
35117 1324474 1063345 750461 424305 99665 -165706 -277944 -190218 56716 387572 756562
35107 756562 1149064 1554080 1959507 2354113 2711706 2990221 3169940 3279417 3357346 3394949
35097 3394949 3340428 3158970 2866728 2505766 2109683 1703421 1319589 999678 781940 690814
35087 690814 728653 869117 1061849 1250396 1389612 1452554 1430942 1332869 1174779 969972
35077 969972 722756 431638 98615 -256554 -584051 -813871 -895712 -836682 -693441 -524789
35067 -524789 -359144 -208307 -94430 -43174 -49527 -65923 -36982 51454 159627 232523 256325
35056 256325 281334 386150 608879 904731 1169592 1308057 1284007 1116921 846971 513981
35046 513981 159771 -174056 -468449 -746455 -1059947 -1446711 -1891414 -2321769 -2646126 -2809942
35036 -2809942 -2830678 -2782378 -2743773 -2755636 -2814093 -2884210 -2913220 -2851088 -2686414 -2468860 -2281553
35025 -2281553 -2176180 -2127071 -2042274 -1819347 -1406475 -831353 -179735 455873 1005553 1405350
35015 1405350 1577706 1461070 1067064 494396 -120534 -665120 -1080515 -1364331 -1554395
35006 -1554395 -1688136 -1761521 -1735462 -1585212 -1327097 -994300 -613340 -218195 141211 433759
34996 433759 673728 881066 1023980 1037460 907393 712873 574036 568090 692166 881460
34986 881460 1051126 1140949 1146213 1114983 1114878 1197271 1375472 1615348 1846930 2006592 2078477
34975 2078477 2083249 2021448 1847442 1519796 1073868 627253 303790 150025 119370 125261
34965 125261 101877 20801 -125515 -327607 -541758 -693639 -722680 -621849 -428066 -188678
34955 -188678 47882 228499 316839 319425 266884 172136 33338 -128512 -278184 -423438
34945 -423438 -618608 -878888 -1120043 -1221524 -1137509 -918478 -641107 -354368 -85849 143429
34935 143429 323735 450237 503582 461743 343347 217811 153628 163049 205861 239868 262431
34924 262431 310762 425074 603185 790222 923678 990300 1028463 1076975 1137998 1189215 1206560
34913 1206560 1161935 1020258 765800 434359 111349 -102853 -134034 31413 330835 652468
34903 652468 901062 1046711 1111287 1118454 1068840 958251 803491 641107 499521 372998
34893 372998 230346 60687 -92903 -164256 -133035 -43241 55641 163003 304872 478430
34883 478430 646087 773989 849852 871450 850308 828747 860266 953697 1046962 1045518 888408
34872 888408 594667 268775 47413 -2935 48244 56237 -60020 -258310 -451108 -601891
34862 -601891 -723514 -821928 -886140 -919283 -941524 -967581 -1009996 -1090747 -1204052 -1263921 -1138109
34851 -1138109 -770193 -254390 234601 583595 804921 974179 1131038 1253378 1318618 1365165
34841 1365165 1467562 1644840 1811242 1833593 1632292 1222799 683700 112555 -401002 -801954
34831 -801954 -1088048 -1287919 -1418498 -1478692 -1477417 -1436910 -1364952 -1257500 -1141200 -1079034 -1108430
34820 -1108430 -1196388 -1280287 -1333940 -1369140 -1394155 -1406569 -1416241 -1436597 -1450585 -1416444 -1315694
34809 -1315694 -1174146 -1031906 -914898 -838827 -813295 -828641 -859305 -894309 -947427 -1024090 -1097204
34798 -1097204 -1136158 -1147177 -1161748 -1189928 -1206081 -1179654 -1099390 -964613 -776338 -551566 -330525
34787 -330525 -148513 -4410 125312 243206 324030 358835 381715 429042 484618 496025 446872
34776 446872 382722 352215 346945 320138 247050 141877 25799 -93930 -216327 -347150 -514965
34765 -514965 -763876 -1112648 -1524868 -1924814 -2241188 -2441946 -2539595 -2563274 -2519502 -2388723
34755 -2388723 -2169957 -1908150 -1646454 -1363365 -1001760 -567093 -153252 148400 327894
34746 327894 422524 450134 424133 406492 485472 698165 1013242 1382875 1761964 2072961
34736 2072961 2212468 2131484 1883340 1565778 1236997 909073 592789 307178 52694 -188741
34726 -188741 -419918 -613370 -732820 -757071 -687791 -552593 -401400 -283611 -222219 -211120
34716 -211120 -223901 -208966 -91958 177748 566700 959812 1235937 1337710 1277696 1109700
34706 1109700 909020 750991 671607 646867 626678 586305 533733 481930 443000 445882 521473
34695 521473 649917 746711 731349 606217 447942 324166 239352 160868 68281 -41441
34685 -41441 -177406 -351318 -545722 -705620 -773937 -728763 -581597 -352275 -60468 261918
34675 261918 564793 790266 882564 792402 495376 28370 -493232 -915039 -1122154 -1094246
34665 -1094246 -896754 -627861 -369130 -165214 -26394 58948 108098 131801 135571 129810 129485
34654 129485 136730 127991 68568 -55449 -219294 -368709 -444555 -413560 -300627 -197717 -218951
34643 -218951 -423613 -780160 -1205545 -1623123 -1972559 -2192240 -2236472 -2117459 -1901842 -1653496
34633 -1653496 -1396949 -1136770 -875337 -589097 -220152 264886 812304 1309212 1674786
34624 1674786 1899656 2000360 1973830 1814804 1554267 1257298 987921 782352 641454 534285
34614 534285 415655 253749 46619 -178655 -369926 -463728 -429558 -313304 -208422 -161072
34604 -161072 -122913 -21698 138448 274618 306839 206845 -22452 -361926 -749365 -1074618
34594 -1074618 -1238613 -1214896 -1046528 -805595 -574277 -437192 -443295 -561013 -692073 -744163
34584 -744163 -687993 -551475 -380457 -208877 -41134 156900 435059 799977 1177508 1455421
34574 1455421 1573500 1560521 1479160 1356113 1184276 975617 776211 622680 510224 416670
34564 416670 334534 257558 154131 -11902 -234008 -463831 -663255 -826092 -933362 -917598
34554 -917598 -711586 -334603 97320 460714 712554 882052 993483 1024800 949773 801786
34544 801786 672570 642856 723304 863051 998248 1080571 1076024 967439 768909 524428
34534 524428 284085 87241 -36685 -77435 -68603 -82110 -168996 -305608 -415368 -441437 -381448
34523 -381448 -258671 -93539 81879 210085 242252 183373 80934 -34377 -182069 -405596
34513 -405596 -726908 -1124956 -1535877 -1864874 -2020688 -1965400 -1734061 -1400504 -1032312 -684547
34503 -684547 -415071 -275240 -283515 -424684 -669764 -974177 -1262028 -1448937 -1496571 -1424668
34493 -1424668 -1264625 -1036291 -788357 -618407 -602257 -711863 -838470 -887906 -819349 -609487
34483 -609487 -243408 239434 738536 1165341 1498400 1744998 1879900 1856188 1659119 1320569
34473 1320569 896944 461632 98456 -143571 -292754 -421780 -570367 -725630 -871726
34464 -871726 -1016537 -1158645 -1268155 -1325942 -1354537 -1381829 -1395320 -1366475 -1309100 -1274034 -1279235
34453 -1279235 -1277164 -1211332 -1089307 -980566 -947727 -992200 -1059240 -1076685 -988880 -779424 -487325
34442 -487325 -201858 -20998 6405 -90765 -228949 -322358 -325342 -242359 -106982 52140 231884
34431 231884 444782 690800 939788 1136620 1219757 1148735 938811 673520 457306 331866
34421 331866 243796 107903 -103138 -340391 -532705 -635787 -637021 -545878 -392087 -213182
34411 -213182 -28827 162354 352216 503708 577828 574038 529728 480057 428672 359266 266141
34400 266141 165954 83024 34491 36456 112075 266993 447726 551603 510039 356347 182264
34389 182264 27779 -154907 -423947 -773482 -1155189 -1531558 -1861975 -2058919 -2023238 -1746403
34379 -1746403 -1345229 -970173 -692275 -489311 -316034 -159099 -32906 48085 83636 87194
34369 87194 76112 55529 13394 -57642 -134621 -177284 -174927 -168268 -212983 -329572 -502267 -718734
34357 -718734 -985490 -1294246 -1591205 -1801617 -1887863 -1877646 -1840547 -1847772 -1947800 -2153972
34347 -2153972 -2432972 -2707039 -2887528 -2926605 -2846040 -2714278 -2588195 -2471917 -2332098 -2150741
34337 -2150741 -1953843 -1782908 -1647417 -1518466 -1367964 -1201705 -1049490 -928810 -819352
34328 -819352 -668028 -424701 -91145 256601 505019 574016 454023 181909 -195772 -622319
34318 -622319 -1015061 -1286542 -1397197 -1379254 -1302426 -1219917 -1145112 -1064135 -958142 -820477
34308 -820477 -670589 -559375 -550303 -677568 -913723 -1180454 -1393747 -1498729 -1471122 -1311971
34298 -1311971 -1062195 -810709 -655597 -640437 -734770 -876760 -1019212 -1133644 -1200481 -1222573
34288 -1222573 -1237752 -1291101 -1391542 -1510543 -1622340 -1726385 -1823669 -1887019 -1872064 -1761761
34278 -1761761 -1597326 -1459894 -1412283 -1452288 -1525671 -1584420 -1620210 -1636550 -1610129 -1504648 -1317268
34267 -1317268 -1089471 -873750 -710096 -630997 -655374 -759689 -873775 -924178 -876566 -735503
34257 -735503 -529502 -314982 -169885 -145092 -221587 -341750 -483891 -676816 -930723 -1183578
34247 -1183578 -1344601 -1381585 -1340088 -1278028 -1207875 -1115448 -1015606 -962322 -998283 -1104729 -1204214
34236 -1204214 -1206980 -1059916 -773363 -419883 -101053 109440 210383 265983 349217 482258
34226 482258 620597 689385 642989 504089 350603 255881 229195 208695 114468 -84456 -346655
34215 -346655 -596803 -789726 -939982 -1090892 -1261984 -1436461 -1595677 -1744746 -1891889 -2015107
34205 -2015107 -2066324 -2007448 -1838237 -1601508 -1371257 -1216480 -1150485 -1122474 -1082440 -1046206
34195 -1046206 -1066311 -1144772 -1218620 -1245564 -1263177 -1331147 -1438048 -1500812 -1453310 -1316758 -1188518
34184 -1188518 -1172251 -1302040 -1513872 -1700104 -1805701 -1857314 -1889075 -1875597 -1775771 -1617906
34174 -1617906 -1486417 -1422592 -1383718 -1307312 -1170122 -967032 -679269 -305088 95869 421642
34164 421642 588875 566859 376657 83987 -221379 -470800 -644023 -739911 -734885 -598480
34154 -598480 -348486 -65968 150721 235681 169809 -21162 -270950 -501187 -674244 -819024
34144 -819024 -993126 -1219693 -1467460 -1685206 -1837278 -1900226 -1848307 -1678264 -1459325 -1327880
34134 -1327880 -1390004 -1618378 -1865546 -1987974 -1942524 -1763439 -1488027 -1144225 -793221 -531743
34124 -531743 -430262 -488015 -659379 -902289 -1180838 -1436420 -1591555 -1601090 -1495056 -1359794
34114 -1359794 -1270511 -1238900 -1220065 -1159246 -1026374 -818269 -550401 -251618 52211 361752
34104 361752 696067 1044051 1334819 1476620 1423255 1193748 845848 458683 129138 -62755
34094 -62755 -109940 -83041 -64226 -86906 -143160 -222807 -322028 -426981 -514226 -569654 -596149
34083 -596149 -603361 -596105 -569669 -513211 -422750 -308600 -175700 3227 270270 623547 992961
34072 992961 1290968 1474128 1542264 1502386 1367554 1182539 1012539 892858 805009 706761
34062 706761 573369 412518 257740 145894 77371 -8362 -197501 -529924 -970914 -1453232
34052 -1453232 -1925162 -2348728 -2676418 -2858525 -2875018 -2751030 -2545363 -2330566 -2172899 -2110294
34042 -2110294 -2136272 -2199085 -2214258 -2090671 -1774007 -1287709 -730321 -219979 166837 413309
34032 413309 541639 590949 609574 649079 748502 914172 1112360 1291280 1423672 1526510
34022 1526510 1626421 1708276 1718481 1625508 1456248 1257025 1034560 757572 410520 22938
34012 22938 -359226 -714898 -1047387 -1344183 -1548418 -1587631 -1445347 -1198474 -961715 -787041
34002 -787041 -633321 -439678 -204074 27566 226999 408983 600688 812857 1036873 1245351
33992 1245351 1398139 1473848 1497151 1510914 1520511 1494658 1427986 1369732 1369347 1416331 1457879 1459467
33980 1459467 1419953 1335021 1178651 933158 622796 305680 35008 -170174 -322792 -442458
33970 -442458 -531762 -574929 -558936 -498239 -445614 -482245 -684695 -1077190 -1601416 -2137643 -2567722
33959 -2567722 -2829910 -2930498 -2919909 -2854381 -2757137 -2602373 -2346782 -1988679 -1591935 -1244627
33949 -1244627 -995648 -828026 -679171 -485893 -234329 15818 171141 189800 119411 32009
33939 32009 -66562 -232139 -487130 -763429 -959734 -1039385 -1051628 -1063971 -1094513 -1115406 -1107306
33928 -1107306 -1092779 -1110943 -1169383 -1236729 -1285146 -1323657 -1376292 -1439380 -1482001 -1485990 -1461387
33917 -1461387 -1414906 -1326498 -1178962 -1002280 -863839 -804036 -789330 -738525 -596270 -376617
33907 -376617 -134329 95787 316222 525340 684405 749586 728401 676675 633515 580930
33897 580930 479292 326845 172368 83178 110915 266451 500781 718647 840661 859143
33887 859143 820023 757663 676420 598603 591254 713020 943875 1187517 1336811 1326719 1150033
33876 1150033 866063 597631 474092 538291 712210 870683 947457 965414 981937 1026590
33866 1026590 1082296 1097546 1010918 789186 461589 110157 -186569 -401700 -556760 -688872
33856 -688872 -831070 -1005920 -1209166 -1393687 -1487459 -1442354 -1267660 -1019944 -770303 -581776
33846 -581776 -500502 -547581 -712075 -955506 -1226868 -1476767 -1666577 -1776814 -1812213 -1793879
33836 -1793879 -1741156 -1664384 -1581248 -1535006 -1579865 -1736446 -1963970 -2180563 -2305619 -2282316
33826 -2282316 -2084059 -1733126 -1315674 -945510 -687435 -523861 -409168 -342374 -364247 -489417
33816 -489417 -667707 -821394 -908952 -949072 -993744 -1079960 -1193464 -1272350 -1256221 -1140765 -981074
33805 -981074 -840405 -743763 -682557 -650820 -666183 -760162 -952568 -1225260 -1508292 -1694254
33795 -1694254 -1680828 -1415491 -916546 -268848 396561 936682 1239310 1257312 1021645 632911
33785 632911 228963 -72710 -229087 -273641 -261490 -217658 -140530 -38886 52243 86791 24974
33774 24974 -154990 -437800 -760044 -1039884 -1231704 -1344653 -1405822 -1422784 -1391830 -1322163
33764 -1322163 -1226457 -1093585 -897358 -638415 -356384 -87722 172528 447526 723420 938581
33754 938581 1034924 1010938 921331 834410 792674 799729 828740 842688 814414 730038 575144
33743 575144 328992 -15739 -429499 -852644 -1228787 -1528138 -1740634 -1854405 -1845034 -1688424
33733 -1688424 -1393488 -1027493 -693896 -461520 -312558 -175797 -13804 137141 212863 182448
33723 182448 54344 -150366 -401556 -648742 -841865 -975850 -1097207 -1252062 -1431714 -1575147
33713 -1575147 -1620704 -1551597 -1398024 -1206760 -1013936 -840678 -698648 -585813 -480371 -356416
33703 -356416 -214626 -89043 -15842 -491 -17905 -33545 -19946 29257 85855 101722 60557
33692 60557 11073 26589 129417 272410 396528 487772 572300 673575 784147 865859 866232
33681 866232 743596 490145 137370 -251117 -583264 -753141 -693439 -435188 -99342 188405
33671 188405 369273 442810 425239 346578 265450 239782 274946 327537 364804 393809 424963
33660 424963 437075 399430 310838 196823 80936 -21615 -94204 -130720 -159327 -232257 -380184
33649 -380184 -581867 -777837 -904873 -924041 -839852 -703621 -582763 -509533 -459494 -380040
33639 -380040 -227440 25526 389810 839586 1303204 1709427 2049800 2368301 2674293 2886198
33629 2886198 2885878 2628750 2193614 1734310 1392527 1240192 1272763 1441035 1693935 1996664
33619 1996664 2309123 2557083 2645290 2516756 2207229 1841007 1561268 1441302 1446129 1481436
33609 1481436 1487758 1486701 1535657 1649544 1775254 1831336 1762973 1577452 1352866 1203474 1199487
33598 1199487 1304363 1406160 1418989 1342155 1222631 1089622 943089 785075 635273 516024
33588 516024 431314 355407 241286 61326 -145849 -288008 -303778 -230100 -170464 -204938 -346100
33577 -346100 -565567 -829935 -1109808 -1382408 -1636245 -1859041 -2020976 -2089960 -2065118 -1972510
33567 -1972510 -1824243 -1609763 -1339205 -1066623 -847492 -694928 -607585 -626345 -820554 -1200221
33557 -1200221 -1658050 -2016968 -2144559 -2034046 -1786548 -1512575 -1242126 -932413 -564297
33548 -564297 -210968 11545 53570 -35075 -179318 -354317 -576029 -846987 -1136983 -1400747
33538 -1400747 -1588630 -1651736 -1571307 -1391057 -1198262 -1059378 -980154 -926411 -866183 -788642
33528 -788642 -704163 -640126 -621256 -637059 -639511 -592487 -518457 -476615 -495300 -546537 -593336 -641809
33516 -641809 -727772 -857636 -981077 -1031544 -992534 -922822 -918114 -1045854 -1306399 -1639626 -1956338
33505 -1956338 -2171364 -2234985 -2157356 -2002933 -1846814 -1729133 -1649899 -1595659 -1554981 -1511895
33495 -1511895 -1446402 -1352183 -1243413 -1136752 -1036295 -943739 -872600 -838717 -838285 -843207 -818244
33484 -818244 -741183 -612732 -453130 -286498 -124826 30570 173589 288504 360535 377518
33474 377518 318798 167267 -43985 -208195 -201552 17703 368921 709625 933059 1012434
33464 1012434 969140 818050 555942 204550 -149341 -380939 -408988 -249351 6968 248235
33454 248235 373744 317084 90494 -192349 -377064 -375040 -205497 58521 356587 652176
33444 652176 918142 1140276 1319075 1444553 1480703 1398517 1220363 1013133 839172 725412
33434 725412 667703 636115 572252 411494 135974 -192559 -463651 -589703 -554131 -400084
33424 -400084 -182378 63986 310069 502107 566798 460119 203118 -142434 -527430 -929535
33414 -929535 -1318997 -1636424 -1822102 -1860323 -1780950 -1617521 -1373004 -1028737 -581448 -69010
33404 -69010 438566 876867 1225228 1511147 1767365 1972881 2039541 1875051 1474548 951284
33394 951284 471940 156433 24877 10717 5577 -86787 -293664 -549037 -744822 -825734
33384 -825734 -825663 -801284 -747513 -600615 -317737 65679 450070 721039 794991 659644 393455
33373 393455 122725 -73094 -218987 -399863 -663853 -977553 -1265359 -1474477 -1605247 -1698983
33363 -1698983 -1801255 -1918376 -1996989 -1958351 -1770844 -1490752 -1224870 -1053207 -987982 -990901
33353 -990901 -1006551 -978175 -858145 -628724 -314387 34664 368760 643124 807676 816812
33343 816812 662100 388667 69171 -241198 -526916 -798019 -1058299 -1281601 -1413169 -1397262
33333 -1397262 -1212803 -892028 -513944 -181676 11797 29102 -78849 -195368 -219486 -141803
33323 -141803 -41499 -7936 -66389 -175890 -286608 -386775 -492300 -603811 -693926 -745483
33313 -745483 -787926 -872967 -1010996 -1151535 -1240752 -1287469 -1355258 -1490041 -1665579 -1798668
33303 -1798668 -1809920 -1676086 -1442114 -1191893 -999227 -891619 -844537 -794965 -661180 -378132
33293 -378132 51180 533059 934743 1178494 1286446 1335116 1380210 1432871 1492172 1573649
33283 1573649 1693481 1831051 1922149 1904682 1778871 1615550 1493173 1427984 1377852 1312342
33273 1312342 1258593 1268758 1359378 1499892 1651267 1796328 1933504 2058562 2158063 2210650
33263 2210650 2191152 2082869 1890919 1637248 1339223 1000921 632462 273837 -9775 -163119
33253 -163119 -176184 -88297 43270 181994 322223 466806 607521 735672 861204 1002131
33243 1002131 1152165 1273522 1329449 1316288 1261010 1199896 1165652 1179521 1239711 1324275 1419382
33232 1419382 1538825 1699131 1877024 2007754 2028635 1915293 1682017 1370150 1041858 761139
33222 761139 559614 425198 332431 275491 265599 311856 418951 589486 806415 1018038
33212 1018038 1161751 1205671 1155894 1029416 840436 612386 379815 168770 -11176 -151899
33202 -151899 -240679 -274329 -260503 -196688 -68865 113500 299331 435331 515090 568828 609962
33191 609962 614531 557201 449555 330065 218781 88688 -110273 -389352 -684527 -898319
33181 -898319 -986927 -993544 -987656 -990092 -973723 -916868 -824947 -707673 -569460 -429124 -323738
33170 -323738 -281092 -300210 -358755 -421190 -440804 -380688 -243364 -61492 146049 384499 637953
33159 637953 837821 897933 772181 471063 44859 -430429 -870455 -1215278 -1444386 -1551484
33149 -1551484 -1525096 -1378928 -1187775 -1060561 -1071566 -1226823 -1479380 -1747261 -1929444 -1955064
33139 -1955064 -1842122 -1689883 -1600988 -1623578 -1763725 -2010824 -2321463 -2604450 -2763775 -2760485
33129 -2760485 -2614758 -2357482 -2013263 -1636452 -1325230 -1158595 -1113009 -1062741 -883469 -563225
33119 -563225 -211291 41248 147420 156406 136901 105454 29613 -118182 -326154 -556619
33109 -556619 -778118 -982220 -1181032 -1394985 -1634137 -1878957 -2078472 -2176328 -2147360 -2013682
33099 -2013682 -1829598 -1652452 -1519651 -1437875 -1385904 -1334914 -1276964 -1234777 -1240053 -1305884 -1423856
33088 -1423856 -1575607 -1728699 -1826095 -1808758 -1666485 -1455871 -1256276 -1116431 -1048524 -1049251
33078 -1049251 -1098680 -1149610 -1153352 -1104829 -1040526 -984776 -919338 -815363 -671194 -498498 -289677
33067 -289677 -30307 255979 499968 634958 641279 538504 350265 94552 -196206 -468653
33057 -468653 -679068 -826860 -944440 -1053243 -1146227 -1224230 -1333492 -1539888 -1859372 -2229567
33047 -2229567 -2559945 -2803495 -2977889 -3131902 -3301070 -3481431 -3624868 -3658238 -3523008 -3210689
33037 -3210689 -2767515 -2269754 -1791881 -1384057 -1064139 -824165 -642177 -487875 -328145
33028 -328145 -146163 41166 200001 317588 402405 435484 349824 92273 -300829 -719407
33018 -719407 -1072258 -1341592 -1550212 -1710496 -1818626 -1868103 -1842517 -1708985 -1441930 -1050781
33008 -1050781 -576564 -75331 384398 732600 939728 1045363 1121168 1205818 1295803 1391318
32998 1391318 1512602 1657646 1776674 1819394 1797643 1777727 1812879 1898321 1987505 2033639 2014770
32987 2014770 1937287 1826141 1707064 1594997 1501890 1448396 1451982 1500825 1554594 1580514 1579291
32976 1579291 1565482 1530462 1440219 1273239 1055043 854552 747446 773448 912764 1096505
32966 1096505 1244909 1303022 1246730 1068489 774675 401233 17923 -299870 -510430 -619504
32956 -619504 -663149 -685273 -727384 -821243 -971719 -1140513 -1255623 -1251435 -1110354 -870579 -597054
32945 -597054 -346367 -151870 -25653 36763 48605 17683 -58910 -177096 -306333 -404467
32935 -404467 -458803 -500260 -566606 -659281 -744420 -784302 -752308 -628860 -414841 -161097 37134
32924 37134 98635 8203 -196807 -478511 -815417 -1171411 -1478552 -1672485 -1737622 -1703492
32914 -1703492 -1603963 -1458605 -1292560 -1149388 -1065324 -1037153 -1029552 -1012253 -979016 -933378 -874408
32903 -874408 -805716 -745544 -711271 -696574 -680418 -665037 -692584 -810302 -1020776 -1275259 -1510889
32892 -1510889 -1676079 -1717319 -1574644 -1233651 -790113 -430773 -317582 -482610 -830063 -1214657
32882 -1214657 -1502169 -1589975 -1435725 -1096959 -717519 -441720 -335019 -384350 -548572 -784978
32872 -784978 -1042711 -1269397 -1441529 -1577026 -1706648 -1834704 -1929425 -1947875 -1869188 -1707135
32862 -1707135 -1494498 -1262365 -1042057 -877702 -807859 -818562 -834684 -785961 -678357 -578946
32852 -578946 -533445 -522272 -498116 -437628 -342643 -214126 -51062 127485 275244 340093 295184
32841 295184 156160 -30480 -221076 -394449 -531908 -592066 -534693 -373703 -178208 -6441
32831 -6441 139975 282219 411582 497583 530566 522931 474592 370448 216593 51749 -89020
32820 -89020 -205231 -314528 -413297 -458944 -389854 -174411 141502 440648 612586 634499
32810 634499 563500 452629 297279 67278 -235304 -563382 -847751 -1017943 -1025313 -876960
32800 -876960 -644204 -417835 -252981 -161545 -138615 -169913 -222176 -263995 -314780 -455144 -764935
32789 -764935 -1245522 -1806279 -2325690 -2725708 -2996688 -3164507 -3243335 -3224004 -3106218 -2934379
32779 -2934379 -2792672 -2758850 -2856946 -3046800 -3253533 -3409437 -3475789 -3435441 -3279584 -3017759
32769 -3017759 -2703867 -2436305 -2309757 -2352986 -2509494 -2678360 -2778387 -2784655 -2716990 -2603010
32759 -2603010 -2457675 -2295695 -2147060 -2040256 -1968841 -1892037 -1778147 -1637822 -1507900 -1415319
32749 -1415319 -1368800 -1375362 -1447590 -1595269 -1818954 -2106102 -2420574 -2697767 -2861729 -2849753
32739 -2849753 -2622297 -2169348 -1531610 -811961 -140009 389564 743582 927757 962384 886506
32729 886506 765500 675496 675438 784006 963095 1120614 1154831 1020834 755901 436113 114631
32718 114631 -195898 -495603 -766182 -964419 -1043670 -991155 -848026 -680249 -524319 -377148
32708 -377148 -246056 -182384 -238341 -402536 -608339 -804191 -986299 -1156292 -1278020 -1300660
32698 -1300660 -1213869 -1062239 -910754 -809179 -780721 -818433 -879564 -897227 -821091 -659638
32688 -659638 -480981 -362534 -327948 -323368 -252955 -47414 283031 646854 922110 1026437
32678 1026437 958226 782107 576375 387698 223424 74109 -63160 -182774 -287018 -395897
32668 -395897 -530475 -686896 -841253 -987104 -1150015 -1344830 -1530652 -1638334 -1644616 -1592485
32658 -1592485 -1533239 -1478714 -1424008 -1383710 -1373823 -1375512 -1350371 -1286146 -1200044 -1100244 -971753
32647 -971753 -803456 -607261 -407237 -228586 -97944 -31253 -13244 -5876 14690 39746 45714
32636 45714 15024 -56100 -145009 -194291 -145257 3577 187476 334726 417952 442540 417730
32625 417730 365987 340926 401550 565693 799869 1044057 1232569 1309843 1258395 1113337
32615 1113337 931363 747714 578456 452901 412629 474375 617287 811852 1038064 1264856
32605 1264856 1432464 1474266 1353803 1080586 706699 316120 -864 -184248 -219605 -119520
32595 -119520 93942 378736 662857 872202 975639 994192 966784 918611 863300 817039
32585 817039 792098 778147 746542 683405 612468 576035 598709 683374 838223 1078694 1381141
32574 1381141 1648097 1750493 1618734 1290817 878213 497085 221997 72796 25925 47395
32564 47395 127371 279178 501171 751882 975051 1146152 1287467 1439572 1619122 1796722
32554 1796722 1914051 1934074 1879774 1809947 1746723 1641160 1429557 1119924 806819 600593
32544 600593 551856 637057 792290 949672 1057654 1091006 1053692 972812 884562 815207 763604
32533 763604 698596 578921 382493 122326 -159068 -408847 -587340 -685783 -723435 -722119
32523 -722119 -684840 -606371 -504488 -431338 -446811 -579130 -808358 -1082866 -1351530 -1585757
32513 -1585757 -1776360 -1914658 -1983265 -1967414 -1869859 -1712450 -1531094 -1371496 -1271722 -1228110
32503 -1228110 -1182816 -1067480 -867789 -635529 -435206 -289820 -177929 -65003 69634 218444
32493 218444 343322 399597 379557 327870 302092 323622 379900 466830 607119 820270 1086061
32482 1086061 1343240 1517764 1554249 1438833 1209556 944655 726850 603803 573851 608361
32472 608361 690545 830978 1038242 1274759 1456400 1510098 1430633 1275492 1113062 987135
32462 987135 917815 902871 902083 838291 640160 294360 -142288 -576257 -921705 -1125201 -1165249
32451 -1165249 -1040628 -769918 -408212 -51145 205995 328040 349956 323303 272139 214161
32441 214161 196665 268673 413928 544259 573947 480779 286135 9986 -317714 -615508
32431 -615508 -770567 -728214 -548731 -357017 -239433 -198517 -195629 -209927 -245020 -297898 -348574
32420 -348574 -384256 -414982 -452761 -485726 -488797 -456487 -409513 -368163 -335423 -311232 -304096 -312260
32408 -312260 -304372 -239321 -104753 78292 286074 507389 723422 893920 982554 991440 959041
32397 959041 927011 915697 921580 920207 871821 744584 547956 340909 197965 159421 204512
32386 204512 263309 260527 169815 40115 -39007 -13400 89188 186515 204895 110836 -95805
32375 -95805 -383311 -675702 -871457 -909575 -824453 -727069 -728344 -872932 -1121736 -1373149 -1506354
32364 -1506354 -1435957 -1152070 -716863 -224519 239786 624002 921528 1164220 1381824 1555466
32354 1555466 1622735 1538873 1323657 1042121 756146 508451 332876 245467 220856 201197
32344 201197 141439 40168 -69236 -137714 -110136 51969 328448 625429 821350 836543
32334 836543 665260 363065 22094 -257541 -411658 -448148 -430210 -414320 -412398 -419253 -458233
32323 -458233 -573594 -773023 -994656 -1146275 -1179098 -1122516 -1053800 -1040585 -1103488 -1211964
32313 -1211964 -1302498 -1310199 -1203699 -1000913 -750726 -499875 -279074 -110827 -11050 22599
32303 22599 8346 -45387 -151731 -317064 -511974 -694933 -866030 -1070979 -1334701 -1605621
32293 -1605621 -1788635 -1833106 -1771975 -1671336 -1559549 -1420569 -1248334 -1085879 -999646 -1020756
32283 -1020756 -1118739 -1229501 -1302765 -1326800 -1319738 -1302308 -1273899 -1213241 -1109248 -992138 -920690
32272 -920690 -926977 -978872 -1006941 -963933 -849654 -689259 -511152 -348949 -240235 -203159 -219163
32261 -219163 -249404 -264276 -251951 -211428 -155895 -120484 -145838 -241625 -372885 -493020 -591455
32250 -591455 -703789 -871466 -1090291 -1297214 -1406041 -1358173 -1150963 -838700 -518920 -300861
32240 -300861 -250981 -350734 -520675 -700418 -895257 -1133115 -1394847 -1618493 -1770416 -1877693
32230 -1877693 -1972737 -2029329 -1982144 -1806469 -1557202 -1323501 -1155504 -1036942 -915555 -752094
32220 -752094 -551720 -367139 -274021 -323535 -495604 -696733 -824345 -850859 -839636 -865437
32210 -865437 -923560 -932748 -825976 -619565 -389511 -202858 -87736 -50956 -92939 -199658
32200 -199658 -338249 -472529 -580090 -653995 -695449 -708125 -695171 -658526 -599141 -511581 -376524
32189 -376524 -172482 89089 345384 516688 561423 486223 310431 52664 -235269 -452537
32179 -452537 -505291 -381892 -156290 79959 271970 396536 439237 397436 289553 139097
32169 139097 -44804 -251082 -432934 -516366 -461241 -307639 -147748 -51507 -27514 -51149
32159 -51149 -109325 -202237 -309259 -373935 -335514 -177912 48157 245685 320972 235874 31390
32148 31390 -197479 -359460 -411821 -364599 -259725 -150291 -78974 -50707 -24400 51014 185324
32137 185324 341983 486155 618966 749962 851927 872738 797730 678964 587494 545492
32127 545492 516746 455176 348148 219471 112389 73325 129021 261051 410914 524312
32117 524312 586020 604353 579352 512232 437963 410329 437763 457697 395878 237488 21861
32106 21861 -216889 -477152 -766527 -1082461 -1419109 -1765675 -2085895 -2317913 -2407616 -2333681
32096 -2333681 -2102771 -1748122 -1344071 -988225 -732489 -539636 -336609 -107733 89552
32087 89552 195789 201688 124314 -28139 -237792 -445286 -574212 -590428 -518666 -404297 -281754
32076 -281754 -178614 -115084 -74810 7293 197407 495254 824041 1089604 1246051 1316196
32066 1316196 1371647 1494013 1723759 2017199 2257857 2333729 2214281 1951271 1617156 1265757
32056 1265757 951529 749181 715071 824695 968945 1025554 934093 707282 392095 41860
32046 41860 -277200 -483830 -522498 -419225 -280812 -215385 -246562 -311776 -342886 -337204 -350099
32035 -350099 -436139 -607706 -836258 -1073464 -1270304 -1388994 -1405561 -1308757 -1112028 -874316
32025 -874316 -689139 -621324 -644840 -657323 -566552 -362123 -109297 111144 256827 341240
32015 341240 415650 527353 682719 849403 994102 1108903 1198854 1261178 1291890 1302297
32005 1302297 1307064 1293685 1221402 1061830 835389 600177 407328 272913 190727 158681
31995 158681 177779 225470 250476 215441 143362 104056 150262 279717 458808 656443 839499
31984 839499 961422 992072 958881 932395 964138 1053532 1173494 1300691 1407346 1446031 1371612
31973 1371612 1183237 935403 704038 540355 450540 414371 423686 499257 662094 890339
31963 890339 1116948 1271545 1313197 1226714 1018223 737177 486682 379503 469905 726210
31953 726210 1055999 1346522 1502058 1483030 1325230 1105621 878529 654784 446715 312893
31943 312893 334249 540744 869381 1201800 1449840 1611559 1746854 1900151 2053152 2152792
31933 2152792 2165185 2080939 1879815 1528772 1032632 467977 -50518 -430564 -628610 -645642
31923 -645642 -524138 -338174 -158261 -19804 67161 91217 46765 -35387 -92122 -76274 6406
31912 6406 108573 177492 180749 112785 -15077 -192881 -413259 -644653 -819236 -880342 -848440
31901 -848440 -815875 -865809 -1012983 -1225524 -1473600 -1739329 -2005215 -2259057 -2496527 -2699729
31891 -2699729 -2831096 -2872537 -2854304 -2816704 -2757241 -2650585 -2512745 -2402302 -2347181 -2301493
31881 -2301493 -2188048 -1959167 -1606862 -1147206 -623966 -112297 311516 611518 800895
31872 800895 918419 1000531 1062001 1091204 1069265 995940 885349 739430 554063 363602
31862 363602 249542 275852 429001 645715 884806 1140768 1396001 1598982 1698812 1675285
31852 1675285 1527264 1260098 904486 533150 238975 94172 124190 297331 527194 706766
31842 706766 771009 734663 662980 607177 571870 533201 469275 369675 232460 71625 -66319
31831 -66319 -105515 15045 281072 588139 802689 846725 724044 478014 151286 -205106
31821 -205106 -511062 -680731 -676994 -538945 -357980 -226467 -189060 -219343 -244749 -214377 -149763
31810 -149763 -121100 -176850 -312729 -505360 -743915 -1009975 -1251182 -1409460 -1471697 -1463010
31800 -1463010 -1386311 -1199342 -869854 -435327 10217 374244 593805 630767 486051 228505
31790 228505 -25620 -190471 -262153 -286497 -296301 -299416 -311055 -363188 -472169 -611606 -726210
31779 -726210 -772267 -751665 -714409 -718863 -776918 -847570 -900849 -973946 -1129612 -1353644 -1524968
31768 -1524968 -1506830 -1253618 -820917 -299824 228901 690328 1007285 1122200 1031396 801868
$$ [...]
##END NTUPLES=NMR SPECTRUM
##END=
