##TITLE=31Pdec_AP-17MHK2_HCl
 D2O
  24 sc
 2.11.2023
##JCAMPDX= 6.0         $$ Bruker NMR JCAMP-DX V2.0
##DATA TYPE= NMR SPECTRUM
##DATA CLASS= NTUPLES
##ORIGIN= UXNMR, Bruker Analytische Messtechnik GmbH
##OWNER= root
$$ XWIN-NMR		Version 3.5
$$ Thu Nov  2 14:02:07 2023 Russian Standard Time (UT+4h)  she@DPX200
##.OBSERVE FREQUENCY= 81.013821
##.OBSERVE NUCLEUS= ^31P
##.ACQUISITION MODE= SIMULTANEOUS
##.ACQUISITION SCHEME= undefined
##.AVERAGES= 24
##.DIGITISER RES= 16
##SPECTROMETER/DATA SYSTEM= spect
##.PULSE SEQUENCE= zgpg30
##.SOLVENT NAME= D2O
##.SHIFT REFERENCE= (INTERNAL, D2O, 0, 248.564)
##AUDIT TRAIL= $$ (NUMBER, WHEN, WHO, WHERE, WHAT)
$$ ##TITLE= Audit trail, XWIN-NMR		Version 3.5
$$ ##JCAMPDX= 5.01
$$ ##ORIGIN= Bruker BioSpin GmbH
$$ ##OWNER= she
$$ F:/spectra/data/she/nmr/P31/1/pdata/1/auditp.txt
$$ ##AUDIT TRAIL=  $$ (NUMBER, WHEN, WHO, WHERE, WHAT)
(   1,<2023-11-02 14:01:10.18 +0400>,<she>,<DPX200>,
      <created by zg, POWCHK disabled, PULCHK disabled
       configuration hash MD5:
       00 E9 B6 7A A2 85 ED C7 34 08 36 98 17 FE 4E 26
       data hash MD5: 32K
       7E 9A 44 8E 69 EE 8F 3C 39 2A 29 81 A2 56 9F 69>)
(   2,<2023-11-02 14:01:14.89 +0400>,<she>,<DPX200>,
      <Start of raw data processing
       efp BC_mod = 2 LB = 5 FT_mod = 6 PKNL = 1 PHC0 = -10638.39 PHC1 = 62.4902 SI = 64K 
       data hash MD5: 64K
       C6 89 D4 A3 24 C4 BE 8A 27 FF D4 6A 9E 5B E5 59>)
(   3,<2023-11-02 14:01:27.09 +0400>,<she>,<DPX200>,
      <pk PHC0 = -34.43377 PHC1 = 0 
       data hash MD5: 64K
       17 68 B2 25 09 F2 1D B6 BA 1E 27 C2 31 15 EF 19>)
(   4,<2023-11-02 14:01:30.51 +0400>,<she>,<DPX200>,
      <abs ABSG = 5 
       data hash MD5: 64K
       B4 A0 92 A4 4F CA 64 62 13 24 E3 04 1C C1 6C DB>)
$$ ##END=
$$ 
$$ hash MD5
$$ EF ED A9 DB 16 02 B0 9D FB 72 18 72 53 40 F8 84
##$RELAX= 
##$RELAX= 
##$RELAX= 
##$RELAX= 
##$RELAX= 
##$RELAX= 
##$RELAX= 
##$RELAX= 
##$RELAX= 
$$ Bruker specific parameters
$$ --------------------------
##$DU= <F:/spectra>
##$EXPNO= 1
##$NAME= <P31>
##$PROCNO= 1
##$TYPE= <nmr>
##$USER= <she>
##$AMP= (0..31)
100 100 100 100 100 100 100 100 100 100 100 100 100 100 100 100 100 100 
100 100 100 100 100 100 100 100 100 100 100 100 100 100 
##$AQSEQ= 0
##$AQ_mod= 1
##$AUNM= <au_zg>
##$AUTOPOS= <>
##$BF1= 81.014009
##$BF2= 200.13
##$BF3= 200.13
##$BF4= 200.13
##$BF5= 200.13
##$BF6= 200.13
##$BF7= 200.13
##$BF8= 200.13
##$BYTORDA= 1
##$CFDGTYP= 0
##$CFRGTYP= 5
##$CHEMSTR= <none>
##$CNST= (0..31)
1 1 145 1 1 1 1 1 1 1 1 1 1 1 1 1 1 1 1 1 1 1 1 1 1 1 1 1 1 1 1 1 
##$CPDPRG= <waltz16>
##$CPDPRG1= <>
##$CPDPRG2= <waltz16>
##$CPDPRG3= <>
##$CPDPRG4= <mlev>
##$CPDPRG5= <mlev>
##$CPDPRG6= <mlev>
##$CPDPRG7= <mlev>
##$CPDPRG8= <mlev>
##$CPDPRGB= <>
##$CPDPRGT= <>
##$D= (0..31)
0 1 0 0 0 0 0 0 0 0 0 0.03 2e-05 3e-06 0 0 0 0 0 0 0 0 0 0 0 0 0 0 0 0 
0 0 
##$DATE= 1698919269
##$DBL= (0..7)
120 120 120 11 120 120 24 19 
##$DBP= (0..7)
150 150 150 150 150 150 150 150 
##$DBP07= 0
##$DBPNAM0= <>
##$DBPNAM1= <>
$$ [...]
##$SUBNAM3= <"">
##$SUBNAM4= <"">
##$SUBNAM5= <"">
##$SUBNAM6= <"">
##$SUBNAM7= <"">
##$SUBNAM8= <"">
##$SUBNAM9= <"">
##$SW= 501.771253377433
##$SWIBOX= (0..15)
0 1 3 0 0 0 0 0 0 0 0 0 0 0 0 0 
##$SW_h= 40650.406504065
##$TD= 32768
##$TD0= 1
##$TE= 0
##$TE2= 300
##$TE3= 300
##$TEG= 300
##$TL= (0..7)
0 120 53 12 22 120 120 120 
##$TP= (0..7)
150 150 150 150 150 150 150 150 
##$TP07= 0
##$TPNAME0= <>
##$TPNAME1= <>
##$TPNAME2= <>
##$TPNAME3= <>
##$TPNAME4= <>
##$TPNAME5= <>
##$TPNAME6= <>
##$TPNAME7= <>
##$TPOAL= (0..7)
0.5 0.5 0.5 0.5 0.5 0.5 0.5 0.5 
##$TPOFFS= (0..7)
0 0 0 0 0 0 0 0 
##$TUNHIN= 0
##$TUNHOUT= 0
##$TUNXOUT= 0
##$USERA1= <user>
##$USERA2= <user>
##$USERA3= <user>
##$USERA4= <user>
##$USERA5= <user>
##$V9= 5
##$VALIST= <valist>
##$VCLIST= <CCCCCCCCCCCCCCC>
##$VD= 0
##$VDLIST= <DDDDDDDDDDDDDDD>
##$VPLIST= <PPPPPPPPPPPPPPP>
##$VTLIST= <TTTTTTTTTTTTTTT>
##$WBST= 1024
##$WBSW= 4
##$XGAIN= (0..3)
0 0 0 0 
##$XL= 0
##$YL= 0
##$YMAX_a= 2317
##$YMIN_a= -2210
##$ZGOPTNS= <>
##$ZL1= 120
##$ZL2= 120
##$ZL3= 120
##$ZL4= 120
##$ABSF1= 248.5645
##$ABSF2= -253.2056
##$ABSG= 5
##$ABSL= 3
##$ALPHA= 0
##$AQORDER= 0
##$ASSFAC= 0
##$ASSFACI= 0
##$ASSFACX= 0
##$ASSWID= 0
##$AUNMP= <proc_1d>
##$AZFE= 0.1
##$AZFW= 0.5
##$BCFW= 0
##$BC_mod= 2
##$BYTORDP= 0
##$COROFFS= 0
##$CY= -3
##$DATMOD= 1
##$DC= 0
##$DFILT= <>
##$DTYPP= 0
##$F1P= 0
##$F2P= 0
##$FCOR= 1
##$FTSIZE= 65536
##$FT_mod= 6
##$GAMMA= 0
##$GB= 0
##$INTBC= 1
##$INTSCL= 6.047779e-11
##$ISEN= 30
##$LB= 5
##$LEV0= 0
##$LPBIN= 0
##$MAXI= 10000
##$MC2= 0
##$MEAN= 0
##$ME_mod= 0
##$MI= 50
##$NCOEF= 0
##$NC_proc= -8
##$NLEV= 6
##$NOISF1= 182.463
##$NOISF2= 159.3651
##$NSP= 0
##$NTH_PI= 0
##$NZP= 0
##$OFFSET= 248.5645
##$PC= 4
##$PHC0= -10672.82
##$PHC1= 62.4902
##$PH_mod= 1
##$PKNL= yes
##$PPARMOD= 0
##$PSCAL= 0
##$PSIGN= 0
##$REVERSE= no
##$SF= 81.0140089999694
##$SI= 65536
##$SIGF1= 159.3651
##$SIGF2= -187.1042
##$SINO= 113.3802
##$SIOLD= 16384
##$SREGLST= <1H.CDCl3>
##$SSB= 0
##$STSI= 65536
##$STSR= 0
##$SW_p= 40650.406504065
##$SYMM= 0
##$S_DEV= 0
##$TDeff= 32768
##$TDoff= 0
##$TI= <>
##$TILT= no
##$TM1= 0
##$TM2= 0
##$TOPLEV= 0
##$USERP1= <user>
##$USERP2= <user>
##$USERP3= <user>
##$USERP4= <user>
##$USERP5= <user>
##$WDW= 1
##$XDIM= 65536
##$YMAX_p= 511154056
##$YMIN_p= -27043719
$$ End of Bruker specific parameters
$$ ---------------------------------
##NTUPLES= NMR SPECTRUM
##VAR_NAME=  FREQUENCY,     SPECTRUM/REAL,   SPECTRUM/IMAG
##SYMBOL=    X,             R,               I
##VAR_TYPE=  INDEPENDENT,   DEPENDENT,       DEPENDENT
##VAR_FORM=  AFFN,          ASDF,            ASDF
##VAR_DIM=   65536,         65536,           65536
##UNITS=     HZ,            ARBITRARY UNITS, ARBITRARY UNITS
##FACTOR=    0.620285442955139, 1,           1
##FIRST=     20137.2065510682, 0,            0
##LAST=      -20513.1999529968, 0,           0
##MIN=       -20513.1999529968, -27043719,   0
##MAX=       20137.2065510682, 511154056,    0
$$ Real data points
##PAGE= N=1
##DATA TABLE= (X++(R..R)), XYDATA
$$ [...]
41727 -453419 -699263 -933516 -1124086 -1293226 -1416046 -1369974 -1036508 -471145 66669 294036
41717 294036 118002 -334095 -870581 -1392880 -1908246 -2426845 -2880370 -3153559 -3185217 -3014866
41707 -3014866 -2723611 -2361546 -1964889 -1611663 -1385289 -1266252 -1129072 -901997 -693988
41698 -693988 -700534 -988113 -1415638 -1761960 -1883012 -1747720 -1391863 -887235 -332072 172256
41688 172256 543433 717098 654120 380070 5214 -328994 -533016 -595525 -551938 -465259
41678 -465259 -431442 -547786 -836652 -1215077 -1565329 -1826780 -2002673 -2101886 -2121145 -2091527
41668 -2091527 -2101803 -2242861 -2533658 -2910810 -3274816 -3531710 -3613178 -3503231 -3267652 -3037652
41658 -3037652 -2930826 -2971016 -3087179 -3194265 -3272366 -3367913 -3534833 -3795273 -4149547 -4582229
41648 -4582229 -5027120 -5346936 -5396350 -5125999 -4611463 -3976316 -3303754 -2621034 -1931152 -1229366
41638 -1229366 -506789 221548 876426 1315142 1391202 1034419 300255 -639453 -1561144 -2273677
41628 -2273677 -2670800 -2728829 -2475402 -1971899 -1323653 -691113 -258233 -148242 -350572 -747256
41618 -747256 -1228764 -1769444 -2379190 -3023045 -3636992 -4194288 -4679814 -4994820 -4973379 -4548563
41608 -4548563 -3861648 -3157470 -2589948 -2155001 -1774856 -1399551 -1044925 -777170 -657926
41599 -657926 -679535 -763351 -833603 -863429 -832803 -696355 -444281 -152084 101442 345298
41589 345298 672067 1086731 1473212 1730743 1889910 2071071 2364009 2757119 3141746 3370345
41579 3370345 3348318 3092756 2691099 2216226 1717843 1279763 1019986 1014191 1252104 1660149
41569 1660149 2107882 2395491 2328125 1864837 1165738 466862 -59046 -320294 -276894 34558
41559 34558 481317 898597 1165039 1198225 929693 348805 -439800 -1245049 -1876012 -2201815
41549 -2201815 -2188671 -1935031 -1636979 -1451837 -1392965 -1384905 -1390834 -1438723 -1553924 -1735298 -1989941
41538 -1989941 -2326358 -2709502 -3082392 -3443207 -3843513 -4286965 -4675801 -4885145 -4854761 -4582645
41528 -4582645 -4067941 -3310553 -2365959 -1367678 -475186 208220 676224 990125 1221768
41519 1221768 1436195 1709378 2100420 2565301 2937639 3063324 2958755 2793739 2723542 2787378
41509 2787378 2959562 3204993 3428438 3433816 3036878 2250413 1331979 632472 386940 604785
41499 604785 1097514 1596438 1891686 1918840 1741258 1450407 1079130 609304 54857 -486617
41489 -486617 -890783 -1118448 -1249629 -1393576 -1581128 -1760307 -1878040 -1940225 -2003007 -2130867
41479 -2130867 -2350033 -2608423 -2788062 -2794612 -2633074 -2359739 -1976721 -1450232 -853354 -400535
41469 -400535 -252174 -309629 -280994 43192 625441 1274121 1816013 2148120 2199845 1940359
41459 1940359 1435729 849125 348657 7313 -215048 -401225 -580585 -688469 -625410 -370456
41449 -370456 -32052 227357 315148 249265 95080 -100986 -310065 -495349 -627911 -723650
41439 -723650 -835470 -994044 -1158396 -1227995 -1112753 -813365 -445025 -163503 -42925 -29155
41429 -29155 -26864 -16714 -55694 -168178 -280975 -287850 -151020 87591 375098 688681 1007311
41418 1007311 1281298 1460445 1544407 1577572 1585230 1534802 1376484 1101693 727269 234324
41408 234324 -416521 -1179077 -1875420 -2307587 -2404484 -2232073 -1896087 -1491696 -1120265 -866404
41398 -866404 -735621 -669182 -631932 -628768 -633482 -593791 -549605 -659358 -1028524 -1561230 -2059151
41387 -2059151 -2431942 -2733251 -3022050 -3287756 -3515263 -3732387 -3958031 -4158634 -4283041
41378 -4283041 -4297223 -4164352 -3833568 -3277318 -2518572 -1613922 -639588 304009 1116627 1743035
41368 1743035 2163987 2342593 2232265 1863008 1379923 962448 720501 672940 780694 968843
41358 968843 1149171 1262049 1288639 1208057 972082 555356 16681 -518195 -930743 -1156212
41348 -1156212 -1182857 -1043979 -815229 -594703 -462408 -444776 -513925 -635491 -828698 -1151980
41338 -1151980 -1590001 -1977033 -2107236 -1948393 -1693807 -1563821 -1591205 -1634750 -1561054 -1359602
41328 -1359602 -1105807 -874734 -692884 -525661 -298966 34038 432208 789301 1025347
41319 1025347 1147495 1227099 1332634 1478418 1618308 1688205 1665867 1584847 1481734 1343931
41309 1343931 1126055 804335 392887 -81597 -586905 -1055803 -1367926 -1386634 -1042020 -403896
41299 -403896 330942 961649 1418233 1762684 2056899 2270705 2340065 2264952 2095590 1846543
41289 1846543 1480720 972404 343823 -345667 -990349 -1424343 -1492407 -1177956 -637890 -92376
41279 -92376 306026 512553 567495 565952 606084 717794 845855 918490 916072 861723 774081
41268 774081 655924 510518 343141 157504 -30240 -187234 -293380 -366730 -449843 -590134
41258 -590134 -844992 -1269330 -1852857 -2477363 -2975997 -3244555 -3278431 -3113327 -2770561 -2269565
41248 -2269565 -1657183 -1000254 -371012 136802 401584 333352 -41905 -580613 -1126774 -1611227
41238 -1611227 -2032621 -2360997 -2509539 -2424991 -2175233 -1905927 -1711449 -1573170 -1414835 -1177612
41228 -1177612 -837989 -410323 18091 274654 183448 -303434 -1046384 -1783924 -2271813 -2411141
41218 -2411141 -2292972 -2115552 -2019242 -1988976 -1930141 -1821604 -1745134 -1756359 -1784550 -1707526 -1501166
41207 -1501166 -1268000 -1130355 -1148122 -1343290 -1732125 -2269903 -2785342 -3042596 -2910678 -2464988
41197 -2464988 -1912663 -1431057 -1081487 -843743 -687376 -599776 -571667 -576743 -564672 -475676
41187 -475676 -280613 -18900 216548 351067 383987 361302 295476 127326 -224425 -774832
41177 -774832 -1427515 -2014400 -2400689 -2582309 -2687672 -2862186 -3134247 -3399675 -3539924 -3537129
41167 -3537129 -3459342 -3351236 -3171871 -2849881 -2385865 -1889014 -1512109 -1346865 -1373302 -1502957
41157 -1502957 -1661291 -1816030 -1935019 -1961076 -1867024 -1717380 -1621747 -1609247 -1582892 -1422015
41147 -1422015 -1109953 -746156 -462669 -353335 -443899 -665645 -858492 -868345 -688997 -489269
41137 -489269 -463232 -645619 -875078 -922135 -648821 -83315 609391 1225019 1632944 1834663
41127 1834663 1920963 1969902 1991815 1968210 1911911 1859262 1819365 1779925 1777713 1913386 2244274
41116 2244274 2680224 3042997 3230378 3261283 3145151 2792027 2127435 1250430 378389 -370629
41106 -370629 -1060738 -1785025 -2508176 -3106288 -3499772 -3684438 -3677191 -3511524 -3270615 -3037745
41096 -3037745 -2788052 -2391966 -1776414 -1062811 -507379 -301014 -437055 -762928 -1134186
41087 -1134186 -1501425 -1853806 -2114629 -2146707 -1888435 -1457873 -1077169 -883530 -828518 -754956
41077 -754956 -547163 -212057 149172 434546 632410 838211 1165889 1627981 2112014 2480427
41067 2480427 2678130 2733103 2668230 2433328 1934494 1147064 216097 -575883 -993191 -1021364
41057 -1021364 -832382 -567569 -198231 369912 1100309 1793851 2240856 2354653 2167007
41048 2167007 1764334 1258256 766095 363216 54405 -191954 -399100 -588909 -803359
41039 -803359 -1069328 -1331609 -1447826 -1270655 -743322 65925 998822 1881325 2597705 3116495
41029 3116495 3444210 3553463 3367939 2825240 1953349 892542 -145514 -952630 -1401421
41020 -1401421 -1487477 -1306502 -989071 -655325 -409991 -333564 -445439 -686308 -963059 -1218706
41010 -1218706 -1459594 -1729464 -2065071 -2457143 -2838838 -3134666 -3346008 -3566969 -3876975
41001 -3876975 -4225727 -4462365 -4474232 -4256907 -3853804 -3289794 -2589696 -1806232 -977955 -88192
40991 -88192 879312 1849439 2667389 3215220 3493214 3575957 3503252 3224908 2654276 1784587
40981 1784587 757637 -197811 -913577 -1370384 -1648622 -1823757 -1926023 -1968402 -1969932 -1949807
40971 -1949807 -1914408 -1837189 -1638548 -1222053 -577738 161099 802343 1227157 1409871 1348155
40961 1348155 1059195 653113 326615 231363 376671 673612 1019419 1316348 1486238 1540711
40951 1540711 1597709 1748072 1909112 1867797 1474161 763903 -77093 -803916 -1191874 -1132689
40941 -1132689 -705957 -111934 496941 1079908 1597943 1931696 1992619 1877472 1815800 1945012
40931 1945012 2191063 2382697 2429021 2361382 2253555 2151302 2059885 1951242 1772770 1469339
40921 1469339 1007029 380944 -377617 -1185198 -1918104 -2472300 -2813815 -2962468 -2953358 -2851277
40911 -2851277 -2780118 -2863904 -3105144 -3363220 -3493014 -3480205 -3403068 -3288476 -3068901 -2693685
40901 -2693685 -2237360 -1869258 -1733581 -1871240 -2228139 -2698389 -3152755 -3453086 -3479870 -3187606
40891 -3187606 -2659923 -2097194 -1701813 -1535072 -1480302 -1355328 -1064716 -654397 -250629 29985
40881 29985 129585 55632 -136336 -377725 -621954 -845974 -1015440 -1061021 -907261 -532095
40871 -532095 1353 564200 1007987 1214637 1146452 872904 529984 223267 -29224 -245462
40861 -245462 -391279 -387224 -209772 58809 314673 544625 820308 1190241 1613212 2006976
40851 2006976 2340374 2662265 3043994 3499395 3964677 4362557 4683152 4987175 5330589
40842 5330589 5711197 6093061 6438315 6677695 6683737 6341008 5661795 4804029 3965095 3270594
40832 3270594 2746214 2344971 1984599 1594673 1159044 714608 319951 47897 -11277 198223
40822 198223 615846 1068676 1381725 1466705 1310228 946535 493423 167470 175412 563764
40812 563764 1203376 1927915 2662748 3418063 4192848 4914707 5472149 5794234 5893163 5828669
40802 5828669 5637485 5305450 4798548 4101112 3233307 2271546 1362132 666915 250946
40793 250946 38582 -85825 -145334 -71635 168520 487441 731365 804884 737178 644999
40783 644999 645353 798875 1115145 1572442 2095944 2531584 2706042 2551004 2141617 1591476
40773 1591476 957424 296000 -235369 -433794 -231001 239566 778024 1269619 1675084
40764 1675084 1932858 1951775 1710849 1322777 971694 791934 805715 953954 1159751 1359610
40754 1359610 1505465 1577294 1599436 1610976 1600834 1500091 1266120 950421 649272 412775
40744 412775 254212 230130 424845 815295 1205735 1361009 1204097 859100 521511 326916
40734 326916 334981 574701 1047615 1682930 2325089 2801324 3012744 2953500 2650664 2123382
40724 2123382 1425000 691246 87903 -298305 -476258 -448369 -145710 486788 1360353 2249132
40714 2249132 2941026 3362784 3558013 3579417 3431847 3105692 2623129 2027497 1345247 591863
40704 591863 -181632 -879876 -1421794 -1793421 -2029638 -2166925 -2237010 -2279857 -2317097 -2316099 -2219473
40693 -2219473 -2012238 -1725163 -1375160 -953885 -492345 -87977 168396 263837 233295 95505
40683 95505 -127268 -333743 -343789 -11286 654835 1472028 2181451 2593309 2685829 2591623
40673 2591623 2489211 2492052 2605804 2744371 2772659 2575308 2134192 1548029 962737 483812
40663 483812 154154 -20546 -67969 -66552 -128899 -347095 -751152 -1299326 -1875945 -2301251
40653 -2301251 -2390747 -2056318 -1375576 -566625 120555 524871 627693 508462 255851 -72702
40643 -72702 -422839 -725738 -946169 -1131403 -1370661 -1692564 -2012512 -2178742 -2067687 -1667183
40633 -1667183 -1109360 -614387 -349831 -316423 -385353 -453578 -541449 -734426 -1062115 -1454810
40623 -1454810 -1792102 -1962158 -1887720 -1542153 -975374 -328289 197852 423570 284380 -136231
40613 -136231 -670329 -1170375 -1559415 -1806879 -1902943 -1878944 -1823087 -1829603 -1917930 -2016231 -2031367
40602 -2031367 -1924685 -1714343 -1419795 -1031047 -548366 -44551 335728 456326 272985
40593 272985 -154599 -705694 -1235600 -1602575 -1721552 -1620050 -1415799 -1214405 -1043693 -904365
40583 -904365 -855273 -1000883 -1386608 -1933600 -2488412 -2925724 -3209634 -3389997 -3558170 -3780716
40573 -3780716 -4036197 -4203380 -4125715 -3709762 -2984247 -2083035 -1170090 -355110 345359 973839
40563 973839 1561061 2093556 2545325 2914723 3209403 3408088 3464538 3353792 3104468 2793291
40553 2793291 2519853 2359808 2292347 2170817 1823409 1224485 540317 -29763 -433477 -745998
40543 -745998 -994079 -1070023 -846108 -334354 297305 843906 1173350 1245627 1076144 703323
40533 703323 179060 -431391 -1056429 -1633255 -2114493 -2457719 -2621029 -2588108 -2398706 -2139571
40523 -2139571 -1898647 -1726912 -1625823 -1547810 -1419001 -1196301 -909644 -625594 -372177 -134710
40513 -134710 71706 176246 132226 968 -62833 111981 646234 1543881 2627363 3577190
40503 3577190 4122095 4216333 4010254 3670748 3281785 2899379 2611969 2499233 2567021 2751768
40493 2751768 2959707 3081504 3009052 2687054 2151459 1507035 879311 386004 105517 24165
40483 24165 21090 -56462 -282611 -607364 -899101 -1024171 -917580 -613441 -203338 255085
40473 255085 775801 1361582 1892512 2146609 1969345 1423421 759612 237561 -32465 -101940
40463 -101940 -82926 -59053 -79486 -187755 -407900 -701847 -980694 -1182448 -1319175 -1424964
40453 -1424964 -1475512 -1395138 -1147342 -792793 -444769 -177121 21415 219942 486967 849296
40443 849296 1284606 1735270 2128876 2411277 2598504 2804943 3174347 3723913 4249827 4433226
40433 4433226 4076502 3235117 2123579 935434 -217077 -1238486 -2021053 -2515708 -2781870
40424 -2781870 -2912593 -2919558 -2730532 -2301596 -1703550 -1096316 -645733 -465705 -597528 -1007105
40414 -1007105 -1603897 -2276220 -2907523 -3368826 -3537294 -3358944 -2889436 -2257754 -1599481
40405 -1599481 -1031650 -651302 -501241 -532092 -638556 -750293 -865589 -989931 -1073052 -1028737
40395 -1028737 -803447 -415142 55863 499053 819065 984876 1044989 1081236 1130279 1136190
40385 1136190 979811 582334 14670 -497663 -716708 -567393 -176030 249140 548929
40376 548929 647812 539298 289566 20011 -175158 -298092 -408297 -531987 -652358 -778966
40366 -778966 -966015 -1236577 -1526146 -1733170 -1807847 -1769945 -1661137 -1513053 -1354549 -1214568
40356 -1214568 -1103917 -1009227 -912899 -808022 -691809 -565970 -458428 -423791 -489048 -600112
40346 -600112 -657649 -625088 -580858 -643637 -857660 -1160577 -1433015 -1551762 -1434259 -1105017
40336 -1105017 -728974 -517838 -562687 -774775 -990196 -1082239 -961479 -557321 107215 847963
40326 847963 1422293 1732982 1896063 2103401 2457130 2927307 3392960 3688785 3679316 3368041
40316 3368041 2930710 2591502 2453629 2465368 2528716 2591265 2628692 2594865 2437383 2153702
40306 2153702 1802042 1454591 1155561 920705 753133 648014 594637 585614 619156 690018
40296 690018 793934 953435 1224858 1656245 2235287 2885743 3503064 3976676 4196600 4086644
40286 4086644 3656865 3012554 2301443 1652853 1147347 805997 601704 508714 539854 693132
40276 693132 858840 847366 557671 83328 -389667 -753923 -1002015 -1122159 -1061996 -804486
40266 -804486 -411720 34825 498159 970011 1421482 1783905 1956143 1832153 1363012 611718
40256 611718 -275047 -1158018 -1952145 -2599679 -3051439 -3292246 -3344981 -3227145 -2932525 -2471465
40246 -2471465 -1896692 -1270264 -637044 -54341 381523 571778 476737 144589 -290886 -642842
40236 -642842 -762031 -643327 -427267 -270511 -224514 -240046 -245279 -195048 -85823 39052
40226 39052 124608 171501 233527 317508 328946 165500 -167570 -581616 -1003544 -1383442 -1635196
40215 -1635196 -1666209 -1490082 -1253191 -1127570 -1209991 -1516629 -2006696 -2579192 -3087248 -3390297
40205 -3390297 -3388914 -3032093 -2350771 -1493735 -666507 4957 518010 883856 1030300 867097
40195 867097 425308 -117078 -549702 -754377 -742451 -611069 -463757 -348653 -266209 -232668
40185 -232668 -304316 -511120 -786759 -1007046 -1104104 -1115665 -1113622 -1108681 -1042739 -857201 -538207
40174 -538207 -93099 478296 1146922 1798408 2274565 2515252 2637961 2834908 3195058 3650072
40164 3650072 4064154 4317093 4312858 4001489 3453232 2876867 2509228 2473009 2730310 3130554
40154 3130554 3486903 3658637 3615365 3420716 3143412 2809840 2446371 2104154 1798019 1476839
40144 1476839 1126867 873551 895052 1226608 1709989 2142478 2417320 2505791 2367689 1930550
40134 1930550 1146160 56941 -1174359 -2307886 -3147972 -3645596 -3863652 -3851703 -3607158
40125 -3607158 -3167758 -2675703 -2302391 -2136050 -2165347 -2325188 -2511784 -2591859 -2472196 -2175577
40115 -2175577 -1816105 -1490409 -1202799 -880087 -435207 166596 868227 1548727 2117446
40106 2117446 2580501 2996491 3373369 3623687 3605695 3194924 2355934 1199080 -40822
40097 -40822 -1132385 -1969017 -2552081 -2889131 -2969799 -2831316 -2571445 -2271429 -1956641 -1646768
40087 -1646768 -1377944 -1140932 -862300 -503226 -129783 177555 447177 773658 1162546
40078 1162546 1483937 1584873 1400958 967450 387514 -197029 -664395 -978543 -1174625
40069 -1174625 -1279071 -1290890 -1250791 -1266501 -1424428 -1700160 -1978102 -2127747 -2043729 -1666379
40059 -1666379 -1023917 -245074 507542 1116318 1517623 1678532 1612808 1402834 1162825 982924
40049 982924 924169 1024918 1251779 1461679 1485783 1274148 920313 534179 129938 -348692
40039 -348692 -930293 -1559743 -2111224 -2446851 -2497610 -2308773 -1989911 -1618783 -1221564 -838398
40029 -838398 -545789 -383127 -301597 -227643 -150441 -111886 -139533 -235538 -412661 -684930 -1015096
40018 -1015096 -1311521 -1495813 -1559101 -1552541 -1545093 -1591470 -1711689 -1879041 -2024870 -2052462 -1849774
40007 -1849774 -1323061 -465040 599284 1660817 2537911 3138924 3434168 3417657 3127854
39998 3127854 2677503 2208786 1798371 1424048 1037519 657038 375046 283831 403619 660568
39988 660568 896404 904403 521836 -247472 -1195513 -2023177 -2505659 -2563536 -2234962 -1650121
39978 -1650121 -1020263 -556240 -330972 -239903 -125981 77281 340502 621974 895457 1111501
39968 1111501 1195181 1104150 864096 540153 195310 -122171 -380260 -569625 -697884 -766286
39958 -766286 -752485 -617630 -337295 56757 462461 761462 904958 925552 849196 630821
39948 630821 217942 -340293 -891210 -1281896 -1437132 -1361181 -1124269 -851186 -662084 -590570
39938 -590570 -585221 -604269 -675321 -846052 -1113866 -1434847 -1778286 -2138335 -2495885 -2786905
39928 -2786905 -2909447 -2768379 -2342156 -1724089 -1086710 -593585 -341314 -352075 -561423 -804110
39918 -804110 -883663 -723051 -435535 -207274 -120502 -125013 -161329 -247433 -423549 -656815 -844797
39907 -844797 -908119 -853653 -744234 -628404 -517031 -422185 -396912 -522562 -859113 -1405516
39897 -1405516 -2084964 -2751170 -3238037 -3462700 -3507134 -3572553 -3818907 -4238346 -4679348 -4977666
39887 -4977666 -5063475 -4971433 -4773672 -4499234 -4105727 -3532856 -2790027 -1983799 -1249644 -656265
39877 -656265 -175907 256129 652706 949628 1088310 1124115 1201156 1371658 1481060 1323193
39867 1323193 918946 553325 487889 691477 897163 864882 530806 -32523 -685360 -1245471
39857 -1245471 -1543010 -1513320 -1224829 -812884 -407630 -101604 83128 222299 443423 824816
39847 824816 1355770 1990685 2691201 3390207 3956161 4239431 4154118 3708490 2984695 2116453
39837 2116453 1267365 589018 176027 45088 129646 283706 326215 136935 -262399 -721907
39827 -721907 -1065145 -1189869 -1095217 -841127 -501494 -160864 61658 30041 -320843 -905281
39817 -905281 -1522747 -1999840 -2300164 -2500054 -2683113 -2877748 -3075414 -3262652 -3411542 -3457555
39807 -3457555 -3320494 -2961457 -2410124 -1728229 -958360 -126538 711125 1454871 2014058
39798 2014058 2366871 2561361 2672048 2764906 2879596 3008637 3091488 3062780 2933676 2820383
39788 2820383 2866976 3117388 3457842 3700156 3742385 3653201 3594669 3671966 3869466 4105395
39778 4105395 4295064 4355972 4215239 3863227 3377955 2857438 2337125 1794840 1211729 597637
39768 597637 -15955 -564267 -949237 -1102020 -1046247 -869607 -649429 -443991 -327024 -355243
39758 -355243 -490463 -610117 -615104 -496302 -306347 -129503 -84914 -280402 -716419 -1277491
39748 -1277491 -1851395 -2419467 -3008826 -3611510 -4190332 -4710993 -5109938 -5268187 -5089381
39739 -5089381 -4605102 -3964192 -3325677 -2789605 -2402538 -2169554 -2052437 -1990783 -1935088 -1855024
39729 -1855024 -1748489 -1679919 -1779253 -2135902 -2683237 -3232708 -3638629 -3903587 -4120976 -4351056
39719 -4351056 -4563122 -4661773 -4548818 -4191475 -3670146 -3160438 -2839206 -2774244 -2875331 -2938025
39709 -2938025 -2752528 -2210765 -1347907 -309461 711600 1536048 2059975 2292131 2314695
39700 2314695 2190776 1930598 1554060 1134836 740107 365827 -6935 -311031 -417794
39691 -417794 -269080 67643 480079 888871 1231479 1437016 1469233 1366240 1196689 991097
39681 991097 744403 468271 205153 -10839 -189692 -383314 -653593 -1029917 -1487129 -1973339
39671 -1973339 -2458094 -2925095 -3305277 -3456447 -3262057 -2761177 -2157976 -1688903 -1479048
39662 -1479048 -1512524 -1710618 -2014846 -2392467 -2779389 -3051282 -3086307 -2869582 -2520532 -2198339
39652 -2198339 -1979763 -1836920 -1727734 -1685117 -1794500 -2076722 -2409676 -2596975 -2533741 -2297552
39642 -2297552 -2063826 -1940486 -1897822 -1840045 -1706490 -1497852 -1243151 -974842 -727991 -536142
39632 -536142 -416573 -366149 -379044 -467343 -652602 -923397 -1206271 -1406837 -1498736 -1559403
39622 -1559403 -1703523 -1995245 -2436045 -3003033 -3654693 -4313032 -4892113 -5355301 -5713843
39613 -5713843 -5969373 -6095572 -6078513 -5931100 -5658608 -5258043 -4771122 -4289629 -3874941 -3508857
39603 -3508857 -3155207 -2827477 -2546480 -2262281 -1882126 -1375493 -803242 -233857 333012
39594 333012 945623 1623052 2305157 2864636 3172605 3179238 2948432 2617515 2324068 2154612
39584 2154612 2120510 2156053 2162539 2087480 1960599 1850004 1812822 1899120 2146690 2516248 2866125
39573 2866125 3060909 3097092 3063784 2996240 2852394 2646750 2516551 2594147 2854635 3137461
39563 3137461 3294210 3284968 3160991 2989107 2773749 2436043 1913358 1315035 927895 990328
39553 990328 1458572 2035358 2415325 2464328 2201310 1713526 1130112 604178 234468 -7844
39543 -7844 -248401 -594906 -1043396 -1473980 -1733534 -1752295 -1602476 -1430914 -1323064 -1250781
39533 -1250781 -1164433 -1105300 -1189365 -1484797 -1933750 -2394578 -2732960 -2866406 -2757539 -2407939
39523 -2407939 -1866769 -1220562 -552671 82043 627472 984576 1044888 796188 372980 -37991
39513 -37991 -340192 -546087 -672114 -689295 -617998 -618163 -904845 -1557981 -2447726 -3351226 -4114922
39502 -4114922 -4707739 -5165420 -5512850 -5718836 -5700888 -5385782 -4787752 -4025704 -3253589 -2577274
39492 -2577274 -2036593 -1637338 -1367884 -1189508 -1044023 -893098 -749688 -667463 -700847 -869516
39482 -869516 -1144323 -1450979 -1685122 -1742340 -1567754 -1203716 -786331 -469617 -335142 -371053
39472 -371053 -521383 -722962 -890154 -909582 -700070 -283973 218362 664887 961829 1095832
39462 1095832 1148592 1279376 1636138 2236048 2930801 3499749 3777743 3713333 3359947 2853579
39452 2853579 2375288 2070002 1961774 1951854 1909885 1762008 1492921 1097464 580176 20790
39442 20790 -394819 -467242 -137635 462218 1130510 1754647 2334396 2871827 3294240 3509731
39432 3509731 3504534 3344232 3084578 2714966 2197128 1531559 764196 -59420 -916128 -1766400
39422 -1766400 -2505810 -2983031 -3090702 -2848165 -2393164 -1888903 -1431104 -1024062 -621166
39413 -621166 -181662 296521 782314 1242601 1662162 2028258 2308782 2472477 2536839 2569699
39403 2569699 2620548 2658419 2593167 2353640 1942335 1440770 989358 739961 769963 1013977
39393 1013977 1301246 1485211 1534516 1497101 1404724 1243091 1006669 747889 555804 496220
39383 496220 577931 761621 984458 1178465 1282690 1256112 1093544 838041 571477 371292
39373 371292 261575 216372 226129 346191 641850 1071501 1452891 1575853 1347527 823020
39363 823020 125714 -626228 -1336973 -1942283 -2426986 -2799101 -3027431 -3043129 -2838283 -2535221
39353 -2535221 -2309359 -2240984 -2266073 -2260168 -2137891 -1884483 -1544516 -1198239 -912170 -685928
39343 -685928 -464250 -214657 26628 194657 249407 167796 -80822 -495478 -974145 -1323508
39333 -1323508 -1370634 -1076190 -551909 15840 466156 720852 775740 658593 414228 129752
39323 129752 -62504 -51830 170504 508095 824383 990185 898990 516774 -43864 -550465
39313 -550465 -818628 -852556 -785575 -703113 -584184 -413037 -263094 -215760 -243703 -246332 -193828
39302 -193828 -177188 -302540 -574930 -896379 -1140587 -1219939 -1131898 -978505 -900453 -928576
39292 -928576 -901837 -583721 117377 1057717 1978054 2677207 3074221 3172590 3025251 2718989
39282 2718989 2340850 1946067 1576526 1298676 1179279 1208801 1283777 1297096 1232908 1143770
39272 1143770 1038923 829881 408316 -232556 -973953 -1671602 -2268196 -2801040 -3310820
39263 -3310820 -3759947 -4038313 -4029382 -3670166 -2988446 -2128493 -1332720 -836035 -725242 -896427
39253 -896427 -1159791 -1376794 -1493350 -1484744 -1333039 -1074336 -822639 -696848 -713657 -767918
39243 -767918 -729853 -564112 -356143 -226064 -219291 -278755 -309836 -252764 -93755 158210 471383
39232 471383 779430 1008063 1126412 1156969 1135625 1084778 1025835 985275 971285 963167 933516
39221 933516 859816 710334 458016 132618 -178690 -428449 -691531 -1103544 -1706428 -2375097
39211 -2375097 -2897404 -3118238 -3032228 -2775516 -2521520 -2347679 -2197796 -1993194 -1765141 -1639882
39201 -1639882 -1700906 -1908641 -2150865 -2319585 -2337017 -2181340 -1935187 -1767673 -1815726 -2091170
39191 -2091170 -2519489 -3025939 -3536068 -3925248 -4047980 -3846988 -3404515 -2865387 -2318997
39182 -2318997 -1760992 -1157004 -531383 14681 379805 548689 581358 523249 367053 118295
39172 118295 -143775 -304970 -291231 -84324 289332 732045 1070707 1156288 979855 651255
39162 651255 273380 -108976 -445777 -650671 -675574 -577410 -479426 -488041 -650160 -938366
39152 -938366 -1248577 -1458925 -1537607 -1572710 -1666666 -1825645 -1975906 -2047343 -1995239 -1774093
39142 -1774093 -1357847 -788641 -162250 433883 933287 1261775 1365964 1286300 1140030 990720
39132 990720 769635 363504 -248868 -989192 -1784363 -2617829 -3465302 -4226450 -4758242 -4972889
39122 -4972889 -4897403 -4658420 -4426232 -4347118 -4473774 -4725811 -4927025 -4915722 -4652694 -4247866
39112 -4247866 -3894878 -3763384 -3905973 -4221773 -4505673 -4572131 -4375836 -4033892 -3733309 -3605925
39102 -3605925 -3661072 -3796806 -3862144 -3742649 -3431249 -3023803 -2622884 -2240560 -1819571 -1360493
39092 -1360493 -996807 -906837 -1155223 -1650981 -2258080 -2897723 -3511174 -3965793 -4078541 -3767161
39082 -3767161 -3151899 -2480178 -1952569 -1614130 -1371669 -1085823 -676191 -189238 229428
39073 229428 457801 498203 441747 351586 225102 67860 -57325 -92400 -62873 -58974 -158855
39062 -158855 -399196 -789299 -1293997 -1801150 -2165228 -2323166 -2352030 -2386402 -2479754 -2555403
39052 -2555403 -2486250 -2215143 -1809182 -1414528 -1157619 -1067133 -1062717 -1006384 -783677 -375893
39042 -375893 121782 569064 900238 1185710 1564138 2113454 2797295 3520793 4197296 4748682
39032 4748682 5086466 5147677 4953421 4597158 4158493 3644916 3029048 2325427 1612807 991561
39022 991561 538150 291259 248239 359063 544588 749222 980417 1286546 1696504 2188667
39012 2188667 2710232 3202253 3594298 3791127 3690249 3228127 2421432 1381900 301627
39003 301627 -595070 -1129175 -1238619 -995686 -559879 -107677 215165 314174 160888 -195372
38993 -195372 -639393 -1031882 -1257058 -1253424 -1030368 -673032 -316160 -84070 -44985 -222362
38983 -222362 -623112 -1209032 -1835238 -2270981 -2336367 -2026612 -1495246 -938155 -512177 -324345
38973 -324345 -427588 -804173 -1384233 -2094419 -2867684 -3608575 -4194954 -4544354 -4665195 -4633687
38963 -4633687 -4542247 -4474362 -4486779 -4579548 -4696727 -4778545 -4802037 -4763848 -4657414 -4494367 -4318819
38952 -4318819 -4161184 -3994212 -3771949 -3501679 -3245093 -3063285 -2995740 -3067871 -3254249 -3432442
38942 -3432442 -3441703 -3222200 -2861048 -2481153 -2124362 -1762113 -1362008 -892034 -305874 388829
38932 388829 1039444 1395050 1292720 790858 112620 -518260 -979036 -1233444 -1280947 -1152881
38922 -1152881 -952319 -865281 -1080431 -1644295 -2377162 -2960209 -3149235 -2929293 -2473717 -1970165
38912 -1970165 -1498971 -1063766 -697374 -500190 -564865 -874147 -1287451 -1637386 -1842827 -1930548
38902 -1930548 -1960885 -1957115 -1915899 -1857178 -1822781 -1826088 -1846663 -1899158 -2072133 -2448151 -2985552
38891 -2985552 -3518874 -3890498 -4059488 -4077027 -3992849 -3812821 -3523251 -3119648 -2618845 -2078872
38881 -2078872 -1615555 -1371597 -1440729 -1808605 -2356884 -2920649 -3362618 -3626576 -3735503 -3732780
38871 -3732780 -3623375 -3377188 -2980641 -2465777 -1889533 -1305193 -757226 -277502 131165
38862 131165 489840 797922 999138 1014824 811262 414975 -141025 -860695 -1751873 -2753922
38852 -2753922 -3717374 -4466549 -4886447 -4962860 -4765206 -4408334 -4018380 -3698632 -3492742 -3363291
38842 -3363291 -3205239 -2892669 -2339626 -1551203 -641270 199063 775266 972453 806370
38833 806370 414591 -10315 -306653 -392903 -260680 49051 445135 785433 930562 833803
38823 833803 572243 272459 7826 -225163 -446618 -637749 -752286 -767632 -712894 -650811
38813 -650811 -640686 -715446 -876126 -1089587 -1295037 -1439521 -1523592 -1595953 -1685414 -1756827 -1760805
38802 -1760805 -1706645 -1640549 -1555965 -1376331 -1038248 -548614 45495 676205 1210994 1463947
38792 1463947 1337623 941221 509477 212388 88353 133083 367602 800041 1382085 2032468
38782 2032468 2666552 3189372 3507013 3576982 3427328 3118316 2715833 2302480 1959808 1711270
38772 1711270 1521448 1377844 1332178 1422215 1581697 1668444 1568177 1248570 744039 132748
38762 132748 -487405 -1051902 -1572491 -2105317 -2669443 -3202678 -3584680 -3691571 -3456108 -2921362
38752 -2921362 -2250780 -1668288 -1364725 -1427420 -1809922 -2345031 -2817451 -3070074 -3060031 -2829308
38742 -2829308 -2455904 -2035043 -1644938 -1279989 -853371 -326484 180242 468191 455963 244457
38732 244457 -16430 -270525 -547533 -869400 -1212923 -1545705 -1855991 -2137391 -2359077 -2465265
38722 -2465265 -2421471 -2276553 -2166002 -2219368 -2449528 -2742655 -2954527 -3001975 -2877121 -2622726
38712 -2622726 -2316912 -2046352 -1843527 -1634962 -1273938 -665188 105783 768176 1041702
38703 1041702 868819 470733 149608 48913 123409 281720 462443 579528 514507 237002
38693 237002 -120606 -371025 -423860 -293841 -23994 309832 548991 526311 241983 -87834
38683 -87834 -207298 -35902 297292 596540 755726 808454 864684 994009 1145585 1175029
38673 1175029 955687 470005 -189881 -887230 -1515049 -2051363 -2565692 -3140141 -3743486
38664 -3743486 -4190095 -4263437 -3902602 -3265344 -2611466 -2132542 -1874175 -1770136 -1710438 -1584476
38654 -1584476 -1304166 -832455 -216071 407665 858336 1003203 832061 457557 48789
38645 48789 -235028 -272539 -2213 536153 1195930 1813210 2324135 2767078 3156983 3400812
38635 3400812 3381659 3108301 2731516 2403247 2146881 1866854 1455023 885326 242936 -319524
38625 -319524 -680273 -829133 -851458 -844879 -883192 -1047654 -1411711 -1934307 -2402409 -2549414
38615 -2549414 -2247657 -1570300 -691142 229699 1077187 1770200 2254606 2486879 2417257 2021404
38605 2021404 1364497 606000 -82785 -598129 -903011 -983133 -835211 -496879 -75595 262209
38595 262209 362934 195289 -99929 -304668 -293219 -99763 168672 432206 635900 720080
38585 720080 669677 578667 599070 809572 1167513 1589925 2035196 2486075 2890717 3159030
38575 3159030 3215878 3048071 2711810 2309744 1954008 1729604 1670539 1751973 1901877 2041504
38565 2041504 2138607 2221893 2335204 2485447 2640640 2754992 2775330 2652235 2390488 2078877
38555 2078877 1819851 1619355 1381891 1019788 529365 -42612 -651532 -1249781 -1782262
38546 -1782262 -2232287 -2640216 -3032028 -3348683 -3483640 -3373534 -3021467 -2460063 -1740540
38537 -1740540 -942600 -144744 609750 1276649 1763367 1994150 2039208 2110365 2376805 2803318
38527 2803318 3187685 3323644 3105369 2520734 1613752 478484 -726533 -1785204 -2490768
38518 -2490768 -2762625 -2710944 -2544665 -2389183 -2219043 -1976877 -1697527 -1462074 -1269202 -1026252
38508 -1026252 -663702 -194283 352215 990542 1737442 2537666 3266956 3800174 4067540
38499 4067540 4073474 3891354 3627302 3354443 3068085 2707146 2215446 1581448 838128 47779
38489 47779 -711478 -1360287 -1835476 -2112179 -2233392 -2323631 -2541677 -2976703 -3576623 -4190579
38479 -4190579 -4687121 -5024458 -5213195 -5237393 -5028855 -4514947 -3695901 -2700147 -1771716 -1163415
38469 -1163415 -988627 -1163104 -1505669 -1888655 -2270681 -2615064 -2860559 -3011574 -3195962
38460 -3195962 -3552353 -4059070 -4525406 -4761351 -4726037 -4522800 -4307312 -4207189 -4254829 -4337261
38450 -4337261 -4241424 -3814401 -3100731 -2313462 -1674930 -1283022 -1094409 -1005843 -967603 -1037072
38440 -1037072 -1292877 -1668249 -1908278 -1754271 -1170102 -350505 473597 1179831 1723019
38431 1723019 2060294 2167471 2090623 1928298 1767661 1653560 1592898 1561775 1529636 1504840
38421 1504840 1539443 1661342 1816054 1903667 1864632 1708842 1479359 1221652 976433 756142
38411 756142 513345 161852 -345319 -959822 -1562696 -2041083 -2347998 -2506562 -2568256 -2568750
38401 -2568750 -2524138 -2460250 -2420514 -2430635 -2470709 -2494996 -2458744 -2307922 -1978795 -1465192 -885418
38390 -885418 -424301 -176256 -71516 20032 138082 214410 190003 116583 136416 367705
38380 367705 791577 1227095 1428197 1244188 711803 -338 -721761 -1346120 -1803048 -2029604
38370 -2029604 -2003385 -1783602 -1490351 -1242566 -1117709 -1141564 -1278623 -1433521 -1497898 -1418524
38360 -1418524 -1214200 -926130 -571725 -152400 323168 849182 1434895 2065852 2652948
38351 2652948 3062739 3226554 3207180 3144799 3153762 3281520 3527835 3847065 4128961 4232477
38341 4232477 4083339 3735862 3325401 2968954 2714494 2552042 2437119 2319651 2199440
38332 2199440 2163514 2325300 2694263 3123965 3416670 3471222 3312669 3004257 2580733 2075086
38322 2075086 1563825 1144870 876705 765881 819520 1087352 1619049 2356973 3080550 3506197
38312 3506197 3494193 3161565 2760466 2439512 2150401 1782243 1328771 892784 578831 442139
38302 442139 511368 773380 1112950 1333489 1293574 1012183 617280 209438 -204008 -667947
38292 -667947 -1213796 -1827367 -2441965 -2952232 -3264974 -3362688 -3310554 -3182206 -2978333 -2635936
38282 -2635936 -2126411 -1525316 -956219 -468353 -12413 434361 757013 785244 503289 129829
38272 129829 -49016 87738 442334 837520 1166310 1427828 1684633 2013521 2458561 2979537
38262 2979537 3431162 3610910 3359561 2656779 1653820 610882 -238605 -803012 -1127520
38253 -1127520 -1281887 -1276459 -1110228 -883323 -808787 -1071858 -1673467 -2419952 -3058755 -3421797
38243 -3421797 -3475477 -3293736 -3005005 -2725740 -2497168 -2279484 -2019983 -1718551 -1413916 -1125940
38233 -1125940 -843597 -564396 -315282 -135180 -66202 -158283 -434073 -821708 -1152884 -1270633
38223 -1270633 -1151297 -922405 -774967 -854221 -1189202 -1678617 -2140760 -2409000 -2411642 -2185853
38213 -2185853 -1834597 -1464898 -1137641 -861075 -643790 -550491 -673350 -1039029 -1582857 -2238181
38203 -2238181 -3008672 -3902774 -4818189 -5552831 -5948706 -6002484 -5835210 -5581545 -5308655 -5006919
38193 -5006919 -4634944 -4176940 -3661610 -3132708 -2630748 -2229549 -2067582 -2290276 -2936824
38184 -2936824 -3888756 -4921482 -5794134 -6322605 -6432058 -6171031 -5659841 -5014353 -4323031
38175 -4323031 -3670058 -3122349 -2667846 -2192907 -1552030 -677743 346052 1286890 1864031
38166 1864031 1918306 1522005 909563 304648 -155985 -362106 -205959 314328 1019877 1658546
38156 1658546 2087740 2320126 2423115 2442113 2422615 2438587 2555589 2780936 3064875 3333316
38146 3333316 3509680 3531187 3376911 3084069 2716508 2300285 1795914 1157394 430112 -229774
38136 -229774 -657176 -789262 -657204 -298571 265147 973151 1726474 2476729 3247709 4011537
38126 4011537 4588527 4744461 4385779 3624144 2675711 1744799 968947 385769 -66917
38117 -66917 -461333 -769391 -882578 -751064 -456578 -133769 134677 331781 473695 599808
38107 599808 752476 922985 1040371 1043452 937918 757228 510529 223512 4077 -11153
38097 -11153 192339 437674 463548 107655 -590545 -1427017 -2160508 -2634827 -2816986 -2745832
38087 -2745832 -2467361 -2028912 -1515902 -1061144 -800227 -809864 -1074441 -1500049 -1966710 -2376862
38077 -2376862 -2656356 -2730775 -2554076 -2192182 -1840616 -1694192 -1783528 -1970302 -2109492 -2181144
38067 -2181144 -2248082 -2325412 -2341418 -2229807 -2026530 -1850147 -1788136 -1818216 -1853149 -1858332 -1906566
38056 -1906566 -2105832 -2484740 -2964293 -3431682 -3814998 -4082766 -4203298 -4138519 -3879276 -3462657
38046 -3462657 -2935291 -2304314 -1547522 -687369 159078 834373 1255802 1463682 1558278 1623442
38036 1623442 1727756 1952132 2347340 2852470 3296247 3503745 3395359 2996239 2399744
38027 2399744 1746550 1199287 878945 805765 910455 1103934 1332169 1573859 1802419 1958190
38017 1958190 1962614 1770368 1413465 989185 601753 314813 142252 55472 -4049 -91430
38007 -91430 -221112 -373196 -533112 -691459 -792668 -723940 -394560 180686 887606 1570489
37997 1570489 2061370 2203362 1926332 1318880 589970 -54668 -491053 -670394 -603148 -361173
37987 -361173 -44751 273883 544178 683170 604295 340386 78157 2983 127458 315535
37977 315535 444600 485268 445738 321737 125405 -90631 -272214 -404000 -501303 -593978
37967 -593978 -727206 -932942 -1167314 -1302177 -1214198 -877949 -360683 248682 873994 1425183
37957 1425183 1769845 1752777 1266971 343719 -811405 -1904055 -2710778 -3161103 -3275941
37948 -3275941 -3079708 -2607304 -1946111 -1195398 -389898 477792 1364639 2175432 2861444
37939 2861444 3445134 3919012 4203011 4269069 4247790 4316704 4493359 4611248 4496828 4106602
37929 4106602 3503171 2796872 2150885 1758563 1721138 1944246 2191345 2244939 2025978 1609979
37919 1609979 1163971 831205 626757 454075 248086 75299 61915 258076 616186 1059343
37909 1059343 1495306 1787384 1815073 1594615 1270724 957166 646420 310058 17861 -110293
37899 -110293 -37491 157119 342190 374195 117931 -467879 -1237719 -1915015 -2285328 -2323913
37889 -2323913 -2139060 -1841081 -1490809 -1128655 -790345 -480087 -157666 215073 600153
37880 600153 866312 874961 598361 138390 -373229 -853140 -1226275 -1376997 -1233275 -893320
37870 -893320 -576536 -409517 -316440 -154683 100762 358982 543023 633734 601003 388016
37860 388016 12844 -355387 -481313 -250314 219380 644894 774301 552408 127463 -284333
37850 -284333 -533528 -567572 -398253 -92148 229882 449078 529938 521353 466752 336923
37840 336923 62840 -385445 -958517 -1536495 -1964476 -2117266 -1973149 -1619181 -1154360 -591978
37830 -591978 109568 916448 1662569 2160018 2360206 2382247 2384340 2428723 2470594 2443135 2327532
37819 2327532 2159828 2005042 1921938 1916720 1919821 1841379 1674296 1519237 1477378 1534751 1588001
37808 1588001 1570353 1496318 1367318 1091991 560842 -207063 -1037899 -1737374 -2228983 -2554565
37798 -2554565 -2771078 -2875275 -2819387 -2575141 -2182638 -1757085 -1447492 -1355840 -1467252 -1663411
37788 -1663411 -1822230 -1901710 -1913664 -1832475 -1573709 -1081700 -412690 290293 884581 1270392
37778 1270392 1386592 1234991 926502 654307 580646 758946 1171819 1796930 2586120 3407753
37768 3407753 4088551 4541966 4811966 4959085 4944412 4683896 4208599 3709301 3386568 3270343
37758 3270343 3198999 2956547 2422700 1632162 746153 -25673 -523112 -706352 -647416 -451123
37748 -451123 -184478 126942 463337 797654 1114762 1422515 1734626 2049847 2351152 2614779
37738 2614779 2810905 2903793 2870634 2729863 2541629 2366287 2224583 2115305 2073258 2174846
37728 2174846 2442057 2739157 2816079 2507197 1890846 1222231 701784 337328 41860 -185628
37718 -185628 -241308 -73449 211524 442011 541211 540930 460424 250161 -122458 -600080 -1107654
37707 -1107654 -1668129 -2381980 -3285300 -4266487 -5127492 -5694523 -5870398 -5631902 -5016540
37698 -5016540 -4106174 -3013027 -1888885 -930326 -313406 -75524 -73131 -89681 4612 191848
37688 191848 368251 440196 385694 266057 178697 166475 161914 32364 -321815 -920822 -1725540
37677 -1725540 -2650284 -3548681 -4241757 -4608805 -4644384 -4403878 -3912560 -3172951 -2267171 -1400968
37667 -1400968 -791980 -506056 -427747 -400060 -374387 -417742 -605097 -936288 -1341778 -1725939
37657 -1725939 -1997208 -2096370 -2030907 -1880469 -1755317 -1742919 -1878299 -2138453 -2460941 -2792092
37647 -2792092 -3128746 -3498591 -3899288 -4280765 -4589251 -4799173 -4899629 -4889203 -4793382 -4639661
37637 -4639661 -4397251 -3996326 -3436665 -2811721 -2172155 -1439577 -559997 289501 773204
37628 773204 713479 268664 -222665 -508779 -529649 -362435 -143987 -7011 -19587 -173555
37618 -173555 -427693 -718010 -917986 -870552 -530568 -40003 406601 761217 1138940 1650022
37608 1650022 2265290 2839199 3209651 3264358 2959562 2319419 1430863 442271 -448447 -1056588
37598 -1056588 -1308963 -1277781 -1100979 -887115 -709337 -639251 -723865 -946277 -1265591 -1681240
37588 -1681240 -2188677 -2669621 -2909270 -2773009 -2333505 -1795147 -1326773 -990843 -782044
37579 -782044 -665159 -575539 -432674 -181080 184017 624609 1077785 1468968 1725203 1785410
37569 1785410 1602672 1150370 442909 -438959 -1334925 -2019801 -2268916 -1970983 -1211234
37560 -1211234 -228188 738945 1570039 2250511 2784093 3151853 3338134 3354421 3226909 2980418
37550 2980418 2641656 2242177 1807139 1346864 865842 382101 -55641 -367844 -482133
37541 -482133 -401626 -237268 -142776 -196703 -357393 -541853 -728461 -959900 -1259959 -1581274
37531 -1581274 -1835409 -1942043 -1844678 -1527280 -1055821 -575297 -208956 44112 270525 496189
37521 496189 623656 537325 235834 -161502 -496924 -627449 -451455 25644 640409 1155578
37511 1155578 1441682 1560611 1662044 1829716 2037935 2206571 2254291 2127330 1835114 1467303
37501 1467303 1141441 912809 737220 516062 169245 -315314 -862640 -1322679 -1522018
37492 -1522018 -1341027 -776053 48064 930058 1696410 2294426 2786418 3236501 3604650
37483 3604650 3761487 3595542 3093841 2345207 1506921 756800 215702 -118036 -336806
37474 -336806 -511189 -634653 -694105 -754557 -927584 -1262039 -1692435 -2085035 -2313242 -2313909
37464 -2313909 -2121063 -1848831 -1602327 -1392534 -1161312 -885963 -618941 -415435 -263050
37455 -263050 -105361 93982 325453 531442 601777 415864 -50105 -659007 -1190497 -1484540
37445 -1484540 -1498828 -1266446 -861041 -402613 -31203 170833 222075 195492 137869 35097
37435 35097 -159543 -465253 -832388 -1172608 -1447623 -1707097 -2002749 -2280103 -2404822 -2297323
37425 -2297323 -1995466 -1582665 -1112013 -622496 -178414 142466 270389 142203 -261086
37416 -261086 -831665 -1340069 -1595593 -1603763 -1536247 -1563559 -1745465 -2047409 -2396837 -2717003
37406 -2717003 -2950963 -3076841 -3101255 -3055894 -3005909 -3012165 -3037570 -2920877 -2503844 -1783106
37396 -1783106 -904499 -36768 694359 1183363 1363491 1279979 1069529 811194 432348 -192611
37386 -192611 -1065252 -2011373 -2794220 -3267848 -3443631 -3434781 -3341413 -3194920 -3020253 -2920676
37376 -2920676 -3041175 -3424933 -3931757 -4317816 -4395596 -4142152 -3699874 -3275323 -2987742 -2785563
37366 -2785563 -2522226 -2113515 -1605547 -1120058 -793335 -753166 -1058260 -1610725 -2180085 -2559946
37356 -2559946 -2677907 -2552273 -2223915 -1782166 -1383748 -1150664 -1062248 -1007706 -925931 -833732
37346 -833732 -736882 -591492 -365929 -83557 216319 518971 812699 1048536 1137315 989074
37336 989074 583958 41714 -392925 -489341 -188381 372735 970803 1415058 1599708 1515824
37326 1515824 1237287 866425 478588 126057 -131543 -251088 -257557 -219611 -158220 -19978
37316 -19978 241013 590498 942553 1226604 1400127 1421384 1241925 821876 149001 -726977
37306 -726977 -1659788 -2444007 -2941999 -3183548 -3315659 -3449972 -3579025 -3639983 -3621929 -3576948
37296 -3576948 -3533985 -3434945 -3168945 -2652981 -1871843 -870938 253213 1368483 2361350
37287 2361350 3189740 3854492 4319114 4507270 4401220 4098351 3739445 3418771 3187724
37278 3187724 3078575 3055596 2993263 2802780 2572305 2488796 2605200 2763114 2765489 2546998
37268 2546998 2148148 1620605 1034849 513139 147953 -106028 -384115 -750352 -1141587
37259 -1141587 -1480262 -1784276 -2131412 -2545825 -2956858 -3268137 -3450282 -3564117 -3700556
37250 -3700556 -3898256 -4110199 -4237547 -4195812 -3970447 -3629683 -3271424 -2929461 -2535835 -2005555
37240 -2005555 -1359044 -731679 -266438 -36947 -67294 -346025 -770203 -1130851 -1237116 -1066401
37230 -1066401 -763280 -501800 -375410 -387956 -481684 -557825 -517382 -321618 -19107 280504
37220 280504 457022 438874 256946 35073 -109817 -158775 -154202 -87133 122902 520976
37210 520976 1036481 1537745 1936456 2213420 2371529 2400486 2278283 1984141 1523055 961895
37200 961895 427285 32408 -201140 -332350 -414008 -436657 -357953 -160052 139209 518465
37190 518465 973143 1495807 2041434 2521568 2846352 2987299 3001810 2980940 2954068 2843738
37180 2843738 2535510 2016337 1446406 1071348 1036632 1279067 1606341 1884489 2138282 2463299
37170 2463299 2853972 3145423 3143692 2809953 2297674 1798416 1365313 909538 365010 -177371
37160 -177371 -519989 -526258 -219208 265731 784267 1240250 1594057 1858264 2069686 2228828
37150 2228828 2271027 2130090 1827354 1455533 1064981 618008 93628 -406141 -724516 -823970
37140 -823970 -837607 -937499 -1199097 -1600138 -2075861 -2519395 -2780200 -2751341 -2470500 -2089555
37130 -2089555 -1737039 -1439550 -1165525 -894832 -640104 -448221 -393376 -516742 -739334 -869402
37120 -869402 -742282 -360695 101016 411118 407807 73908 -465512 -1028529 -1483605 -1774233
37110 -1774233 -1857454 -1678494 -1239521 -652981 -80835 362904 627295 690985 580572 410397
37100 410397 337702 454241 742002 1122316 1502290 1774166 1829342 1615034 1171070 608380
37090 608380 68514 -309765 -439585 -336201 -104203 139599 324008 425376 473684 585425
37080 585425 934568 1608704 2471406 3204406 3524425 3375161 2922078 2382007 1865086 1357736
37070 1357736 816330 250234 -276029 -690155 -949091 -1048477 -1014336 -881068 -670538 -400544
37060 -400544 -111567 143310 353002 571780 865441 1244882 1658515 2012698 2174584 2008072
37050 2008072 1483313 749105 41834 -479466 -763153 -751043 -329689 555965 1784125
37041 1784125 3087920 4181240 4856739 5046271 4857736 4521541 4234543 4052297 3950595
37032 3950595 3946101 4093183 4380204 4697852 4922295 4989465 4892627 4668309 4407670 4230222
37022 4230222 4195308 4244173 4253288 4148637 3970589 3847205 3916098 4255351 4863720 5689770
37012 5689770 6665740 7707426 8703369 9541875 10160641 10548914 10687908 10509190 9940770
37003 9940770 9002293 7845200 6688934 5711245 4992882 4552828 4408574 4576103 5016608
36994 5016608 5618367 6251731 6827480 7295800 7630987 7866231 8129685 8584154 9297515
36985 9297515 10189353 11120609 12022173 12927225 13898497 14946348 16017266 17052589 18053273
36976 18053273 19078575 20173475 21307975 22400849 23383480 24208048 24813749 25158598 25320214
36967 25320214 25511388 25921992 26534232 27122540 27433558 27341104 26841774 25965430 24741311
36958 24741311 23249521 21675305 20279144 19270011 18663935 18260591 17795549 17149242 16408352
36949 16408352 15723701 15139643 14591814 14048060 13589602 13322175 13234567 13185445 13032888 12752178
36939 12752178 12419590 12107042 11818593 11521468 11207285 10907345 10663635 10504128 10438781
36930 10438781 10453434 10496805 10493384 10400022 10263834 10212957 10365616 10730461 11197797 11640320
36920 11640320 12019778 12374598 12701084 12890669 12836376 12597191 12400113 12443672 12719834 13050849
36910 13050849 13273189 13353117 13354179 13358490 13431883 13612828 13893904 14219290 14506996 14661744
36900 14661744 14583656 14223932 13665205 13114580 12776468 12730516 12927840 13258561 13597367 13840655
36890 13840655 13972003 14082985 14278947 14572686 14916851 15319888 15854457 16543828 17316001
36881 17316001 18103544 18929640 19854830 20888193 21996481 23153479 24316186 25378606
36873 25378606 26222876 26832305 27326421 27894839 28726328 29967351 31664412 33714180 35913440
36864 35913440 38097393 40230290 42378398 44644767 47144605 49990334 53248924 56924152
36856 56924152 61010371 65552862 70631608 76308669 82643420 89769007 97906808 107263115
36848 107263115 117917141 129837560 143014997 157570801 173752142 191859618 212192247
36841 212192247 235017504 260522302 288742262 319505090 352379944 386574930 420771721
36834 420771721 452991611 480641954 500859454 511154056 510160186 498121369 476798827
36827 476798827 448858436 417125524 384058352 351498117 320602474 291936754 265704301
36820 265704301 241966207 220698218 201748342 184878682 169901812 156735719 145303570
36813 145303570 135422266 126817374 119215793 112400637 106213067 100547276 95342642 90557763
36805 90557763 86146113 82051026 78203553 74520761 70928477 67391620 63900686 60432314
36797 60432314 56964809 53541134 50262368 47181557 44242089 41367813 38593309 36060373
36789 36060373 33892306 32098465 30581049 29197801 27840339 26507844 25307616 24340449
36781 24340449 23578289 22885103 22149520 21350635 20500324 19593750 18648709 17733656 16898681
36772 16898681 16105923 15280268 14413015 13562860 12759897 11969417 11175064 10455192 9938361
36763 9938361 9701484 9741988 10027598 10515703 11108052 11638973 11965316 12064314 12002651 11808273
36753 11808273 11421413 10796014 10007122 9212235 8526443 7980790 7585693 7365347 7306560
36744 7306560 7326358 7332351 7287985 7181456 6956495 6531868 5902325 5187285 4559742 4137438
36734 4137438 3948204 3981983 4253294 4801842 5628954 6638317 7656790 8533609 9230352
36725 9230352 9824393 10438918 11162370 11992132 12814720 13447777 13740000 13649791 13226868 12536292
36715 12536292 11630055 10583221 9510909 8527271 7707789 7099004 6731490 6598737 6643186
36706 6643186 6781798 6922902 6941940 6687019 6074765 5186153 4220785 3333174 2530967 1737700
36696 1737700 926353 173457 -402798 -742835 -889261 -931827 -902591 -741648 -397013 50639
36686 50639 413720 570932 581750 603928 724686 892647 969649 798961 261343 -640079
36676 -640079 -1714279 -2652818 -3222272 -3400674 -3334826 -3194209 -3068697 -2953631 -2777302 -2443870
36666 -2443870 -1891360 -1140194 -297755 481132 1054783 1355911 1419478 1337039 1161334 861841
36656 861841 390984 -214186 -815975 -1257758 -1448012 -1380638 -1114069 -745689 -376545 -63438
36646 -63438 203365 464004 724748 935489 1040711 1057049 1092593 1273607 1643263 2133655
36636 2133655 2630297 3046783 3343723 3525204 3660718 3888834 4336972 5013524 5806070
36627 5806070 6598332 7358420 8094561 8758641 9232222 9400138 9217756 8726289 8038236
36618 8038236 7301435 6638472 6105035 5713299 5477759 5403425 5436025 5472963 5443720 5347074
36608 5347074 5189548 4925711 4505104 3971076 3476944 3192335 3196887 3445088 3800520 4100004
36598 4100004 4215212 4086775 3726110 3208519 2666938 2254925 2068801 2092712 2228725 2372995
36588 2372995 2450442 2402438 2195934 1865779 1518463 1262106 1127112 1054338 953166 778697
36578 778697 574243 440667 444651 554569 684656 798406 939131 1156184 1434798 1706024
36568 1706024 1884932 1880372 1615544 1090513 413044 -266484 -845562 -1283771 -1568066 -1718936
36558 -1718936 -1821113 -1990283 -2285380 -2670957 -3061921 -3374878 -3541940 -3528076 -3368733 -3169470
36548 -3169470 -3036484 -2999854 -3001575 -2944205 -2748760 -2386587 -1878097 -1272924 -640428 -75321
36538 -75321 320054 492556 473429 336187 128576 -131820 -411378 -645629 -760705 -673262
36528 -673262 -291353 409143 1286698 2075317 2573717 2773346 2781588 2665691 2418290 2046813
36518 2046813 1640396 1344372 1287610 1508662 1908645 2284286 2454193 2376390 2144240 1887264
36508 1887264 1691222 1579108 1516483 1433747 1279034 1055136 787804 480014 142460 -141478
36498 -141478 -242145 -95055 253170 722969 1277464 1891187 2489443 2974513 3304005 3506127
36488 3506127 3619746 3646472 3560236 3344898 3032089 2723911 2558253 2601366 2761421 2842317
36478 2842317 2703323 2349581 1867705 1322064 749242 216335 -179652 -378637 -388973 -251454
36468 -251454 -9133 283888 570351 828980 1070842 1273080 1351185 1229861 916533 479726
36458 479726 -6777 -459403 -772310 -885215 -851804 -774989 -683561 -544830 -390700 -329435
36448 -329435 -396310 -477797 -440117 -269073 -28825 246402 536361 760351 821728 725865
36438 725865 585003 510385 558220 760875 1118501 1537668 1851277 1943507 1826162 1581083
36428 1581083 1269741 911529 503244 37681 -457550 -879776 -1092368 -1040205 -804513 -526529
36418 -526529 -299457 -140634 -24587 90386 247159 474180 789427 1213060 1737495 2274167
36408 2274167 2674684 2838019 2776977 2564303 2246007 1829088 1318498 733028 110138 -475609
36398 -475609 -927764 -1200356 -1336272 -1395731 -1362151 -1164150 -794905 -378520 -106871 -117969
36388 -117969 -420932 -907737 -1426015 -1850740 -2101828 -2122831 -1883758 -1413856 -797540 -119323
36378 -119323 558894 1150938 1523502 1572617 1317887 896463 480036 218144 222206 537270
36368 537270 1115698 1850804 2645500 3433088 4144334 4691288 4993561 5010098 4760427 4342280
36358 4342280 3914086 3610931 3449223 3314881 3046331 2541662 1834484 1112500 644272
36349 644272 623423 1041431 1700382 2336570 2737142 2797495 2537229 2066601 1496024 865274
36339 865274 172583 -551468 -1239645 -1839388 -2312609 -2585412 -2561091 -2218152 -1676077 -1150813
36329 -1150813 -848162 -864373 -1129498 -1446370 -1642786 -1708297 -1754098 -1847695 -1940333 -1951374
36319 -1951374 -1846012 -1608738 -1225291 -752183 -351010 -183594 -286265 -578199 -954151
36310 -954151 -1323085 -1595487 -1703649 -1635582 -1412669 -1048974 -573334 -77450 304172 466911
36300 466911 373171 42470 -464341 -1078318 -1777928 -2578979 -3417029 -4073428 -4302173 -4042554
36290 -4042554 -3455686 -2756037 -2068823 -1444302 -910938 -461645 -52261 320240 569512
36281 569512 604877 446210 206835 -26119 -251474 -505416 -805514 -1152582 -1540738 -1930474
36271 -1930474 -2228318 -2325600 -2165845 -1769543 -1205352 -563689 37011 457835 606410 510141
36261 510141 294900 77982 -91005 -175728 -101924 170374 541449 818272 893857 832463
36251 832463 750821 665051 502176 227272 -110877 -467643 -879939 -1416375 -2063867 -2693873
36241 -2693873 -3147366 -3340255 -3284079 -3033665 -2656484 -2256983 -1978034 -1920655 -2058001 -2257029
36231 -2257029 -2386355 -2384871 -2246926 -1996566 -1689451 -1393511 -1136796 -893550 -630232 -334152
36221 -334152 6277 389146 726370 831015 547814 -95438 -888087 -1572886 -1969988 -2024883
36211 -2024883 -1814990 -1511075 -1268907 -1125317 -1005725 -811005 -462768 96315 850261
36202 850261 1632601 2180234 2331189 2152620 1849657 1586284 1429099 1412422 1566842 1860843
36192 1860843 2163212 2305729 2191441 1848485 1393087 941006 542108 191466 -108582
36183 -108582 -320855 -412888 -393636 -285920 -86905 202449 514300 725800 754638 623029
36173 623029 415926 196940 -19264 -229855 -405135 -493326 -465984 -369663 -329708 -472504
36163 -472504 -817332 -1251888 -1633947 -1917613 -2175089 -2512725 -2983545 -3554231 -4102649 -4438747
36153 -4438747 -4386550 -3905653 -3137215 -2307512 -1580801 -1001282 -539059 -148834 207225 549422
36143 549422 879846 1210406 1578135 1987064 2338902 2495167 2453743 2415217 2606101 3041341
36133 3041341 3501945 3735434 3639601 3276263 2787551 2329024 2026924 1936862 2033215 2244727
36123 2244727 2489205 2676344 2715275 2554608 2215378 1771842 1292233 782133 170674 -623582
36113 -623582 -1563829 -2426128 -2911920 -2873272 -2426925 -1848875 -1382154 -1133348 -1077963 -1111004
36103 -1111004 -1129429 -1129507 -1223988 -1529551 -2042235 -2642668 -3191310 -3571595 -3669897 -3403401 -2807236
36092 -2807236 -2051523 -1329285 -733976 -258231 112160 333985 334552 85582 -357021 -879507
36082 -879507 -1363898 -1710085 -1828453 -1663788 -1259697 -772609 -373175 -124920 21724 128030
36072 128030 194561 183215 62003 -195012 -621342 -1236843 -2010945 -2854684 -3647377 -4279444
36062 -4279444 -4695049 -4911303 -4995466 -5020050 -5033092 -5046610 -5027853 -4909084 -4633309 -4196705
36052 -4196705 -3637663 -2997456 -2311472 -1620229 -951627 -300254 333411 881827 1233574
36043 1233574 1334800 1237632 1036650 785836 481525 84345 -457991 -1163918 -1959321 -2691609
36033 -2691609 -3230572 -3537304 -3623094 -3484922 -3120107 -2574022 -1925948 -1235789 -530302 183486
36023 183486 928976 1754994 2656402 3498642 4081458 4306522 4253618 4076350 3855572 3576812
36013 3576812 3215480 2795531 2367601 1973259 1650388 1440313 1342996 1260805 1028210 536709
36003 536709 -164638 -898529 -1478522 -1801179 -1867514 -1765924 -1626879 -1547458 -1547243 -1615093 -1775574
35992 -1775574 -2054320 -2382492 -2604482 -2607068 -2396422 -2037780 -1589265 -1131564 -790309 -652232
35982 -652232 -681438 -766985 -828869 -842618 -808572 -759860 -766526 -862364 -988726 -1074397 -1144713
35971 -1144713 -1273815 -1447375 -1568511 -1611157 -1677970 -1869538 -2160129 -2438940 -2623262 -2699274
35961 -2699274 -2698119 -2666263 -2625480 -2540656 -2365341 -2132787 -1944491 -1832563 -1681066 -1328856
35951 -1328856 -719264 84016 980108 1864190 2595339 3003742 2973524 2530676 1863166 1243585
35941 1243585 871374 738698 664980 500137 289432 217939 408884 801922 1211063 1466128
35931 1466128 1505861 1378104 1177633 981876 832937 755324 755560 795788 797876 699236 501759
35920 501759 270250 108765 134176 415933 897572 1396082 1714885 1765264 1590117 1312966
35910 1312966 1078431 985806 1022939 1077057 1043253 906390 694718 395391 -23351 -514043
35900 -514043 -926341 -1098286 -963204 -591103 -157905 146786 230214 125429 -96463 -409134
35890 -409134 -795205 -1178215 -1474664 -1715369 -2041855 -2547740 -3151817 -3637582 -3795579 -3546941
35880 -3546941 -2990328 -2342124 -1781953 -1335490 -934384 -573983 -338550 -257988 -230581 -155891
35870 -155891 -94479 -215806 -592204 -1094911 -1493870 -1627845 -1493062 -1221417 -989534 -912888
35860 -912888 -993295 -1159725 -1353157 -1561582 -1778331 -1947830 -1972347 -1788766 -1451955 -1136403
35850 -1136403 -1030358 -1210851 -1618042 -2130456 -2631035 -3009211 -3165474 -3063675 -2757401
35841 -2757401 -2325116 -1789102 -1127431 -350594 472362 1260974 1964178 2556431 3026853
35832 3026853 3374865 3583910 3594666 3344953 2862308 2293858 1814556 1507087 1337038 1222668
35822 1222668 1105944 975230 862619 830036 922059 1096380 1207651 1100224 748585 305555
35812 305555 -8205 -76744 42736 210367 341529 449807 579788 734478 879904 998374
35802 998374 1109472 1235127 1364181 1472082 1576107 1750940 2068079 2516019 2990333 3365666
35792 3365666 3569875 3592242 3449475 3172032 2813026 2429155 2028391 1553478 949271 257579
35782 257579 -368013 -761986 -881130 -856134 -909097 -1191586 -1667916 -2146477 -2441355 -2518413
35772 -2518413 -2487627 -2465663 -2469758 -2445692 -2361002 -2240210 -2129961 -2068804 -2084444 -2177699 -2298367
35761 -2298367 -2370844 -2360617 -2291095 -2184327 -2019361 -1771460 -1459064 -1118664 -764075 -421968
35751 -421968 -196215 -237069 -620216 -1274265 -2028286 -2704433 -3171595 -3365313 -3296791 -3032240
35741 -3032240 -2645383 -2197542 -1761725 -1427554 -1249670 -1202224 -1206462 -1195920 -1140044 -1020264
35731 -1020264 -814002 -509619 -126757 278670 627545 851355 931670 902475 803255 641232
35721 641232 417543 178516 9804 -27065 68043 265260 548403 907128 1295444 1616402
35711 1616402 1748039 1580610 1051914 192319 -839028 -1785631 -2413138 -2637056 -2543692
35702 -2543692 -2286741 -1968013 -1613411 -1235853 -886560 -632466 -494001 -418094 -320332 -161212
35692 -161212 17261 139727 188532 238277 391031 684265 1066811 1446042 1742680 1923078
35682 1923078 2014438 2081673 2151912 2160699 2013305 1711656 1381169 1145180 997272 820081
35672 820081 506115 37735 -519238 -1054994 -1458405 -1665357 -1676529 -1507377 -1125904 -477929
35662 -477929 405627 1342421 2060658 2342421 2135742 1567811 868632 264846 -88702 -116171
35652 -116171 195941 797528 1565814 2322135 2876259 3082305 2904307 2465713 2010321 1754441
35642 1754441 1750371 1903281 2107212 2324160 2534684 2681354 2715366 2674187 2657475 2713842
35632 2713842 2771736 2683735 2330481 1706315 945399 260686 -195878 -448729 -659991 -956091
35622 -956091 -1309230 -1607868 -1811446 -1981328 -2159838 -2281026 -2243651 -2043474 -1782432 -1546013
35612 -1546013 -1310108 -985179 -536170 -55086 267969 256168 -119523 -681188 -1140504 -1294325
35602 -1294325 -1138737 -802787 -412442 -44728 237670 394512 470174 592307 869720 1306546
35592 1306546 1822077 2314847 2688438 2868049 2852820 2739630 2644863 2599123 2551344 2465621
35582 2465621 2361338 2250213 2092201 1851159 1558995 1283651 1053896 852642 665767
35573 665767 493868 330242 188145 162589 405206 987477 1800570 2611870 3200998 3427460
35563 3427460 3221389 2592000 1660526 625483 -351091 -1213901 -1960603 -2550721 -2907362
35554 -2907362 -3004919 -2924827 -2816295 -2812070 -2968809 -3247489 -3524349 -3636734 -3458811 -2968353
35544 -2968353 -2263029 -1519406 -913807 -530443 -300230 -30444 461932 1204615 2044933
35535 2044933 2775012 3287683 3620762 3870850 4075402 4160466 3980088 3418301 2492287 1378885
35525 1378885 331683 -445427 -866164 -950804 -792876 -526245 -265676 -47016 154673
35516 154673 343095 480927 572584 711931 992622 1398668 1836149 2248019 2633450 2969690
35506 2969690 3200048 3325564 3447961 3683279 4063091 4535052 5014920 5412371 5650347
35497 5650347 5700668 5582908 5311186 4874762 4291705 3643639 3028372 2508599 2122484 1887820
35487 1887820 1755576 1618756 1435666 1305399 1344828 1515321 1654531 1672067 1628450 1613298
35477 1613298 1636010 1671260 1731824 1833498 1933431 1963399 1904685 1793762 1683830 1640950 1740121
35466 1740121 1990868 2258016 2309146 1974209 1259468 326595 -598038 -1300819 -1647081 -1645746
35456 -1645746 -1448524 -1230418 -1035233 -752988 -271597 365819 988027 1470274 1830777
35447 1830777 2137745 2379105 2479618 2411778 2213698 1902900 1458855 923883 443684 133813
35437 133813 -58255 -278241 -552948 -721438 -602079 -182378 381874 908777 1287190 1474842
35427 1474842 1490998 1437704 1458672 1599711 1712001 1549886 990121 136305 -788227 -1601485
35417 -1601485 -2201553 -2515258 -2493247 -2160926 -1622541 -998199 -381961 145052 511954 691699
35407 691699 707018 584426 331040 -21658 -377972 -614563 -656055 -512201 -264769 -28878
35397 -28878 108175 148877 182290 300783 528570 836795 1185182 1501049 1645062 1484754
35387 1484754 1047179 557117 258638 182781 119094 -165785 -693628 -1266029 -1667062 -1847630
35377 -1847630 -1924641 -2050999 -2308157 -2676989 -3052248 -3293157 -3320222 -3188159 -3034524 -2938203
35367 -2938203 -2849827 -2672301 -2384573 -2073556 -1872129 -1885807 -2156468 -2666088 -3367261 -4199191
35357 -4199191 -5052953 -5737846 -6044989 -5883922 -5342369 -4607764 -3866181 -3272684 -2928559
35348 -2928559 -2813511 -2781584 -2699906 -2576312 -2488102 -2406957 -2183043 -1722334 -1113418 -545935
35338 -545935 -145550 87410 219034 294060 278205 62684 -446341 -1213581 -2063257 -2796719
35328 -2796719 -3303786 -3553839 -3527431 -3212807 -2668861 -2048981 -1529724 -1201460 -1020525 -872652
35318 -872652 -698730 -559388 -560608 -717849 -916483 -1007601 -916431 -658243 -297783 74606
35308 74606 363456 521178 586686 642789 728553 808272 823235 754746 636978 529622 487779
35297 487779 545576 710432 958779 1228088 1419019 1431387 1226307 866407 495371 264791
35287 264791 245906 374531 483088 427312 208252 -44448 -222517 -353140 -552087 -893670
35277 -893670 -1357186 -1879628 -2417617 -2958120 -3505353 -4068011 -4633036 -5137378 -5481964 -5589642
35267 -5589642 -5451099 -5121934 -4689588 -4235924 -3801353 -3367094 -2882708 -2327549 -1753319
35258 -1753319 -1272982 -1006345 -1008686 -1216593 -1463255 -1583940 -1533678 -1397927 -1286065 -1232972
35248 -1232972 -1209101 -1191037 -1181843 -1164447 -1070404 -820236 -397759 116521 584054 886432
35238 886432 981971 903235 712975 466969 205453 -46888 -287298 -530271 -782108 -1024518
35228 -1024518 -1233314 -1405642 -1552500 -1665571 -1708798 -1653000 -1518528 -1388842 -1388590 -1630051
35218 -1630051 -2136342 -2784541 -3335780 -3561740 -3373953 -2842472 -2099453 -1239331 -309969
35209 -309969 634002 1510632 2246989 2801756 3129750 3151949 2808592 2149318 1332430 508918
35199 508918 -273491 -1028891 -1718651 -2219236 -2406724 -2242629 -1771390 -1074575 -264692 491606
35189 491606 1000371 1142458 972362 708037 594151 747691 1125316 1625389 2183870 2748936
35179 2748936 3209088 3429020 3376898 3158042 2885040 2557207 2114990 1579938 1077253 722007
35169 722007 528275 426531 324063 151723 -87582 -293587 -340477 -212767 -47986 -19257
35159 -19257 -191509 -501086 -836219 -1104218 -1248859 -1251157 -1123011 -893143 -613133 -374863
35149 -374863 -266874 -268093 -221637 18687 420547 808532 1067248 1240177 1398552 1478809
35139 1478809 1323919 876276 273237 -261739 -587851 -695789 -630745 -411077 -15199 593608
35129 593608 1440435 2493075 3604037 4528061 5069503 5241275 5245631 5277826 5378711 5494122
35119 5494122 5619675 5816233 6090467 6323900 6351614 6099244 5641476 5138406 4698253 4272820
35109 4272820 3701098 2896532 1988763 1239323 813708 674194 691404 795019 985981 1263333
35099 1263333 1608821 2032186 2577627 3269963 4071758 4891407 5616323 6146551 6426707
35090 6426707 6464756 6321686 6078267 5795721 5483781 5101390 4609707 4038290 3489512 3074674
35080 3074674 2858571 2854353 3022390 3245418 3338055 3128710 2544143 1619927 467696 -738851
35070 -738851 -1787380 -2513151 -2893199 -3038557 -3085628 -3100885 -3068255 -2922906 -2587633 -2018929
35060 -2018929 -1258995 -442594 273189 812350 1235171 1699255 2348248 3205494 4152754
35051 4152754 5004882 5608921 5892180 5852038 5524889 4960052 4209878 3342206 2451242 1626464
35041 1626464 898554 241972 -350287 -820465 -1099744 -1181742 -1105787 -887904 -518980 -31675
35031 -31675 476489 903238 1202288 1385353 1498464 1603099 1743116 1904665 2019732 2016335
35021 2016335 1857669 1553456 1180195 889044 822811 968851 1115551 1003398 529596 -201173
35011 -201173 -997417 -1712326 -2270649 -2627528 -2746657 -2620378 -2294708 -1865575 -1446405 -1128290
35001 -1128290 -949135 -877552 -827196 -722643 -585230 -540680 -699761 -1020787 -1315153 -1393582
34991 -1393582 -1182407 -704699 -8889 843952 1755498 2600504 3259922 3635143 3675667 3448477
34981 3448477 3158043 3019040 3075289 3176666 3152513 2972234 2710386 2395873 1960964 1351669
34971 1351669 646074 24936 -377006 -579649 -725166 -952653 -1294450 -1657676 -1885609
34962 -1885609 -1866728 -1631604 -1345157 -1161152 -1062587 -868217 -409808 318788 1184750 2025807
34952 2025807 2700233 3095730 3189730 3105679 3028800 3030554 3024820 2924717 2786062 2739811 2812147
34941 2812147 2874452 2775286 2483662 2101718 1777280 1617350 1647424 1809250 1985784 2044979
34931 2044979 1891734 1517668 1024536 582937 329492 283090 360446 464136 539442 556193
34921 556193 474288 251542 -123978 -617294 -1143044 -1564687 -1726719 -1542200 -1078351 -546363
34911 -546363 -181384 -105942 -278688 -546467 -745118 -786949 -697342 -585199 -560981 -657179
34901 -657179 -817260 -962354 -1061449 -1123263 -1128459 -1012026 -748497 -439020 -263248 -321099
34891 -321099 -542242 -765095 -880121 -878820 -800965 -688241 -587241 -548232 -594310 -703280
34881 -703280 -821188 -878339 -810091 -611379 -377104 -233557 -199450 -159130 -14622 172854
34871 172854 246245 133718 -93394 -333716 -560241 -797000 -1047167 -1276857 -1442713 -1518050
34861 -1518050 -1517512 -1501450 -1514169 -1504175 -1359455 -1059898 -750239 -606633 -654665 -773756 -865006
34850 -865006 -948779 -1087695 -1272978 -1421229 -1454004 -1352742 -1154644 -922490 -717489 -590057
34840 -590057 -590030 -761849 -1092948 -1467055 -1717369 -1761628 -1664697 -1536700 -1383710 -1095192 -578250
34829 -578250 128045 879492 1539531 2050196 2415703 2647903 2731240 2626556 2307694 1808032
34819 1808032 1235014 722638 349912 97642 -118725 -381021 -728530 -1155723 -1615422
34810 -1615422 -2024360 -2300387 -2421510 -2443855 -2450206 -2488910 -2572175 -2715333 -2945481 -3263716
34800 -3263716 -3617151 -3921806 -4111895 -4169390 -4117434 -3988369 -3785671 -3465273 -2957328 -2221504
34790 -2221504 -1299714 -325241 533897 1178123 1649217 2085836 2575261 3049106 3353618
34781 3353618 3429300 3390987 3408373 3524188 3616438 3538196 3276756 2973767 2800777 2810873
34771 2810873 2887249 2819808 2447896 1770170 951968 228257 -235169 -432492 -501213 -615153
34761 -615153 -870300 -1243722 -1640488 -1979212 -2246419 -2474773 -2663151 -2724461 -2536692 -2056693
34751 -2056693 -1367723 -611114 97721 674777 1049858 1215383 1280944 1407534 1663841 1984130
34741 1984130 2264385 2431366 2399413 2057943 1403442 663275 196521 233948 731104 1456146
34731 1456146 2166184 2702544 2999071 3071367 3000038 2892782 2838269 2866165 2916347 2850637
34721 2850637 2544691 2007280 1403932 948409 769145 859814 1107103 1341375 1405075 1235733
34711 1235733 896574 503674 119650 -265750 -658850 -1000355 -1198846 -1216319 -1110758 -998153
34701 -998153 -974169 -1059258 -1198149 -1294712 -1247442 -983467 -509129 50656 495895 682695
34691 682695 625375 460914 327696 303956 439268 771055 1270998 1819622 2292646 2663653
34681 2663653 2976873 3231112 3360780 3358312 3350549 3480828 3726157 3894070 3819360 3526829
34671 3526829 3183529 2926765 2763427 2600398 2322549 1849347 1168986 345580 -523323
34662 -523323 -1372384 -2184585 -2938843 -3560850 -3945797 -4032696 -3856225 -3533247 -3197109 -2923455
34652 -2923455 -2698079 -2455361 -2157867 -1842303 -1587468 -1441719 -1386291 -1365760 -1345034 -1328374
34642 -1328374 -1319812 -1273824 -1107094 -776016 -335923 92851 415576 608652 690417 683150
34632 683150 611195 501432 360134 167767 -80494 -343174 -563978 -725594 -854629 -987290
34622 -987290 -1150704 -1357287 -1578810 -1732190 -1733819 -1580730 -1352166 -1127844 -938831 -804395
34612 -804395 -762371 -814568 -864407 -768652 -477916 -109862 139804 174063 95702 135199 462668
34601 462668 1052527 1720224 2271156 2597412 2662142 2468669 2087322 1666503 1347653 1158805
34591 1158805 1015152 810529 478042 -10560 -634833 -1299447 -1871483 -2276036 -2530644
34582 -2530644 -2676715 -2719569 -2654364 -2497209 -2244960 -1845002 -1270671 -617332 -64258 272490
34572 272490 417329 469237 504986 558087 643945 763624 891573 983540 1003925 956237 907802
34561 907802 979638 1272707 1775848 2350986 2814263 3027637 2935565 2564454 2000190 1322183
34551 1322183 535263 -392045 -1390962 -2244213 -2739813 -2860421 -2770512 -2635039 -2516556 -2441240
34541 -2441240 -2468156 -2638396 -2909719 -3203818 -3493371 -3786382 -4035308 -4119531 -3935359 -3474007
34531 -3474007 -2800687 -1986769 -1086556 -172332 627456 1140597 1224243 853831 151487 -681160
34521 -681160 -1469507 -2121034 -2605327 -2912421 -3038595 -2998451 -2841395 -2656826 -2553388 -2612517
34511 -2612517 -2855117 -3262275 -3824453 -4544811 -5376727 -6168916 -6694330 -6751006 -6261885 -5318910
34501 -5318910 -4155626 -3052633 -2213245 -1689431 -1416929 -1317057 -1353336 -1493060 -1648863
34492 -1648863 -1701285 -1592340 -1375709 -1151849 -957418 -737071 -423166 -16563 427275 867922
34482 867922 1296947 1684107 1948534 2018378 1910233 1722450 1548206 1412330 1287835 1140079
34472 1140079 936992 642898 240646 -235540 -711061 -1122958 -1448918 -1683407 -1808766
34463 -1808766 -1812386 -1729704 -1653900 -1694420 -1921747 -2339201 -2889490 -3479047 -4001378 -4354745
34453 -4354745 -4466073 -4325202 -3999032 -3590303 -3167567 -2744110 -2325960 -1947322 -1630277
34444 -1630277 -1335064 -999506 -626365 -282979 -1158 272818 595040 931219 1199254
34435 1199254 1386649 1565644 1776914 1938320 1895562 1551670 944941 231054 -392770 -779314
34425 -779314 -903877 -872859 -849533 -946257 -1166538 -1435248 -1677333 -1868020 -2012602 -2091687
34415 -2091687 -2049856 -1854806 -1563465 -1318724 -1280149 -1548185 -2112577 -2826234 -3434555 -3690109
34405 -3690109 -3492313 -2932762 -2216678 -1556341 -1113968 -964998 -1052592 -1197670 -1214828 -1041439
34395 -1041439 -742516 -404663 -63327 271195 574551 832063 1073347 1342620 1644053
34386 1644053 1954863 2295382 2745043 3358321 4076105 4741177 5194669 5344807 5170609
34377 5170609 4721334 4137475 3622611 3327465 3248499 3263734 3260869 3198307 3056854 2801943
34367 2801943 2425591 1974071 1482517 911563 207892 -576171 -1271433 -1708745 -1821560
34358 -1821560 -1648062 -1288393 -873769 -525786 -301905 -186560 -143248 -154376 -206607 -275556
34348 -275556 -346561 -417293 -450705 -356857 -68481 368317 806369 1096486 1162014 1009580
34338 1009580 721640 441260 315607 423116 759265 1280270 1919399 2549071 2974146
34329 2974146 3020052 2650002 1996632 1279160 675874 243354 -64077 -292189 -397162 -267470
34319 -267470 159370 817862 1562930 2277853 2913057 3438245 3806221 3987950 4016176 3952834
34309 3952834 3805134 3501509 2976131 2275266 1567795 1055391 878580 1076300 1568548
34300 1568548 2149189 2549484 2586462 2269764 1742347 1126513 465887 -191698 -724371 -996206
34290 -996206 -967722 -717427 -361116 39721 508529 1107021 1840997 2607766 3268715 3781811
34280 3781811 4209119 4557218 4668136 4354706 3644602 2823593 2212857 1934904 1894316 1922321
34270 1922321 1899914 1782084 1573969 1317405 1094177 1014498 1158920 1499777 1894645 2192391
34260 2192391 2342862 2378598 2316660 2143917 1900783 1703460 1643700 1715582 1876378 2122025
34250 2122025 2439791 2725218 2829598 2697954 2408628 2069455 1718718 1338248 925288
34241 925288 534255 268222 228074 435800 799964 1187805 1541304 1894348 2271158 2611419
34231 2611419 2823995 2886704 2861698 2830199 2843423 2924588 3076349 3269534 3442616 3529918
34221 3529918 3494697 3344031 3129457 2935933 2842515 2855731 2870772 2729277 2358890 1867363
34211 1867363 1472814 1316407 1343966 1372586 1254625 969376 590942 212334 -100735 -322454
34201 -322454 -459096 -527331 -544210 -545302 -588043 -694671 -787640 -721516 -408567 90065 598469
34190 598469 940191 1037006 945021 817227 801949 946755 1202748 1518066 1888463 2294046
34180 2294046 2630700 2771313 2707068 2584201 2566046 2668036 2756030 2713863 2590776 2557412
34170 2557412 2717261 2990347 3196371 3219410 3054419 2720035 2200194 1499826 712070 -13069
34160 -13069 -556349 -872593 -979036 -932526 -796442 -591668 -284833 150093 668885 1183879
34150 1183879 1645685 2064607 2446689 2736619 2840432 2701623 2362368 1966416 1694274
34141 1694274 1663160 1866674 2208263 2592235 2982490 3386597 3800001 4167381 4394800 4410005
34131 4410005 4223941 3930607 3641460 3425829 3308829 3292107 3352438 3444773 3542418 3662014
34121 3662014 3810490 3912251 3839322 3542622 3132039 2795735 2633073 2567266 2412778 2024574
34111 2024574 1401326 678989 51338 -311389 -320631 -14493 435494 803248 942377 861057
34101 861057 676414 516378 458727 513910 629604 730993 782056 792385 758954 654519
34091 654519 515390 491488 730659 1212895 1747195 2126516 2246720 2105073 1766526 1343762
34081 1343762 939988 580297 239369 -58309 -227237 -228244 -124808 -2873 105896 182605
34071 182605 162025 -26418 -389854 -884307 -1453850 -2009992 -2423629 -2621861 -2684300 -2775126
34061 -2775126 -2975947 -3238880 -3498670 -3754939 -4010209 -4180273 -4123120 -3756328 -3128437 -2381833
34051 -2381833 -1653519 -995906 -375466 252311 862174 1352655 1617440 1621503 1418326 1109671
34041 1109671 791430 524693 338768 239753 204757 189122 178822 240899 482203 932807
34031 932807 1493880 2021455 2435057 2721792 2877697 2907573 2874081 2883299 2996706 3190217
34021 3190217 3418685 3690829 4051396 4501581 4965776 5346669 5602392 5750476 5783858 5602213
34011 5602213 5076520 4211698 3216952 2370092 1813358 1507995 1365795 1358888 1482950 1681258
34001 1681258 1879533 2090657 2421426 2938910 3555485 4087358 4424933 4605704 4706000
33992 4706000 4707793 4519585 4102444 3511610 2817993 2063458 1317835 704368 305864 83805
33982 83805 -56314 -154309 -204459 -234735 -296815 -390330 -474072 -553187 -681869 -869678 -1056461
33971 -1056461 -1198291 -1308355 -1386598 -1382800 -1278141 -1145658 -1069636 -1037698 -960725 -771380
33961 -771380 -462739 -66059 355457 714866 959473 1110282 1197849 1172153 930578 444004
33951 444004 -174883 -727473 -1039057 -1053492 -877547 -714581 -687580 -723828 -670089 -517237
33941 -517237 -430610 -532492 -733285 -833034 -732187 -477765 -154009 174246 418696 473817
33931 473817 320473 77873 -95577 -140363 -118717 -130159 -232427 -419663 -634467 -797615
33921 -797615 -850031 -777452 -603857 -388541 -234947 -244231 -394293 -482038 -266930 289403
33911 289403 957935 1433538 1558502 1353309 905756 306195 -336655 -909140 -1360586 -1721713
33901 -1721713 -2025889 -2230228 -2241724 -2025796 -1682593 -1403780 -1327087 -1411840 -1468629 -1333241
33891 -1333241 -1006782 -614738 -254594 82059 456473 903499 1406515 1901305 2284116
33882 2284116 2448540 2339886 1967642 1376527 642275 -109301 -741786 -1205196 -1565255
33873 -1565255 -1908194 -2242390 -2520114 -2724923 -2892396 -3050215 -3170858 -3188349 -3046996 -2735754
33863 -2735754 -2285477 -1734696 -1110803 -469476 58672 317482 254096 -27237 -358218 -620159
33853 -620159 -752977 -719022 -523647 -239531 56963 358467 673662 920767 962606 767201
33843 767201 454149 134842 -235957 -787983 -1543419 -2352882 -3011100 -3386391 -3441067 -3189815
33833 -3189815 -2684220 -2023097 -1338814 -753010 -339372 -115073 -50139 -88305 -188063 -365363
33823 -365363 -678629 -1134788 -1605374 -1871617 -1782941 -1371606 -815844 -316770 -11643 53101
33813 53101 -69594 -244523 -326190 -241897 -9579 305122 627424 890072 1053547 1114732
33803 1114732 1075245 913140 619153 251381 -90227 -347389 -521088 -603035 -544399 -322813
33793 -322813 -2564 309990 553419 728163 848143 909827 904203 834154 716822 576627
33783 576627 429493 271288 99493 -50079 -122755 -129524 -189455 -445978 -933627 -1542263
33773 -1542263 -2106424 -2515021 -2753313 -2879711 -2971129 -3060823 -3108850 -3045716 -2859359 -2630374
33763 -2630374 -2466883 -2406043 -2387480 -2317745 -2144513 -1864475 -1483024 -1001944 -459128 42807
33753 42807 377759 473494 342451 42530 -380538 -918752 -1585496 -2367976 -3181021 -3882545
33743 -3882545 -4366648 -4640617 -4783552 -4839650 -4801382 -4703368 -4666251 -4795990 -5066449 -5342900
33733 -5342900 -5502165 -5496416 -5333249 -5058304 -4753934 -4490532 -4255082 -3968816 -3600913 -3235855
33723 -3235855 -3003730 -2959984 -3041606 -3107706 -3001489 -2615666 -1964980 -1212659 -588328 -236651
33713 -236651 -124260 -87542 21909 214794 360122 299288 -20354 -508111 -1008688 -1401206
33703 -1401206 -1622643 -1632526 -1406650 -983246 -485832 -60720 221591 395937 533939 659504
33693 659504 739257 742790 690226 632567 594833 548057 435994 228136 -43216 -286157 -394243
33682 -394243 -310954 -69331 230541 496216 711330 941463 1274135 1742115 2286368 2779838
33672 2779838 3090361 3139158 2919621 2475088 1871812 1203080 606415 230074 135576 235104
33662 235104 369008 463878 578344 767343 948641 973392 821432 651297 622953 718371
33652 718371 776818 671586 404339 50524 -324622 -688217 -1030739 -1368672 -1738617 -2163274
33642 -2163274 -2619073 -3037151 -3331177 -3433362 -3326885 -3056178 -2701889 -2341862 -2030181
33633 -2030181 -1791055 -1608990 -1430360 -1199719 -904287 -579100 -279579 -63108 23327 -20149
33623 -20149 -114437 -140301 -31392 181942 426910 670271 943130 1303095 1773019 2292971
33613 2292971 2731641 2980510 3051083 3048475 3035096 2960402 2752214 2432141 2084136 1727262
33603 1727262 1279069 652009 -152975 -1047469 -1899913 -2566892 -2938814 -3011795 -2912077 -2818484
33593 -2818484 -2845432 -2992843 -3188421 -3362466 -3489752 -3576713 -3622354 -3609796 -3549113 -3508613
33583 -3508613 -3562007 -3692118 -3773474 -3662743 -3283816 -2623330 -1702190 -608494 464910
33574 464910 1290120 1746820 1877996 1797859 1574803 1219351 749592 222246 -299810 -777081
33564 -777081 -1181255 -1480813 -1659333 -1733412 -1731453 -1667216 -1563225 -1488857 -1517648 -1614700 -1610565
33553 -1610565 -1353170 -888449 -442102 -209804 -203621 -315382 -480872 -746716 -1206753 -1902139
33543 -1902139 -2747116 -3509727 -3900826 -3757013 -3157304 -2337925 -1500400 -724001 -24755
33534 -24755 576337 1049299 1356408 1440351 1262624 871326 382751 -118218 -603356 -1012427
33524 -1012427 -1221177 -1157029 -893295 -564819 -229976 121870 471084 763841 989905 1175665
33514 1175665 1293906 1258032 1024132 638469 177850 -282287 -628777 -744910 -656975 -583205
33504 -583205 -745300 -1139250 -1542829 -1730225 -1632637 -1322788 -929002 -579788 -361013 -272694
33494 -272694 -239089 -183306 -87588 18515 104114 155316 159906 90362 -88550 -379201 -703213
33483 -703213 -909233 -867424 -578277 -180263 159540 361516 450259 479161 448842 289534
33473 289534 -81105 -665451 -1330956 -1852333 -2040675 -1871747 -1514370 -1230104 -1211578 -1473361
33463 -1473361 -1866700 -2192032 -2320739 -2257833 -2128945 -2098952 -2254260 -2532873 -2783418 -2909877
33453 -2909877 -2945252 -2976689 -3036110 -3099878 -3162428 -3239259 -3284641 -3166469 -2769547 -2108002 -1311670
33442 -1311670 -525652 142779 604637 791334 714807 493097 269638 108475 -2925 -60692
33432 -60692 -10647 174290 440927 736384 1109377 1654643 2352215 3033667 3539535 3859907
33422 3859907 4089252 4297458 4493544 4666884 4790421 4798886 4629102 4285842 3830163 3322007
33412 3322007 2826187 2445730 2254009 2172146 1992989 1577688 991819 420579 -6590 -281134
33402 -281134 -462486 -614173 -764117 -881222 -904094 -820827 -698785 -610325 -557853 -498294
33392 -498294 -399713 -230152 64996 498739 965026 1298869 1438212 1490166 1625864 1938446
33382 1938446 2400401 2909185 3345734 3611185 3639709 3401062 2924853 2338820 1841045 1578235
33372 1578235 1558946 1725705 2083888 2681532 3458210 4197826 4672033 4779910 4524061 3931025
33362 3931025 3069710 2099239 1199253 440433 -220046 -809469 -1264916 -1514078 -1592291 -1643400
33352 -1643400 -1811509 -2143313 -2580416 -3025149 -3411508 -3723744 -3963962 -4125860 -4213899 -4271501
33342 -4271501 -4360270 -4505663 -4682123 -4858464 -5035733 -5215358 -5331574 -5243116 -4824814 -4085356
33332 -4085356 -3190923 -2359210 -1720815 -1271101 -925468 -592204 -207335 247712 733378
33323 733378 1178922 1546747 1859463 2152811 2426476 2662644 2866131 3046405 3165928 3140423
33313 3140423 2900342 2450185 1893655 1423082 1240069 1406972 1757599 2004109 1962857 1660207
33303 1660207 1230990 783149 392748 157649 159069 360815 602566 717985 640523 394469
33293 394469 21210 -460636 -1037341 -1665266 -2262586 -2748616 -3111636 -3435958 -3832079 -4318243
33283 -4318243 -4777195 -5038732 -4997493 -4651085 -4056630 -3288682 -2438698 -1619911 -946357 -505114
33273 -505114 -341044 -440224 -713966 -1028952 -1296250 -1535843 -1828221 -2199525 -2581071 -2884465
33263 -2884465 -3076035 -3157306 -3120119 -2978900 -2831303 -2818228 -2994062 -3264265 -3468644 -3506814
33253 -3506814 -3380368 -3154005 -2902980 -2672608 -2459176 -2243661 -2061073 -2009711 -2158151 -2453836
33243 -2453836 -2746697 -2886425 -2779203 -2399906 -1828946 -1279352 -1006073 -1129470 -1558193
33234 -1558193 -2094088 -2577042 -2916856 -3055634 -2983263 -2788015 -2624139 -2588255 -2633888 -2611396
33224 -2611396 -2382257 -1912613 -1301491 -733708 -367019 -222693 -183203 -111132 31144 180044
33214 180044 264369 279602 290678 402213 723533 1306630 2071861 2808084 3290450 3417387
33204 3417387 3226424 2789816 2133973 1275787 301438 -634174 -1385826 -1872083 -2061162
33195 -2061162 -1948772 -1575990 -1044314 -473322 66749 568565 1033526 1416027 1622934
33186 1622934 1560735 1193187 582885 -108873 -689476 -1048514 -1231247 -1397284 -1692045 -2138970
33176 -2138970 -2627334 -2978736 -3036606 -2746580 -2206649 -1649999 -1343027 -1448220 -1940399 -2627837
33166 -2627837 -3263100 -3683556 -3897341 -4041980 -4234102 -4449447 -4566482 -4531798 -4456494 -4526032
33156 -4526032 -4815498 -5194866 -5403698 -5222157 -4606055 -3694004 -2694395 -1765530 -1005876
33147 -1005876 -526745 -455262 -811476 -1413889 -1975303 -2313100 -2448092 -2513556 -2613298 -2764041
33137 -2764041 -2911083 -2963397 -2850969 -2592225 -2295384 -2067818 -1932637 -1845009 -1758737 -1643600
33127 -1643600 -1466153 -1214078 -945599 -760489 -689537 -643969 -513996 -306487 -148679 -157175
33117 -157175 -343819 -664584 -1110371 -1686820 -2309549 -2788155 -2960380 -2822444 -2502342 -2138119
33107 -2138119 -1823996 -1635162 -1607448 -1660072 -1606575 -1306371 -789539 -198248 367141 894909
33097 894909 1370093 1696229 1733949 1400055 729754 -123889 -934799 -1479635 -1623995 -1381503
33087 -1381503 -913826 -458270 -200780 -172730 -272448 -402430 -566151 -810221 -1112195 -1389079
33077 -1389079 -1605392 -1797432 -1973178 -2066353 -2044760 -2006921 -2085543 -2263342 -2358349 -2213285
33067 -2213285 -1853498 -1438599 -1103368 -880700 -746198 -680319 -675347 -712150 -752972 -755172 -685827
33056 -685827 -523128 -245714 172016 737113 1398129 2036714 2520390 2774155 2796203 2604958
33046 2604958 2188302 1523547 648781 -300910 -1145598 -1757661 -2110187 -2240072 -2189912 -2008367
33036 -2008367 -1791085 -1668110 -1712471 -1869616 -1995686 -1953219 -1662991 -1120566 -442451 114398
33026 114398 285684 24860 -435815 -788544 -877941 -701660 -277971 364186 1083428 1650642
33016 1650642 1934074 1992505 1950406 1859661 1739479 1675422 1784392 2107940 2610246 3247731
33006 3247731 3947381 4523041 4723715 4431149 3778709 3041883 2428403 1976786 1606281
32997 1606281 1221339 786934 350185 12500 -123347 -2717 341676 773048 1100156
32988 1100156 1193921 1065121 810634 504777 185766 -73952 -167115 -53294 190509 457360
32978 457360 713839 991831 1325396 1739476 2256271 2839150 3334896 3537367 3338273 2796658
32968 2796658 2064210 1285155 581471 77734 -136946 -97548 19280 12173 -192788 -518208
32958 -518208 -868181 -1259666 -1793819 -2507768 -3289580 -3946951 -4339549 -4449822 -4364997 -4208616
32948 -4208616 -4063202 -3935372 -3797218 -3647903 -3502222 -3333062 -3094717 -2829074 -2683057
32939 -2683057 -2763569 -3012587 -3280449 -3488729 -3656938 -3797075 -3867866 -3838325 -3721586 -3529279
32929 -3529279 -3267734 -3017839 -2950731 -3188744 -3658695 -4122098 -4347080 -4241042 -3857218 -3325479
32919 -3325479 -2770168 -2248378 -1750572 -1274403 -892626 -725857 -850209 -1250932 -1855214
32910 -1855214 -2568088 -3263060 -3782956 -4010090 -3957917 -3779820 -3668885 -3734409 -3953426 -4211078
32900 -4211078 -4371595 -4330249 -4044266 -3551814 -2961338 -2394282 -1914779 -1513072 -1162114 -883526
32890 -883526 -744248 -784859 -962062 -1172382 -1330400 -1416655 -1455624 -1468187 -1455891 -1414231 -1339783
32879 -1339783 -1230957 -1104003 -1005482 -982130 -1032328 -1112730 -1203443 -1339647 -1559234 -1842404
32869 -1842404 -2129590 -2383097 -2601695 -2782822 -2897504 -2897023 -2720834 -2311294 -1663144 -870955
32859 -870955 -102502 491133 841418 967229 955939 931569 985019 1109743 1234468 1327295
32849 1327295 1419094 1498853 1446236 1142552 641596 172860 -37369 80615 446237 912272
32839 912272 1307676 1460466 1270945 792499 207403 -308964 -702092 -1017342 -1285578 -1453308
32829 -1453308 -1428902 -1182544 -791397 -393797 -105361 32732 44474 -32540 -188733 -420729
32819 -420729 -656895 -731620 -494599 20431 566051 872305 883484 789677 821107 1024730
32809 1024730 1237661 1251858 995758 583881 220797 53863 90359 231142 370279 458652
32799 458652 488107 453876 367516 302389 385639 706289 1222176 1771886 2193039 2435275
32789 2435275 2563908 2665019 2753608 2764056 2612021 2262024 1750877 1161366 573759 38146
32779 38146 -404432 -679294 -684260 -370595 177617 763710 1184382 1305279 1046648 356777
32769 356777 -736914 -2045554 -3236101 -3985280 -4159268 -3882358 -3450788 -3149755 -3093893
32760 -3093893 -3216060 -3418804 -3720420 -4199602 -4787791 -5197533 -5141298 -4611067 -3880826 -3236509
32750 -3236509 -2762169 -2383144 -2016933 -1616889 -1130430 -515363 187138 843678 1305141
32741 1305141 1470190 1294999 809510 156267 -428846 -733762 -695189 -418314 -88086 141028
32731 141028 203313 114140 -74914 -312634 -548150 -715771 -751171 -640902 -447247 -262926
32721 -262926 -127655 11996 252814 634542 1084949 1470789 1704582 1788959 1753151 1575092
32711 1575092 1202570 652297 59313 -387723 -556241 -426823 -78949 355530 744664
32702 744664 1010262 1171238 1349137 1712655 2370644 3278183 4243517 5049910 5585806 5862993
32692 5862993 5933079 5818787 5521689 5054604 4445267 3736913 3017096 2432659 2134976 2182744
32682 2182744 2489170 2857647 3071558 2979125 2543059 1854767 1114199 561604 361497 501726
32672 501726 806708 1077509 1227673 1281163 1272111 1199410 1077632 970983 944827 1024149 1233965
32661 1233965 1634619 2246628 2945327 3498083 3741857 3700202 3507878 3250953 2913828 2464416
32651 2464416 1938718 1415566 932805 469535 19954 -348178 -543197 -553893 -476292 -429879
32641 -429879 -468599 -578885 -728330 -878270 -955977 -855924 -502947 70613 707016 1196535
32631 1196535 1402933 1343271 1145066 921184 694788 440204 157545 -122735 -383232 -620303
32621 -620303 -800680 -858058 -751041 -503444 -176316 176561 510396 774358 931653 992423
32611 992423 994220 935754 755040 406324 -41631 -420118 -607373 -660794 -780353 -1131116
32601 -1131116 -1709031 -2372006 -2967437 -3411592 -3678311 -3761911 -3664844 -3399576 -2991438 -2491305
32591 -2491305 -1984099 -1553819 -1212286 -869710 -404577 221711 925539 1580920 2126640
32582 2126640 2580407 2957470 3206055 3236724 2997260 2508244 1855538 1179199 641638 342169
32572 342169 243087 213995 162977 96362 51186 26898 11631 19638 49782 47605 -22021 -81282
32560 -81282 6437 270799 567815 690709 513105 31526 -660593 -1400950 -2008646 -2370764
32550 -2370764 -2490023 -2438294 -2281939 -2068484 -1858186 -1724923 -1710522 -1779264 -1814075 -1672041
32540 -1672041 -1287564 -749180 -255027 36899 115450 77374 16419 -31672 -82605 -202980
32530 -202980 -499609 -1032358 -1702052 -2263586 -2492958 -2342403 -1932312 -1427071 -941813 -528884
32520 -528884 -190125 108377 392963 632702 753316 711883 536805 286884 4943 -266069
32510 -266069 -458614 -523052 -489659 -451695 -489643 -642678 -937509 -1383663 -1925067 -2448953
32500 -2448953 -2871916 -3179735 -3362036 -3363588 -3151673 -2796187 -2422524 -2093892 -1779959 -1425238
32490 -1425238 -1009419 -566576 -200358 -60424 -232913 -647658 -1146252 -1638073 -2126978
32481 -2126978 -2588676 -2910784 -2989482 -2818959 -2449564 -1927326 -1330523 -808308 -506034 -463348
32471 -463348 -617709 -866770 -1084976 -1141154 -993999 -759907 -609159 -584875 -570543 -423575
32461 -423575 -86682 402218 908029 1191413 1015319 347392 -567236 -1378771 -1863844 -1985654
32451 -1985654 -1807382 -1425832 -966269 -561972 -306028 -229094 -297046 -388657 -299977 146587
32441 146587 948272 1892500 2706225 3239416 3519680 3672028 3810113 3979484 4165980 4345746
32431 4345746 4527493 4735151 4944027 5057596 4973898 4667823 4188318 3593868 2939584 2334773
32421 2334773 1951589 1911691 2159303 2476250 2631485 2514415 2155643 1668852 1172501 712141
32411 712141 225309 -388099 -1125147 -1820702 -2254510 -2310504 -2018923 -1476672 -781996 -49271
32401 -49271 571941 945220 1017164 824473 439053 -75910 -661143 -1246520 -1772462 -2226286
32391 -2226286 -2630918 -2980075 -3201522 -3212832 -3011321 -2681920 -2312614 -1929607 -1522637 -1098648
32381 -1098648 -686098 -311792 -1951 212468 319404 335173 257473 31443 -381833 -897499
32371 -897499 -1317578 -1479307 -1376218 -1123635 -832814 -538150 -221502 132874 519689 932995
32361 932995 1381738 1865194 2333646 2703894 2940069 3099761 3259439 3393998 3368264 3061800
32351 3061800 2478932 1730250 937440 173158 -532362 -1155504 -1654351 -1984506 -2155559
32342 -2155559 -2260526 -2406951 -2603238 -2742564 -2712389 -2489221 -2116148 -1639243 -1107867 -600407
32332 -600407 -187945 128824 411774 717996 1066186 1451348 1843320 2164491 2309843 2211627
32322 2211627 1873685 1348574 712707 68025 -470392 -819564 -961886 -938880 -834251 -758532
32312 -758532 -801372 -956598 -1102575 -1090425 -868970 -524603 -202011 16325 170353 378117
32302 378117 723612 1172412 1598331 1903873 2115619 2355553 2722023 3206275 3714510 4139673
32292 4139673 4392239 4388292 4069930 3479048 2795230 2256189 2017884 2089543 2379954 2763230
32282 2763230 3100288 3262308 3193890 2947610 2622789 2269464 1865669 1369328 767625 99913
32272 99913 -526050 -956906 -1090079 -960370 -696313 -390454 -55887 291644 578240 731615
32262 731615 741452 612958 303977 -226880 -921548 -1620850 -2154054 -2394734 -2261735 -1753459
32252 -1753459 -1010160 -280537 234956 512029 669696 833774 1042009 1245471 1363015
32243 1363015 1341006 1189305 966131 720291 454193 152224 -165681 -434032 -578389 -547633
32233 -547633 -318509 103477 665878 1246358 1657160 1705973 1306138 560930 -276660 -965581
32223 -965581 -1415785 -1672613 -1794655 -1789455 -1666068 -1494198 -1368170 -1326233 -1333398 -1330795 -1269647
32212 -1269647 -1106967 -821723 -468150 -188135 -123491 -294476 -570793 -772197 -808176 -740300
32202 -740300 -729298 -916691 -1324224 -1835430 -2271444 -2507740 -2541497 -2456027 -2324005 -2153296
32192 -2153296 -1929454 -1692116 -1538980 -1543835 -1687367 -1880022 -2036653 -2117184 -2126453 -2122146 -2219028
32181 -2219028 -2527027 -3044105 -3623728 -4071108 -4269372 -4221705 -4018247 -3787137 -3627241 -3526513
32171 -3526513 -3365312 -3062267 -2710750 -2505331 -2528371 -2685722 -2880325 -3162863 -3634358 -4250414
32161 -4250414 -4818080 -5183794 -5347857 -5382264 -5309518 -5101971 -4755335 -4322243 -3900728 -3619691
32151 -3619691 -3598976 -3864717 -4299965 -4718293 -5006754 -5191169 -5368251 -5595074 -5842414 -6022730
32141 -6022730 -6039532 -5823777 -5357249 -4681448 -3879456 -3035631 -2208813 -1448725 -832543 -462429
32131 -462429 -404883 -627524 -997448 -1336457 -1481882 -1329764 -868226 -186685 566623 1255222
32121 1255222 1788427 2104054 2156955 1950673 1571545 1170810 899947 842321 972206 1162242
32111 1162242 1252502 1146992 860645 485414 134174 -76111 -27016 355195 1026924 1809402
32101 1809402 2465482 2824985 2876815 2766486 2688919 2742940 2865616 2908517 2782374 2533384
32091 2533384 2296711 2190471 2240747 2380394 2514206 2602843 2691388 2847420 3073082 3295897
32081 3295897 3450669 3551183 3667202 3841302 4042814 4198416 4253000 4198363 4055761 3844549
32071 3844549 3569551 3226925 2809823 2314178 1761136 1223334 808862 593486 565981 649083
32061 649083 767867 884714 974636 987301 842345 467702 -130721 -811615 -1332826 -1502038
32051 -1502038 -1322146 -966336 -592531 -202773 298541 935857 1589759 2089230 2345281
32042 2345281 2383072 2265343 2014138 1620727 1121968 639114 318749 239715 393412 741809
32032 741809 1253535 1866845 2450551 2841745 2930717 2708960 2254800 1689496 1129997 654532
32022 654532 305983 125937 160062 408338 788487 1179007 1491816 1681794 1711152 1564184
32012 1564184 1310664 1103303 1067788 1201732 1396479 1540022 1582417 1530434 1424218 1322262
32002 1322262 1273304 1281570 1311368 1338477 1388183 1508226 1703922 1911183 2045446 2084364 2099720
31991 2099720 2194213 2395093 2615099 2732123 2708299 2619545 2571351 2609545 2721635 2889347
31981 2889347 3094058 3277110 3352510 3297919 3212874 3250094 3486600 3872866 4286913 4608125
31971 4608125 4760359 4743166 4637269 4534315 4433982 4243556 3906235 3494998 3141244 2899241
31961 2899241 2727697 2580505 2451545 2336171 2225891 2171507 2287892 2633631 3100838 3462930
31951 3462930 3525383 3216585 2573850 1703575 758893 -89828 -688514 -907119 -653741 50585
31941 50585 998338 1864729 2417669 2660615 2745082 2760752 2649283 2316606 1784077 1213753
31931 1213753 814425 733030 991425 1475460 1987393 2355316 2528593 2580014 2628748 2771961
31921 2771961 3063168 3492481 3950396 4245259 4222222 3889729 3404031 2911786 2430916 1911005
31911 1911005 1386064 1007862 900275 1016333 1192091 1345385 1575093 2032725 2718589
$$ [...]
##END NTUPLES=NMR SPECTRUM
##END=
