##TITLE=31Pdec_AP-17M2H_HCl
 D2O
  24 sc
 2.11.2023
##JCAMPDX= 6.0         $$ Bruker NMR JCAMP-DX V2.0
##DATA TYPE= NMR SPECTRUM
##DATA CLASS= NTUPLES
##ORIGIN= UXNMR, Bruker Analytische Messtechnik GmbH
##OWNER= root
$$ XWIN-NMR		Version 3.5
$$ Thu Nov  2 14:10:21 2023 Russian Standard Time (UT+4h)  she@DPX200
##.OBSERVE FREQUENCY= 81.013821
##.OBSERVE NUCLEUS= ^31P
##.ACQUISITION MODE= SIMULTANEOUS
##.ACQUISITION SCHEME= undefined
##.AVERAGES= 24
##.DIGITISER RES= 16
##SPECTROMETER/DATA SYSTEM= spect
##.PULSE SEQUENCE= zgpg30
##.SOLVENT NAME= D2O
##.SHIFT REFERENCE= (INTERNAL, D2O, 0, 248.564)
##AUDIT TRAIL= $$ (NUMBER, WHEN, WHO, WHERE, WHAT)
$$ ##TITLE= Audit trail, XWIN-NMR		Version 3.5
$$ ##JCAMPDX= 5.01
$$ ##ORIGIN= Bruker BioSpin GmbH
$$ ##OWNER= she
$$ F:/spectra/data/she/nmr/P31/1/pdata/1/auditp.txt
$$ ##AUDIT TRAIL=  $$ (NUMBER, WHEN, WHO, WHERE, WHAT)
(   1,<2023-11-02 14:09:31.96 +0400>,<she>,<DPX200>,
      <created by zg, POWCHK disabled, PULCHK disabled
       configuration hash MD5:
       00 E9 B6 7A A2 85 ED C7 34 08 36 98 17 FE 4E 26
       data hash MD5: 32K
       B0 9B B1 45 62 FD A5 2F 93 17 27 97 E2 3D 83 EA>)
(   2,<2023-11-02 14:09:34.21 +0400>,<she>,<DPX200>,
      <Start of raw data processing
       efp BC_mod = 2 LB = 5 FT_mod = 6 PKNL = 1 PHC0 = -10672.82 PHC1 = 62.4902 SI = 64K 
       data hash MD5: 64K
       45 E0 BF 46 56 55 A9 B5 57 5E C4 56 2C 63 9B 3B>)
(   3,<2023-11-02 14:09:48.09 +0400>,<she>,<DPX200>,
      <pk PHC0 = 10.39448 PHC1 = 0 
       data hash MD5: 64K
       C2 BF EE E1 6C DC F7 CB 2E 5B 31 E5 2E F3 B9 49>)
(   4,<2023-11-02 14:09:51.68 +0400>,<she>,<DPX200>,
      <abs ABSG = 5 
       data hash MD5: 64K
       C7 7E 99 A3 C4 FF 4A D3 08 A4 F1 A1 65 2F 35 17>)
$$ ##END=
$$ 
$$ hash MD5
$$ 91 87 B6 2B 62 D8 11 3F 33 1F D3 6C 03 90 72 0A
##$RELAX= 
##$RELAX= 
##$RELAX= 
##$RELAX= 
##$RELAX= 
##$RELAX= 
##$RELAX= 
##$RELAX= 
##$RELAX= 
$$ Bruker specific parameters
$$ --------------------------
##$DU= <F:/spectra>
##$EXPNO= 1
##$NAME= <P31>
##$PROCNO= 1
##$TYPE= <nmr>
##$USER= <she>
##$AMP= (0..31)
100 100 100 100 100 100 100 100 100 100 100 100 100 100 100 100 100 100 
100 100 100 100 100 100 100 100 100 100 100 100 100 100 
##$AQSEQ= 0
##$AQ_mod= 1
##$AUNM= <au_zg>
##$AUTOPOS= <>
##$BF1= 81.014009
##$BF2= 200.13
##$BF3= 200.13
##$BF4= 200.13
##$BF5= 200.13
##$BF6= 200.13
##$BF7= 200.13
##$BF8= 200.13
##$BYTORDA= 1
##$CFDGTYP= 0
##$CFRGTYP= 5
##$CHEMSTR= <none>
##$CNST= (0..31)
1 1 145 1 1 1 1 1 1 1 1 1 1 1 1 1 1 1 1 1 1 1 1 1 1 1 1 1 1 1 1 1 
##$CPDPRG= <waltz16>
##$CPDPRG1= <>
##$CPDPRG2= <waltz16>
##$CPDPRG3= <>
##$CPDPRG4= <mlev>
##$CPDPRG5= <mlev>
##$CPDPRG6= <mlev>
##$CPDPRG7= <mlev>
##$CPDPRG8= <mlev>
##$CPDPRGB= <>
##$CPDPRGT= <>
##$D= (0..31)
0 1 0 0 0 0 0 0 0 0 0 0.03 2e-05 3e-06 0 0 0 0 0 0 0 0 0 0 0 0 0 0 0 0 
0 0 
##$DATE= 1698919771
##$DBL= (0..7)
120 120 120 11 120 120 24 19 
##$DBP= (0..7)
150 150 150 150 150 150 150 150 
##$DBP07= 0
##$DBPNAM0= <>
##$DBPNAM1= <>
$$ [...]
##$SUBNAM3= <"">
##$SUBNAM4= <"">
##$SUBNAM5= <"">
##$SUBNAM6= <"">
##$SUBNAM7= <"">
##$SUBNAM8= <"">
##$SUBNAM9= <"">
##$SW= 501.771253377433
##$SWIBOX= (0..15)
0 1 3 0 0 0 0 0 0 0 0 0 0 0 0 0 
##$SW_h= 40650.406504065
##$TD= 32768
##$TD0= 1
##$TE= 0
##$TE2= 300
##$TE3= 300
##$TEG= 300
##$TL= (0..7)
0 120 53 12 22 120 120 120 
##$TP= (0..7)
150 150 150 150 150 150 150 150 
##$TP07= 0
##$TPNAME0= <>
##$TPNAME1= <>
##$TPNAME2= <>
##$TPNAME3= <>
##$TPNAME4= <>
##$TPNAME5= <>
##$TPNAME6= <>
##$TPNAME7= <>
##$TPOAL= (0..7)
0.5 0.5 0.5 0.5 0.5 0.5 0.5 0.5 
##$TPOFFS= (0..7)
0 0 0 0 0 0 0 0 
##$TUNHIN= 0
##$TUNHOUT= 0
##$TUNXOUT= 0
##$USERA1= <user>
##$USERA2= <user>
##$USERA3= <user>
##$USERA4= <user>
##$USERA5= <user>
##$V9= 5
##$VALIST= <valist>
##$VCLIST= <CCCCCCCCCCCCCCC>
##$VD= 0
##$VDLIST= <DDDDDDDDDDDDDDD>
##$VPLIST= <PPPPPPPPPPPPPPP>
##$VTLIST= <TTTTTTTTTTTTTTT>
##$WBST= 1024
##$WBSW= 4
##$XGAIN= (0..3)
0 0 0 0 
##$XL= 0
##$YL= 0
##$YMAX_a= 2435
##$YMIN_a= -997
##$ZGOPTNS= <>
##$ZL1= 120
##$ZL2= 120
##$ZL3= 120
##$ZL4= 120
##$ABSF1= 248.5645
##$ABSF2= -253.2056
##$ABSG= 5
##$ABSL= 3
##$ALPHA= 0
##$AQORDER= 0
##$ASSFAC= 0
##$ASSFACI= 0
##$ASSFACX= 0
##$ASSWID= 0
##$AUNMP= <proc_1d>
##$AZFE= 0.1
##$AZFW= 0.5
##$BCFW= 0
##$BC_mod= 2
##$BYTORDP= 0
##$COROFFS= 0
##$CY= -3
##$DATMOD= 1
##$DC= 0
##$DFILT= <>
##$DTYPP= 0
##$F1P= 0
##$F2P= 0
##$FCOR= 1
##$FTSIZE= 65536
##$FT_mod= 6
##$GAMMA= 0
##$GB= 0
##$INTBC= 1
##$INTSCL= 6.047779e-11
##$ISEN= 30
##$LB= 5
##$LEV0= 0
##$LPBIN= 0
##$MAXI= 10000
##$MC2= 0
##$MEAN= 0
##$ME_mod= 0
##$MI= 50
##$NCOEF= 0
##$NC_proc= -11
##$NLEV= 6
##$NOISF1= 182.463
##$NOISF2= 159.3651
##$NSP= 0
##$NTH_PI= 0
##$NZP= 0
##$OFFSET= 248.5645
##$PC= 4
##$PHC0= -10662.43
##$PHC1= 62.4902
##$PH_mod= 1
##$PKNL= yes
##$PPARMOD= 0
##$PSCAL= 0
##$PSIGN= 0
##$REVERSE= no
##$SF= 81.0140089999694
##$SI= 65536
##$SIGF1= 159.3651
##$SIGF2= -187.1042
##$SINO= 113.3802
##$SIOLD= 16384
##$SREGLST= <1H.CDCl3>
##$SSB= 0
##$STSI= 65536
##$STSR= 0
##$SW_p= 40650.406504065
##$SYMM= 0
##$S_DEV= 0
##$TDeff= 32768
##$TDoff= 0
##$TI= <>
##$TILT= no
##$TM1= 0
##$TM2= 0
##$TOPLEV= 0
##$USERP1= <user>
##$USERP2= <user>
##$USERP3= <user>
##$USERP4= <user>
##$USERP5= <user>
##$WDW= 1
##$XDIM= 65536
##$YMAX_p= 456245719
##$YMIN_p= -71951393
$$ End of Bruker specific parameters
$$ ---------------------------------
##NTUPLES= NMR SPECTRUM
##VAR_NAME=  FREQUENCY,     SPECTRUM/REAL,   SPECTRUM/IMAG
##SYMBOL=    X,             R,               I
##VAR_TYPE=  INDEPENDENT,   DEPENDENT,       DEPENDENT
##VAR_FORM=  AFFN,          ASDF,            ASDF
##VAR_DIM=   65536,         65536,           65536
##UNITS=     HZ,            ARBITRARY UNITS, ARBITRARY UNITS
##FACTOR=    0.620285442955139, 1,           1
##FIRST=     20137.2065510682, 0,            0
##LAST=      -20513.1999529968, 0,           0
##MIN=       -20513.1999529968, -71951393,   0
##MAX=       20137.2065510682, 456245719,    0
$$ Real data points
##PAGE= N=1
##DATA TABLE= (X++(R..R)), XYDATA
$$ [...]
14823 -13538115 -11655709 -10492222 -9320385 -7578344 -5459861 -3666273 -2619496 -2041073
14815 -2041073 -1373009 -510486 53562 -176440 -1126686 -2265132 -3132699 -3576931 -3542454
14806 -3542454 -2962713 -2091129 -1814269 -3272226 -6900663 -11882058 -16763592 -20725495 -24119339
14797 -24119339 -27641104 -31132501 -33494383 -33826368 -32397455 -30339931 -28546915 -27014691
14789 -27014691 -25081462 -22056486 -17727617 -12620309 -7889730 -4735309 -3686754 -4393953
14781 -4393953 -6031583 -7765884 -8874286 -8716010 -6854399 -3263402 1550898 6518796
14773 6518796 10175562 11286936 9731564 6801618 4395844 3739690 4788074 6654819
14765 6654819 8387981 9389802 9461049 8790330 7957972 7737173 8579688 10083969 11029750
14756 11029750 10239863 7658440 4562840 2581654 2474828 3836659 5741509 7417228
14748 7417228 8410864 8549928 8028006 7410559 7321199 8044268 9408604 10928385 11946880
14739 11946880 11748347 9806671 6179320 1758764 -1977225 -3782124 -3549268 -2515594
14731 -2515594 -2406253 -4155002 -7288631 -10391949 -12101976 -11896328 -10374008 -8958661
14723 -8958661 -9013607 -10791779 -13093500 -14054558 -12387647 -8014670 -1805368 5040414 11479397
14714 11479397 16920889 21326005 24999137 28179720 30797450 32555475 33127545 32266459
14706 32266459 29894289 26241292 21853644 17315589 12893960 8483528 3920313 -681432
14698 -681432 -4922051 -8418674 -11095609 -13225143 -15269614 -17681049 -20686888 -24062256
14690 -24062256 -27076862 -28822474 -28740397 -26862322 -23592095 -19414485 -14893599 -10768349
14682 -10768349 -7763052 -6202512 -5873962 -6262409 -6838682 -7156068 -6850361 -5665255 -3449873
14673 -3449873 -128500 4203807 9064774 13563320 16799218 18409373 18704919 18196862
14665 18196862 16964273 14576068 10770786 6229944 2497437 907909 1511092 3057748
14657 3057748 3986546 3408530 1388885 -1303311 -3588005 -4570234 -4076491 -2762531 -1470328
14648 -1470328 -352571 1297560 4293377 8697980 13774146 18720627 23329404 27866824
14640 27866824 32432713 36678559 40284055 43535221 47102395 51145341 54867681 57164326
14632 57164326 57601268 56554112 54477417 51360932 46998498 41502380 35259702 28448090
14624 28448090 20890184 12538634 4001553 -3566893 -9128801 -12289938 -13243910 -12376813
14616 -12376813 -10042749 -6624589 -2578521 1697204 5937284 9837812 12880235 14491944
14608 14491944 14420711 12857802 10164931 6585839 2303172 -2297885 -6567419 -9861830
14600 -9861830 -11852650 -12503147 -11708155 -9047562 -4114993 2746334 10117350 16131498
14592 16131498 19511464 19933833 17506904 12295618 4625381 -4361138 -12877696 -19403969
14584 -19403969 -23394768 -25200113 -25523865 -24963520 -23786570 -21938214 -19323650 -16182305
14576 -16182305 -13156423 -10980428 -10133519 -10607689 -11639598 -11651579 -9033686 -3537344 3191462
14567 3191462 8842833 12206682 13536017 13501934 12490268 11029414 10186024 10946629 13398454
14558 13398454 16884476 20795066 24868447 28869209 32362551 34776305 35421597 33617025
14550 33617025 29256558 23283205 17175166 11816842 7177094 3165924 355184 -476460
14542 -476460 725397 3120686 5598305 7333552 7912002 7326933 6015108 4743679 4258314
14533 4258314 4837767 5985399 6574953 5626328 3212338 555661 -867570 -245643 2454912
14524 2454912 6809778 12023297 17014098 20974196 23880541 26124394 27714568 28343462
14516 28343462 28342287 29026580 31631523 36011965 40636109 43768215 44512413 42932872 39579574
14507 39579574 35045571 29806717 24253824 18721720 13428778 8471777 3986056 194011
14499 194011 -2943835 -6039263 -9773303 -13813107 -16504376 -16035077 -11961526 -5558019
14491 -5558019 1080364 6095874 8478994 8367547 6940809 5619216 5068806 5033743 5053305
14482 5053305 5000519 4911896 4802855 4945025 5911481 7877567 10098168 11588856 12279728
14473 12279728 13041436 14539895 16491455 18131218 18985705 19040137 18621159 18419334 19196630
14464 19196630 20995458 22888820 23998502 24591714 25658019 27522783 29501093 30946063
14456 30946063 31921391 32544194 32330011 30779714 28237786 25544364 23040044 20564882
14448 20564882 18384320 17362369 17892964 19164964 19963639 19992732 19986361 20583623 21512850
14439 21512850 22046307 22000917 22001517 22761988 24305154 25965278 26997084 27050436 26230179 24988536
14429 24988536 23880096 23000748 21563261 18480616 13690021 8554785 4519749 1575858
14421 1575858 -1503685 -5571923 -10237011 -14427218 -17210145 -18085235 -17235984 -15800823
14413 -15800823 -15257677 -15990877 -16742133 -15853392 -12813378 -8341235 -3426201 1146083 4610619
14404 4610619 6348043 6416001 5609296 4823450 4471369 4437391 4338634 3841942 2948557 1993309
14394 1993309 1297051 998599 1370085 2962650 6037222 10047963 14123127 17869536 21135791
14385 21135791 23084370 22289146 18114618 11577466 4559725 -1491077 -5889672 -8252481
14377 -8252481 -8236901 -5652491 -620398 6138630 12939173 17441352 17962126 14671607 9393151
14368 9393151 4345293 1178167 737135 2945930 6675790 10208772 12280020 12670133
14360 12670133 11760165 9833701 7126279 4375002 2805229 3293601 5680754 9111477
14352 9111477 12972891 17264826 22069061 27015008 31539014 35495254 39160791 42624735
14344 42624735 45459109 47080021 47211971 45920179 43467672 40361971 37350630 35032913
14336 35032913 33378892 31699686 29109978 25100895 19931911 14658464 10604137 8464056
14328 8464056 7801825 7514294 6832691 5854046 5182775 5192235 5636559 5867867 5366777 4073191
14318 4073191 2242874 90913 -2296568 -4758317 -7007785 -8879288 -10444659 -11785394
14310 -11785394 -12858693 -13754635 -14855658 -16417679 -18044307 -18845086 -18154838 -15998355
14302 -15998355 -13014832 -10237951 -8883761 -9900023 -13426850 -18749825 -24805741 -30612866
14294 -30612866 -35349313 -38542849 -40535359 -42478424 -45323269 -48630820 -50593340 -49428675
14286 -49428675 -44771528 -37735534 -29807207 -21884936 -14392668 -8038831 -4026854 -3237836
14278 -3237836 -5261903 -8459197 -11045032 -12037850 -11277473 -8986476 -5693661 -2433830
14270 -2433830 -514341 -759147 -2984947 -6236021 -9415402 -11710419 -12751251 -12732014 -12402614
14261 -12402614 -12689016 -14125219 -16572682 -19348372 -21499919 -22141558 -20948997 -18529143
14253 -18529143 -16121017 -14736466 -14601029 -15339327 -16354352 -16892681 -16161404 -13843481 -10421625
14244 -10421625 -6747449 -3502701 -1385602 -1408302 -4188369 -8862066 -13416757 -16440945
14236 -16440945 -18089923 -19099310 -19465268 -18618603 -16478168 -13715607 -11171555 -9515810
14228 -9515810 -9274763 -10561488 -12740007 -14821742 -16257012 -17011904 -16988948 -15926436 -13940425
14219 -13940425 -11626192 -9397558 -7147296 -4829042 -3017255 -2527790 -3638139 -5916588
14211 -5916588 -8646349 -11150179 -12809434 -13101801 -11803575 -9176430 -5944126 -2987245
14203 -2987245 -900121 177801 216889 -1131646 -4406699 -9711613 -16249194 -22374271
14195 -22374271 -26083615 -25907642 -21933010 -15998979 -10469713 -6688143 -4805202 -4793799
14187 -4793799 -6818281 -10425061 -14157066 -16596509 -17537675 -17825704 -18425414 -19995765 -22873971
14178 -22873971 -26804298 -30851017 -34142048 -36630706 -38683423 -40069588 -39942086 -37868620
14170 -37868620 -34440760 -30830788 -28163855 -27315597 -28736912 -32144351 -36628041 -41257240
14162 -41257240 -45426795 -48628539 -50290543 -50095161 -48277500 -45447442 -42218605 -39007881
14154 -39007881 -35938604 -32837332 -29527714 -26204066 -23315313 -21038234 -19115157 -17275941
14146 -17275941 -15544661 -14037696 -12758361 -11729080 -11023267 -10491372 -9787800 -8954091 -8706280
14137 -8706280 -9780590 -12118657 -14974705 -17654984 -19788592 -20968392 -20583444 -18189906
14129 -18189906 -13883383 -8257441 -2138503 3676678 8683679 12796258 16119600 18573474
14121 18573474 19811188 19435455 17151143 12852375 6919605 480267 -5004625 -8698296
14113 -8698296 -10803471 -11836852 -11627914 -9296192 -4250885 2870464 10174893 15347062
14105 15347062 16813589 14615782 10344853 5975929 2521936 -159585 -2333681 -3621838
14097 -3621838 -3586634 -2708888 -2077897 -1981185 -1381805 792445 4148417 7037203 8093784
14088 8093784 7184274 5027740 2520442 595077 197531 1907935 5628648 10763722
14080 10763722 16461546 21479199 24166265 23214121 18691076 12201264 5879949 1167795
14072 1167795 -1645638 -3023852 -3515331 -3383031 -2705023 -1686795 -759260 -341163 -569753
14063 -569753 -1263066 -2007978 -2227028 -1336060 969626 4592287 9212729 14411457 19475996
14054 19475996 23328262 25026226 24395405 21968518 18313004 13664047 8261594 2762123
14046 2762123 -1919244 -5153406 -6932280 -7708565 -7875951 -7293422 -5364034 -1764798 2911127
14037 2911127 7457172 11031086 13607529 15442413 16480458 16582286 16082339 15677736 15715890
14028 15715890 15869390 15637625 15041835 14736896 15476354 17458116 20114224 22533347 24155866
14019 24155866 25097825 25849429 26768661 27874893 28915064 29416029 28755600 26463202 22629239
14010 22629239 18054622 13998387 11659739 11599908 13438240 16188746 19021998 21577807
14002 21577807 23459028 23817926 21966929 18328287 14223698 10525043 6889792 2556160
13994 2556160 -2432329 -7090399 -10351123 -11765311 -11505432 -9995817 -7524611 -4070625
13986 -4070625 364887 5091853 8619851 9592870 7888273 4664550 1463347 -547245
13978 -547245 -771629 714112 3070644 5077002 5891397 5425081 4127853 2783849 2455835
13969 2455835 3978198 7090133 10390209 12540504 13326454 13239864 12347496 10147308 6500297
13960 6500297 2166282 -1746926 -4517248 -5878510 -5778159 -4422730 -2431749 -666858
13952 -666858 146883 -345159 -2051062 -4426218 -6681839 -8207246 -8800824 -8502803 -7450708
13943 -7450708 -6101597 -5379321 -6181112 -8615069 -11890112 -14982537 -17239074 -18369403
13935 -18369403 -18224143 -16838332 -14527722 -11676666 -8441901 -4778615 -655155 3902763
13927 3902763 8810727 13668595 17571982 19560946 19387715 17598343 14782255 11087157
13919 11087157 6695086 2421728 -657138 -2205736 -2991829 -4218346 -6584618 -9789562
13911 -9789562 -12619352 -13659521 -12464514 -10274423 -9331497 -11246269 -15969653 -22092618
13903 -22092618 -27729806 -31263803 -32082146 -31191357 -30813389 -32786552 -37196004 -42550566
13895 -42550566 -46986313 -49160130 -48532999 -45460171 -40962699 -35994982 -30972950 -26238356
13887 -26238356 -22579430 -20640162 -19998213 -19623439 -19331921 -20007552 -22091186 -24557357 -25882719
13878 -25882719 -25504813 -23756505 -20764710 -16143057 -9731997 -2103538 5774575 13108559
13870 13108559 19548960 25166262 30135544 34251953 36855933 37430804 36127219 33521413
13862 33521413 30162300 26721916 24253070 23575607 24291683 24923309 24290464 22563697 20973793
13853 20973793 20829930 22788195 26487747 30526828 33083258 32989026 30331852 26130478
13845 26130478 21692410 18246090 16675563 17189397 19272216 21998886 24212236 24515193
13837 24515193 21756863 16006767 8790779 1957699 -3579875 -7815589 -10824769 -12586330
13829 -12586330 -13506150 -14468957 -16138241 -18508132 -21243378 -24123595 -26963365 -29327184
13821 -29327184 -30547532 -29991425 -27331140 -22787494 -17251110 -12056520 -8485317 -7349322
13813 -7349322 -8748411 -11905353 -15320402 -17532697 -17996083 -17167889 -15822337 -14532993
13805 -14532993 -13705666 -13522736 -13548959 -12826094 -10889853 -8623079 -7737464 -9378127 -13360159
13796 -13360159 -18510925 -23315905 -26312854 -26488186 -23752849 -18981509 -13417606 -8040030
13788 -8040030 -3409865 256352 3183396 6062225 9547951 13480196 16679348 17720706
13780 17720706 16047028 12378562 8093489 4286666 1417161 -352223 -795286 277351
13772 277351 2707826 5904472 8983756 10974541 11164959 9561893 6941672 4163036
13764 4163036 1421661 -1585515 -4810354 -7558632 -9184542 -9739694 -9675426 -9159674 -8018498
13755 -8018498 -6183377 -3814222 -1054878 1902904 4458692 5781929 5690176 5161204 5695632
13746 5695632 8237845 12808147 18826344 25283039 30665690 33397000 32862637 29905005
13738 29905005 26016022 22098456 18230235 14509682 11703408 10847828 12347209 15568318
13730 15568318 19207222 22006777 23330070 23264034 22190696 20252102 17341404 13602300
13722 13602300 9655484 6146425 3267926 922159 -934735 -2533783 -4710215 -8422188
13714 -8422188 -13545993 -18478656 -21282250 -21165335 -18771496 -15305333 -11670954 -8329943
13706 -8329943 -5651027 -4226887 -4763282 -7462698 -11459853 -15167535 -17483438 -18586628
13698 -18586628 -19408536 -20532696 -21846245 -22983485 -23608751 -23290098 -21572463 -18353458
13690 -18353458 -13964244 -8898759 -3817397 211043 2089844 1711205 261807 -903616
13682 -903616 -1537667 -2345592 -3781060 -5452830 -6673333 -7117585 -6789271 -5694508 -3842316
13673 -3842316 -1468836 919108 2735297 3577099 3449071 2760252 1922928 859636 -933165
13664 -933165 -3704243 -6980553 -9955694 -12204216 -13723316 -14298687 -13224324 -9931265
13656 -9931265 -4759456 1143667 6654595 11223424 14717791 17128163 18593829 19419786
13648 19419786 19772804 19503540 18523260 17185076 15906296 14470198 12164415 8734878
13640 8734878 4780429 959355 -2808726 -6949610 -11285256 -14960300 -17303591 -18422225
13632 -18422225 -18968034 -19676655 -21144177 -23611158 -26731424 -29792715 -32327279 -34279167
13624 -34279167 -35470289 -35317481 -33486315 -30610849 -27856615 -25716653 -23621353 -20866472
13616 -20866472 -17593455 -14625562 -12589505 -11519300 -11190977 -11428614 -11943962 -12134089 -11275955
13607 -11275955 -8901675 -4970864 102017 5405596 9739930 12308840 13340053 13782596
13599 13782596 14262331 14528996 14033564 12758932 11209192 9805996 8717066 8245052 8940705
13590 8940705 11123235 14491402 18321389 21848396 24383806 25392279 24766607 22913386
13582 22913386 20327995 17155256 13357906 9201227 5284965 2092589 -262184 -1840265
13574 -1840265 -2703989 -3035087 -3167082 -3270649 -3119348 -2408837 -1319027 -548465 -647089
13565 -647089 -1401747 -2089783 -2433675 -3161348 -5388056 -9390342 -14134108 -18060680 -20184199
13556 -20184199 -20412244 -19173183 -17066623 -14630343 -11916601 -8281976 -3122847 2966854
13548 2966854 8226771 11306750 12535631 13210169 13839566 13636790 11758784 8542220 5300746
13539 5300746 3210527 2553137 2707780 2595233 1384676 -816294 -2959761 -4010603 -3988103
13530 -3988103 -3964472 -5051301 -7474228 -10516186 -13104904 -14433340 -14289656 -13058131 -11479537
13521 -11479537 -10372097 -10440596 -12048107 -14894564 -17981063 -20213628 -21223046 -21533177
13513 -21533177 -21934965 -22852273 -24265392 -25852699 -26915973 -26387457 -23367563 -17844820
13505 -17844820 -10799429 -3551710 2969688 8438235 12835531 16022119 17557571 17025575
13497 17025575 14692220 11793794 9933770 10059240 12019643 14965140 17904866 19963451
13489 19963451 20643282 20248640 19853822 20413270 21814559 22969813 22768781 20729818 16918702
13480 16918702 11835590 6635543 2966392 1949959 3246752 5426920 7298222 8610028
13472 8610028 9469079 9530413 8135300 5104336 1066131 -2998011 -6291154 -8283663 -8613585
13463 -8613585 -7220168 -4569870 -1576516 783015 1777468 962754 -1812764 -6174894
13455 -6174894 -10921930 -14167673 -14203155 -10610673 -4682608 1340695 5628209 7615154
13447 7615154 7888396 7551246 7649624 8755508 10667197 12488500 13240972 12514546 10503058
13438 10503058 7557203 4003927 426954 -2276834 -3490548 -3455506 -2978164 -2555505 -2052596
13429 -2052596 -1332037 -935808 -1855135 -4610292 -8673979 -12792295 -15802051 -17242057 -17434181
13420 -17434181 -17106313 -16790056 -16339795 -14960121 -11837588 -6948721 -1384114 3114278
13412 3114278 5088794 4134434 1014940 -2925219 -6669351 -10146443 -14102574 -19301165
13404 -19301165 -25662093 -31996597 -36510076 -37725896 -35339747 -30602325 -25894901 -23439544
13396 -23439544 -23830992 -25650275 -26748710 -26124216 -24542769 -23381248 -23124441 -23115314 -22472229
13387 -22472229 -20893171 -18690502 -16473723 -14865201 -14129602 -13865626 -13335820 -12327739
13379 -12327739 -11437843 -11225137 -11334537 -10882646 -9596496 -8085923 -6968904 -6277457 -5984067
13370 -5984067 -6596006 -8603265 -11402731 -13319638 -12992396 -10627673 -7818682 -6294067
13362 -6294067 -6940729 -9820483 -14732578 -21465349 -29446524 -37318916 -43179162 -45566494
13354 -45566494 -44410965 -41016249 -37008673 -33195122 -29367639 -25114619 -20639169 -16629432
13346 -16629432 -13403382 -10475131 -7130757 -3245369 697320 4222946 7120582 9119329
13338 9119329 9833334 9330794 8428872 7992434 8027869 7827790 7004947 6059520 5863575 6873502
13328 6873502 8959551 11702880 14555844 16802434 17693467 16851276 14606588 11930803
13320 11930803 9953340 9361170 10066585 11323412 12134769 11683987 9670786 6477177 2971453
13311 2971453 -63876 -2409132 -4277251 -5759507 -6556825 -6270467 -4766213 -2145870
13303 -2145870 1482360 5996778 11027077 15886612 19875073 22703448 24603717 25933388
13295 25933388 26612479 26060848 23900380 20769857 18283430 18042129 20662076 25638848
13287 25638848 31805004 37688697 41718705 42729073 40694345 36924744 33316950 31329909
13279 31329909 31616458 34277710 38923487 44314995 48432265 49551252 47452280 43369948
13271 43369948 38735405 34221718 29973892 26193612 23046479 20247674 17236947 13757932
13263 13757932 9956593 6031411 2264909 -581833 -1506378 -304447 1880584 3456065
13255 3456065 3884467 4219990 6234094 10987732 17910467 24962556 29813467 31219555
13247 31219555 29508484 25932657 21789181 18108359 15661785 14734923 14847722 14951142
13239 14951142 14030673 11617494 7995248 4108619 1074887 -493177 -632051 586948
13231 586948 3473954 8078936 13250016 16854495 17147790 13776721 7559102 -232614
13223 -232614 -8213893 -15020331 -19669351 -21925050 -22235246 -21336402 -19867226 -18093479 -15824197
13214 -15824197 -12728043 -8901175 -5066877 -2125605 -578513 -410056 -1324463 -2924075
13206 -2924075 -4781969 -6557406 -8060831 -9139929 -9563621 -9104653 -7697181 -5496526
13198 -5496526 -2925731 -745159 122278 -866002 -3378834 -6282412 -8276255 -8672569 -7859739
13189 -7859739 -7059488 -7318061 -8484069 -9307448 -8725403 -6927033 -5024787 -3918232 -3709609
13180 -3709609 -3922273 -3814107 -2625214 -142601 2793438 4759416 4950922 3680660 1689387
13171 1689387 -479217 -2144651 -2165690 245600 4385520 8273733 10204988 9941148 8516807
13162 8516807 7283508 7134216 8139895 9601897 10601549 10648956 9698699 7600222 3945917
13153 3945917 -1300469 -7269137 -12541687 -15973350 -17141523 -16326104 -14300188 -11873187
13145 -11873187 -9323606 -6496275 -3777192 -2635013 -4512085 -9106323 -14300348 -18019905
13137 -18019905 -19811250 -20489566 -20805229 -20896406 -20667536 -20044449 -18789013 -16472815 -12861442
13128 -12861442 -8296909 -3750653 -522304 419437 -830757 -3072061 -4921803 -5697597
13120 -5697597 -5180560 -2864656 1786571 8130980 14030038 17304508 17380122 15272360 12323128
13111 12323128 9417948 7091848 5511642 4082964 1694865 -2131573 -6583408 -10421465
13103 -10421465 -13286265 -15721341 -18087881 -20072133 -21363593 -22203916 -22835684 -22762882 -21110065
13094 -21110065 -17701319 -13442776 -9662672 -7377292 -7099180 -8783128 -11631442 -14254816
13086 -14254816 -15463007 -15000816 -13508423 -11963540 -11281000 -12124684 -14600901 -17988001
13078 -17988001 -20988554 -22454032 -21961073 -19848799 -16873701 -13770123 -10898621 -8175086
13070 -8175086 -5343853 -2281587 1032059 4741826 9098067 14143747 19530511 24709982
13062 24709982 29253857 32957488 35664285 36985914 36185747 32463895 25587615 16396705
13054 16396705 6705487 -1385928 -6334309 -7697514 -6109219 -2709851 1477488 5632196
13046 5632196 8827719 10166780 9550943 8039510 7024360 7114018 8082252 9638958 11676295
13037 11676295 13776832 15097885 15015701 13558564 11087834 7958948 4637744 1625696
13029 1625696 -1096350 -4146266 -7806248 -11258860 -13193609 -13032235 -11213527 -8475972
13021 -8475972 -5275064 -1724946 2392974 7489391 13485764 19180460 22753630 23101671
13013 23101671 20440477 15671458 9726040 3742231 -738606 -2478795 -1522367 838694
13005 838694 3181366 4994967 6746054 9130459 12327519 15931948 19520819 23080165
12997 23080165 26655125 29675053 31017921 29949424 26809342 22600364 18077520 13461930
12989 13461930 8921080 5006746 2466847 1653335 2147824 3019336 3549923 3724598 3939359
12980 3939359 4307450 4493538 4274704 3991303 4249224 5314975 6960904 8796624 10617722
12971 10617722 12516766 14738367 17316581 19828685 21722870 22941048 23873340 24490814
12963 24490814 23887848 21084723 16091497 9826398 3235670 -2988320 -7992312 -10833795
12955 -10833795 -11280149 -10159473 -8688266 -7700215 -7556977 -8283576 -9471129 -10458460 -11070719
12946 -11070719 -11977402 -13894355 -16494013 -18413343 -18296830 -15656446 -10965808 -5367713
12938 -5367713 -232755 3518421 5937354 7765281 9592570 11476712 13303038 15053615
12930 15053615 16486801 16926594 15842001 13590864 11209292 9360205 7782988 6010686
12922 6010686 4452240 4379309 6665925 10679649 14594679 16772003 16744504 15011891 12248320
12913 12248320 8884516 5225273 1626704 -1557474 -4158864 -6316319 -8374097 -10504579
12905 -10504579 -12395610 -13522372 -13821622 -13773905 -13503252 -12064205 -8204862 -1962852 4881780
12896 4881780 10138503 12780139 13181080 12280646 10894854 9592855 8723800 8425517 8795759
12887 8795759 10069022 12409281 15472925 18400697 20450869 21643796 22714731 24436232
12879 24436232 26980302 29793553 31870807 32121838 29807051 25069903 19134842 13639696
12871 13639696 9518625 6708576 5068657 5112462 7225554 10319117 12050939 10760603
12863 10760603 6874397 2264415 -1330968 -3086973 -3026354 -1900109 -850230 -432472
12855 -432472 106761 2083019 5812526 10183893 13818301 16208887 17613500 18356112 18610038
12846 18610038 18552467 18269651 17545491 16060541 13883674 11643798 10168012 9927373 10677099
12837 10677099 11501411 11345755 9820621 7663690 6317173 6800833 8817432 11000836
12829 11000836 12207165 12578294 13161391 14480037 15836518 16269989 15861885 15548663 15667568
12820 15667568 15233353 12918388 8458750 2864020 -2525262 -6925490 -10240487 -12670254
12812 -12670254 -14282407 -14847630 -14037885 -11801913 -8548553 -5013254 -2025968 -313629
12804 -313629 -249047 -1632219 -3814072 -6168820 -8480981 -10929511 -13765819 -16905731 -19672653
12795 -19672653 -21066700 -20624224 -19076381 -17888230 -18001856 -19121201 -20153975 -20119938 -18793354
12786 -18793354 -17009726 -16438434 -18413792 -22513836 -26599829 -28683683 -28627370 -27853329 -27830545
12777 -27830545 -29232292 -32044540 -35642215 -38779141 -40217466 -39610551 -37435240 -34112478
12769 -34112478 -29751840 -24818380 -20349782 -17088920 -14808150 -12915067 -11461711 -11136792
12761 -11136792 -12374925 -14789493 -17412627 -19268048 -19840529 -19289027 -18199561 -16942944
12753 -16942944 -15321868 -13027316 -10358749 -8238956 -7498519 -8331776 -10446838 -13485974
12745 -13485974 -17153669 -21091740 -24858998 -28101314 -30688519 -32634000 -33876773 -34208487
12737 -34208487 -33526654 -32175542 -30859152 -30004557 -29211232 -27517047 -24307829 -19857441
12729 -19857441 -14878690 -9711165 -4280087 1033536 4794284 5270553 2049692 -3176968
12721 -3176968 -7598926 -9140164 -7531612 -3999013 -286217 2142041 2533078 978562
12713 978562 -1871155 -5422552 -9486893 -13923751 -18067295 -20851455 -21700826 -21164628 -20463877
12704 -20463877 -20419114 -20918488 -21303666 -20961180 -19483651 -16651572 -12667670 -8337032 -4638077
12695 -4638077 -1983908 -65315 1612164 3365414 5559792 8677138 12646208 16250971
12687 16250971 17762797 16413423 13076557 9401084 6429875 4103993 1826317 -777729
12679 -777729 -3591268 -6195225 -8122999 -8926930 -8143803 -5468387 -1248176 3142406 5739334
12670 5739334 5298350 2490257 -258064 -431300 2726707 7810009 12556884 15500309
12662 15500309 16496528 16093843 14808447 12944087 10629960 7736063 3934240 -885323
12654 -885323 -6281352 -11482810 -15924993 -19531559 -22594137 -25467899 -28259137 -30687816
12646 -30687816 -32338912 -33116853 -33341860 -33389326 -33447006 -33606062 -33732235 -33022328 -30217351
12637 -30217351 -24859079 -18134011 -11884425 -6838577 -2361210 2092901 5987827 8401646
12629 8401646 9084283 8335524 6193199 2315866 -3331409 -9990468 -16330100 -21002036
12621 -21002036 -23093483 -22333190 -19013492 -13736240 -7269992 -597208 5158974 9156982
12613 9156982 11367067 12744955 14759227 18375377 23170483 27516519 29911472 30149255
12605 30149255 29085172 27537211 25838868 24261658 23166215 22542576 21927140 21024345
12597 21024345 19957685 18657588 16526374 13168096 9118047 5428634 2813223 1565945
12589 1565945 1907269 3733553 6131803 7771307 7945582 7000931 5883149 5615168 6941422
12580 6941422 9745242 12675341 13956349 12956145 10737524 8957294 8552316 9579478
12572 9579478 11764737 14698850 17739712 20293560 22313137 24230338 26272102 28022053
12564 28022053 28800044 28388068 27227028 25873711 24374044 22262727 19136461 15154651
12556 15154651 11078802 8005813 6956247 8288202 11266004 14448019 16796903 18318079
12548 18318079 19464096 20204307 20072127 18964917 17384650 15800344 14153019 12145534
12540 12145534 9748941 7263282 5062328 3377707 2156038 1060492 -173489 -1273667
12532 -1273667 -1506229 -365548 1862727 4201142 5479408 4830895 2138608 -1733278
12524 -1733278 -5354614 -7697801 -8774654 -9322584 -9992103 -10873089 -11591752 -11679912 -10923083
12515 -10923083 -9456079 -7467935 -4833710 -1262771 3090420 7395906 10724182 12722218
12507 12722218 13605404 13744887 13554334 13577945 14210173 15223626 15879785 15657564 14684386
12498 14684386 13368204 11884659 10274535 8872325 8283873 8880901 10526097 12835870
12490 12835870 15454061 17903938 19416216 19286900 17467057 14583162 11330734 8090820
12482 8090820 5261387 3688213 4396765 7791612 13150165 18819286 22884131 23991972
12474 23991972 22063631 18428507 15035781 13166586 12684006 12456539 11542440 10063146
12466 10063146 8978485 9004110 9845179 10659082 11171614 11947731 13457327 15345515 17011184
12457 17011184 18544385 20484325 22735476 24333301 24439548 23138311 21079550 18719989
12449 18719989 16130594 13220669 9878732 6123393 2390149 -458796 -1647029 -1052220
12441 -1052220 635627 2102392 1921448 -463058 -3901321 -6138241 -5869389 -4203064
12433 -4203064 -3722968 -6036845 -10348827 -14212085 -15345879 -12910794 -7651448 -1171269
12425 -1171269 5082956 10417850 14677787 17658032 18982275 18604442 17229923 16019752
12417 16019752 15751164 16189631 16290314 15136548 12764043 10018074 7621824 5585625
12409 5585625 3617735 1843668 807227 841426 1741595 3075377 4509126 5667860 5901850
12400 5901850 4537777 1481998 -2554576 -6598284 -10180394 -13410944 -16252764 -18022782
12392 -18022782 -17982454 -16353755 -14290699 -12632867 -10981857 -8271037 -4047514 1064380
12384 1064380 5968044 9798134 12099999 12734399 11832852 9783960 7215475 4971606
12376 4971606 3883992 4234270 5348757 5875970 4606536 1148167 -3935320 -9391332
12368 -9391332 -13748215 -15847318 -15189179 -11945532 -6850306 -1147382 3691944 6715871
12360 6715871 8164409 9239494 11019346 13510769 15647131 16102668 14206774 10313827
12352 10313827 5418299 385839 -4472145 -9110546 -13174000 -15818489 -16090009 -13497426
12344 -13497426 -8405574 -2036587 3996796 8386389 10563643 10682976 9404922 7603618
12336 7603618 5874408 4143682 2029867 -277987 -1868629 -2078792 -1225419 -12301
12328 -12301 1367433 2950667 4132325 3878138 1884690 -1065680 -3971162 -6212474 -7179943
12319 -7179943 -6095411 -2776438 1812308 6333688 10333160 14456736 19570267 25879528
12311 25879528 32731032 39035043 44007370 47644100 50297928 51727435 50957668 47370007
12303 47370007 41613919 35070256 28662257 22623402 17233465 13191579 11144131 11200157
12295 11200157 12996567 15919028 19152175 21836683 23435124 23872031 23263942 21700049
12287 21700049 19404929 16918271 14838856 13329327 11951714 10019656 7124065 3449866
12279 3449866 -188994 -2529483 -2329923 831544 5908168 10709973 13289905 13167856
12271 13167856 11113079 7871107 3481738 -2129145 -8383555 -14223928 -18814538 -21775088
12263 -21775088 -22917826 -22107247 -19323783 -14641630 -8298942 -1100841 5411513 9711692
12255 9711692 11398860 11362906 10826222 10457274 10346486 10332609 10080443 9219142 7876911
12246 7876911 6991287 7646646 9919522 12547917 13888142 13177818 10904011 8167713 5866034
12237 5866034 4326146 3314229 2165554 146146 -2851182 -5809656 -7060315 -5577097
12229 -5577097 -1880928 2346761 5427801 6447774 5237490 2145078 -1980123 -5852477
12221 -5852477 -8195020 -8383912 -6828808 -4827481 -3958419 -5290534 -8793557 -13277125
12213 -13277125 -16951248 -18378795 -17273743 -14521163 -11336934 -8392028 -5833765 -3969758
12205 -3969758 -3436107 -4492846 -6555333 -8796070 -10939249 -13029016 -14672507 -15217576
12197 -15217576 -14800710 -14603422 -15659815 -17675711 -19311230 -19397789 -17615660 -14266630 -9893442
12188 -9893442 -5200094 -1034388 1771104 2610626 1344370 -1447486 -4510151 -6534908
12180 -6534908 -6971781 -6254946 -5219916 -4339136 -3503136 -2422677 -1125917 -12161 593032
12171 593032 914400 1698089 3633437 6747024 10339044 13551569 16104748 18512601 21439913
12162 21439913 24742193 27333283 28291962 28008234 27820465 28415527 28983386 28184228 25586113
12153 25586113 21812130 17662904 13715283 10600007 8808541 7895508 6523786 3909583
12145 3909583 902652 -1021687 -1744133 -2743301 -5072335 -7623692 -7954018 -4710929 1147728
12136 1147728 7445694 12607911 16308553 18861871 20480232 21013017 20002012 16996471
12128 16996471 12233080 7150693 3801790 3288369 4814917 6574027 7567865 8348277
12120 8348277 10043121 13009595 16501871 19256570 20139141 18547035 14705815 9671784
12112 9671784 4785348 965727 -1497823 -2706549 -3018292 -3024456 -3163234 -3189349 -2428491
12103 -2428491 -863640 333766 -197831 -2526555 -5244455 -6721180 -6282417 -4310660
12095 -4310660 -1738762 358201 1129692 435254 -956662 -1793375 -1005456 1913601 6799867
12086 6799867 12796837 18595795 23058927 25782097 27105381 27701141 28131483 28433425 27804319
12077 27804319 24902767 18963217 10769419 2296426 -4717927 -9729571 -13014893 -14742981
12069 -14742981 -14662679 -12556609 -8775948 -4290867 -196221 2981821 5566498 8188691
12061 8188691 10852095 12622628 12335250 9536781 4727890 -1034644 -6463824 -10107658
12053 -10107658 -10660850 -7733517 -2413870 3166210 7097182 8709626 8541572 7584592
12045 7584592 6678461 6297128 6337845 5967557 4167440 860235 -2740119 -5332301 -6911784
12036 -6911784 -8453696 -10315861 -11616779 -11353389 -9486946 -6548322 -2760758 1783478
12028 1783478 6368190 9811930 11468139 11662207 11175184 10730059 10884888 11715981 12312767
12019 12312767 11157092 7585083 2762065 -1127921 -2601510 -1662158 773018 3734701
12011 3734701 6563703 8943908 10814753 12009410 11829333 9274704 4063228 -2601618
12003 -2601618 -8563824 -12175670 -13227426 -12532455 -10863521 -8443836 -5289729 -1721645
11995 -1721645 1576172 3894676 4896350 4874512 4689464 5156230 6143640 6310166 4089902
11986 4089902 -807914 -6889069 -11898413 -14347014 -14209266 -12532868 -10626753 -9408526
11978 -9408526 -9064995 -9097783 -8797862 -7845009 -6499933 -5262651 -4480090 -4339190 -5022061
11969 -5022061 -6527413 -8280777 -9272859 -8956090 -7950968 -7501216 -8094568 -8871159 -8536270
11960 -8536270 -6551346 -3137047 1552769 7566625 14325437 20245863 23736960 24540621
11952 24540621 23870560 23328214 23846157 25440827 27505049 29175212 29645116 28358844 25021390
11943 25021390 19648048 12864774 6077819 901339 -1940122 -3157002 -4245096 -6252903
11935 -6252903 -9082384 -11773572 -13344638 -13435551 -12253757 -9983658 -6470365 -1755310
11927 -1755310 3155061 6526107 7214041 5589267 2964229 344273 -1983148 -3920431
11919 -3920431 -5206054 -5651704 -5275644 -3998582 -1515391 2314386 7138524 12264038
11911 12264038 16832407 19728642 19846694 17021673 12548337 8225602 4825707 1905187
11903 1905187 -873941 -2830409 -3008665 -1459392 652990 2027434 1898121 -108210
11895 -108210 -4147497 -9876103 -16272375 -22053633 -26198867 -27923777 -26402020 -21010405
11887 -21010405 -12047332 -980271 10273846 20336316 28673563 35235301 40136202 43623560
11879 43623560 45908423 46755411 45447405 41484220 35320774 28211250 21293163 14929267
11871 14929267 8832099 2505446 -4512468 -12459105 -20978407 -28939172 -34935861 -38201175
11863 -38201175 -39055895 -38483249 -37355904 -36074512 -34722654 -33240379 -31307825 -28250967
11855 -28250967 -23411650 -16823297 -9509579 -3044400 1221544 2670795 1565420 -990666
11847 -990666 -3386419 -4314008 -3607503 -2257927 -1459618 -1616571 -2258620 -2771511 -3058836
11838 -3058836 -3508629 -4416282 -5496825 -5989044 -5248284 -3175109 -19135 4067537 9008375
11829 9008375 14341125 19088628 22259199 23320434 22120915 18689120 13454958 7541566
11821 7541566 2469697 -557903 -1107297 411768 2720506 3914375 2490600 -1329756
11813 -1329756 -5420205 -7252151 -5761741 -1848498 2712090 6695133 10030280 13437323
11805 13437323 17616687 22550999 27279504 30279926 30285033 27059444 21596447 15530334
11797 15530334 10174791 5969826 2747680 399040 -811026 -483243 1551668 5103489
11789 5103489 9628365 14226789 17816316 19652998 19902370 19688818 20433704 22953736 27031484
11780 27031484 31734613 36078808 39409388 41340952 41636160 40326960 37883471 35097885
11772 35097885 32712804 31070028 29941666 28625584 26395348 23082565 19184427 15268084
11764 15268084 11369918 7170464 2644865 -1771864 -5674996 -9037733 -11960459 -14304319
11756 -14304319 -15695586 -15705653 -13938108 -10206004 -4889412 935750 5865927 8683512
11748 8683512 8664835 5839312 1257796 -3229255 -5923823 -6223252 -4699628 -2509423 -909058
11739 -909058 -998143 -3272415 -7119724 -10944036 -13049022 -12581405 -9920059 -6475720 -4006328
11730 -4006328 -3581018 -4828163 -6306698 -6843219 -6488377 -6123410 -6369022 -7157341 -8265674
11721 -8265674 -9867595 -12337929 -15647567 -19148370 -21960212 -23464676 -23403794 -21614000
11713 -21614000 -17823510 -11831253 -3941568 4792268 12841730 18854456 22182274 22906709
11705 22906709 21471619 18349062 13971774 8776449 3153385 -2628256 -8362225 -13791174
11697 -13791174 -18619734 -22608295 -25571583 -27333800 -27827784 -27249817 -25983459 -24316946
11689 -24316946 -22299146 -19837560 -16785329 -12951984 -8287947 -3193119 1556583 5399202
11681 5399202 8402306 10882544 12646259 12826944 10620093 6244166 1248125 -2199704
11673 -2199704 -2654620 -356043 3116036 6256426 8726760 11114640 13937883 17151808
11665 17151808 20410805 23331948 25391037 25887795 24276864 20546527 15344069 9919154
11657 9919154 5878792 4584201 6449576 10812827 16523659 22560750 28126439 32520356
11649 32520356 35294408 36535971 36774784 36497238 35781105 34415381 32333241 29892277
11641 29892277 27716598 26283934 25730593 26047111 27260718 29212411 31222480 32247847
11633 32247847 31513940 28988185 25331314 21516055 18312764 15751583 13024401 9286332
11625 9286332 4798996 1117230 -14374 2142677 7130512 13794927 20687910 26416119
11617 26416119 30236358 32382214 33497357 33757118 32818494 30535542 27283291 23498142
11609 23498142 19320244 14905442 10730652 7214340 4186065 1103899 -2195782 -5285281
11601 -5285281 -7824391 -10228952 -13364035 -17502757 -21734638 -24533930 -24895174 -22898114
11593 -22898114 -19383432 -15415690 -12051198 -10111166 -9685425 -9922975 -9693239 -8555817
11585 -8555817 -6925707 -5382155 -4139305 -3143809 -2183804 -673027 2238137 6878228
11577 6878228 12507979 17873017 22186053 25294016 27126331 27555335 26862794 25793595
11569 25793595 24813244 23598049 21559900 18668483 15453949 12362700 9472465 6789702
11561 6789702 4437958 2416054 415546 -1922775 -4612577 -7217492 -9084178 -9757027
11553 -9757027 -9374733 -8674421 -8379001 -8499409 -8428360 -7762666 -6728435 -5620107 -4146237
11544 -4146237 -1719491 1711928 5448191 8579628 10441964 10680100 9409740 7465632
11536 7465632 6000907 5455702 5128135 4019071 1844892 -1097341 -4739241 -9270151
11528 -9270151 -14303131 -18593787 -20953662 -21190840 -19878173 -17464135 -14057262 -10032492
11520 -10032492 -6344094 -3916934 -2866931 -2564303 -2440788 -2535662 -3180846 -4298030 -5199412
11511 -5199412 -5151932 -4071361 -2555050 -1214487 -88124 1193116 2781323 4410391
11503 4410391 5855502 7281251 8865422 10269510 10900402 10736328 10510965 10882434 11685556
11494 11685556 12230431 12109893 11425738 10392992 9084014 7526622 5736723 3634341
11486 3634341 1216262 -1106950 -2557389 -2468382 -651868 2581194 6522022 10318329
11478 10318329 13569628 16777134 20885051 26254894 32298564 38020040 42427796 44423929
11470 44423929 43099709 38699605 32857262 27302466 22561175 18304798 14476516 11308945
11462 11308945 8543410 5673560 3110015 2139127 3186528 4747753 4698123 2395319
11454 2395319 -971219 -3800462 -5270165 -5305253 -4126554 -2169411 -134482 1225144
11446 1225144 1427164 436917 -1278346 -2823319 -3240723 -2086214 245266 2767334 4509542
11437 4509542 4966042 4098676 2082077 -798256 -3968402 -6474586 -7380988 -6469139 -4547543
11428 -4547543 -2957852 -2620389 -3367319 -4076333 -3542190 -1457594 1302214 3339977 3687172
11419 3687172 2204546 -613705 -3865044 -6340528 -6919636 -5283868 -2227731 939921
11411 939921 3428587 5540727 8401744 13079289 19642221 26866847 33008690 37078001
11403 37078001 39370390 40764383 41729163 42162882 41939832 41233016 40271205 39027240 37262516
11394 37262516 34839470 32070701 29914055 29713610 32344793 37286471 42540492 45719265
11386 45719265 45538206 42520929 38361200 34501713 31144549 27489794 22807575 17176101
11378 17176101 11227835 5402019 -375329 -6303558 -12108146 -16878640 -19597170 -20007059
11370 -20007059 -19023700 -18146234 -18315739 -19298992 -20059457 -19530666 -17130994 -13012585 -8143331
11361 -8143331 -3947209 -1506601 -1028994 -2029139 -3690768 -4870723 -4231094 -1043128
11353 -1043128 4082589 9658389 14561461 18535084 21578020 23420095 23850601 23205073
11345 23205073 22245355 21740746 22262575 24004652 26451694 28401183 28663599 26801946 23201835
11336 23201835 18720972 14473124 11595339 10690790 11451160 13098913 15148620 17411985
11328 17411985 19335347 19919715 18694984 16571899 15331875 16157598 18739899 21805743
11320 21805743 24427081 26813126 29887248 34112579 38749136 42301118 43641877 42561216
11312 42561216 39271541 33823819 26484709 18632200 12685234 10627093 12559816 16849687
11304 16849687 21530259 25279402 27256025 26805189 23947069 19923904 16558248 14744603
11296 14744603 13790167 12415329 10188058 7730715 5660775 3702797 1014692 -2743343
11288 -2743343 -6849034 -10057317 -11621348 -11739709 -11106455 -10244812 -9373992 -8691839 -8421199
11279 -8421199 -8498586 -8462958 -7809713 -6305298 -3809560 26956 5559054 12532950 19785810
11270 19785810 25655617 28770482 28638631 25722421 21041384 15645301 10376975 5978784
11262 5978784 3112930 2016773 2224575 2934030 3738559 4797125 6199249 7436813 7797388
11253 7797388 7202205 6361080 6018415 6212184 6327049 5682202 3958084 1290426 -1698341
11244 -1698341 -3918519 -4158811 -1699290 3312481 10013489 17229191 23780836 28727830
11236 28727830 31638612 32670626 32293035 30973211 29190160 27523117 26347645 25390566
11228 25390566 23915450 21592858 19082149 17577531 17775228 19254758 20656192 20367530
11220 20367530 17363319 11847549 5228725 -723974 -4927172 -7393483 -8862299 -10168978
11212 -10168978 -11778957 -13601671 -15190052 -16276294 -17084442 -17888708 -18282734 -17273192
11204 -17273192 -14361761 -10324794 -6581768 -3827232 -1612600 609403 2322273 2178887
11196 2178887 -569259 -5124879 -9814864 -13605883 -16730951 -19833869 -22810076 -24683461
11188 -24683461 -24391934 -21401851 -15761815 -8119380 130057 7142958 11524296 12948686
11180 12948686 11855944 8859218 4774438 928784 -1305730 -1672761 -1474002 -2447222
11172 -2447222 -5058536 -7913205 -8834771 -6608380 -1965264 2844250 5452203 4698852
11164 4698852 1041896 -4012790 -8882539 -12666499 -15390582 -17703435 -20227685 -23029674
11156 -23029674 -25602670 -27244089 -27367040 -25606618 -22002627 -17300819 -12892075 -10089240
11148 -10089240 -9259304 -9655573 -10130614 -10073070 -9807140 -10245467 -12159255 -15631084 -20036649
11139 -20036649 -24438421 -27982142 -30063666 -30385203 -29027568 -26409582 -23020263 -19131263
11131 -19131263 -14790843 -10093037 -5451683 -1655606 378953 105770 -2224053 -5664645
11123 -5664645 -9226894 -12442058 -15295273 -17821953 -20019267 -22077843 -24374759 -27114412
11115 -27114412 -30161371 -33334762 -36703755 -40484081 -44828769 -49879596 -55786518 -62276675
11107 -62276675 -68179242 -71774071 -71951393 -69019682 -64255269 -58745761 -52841064 -46614974
11099 -46614974 -40441543 -34851018 -30031931 -25857941 -22393033 -19952840 -18447293 -16977731
11091 -16977731 -14479510 -10678898 -6055282 -865640 5348061 12986325 21288775 28268387
11083 28268387 31818082 30964581 26325991 19616553 12670992 6685039 2119678 -930768
11075 -930768 -2493648 -2777316 -2161492 -975977 520329 1823703 2161968 1180749 -371063
11066 -371063 -915833 946325 5774411 13324434 22674249 32134818 39474115 42770253
11058 42770253 41328196 35980024 28726495 21961371 17444502 15535464 15485089 16669454
11050 16669454 19321508 23726137 28913802 32747642 33514995 31158083 26873964 21922390
11042 21922390 17047193 12592586 8591882 4794742 1061919 -2194361 -4279500 -4965598
11034 -4965598 -4665754 -3871528 -2891260 -2316071 -3179447 -6061331 -10160126 -13725666 -15478901
11025 -15478901 -15418500 -14425590 -13502787 -13340102 -14106307 -15440001 -16850925 -18106930 -18856891
11016 -18856891 -17914652 -13608647 -5337084 5454724 16150000 24626065 29967427 32152776
11008 32152776 31724679 29595748 26505369 22505344 17316789 11206854 5157156 163302
11000 163302 -3267435 -4978050 -5094764 -4318122 -3815072 -4401067 -5926548 -7581625 -8551599
10991 -8551599 -8280254 -6569968 -3892909 -1411539 -205153 -392918 -1211746 -1872218 -2089359
10982 -2089359 -1923792 -1597083 -1640304 -2847193 -5637897 -9386327 -12531692 -13477826 -11462515
10973 -11462515 -6698540 84097 7988145 15816684 21938925 24849171 24203396 21229752
10965 21229752 17926032 15845013 15624851 17286856 20424674 24002537 26452045 26485412
10957 26485412 23962355 19953752 16090948 13915206 14470049 17838061 22729650 26855066
10949 26855066 28321511 27012000 24587463 23081702 23474495 25416247 27887619 29846213
10941 29846213 30470206 29318750 26626726 23464150 21413719 21780490 24748869 29101248
10933 29101248 32867318 34504153 33619056 30725299 26598372 21999361 17666925 14071666
10925 14071666 11131042 8490872 6145838 4482678 3640336 3161812 2440075 1224133
10917 1224133 -471539 -2577151 -4716220 -6009706 -5690052 -4033340 -2386293 -2122166
10909 -2122166 -3665440 -6466456 -9600808 -12241155 -13810327 -14064979 -13189603 -11726731
10901 -11726731 -10262594 -9060633 -7945788 -6545745 -4651223 -2356431 59033 2259116
10893 2259116 3881719 4625839 4441857 3611203 2612431 1947913 2012193 2865807 4016772
10884 4016772 4633358 4216595 3054486 1944562 1598062 2431574 4724786 8615412 13843075
10875 13843075 19653540 25035117 29055019 31161910 31484364 30905575 30584083 31132076 32182523
10866 32182523 32731204 31849810 29158488 24906184 19860772 15108441 11705100 10241841
10858 10241841 10571689 11869957 12936319 12563950 9990629 5456301 435679 -3105525
10850 -3105525 -4198896 -3655422 -3083479 -3160605 -3225922 -2539579 -1342666 -349360 309107
10841 309107 1038575 1891844 2402881 2492109 3115340 5675529 10814224 17817673 25114736
10832 25114736 31365433 36186779 39837006 42219147 42489156 39946179 35133457 29599372
10824 29599372 24496774 19767109 14800539 9498266 4382022 -112720 -4072822 -7822114
10816 -7822114 -11424680 -14553347 -16743988 -17666881 -17122316 -14859831 -10595171 -4340132
10808 -4340132 3343952 11514118 19211934 25670911 30482898 33888869 36752053 39800350
10800 39800350 42789073 44645699 44440348 41963182 37495093 31622278 25494054 20671840
10792 20671840 18100446 17307574 16980761 16277530 15332960 14696456 14723354 15453844 16514396
10783 16514396 16879602 15170552 10752002 4602104 -1214818 -5150738 -7252783 -8691445
10775 -8691445 -10415736 -12389772 -13928124 -14367464 -13304931 -10589011 -6541882 -2143695
10767 -2143695 1446291 3799130 5533797 7636929 10567976 14029277 17381688 20183617
10759 20183617 22545853 25131615 28628036 32978822 37182346 39964749 40554340 38741609
10751 38741609 34543311 28305512 21153329 14865482 10920199 9639174 10295244 11900258
10743 11900258 13773976 15543453 16948070 17799420 17981871 17304771 15414009 12114526
10735 12114526 7923252 4123303 1978630 1824162 3040158 4876551 7064710 9571531
10727 9571531 12060614 13869916 14412033 13369893 10603709 6222655 898855 -4077361
10719 -4077361 -7286271 -7832147 -5649765 -1403347 3788507 8686672 12310933 14225109
10711 14225109 14549677 13761505 12532527 11686669 12050542 14034983 17221410 20442171 22433471
10702 22433471 22537919 20889619 18062270 14607419 10832962 6857937 2800336 -1086884
10694 -1086884 -4461564 -7045498 -8667567 -9192400 -8595896 -7193230 -5562540 -3980864
10686 -3980864 -2035601 903158 4820122 8958897 12670018 16066012 19625977 23313798
10678 23313798 26292052 27435612 26046133 22316838 17442223 13211731 11060805 11208238
10670 11208238 12749259 14673100 16704148 19103676 21881502 24506763 26369746 27217793
10662 27217793 27034375 25808698 23701494 21203865 18712852 16022924 12714401 9141641
10654 9141641 6552479 5904582 6817174 7915725 7921249 6205666 2804173 -1484627 -5209160
10645 -5209160 -7160424 -7313026 -6570039 -5681264 -4873029 -4431347 -4946971 -6732135 -9440872
10636 -9440872 -12454839 -15231674 -17154269 -17606862 -16537787 -14522511 -11975729 -8785450
10628 -8785450 -5108307 -1959441 -287733 321066 1342950 3689386 6783281 9130960
10620 9130960 9339913 6743843 1795602 -3867408 -8252922 -10363188 -10660105 -10147997 -9301462
10611 -9301462 -8047467 -6428669 -4860598 -3802773 -3514198 -4197131 -6089851 -9111690
10603 -9111690 -12373884 -14289192 -13543416 -10208141 -5869220 -2493515 -1065705 -1256525
10595 -1256525 -2226880 -3532540 -5238834 -7392977 -9642839 -11452354 -12583982 -13203736
10587 -13203736 -13466392 -13144396 -11827607 -9447550 -6453866 -3479967 -967646 891357
10579 891357 2013527 2315029 1751760 551761 -590583 -854871 -74386 1127843 2427185
10570 2427185 4758663 9447898 16290221 23199732 28100550 30653543 31830210 32429934
10562 32429934 32589355 32252765 31322601 29444525 26274082 21999779 17182579 12126232
10554 12126232 6859160 1740994 -2373877 -4712712 -5050123 -3599316 -831206 2436748
10546 2436748 5059388 5965911 4636930 1319463 -3038754 -7131130 -9906734 -11122534
10538 -11122534 -11326096 -11181964 -10672251 -8944676 -5179952 176296 5249149 8203173
10530 8203173 8867765 8606483 8734986 9568403 10856036 12273747 13211967 12868704 11149088
10521 11149088 9112282 8182464 9235505 12464547 17310064 22151167 24935974 24838808
10513 24838808 22833519 20280002 17730889 15568190 14682498 15520589 17254256 18864140
10505 18864140 20262773 21350417 20947749 18147426 14174390 11569777 12002390 15958299
10497 15958299 23612700 34453566 47035825 61071671 79066879 104263850 138646867
10490 138646867 185413564 249983804 331181788 410240203 456245719 449273167 397126857
10483 397126857 326560158 260609762 207346958 165805477 134231201 111019700 93673132
10476 93673132 80811058 73125739 70394442 69607485 67871044 65457476 64234551 64404154
10468 64404154 64409768 63002214 59833887 54743211 47851490 39945860 31733187 23149983
10460 23149983 14250193 6214947 534801 -2467205 -3579142 -3604048 -3032286 -2351338 -1857101
10451 -1857101 -1358815 -643850 56750 576355 1377640 2971310 5041901 6698908 7322184
10442 7322184 6687759 4692694 1670095 -1263645 -2933580 -3235559 -3104941 -3410262 -4235360
10433 -4235360 -5109088 -5535400 -5387349 -5102959 -5353150 -6232365 -7008617 -7003579 -6432855 -5941700
10423 -5941700 -5572386 -4745152 -3164609 -1241954 375208 1291963 1405617 819548 -294910
10414 -294910 -2037864 -4858458 -8886650 -13235163 -16423546 -17635126 -17311620 -16510060 -16003958
10405 -16003958 -16057178 -16639615 -17474473 -17905063 -16989659 -14011632 -9106255 -3385028 1770319
10396 1770319 5640928 8280580 9767775 9826754 8502865 6832343 6233105 7158876 8677430
10387 8677430 9408397 8607333 6367772 3225680 -122091 -2927677 -4682711 -5543160 -6358158
10378 -6358158 -7992828 -10454702 -12781639 -13920059 -13607165 -12267976 -10316444 -7968949
10370 -7968949 -5612410 -3753971 -2391896 -837903 1574007 4819270 8270401 11050909
10362 11050909 12197279 11037727 7847455 3856189 293399 -2356690 -4061271 -4782087
10354 -4782087 -4743888 -4687736 -5264098 -6415337 -7819853 -9615040 -12085308 -14868449 -17107738
10345 -17107738 -18270872 -18250262 -16836693 -13833783 -9712531 -5443801 -1496377 2466305
10337 2466305 6774369 11202674 15415431 19407379 23214098 26628451 29523971 32116478
10329 32116478 34586906 36673436 37891268 38033197 37391255 36687618 36697075 37421921 37483592
10320 37483592 34869935 28733310 20278256 11685321 4451346 -1029007 -4739375 -6513723
10312 -6513723 -6208381 -4017706 -496920 3651402 7856198 11772702 14988144 16729518
10304 16729518 16293429 13987201 11350946 10148970 11190194 14065592 17567886 20179205
10296 20179205 20729364 19167602 16477323 13378501 9346145 3427136 -4185042 -12078879
10288 -12078879 -19142732 -25469922 -31517575 -36968028 -40888076 -42668848 -42313984 -39965397
10280 -39965397 -35683748 -29854418 -23527212 -18115335 -14720170 -13670770 -14512101 -16296330
10272 -16296330 -17963969 -18699456 -18195741 -16703470 -14729714 -12508587 -9726600 -5896881
10264 -5896881 -1110403 3619354 6855374 7656349 6091914 2963143 -930447 -5295551
10256 -5295551 -10210294 -15562043 -20713466 -24842159 -27642349 -29571869 -31247391 -32560942
10248 -32560942 -32486143 -29847901 -24336722 -16888417 -9267137 -3305985 -203009 -38872
10240 -38872 -1768862 -3905500 -5497871 -6539622 -7514293 -8790996 -10554586 -12982089 -16082794
10231 -16082794 -19440144 -22484322 -25066659 -27464398 -29751154 -31456475 -31939949 -30773475
10223 -30773475 -27589118 -21963462 -13959116 -4753292 3670689 9698200 13008131 14498406
10215 14498406 15496155 16951746 19069831 21482747 23739118 25639138 27150457 28150714
10207 28150714 28367442 27519404 25485754 22506483 19344906 17034079 16117753 16112065 15929518
10198 15929518 14851760 12903425 10334569 7124465 3204033 -1090600 -5128635 -8544424
10190 -8544424 -11475722 -14192867 -16626362 -18351358 -19003374 -18661234 -17818289 -16964563 -16142321
10181 -16142321 -14868689 -12539955 -9048713 -5102464 -1840788 88474 1164561 2569715
10173 2569715 5006241 8001813 10427646 11513561 11229300 9965404 8237955 6589777
10165 6589777 5283041 3975221 2121784 -70531 -1420591 -787729 1891878 5743487
10157 5743487 9745206 13014753 14684690 14194465 11795172 8323724 4370554 -17361
10149 -17361 -4837800 -9799614 -14554304 -18751922 -21687387 -22447830 -20828205 -17749513 -14396196
10140 -14396196 -11290041 -8608192 -6924305 -6856610 -8125957 -9749157 -11276808 -13184461
10132 -13184461 -15853902 -18797410 -21192022 -22598895 -22746421 -21193756 -17934856 -14107603
10124 -14107603 -11398255 -10657411 -11493950 -13144749 -15175247 -17202300 -18492355 -18294917
10116 -18294917 -16467831 -13563768 -10387785 -7555699 -5254940 -3154393 -587515 2898556
10108 2898556 6962535 10381034 11618442 9732606 5075317 -677822 -5298433 -7198687
10100 -7198687 -6323119 -4155725 -2816915 -3833441 -7412974 -12669224 -18447102 -23971080
10092 -23971080 -28932239 -33241786 -36760595 -39126758 -39885361 -39040875 -37453672 -36243595
10084 -36243595 -35590564 -34553618 -32462194 -30108018 -28963533 -29406702 -30423928 -31118068
10076 -31118068 -31764533 -32989305 -34448898 -34952665 -33799712 -31593936 -29711993 -29139477
10068 -29139477 -29722454 -30333426 -29829702 -28061603 -25952769 -24511775 -23876342 -23456734 -22828705
10059 -22828705 -22148045 -21663300 -21144952 -20061838 -18285566 -16417891 -15267336 -14981495 -14777669
10050 -14777669 -13599645 -11023517 -7523567 -3996879 -1150121 799029 2092737 3125047
10042 3125047 3965595 4194024 3433154 2051137 1031740 993504 1501473 1435176 -110368
10033 -110368 -3245405 -7210921 -10679868 -12447474 -12184718 -10497624 -8176378 -5585686
10025 -5585686 -2880950 -448141 1250303 2112919 2332554 1949689 783510 -1148052 -3322358
10016 -3322358 -4877775 -5098377 -3959614 -2375490 -1698572 -2650891 -4727355 -6735511 -7773184
10007 -7773184 -7624574 -6644126 -5701260 -5958401 -8023841 -11181267 -13878079 -15178389 -15558860
9998 -15558860 -16306280 -18443672 -22206810 -27076355 -32065553 -36253480 -39302850 -41387138
9990 -41387138 -42601148 -42696098 -41471687 -39132191 -36071961 -32532499 -28673617 -24808619
9982 -24808619 -21329178 -18435276 -16061515 -14037966 -12293989 -10994412 -10473046 -10876408
9974 -10876408 -11858475 -12821558 -13516230 -14236258 -15403733 -17177771 -19469642 -21989563 -24120994
9965 -24120994 -25085559 -24546072 -22892703 -20691897 -17999851 -14476339 -10054759 -5192426
9957 -5192426 -473186 3750957 7221813 9471141 9865760 8043177 4310186 -457487
9949 -457487 -5398212 -10108867 -14428311 -17969466 -20277092 -21540350 -22725412 -24646439
9941 -24646439 -27086995 -29133150 -30185041 -30255951 -29420152 -27574751 -24994390 -22672160 -21585185
9932 -21585185 -21646252 -21756903 -21014591 -19606230 -18347395 -17614741 -17110881 -16595011 -16349547
9923 -16349547 -16696479 -17387059 -17802592 -17574024 -16693133 -15184752 -13059393 -10520754 -7832866
9914 -7832866 -4977010 -1789958 1517068 4267468 5779992 5776291 4619143 3586547 4568219
9905 4568219 8617985 14707619 20627918 25219186 29016576 32928697 37818098 45823305
9897 45823305 59993076 80424140 101402166 114692899 116425716 109749152 100629773 92459424
9889 92459424 85207519 78082834 71247500 65209622 59862252 54530343 48545601 41718811
9881 41718811 34571894 28087632 22947500 18973028 15376245 11421440 6828468 1893393
9873 1893393 -2547192 -5553930 -6817484 -6894136 -6637374 -6605346 -7024250 -7820551 -8359065
9864 -8359065 -7556311 -4784921 -612027 3623592 6847190 8699877 9270077 8764313 7356776
9855 7356776 5135832 2306192 -496885 -2492208 -3619438 -4698199 -6281762 -7715016
9847 -7715016 -7922126 -6931364 -5992706 -6184466 -7363638 -8460066 -8425236 -7086927 -5623421
9838 -5623421 -6001697 -9128443 -13409292 -15828071 -14713352 -10926019 -6272502 -1656756
9830 -1656756 2719764 6226733 7948245 7805839 6785602 6055305 6425947 8612849 13228645
9821 13228645 20048909 27550802 33549149 36416643 35915987 33259849 30456397 29152332
9813 29152332 29593099 30535345 30242083 27690554 23054360 17342608 11705019 6880977 3012193
9804 3012193 -154773 -2874897 -5171512 -6931634 -8127758 -8871882 -9295151 -9504820 -9741862
9795 -9741862 -10506679 -12337250 -15324178 -18867341 -21996257 -23942439 -24414960 -23491108 -21453948
9786 -21453948 -18720656 -15725287 -12812236 -10368714 -9006507 -9263695 -10901867 -12702928
9778 -12702928 -13299461 -12287688 -10453804 -8973971 -8499338 -8908686 -9713230 -10616926 -11729099
9769 -11729099 -13223454 -14812375 -15762180 -15588832 -14555895 -13194649 -11422598 -8509341
9761 -8509341 -3981910 1765602 7889281 13767701 18990650 23007147 25330434 26149931
9753 26149931 26322374 26500256 26454262 25495163 23480619 21156448 19441863 18526075 17778841
9744 17778841 16495921 14635270 12837977 11857211 12057057 13362287 15415474 17593014
9736 17593014 19039365 19125124 18138886 17356456 18070496 20413959 23207505 24922363 24653013
9727 24653013 22314936 18445640 14156355 10900737 9571504 9571944 9125567 6835365 2888742
9718 2888742 -1364109 -4795530 -7201549 -8772948 -9311883 -8197363 -4949604 410566
9710 410566 7496549 15720337 24090498 30999225 34701718 34486062 31499558 28208411 26764767
9701 26764767 27712702 30090863 32541943 34218783 34846069 34332868 32637719 30052485 27449498
9692 27449498 25994806 26406649 28438172 31154550 33754866 36099272 38483576 41030178
9684 41030178 43305078 44382495 43306953 39856666 35181487 31534788 30887601 33483511
9676 33483511 37712786 41362443 42937160 42044220 39132241 35279842 31994708 30590285
9668 30590285 31346434 33247432 34638676 34252709 31840415 28136543 24335572 21374911
9660 21374911 19394492 17758402 15671570 12880695 9885236 7639460 7159461 9228447
9652 9228447 14037996 20815619 27920990 33643154 37105586 38433219 38120030 36360036
9644 36360036 32958362 27695951 20686166 12494249 4021506 -3804219 -10380348 -15547108
9636 -15547108 -19373197 -21859353 -22852984 -22185385 -19862133 -16197011 -11845521 -7697581
9628 -7697581 -4653956 -3369436 -4002678 -6056124 -8556421 -10670213 -12263728 -13733922
9620 -13733922 -15237454 -16264612 -16086875 -14466672 -11796235 -8736153 -5988746 -4345433
9612 -4345433 -4577871 -6972652 -10862794 -14657356 -16595055 -15905254 -13434614 -10896865 -9268054
9603 -9268054 -8092610 -6567695 -4986042 -4610569 -6211190 -9235384 -12490240 -15181641
9595 -15181641 -17136419 -18469456 -19372936 -20001041 -20325308 -20301756 -20310221 -21067786 -22800619
9586 -22800619 -24781414 -26057196 -26453745 -26513095 -26613510 -26551947 -25889760 -24301361 -21636877
9577 -21636877 -18063096 -14156447 -10472632 -7024338 -3609240 -629704 1078545 1559493
9569 1559493 2330025 5048841 9700961 14478016 17351410 17460328 15176820 11409165 7024629
9560 7024629 2554794 -1914942 -6562821 -11385764 -15887361 -19248154 -20907115 -21110144
9552 -21110144 -20861507 -21094381 -21784572 -22147354 -21914584 -22087791 -23943700 -27386239 -30807088
9543 -30807088 -32707407 -33072996 -33021858 -33524716 -34736106 -36189492 -37185354 -37118528 -35829837
9534 -35829837 -33680992 -31100557 -28138381 -24691611 -21083468 -18133420 -16605988 -16681252
9526 -16681252 -17816709 -18924313 -18921277 -17603262 -16050687 -15805580 -17484307 -20376440 -23340935
9517 -23340935 -25678923 -27078065 -27301404 -26392853 -24910450 -23527220 -22549873 -22163129 -22892989
9508 -22892989 -25245437 -28848122 -32443715 -34929237 -36098715 -36255234 -35489843 -33622556
9500 -33622556 -30581850 -26531321 -21818104 -17138743 -13622559 -12309249 -13410875 -16277518
9492 -16277518 -20076002 -24221781 -28143840 -31102980 -32620979 -32889116 -32332890 -30747728
9484 -30747728 -27187788 -20881742 -12196444 -2745361 5297845 10189738 11548068 10698919
9476 10698919 9814429 10152559 10958098 10215936 6503844 112606 -7308341 -13773308 -17751852
9467 -17751852 -18599959 -16684143 -13079424 -9052175 -5811172 -4450498 -5564618 -8741487
9459 -8741487 -12820055 -16867947 -20588719 -23636537 -25141680 -24524751 -22497280 -20552664
9451 -20552664 -19391325 -18293386 -16088998 -12358489 -7699394 -3329785 -543798 13914
9443 13914 -1047082 -2224725 -2407647 -1699342 -896217 -495987 -466529 -618715 -704273 -244904
9433 -244904 1253549 3773940 6690965 9238512 10873161 11191089 9825289 6675653 2184769
9424 2184769 -2728910 -7009244 -9797408 -10691232 -9916612 -8224088 -6408367 -4787930 -3162664
9415 -3162664 -1276022 818019 2958394 5304298 8252951 11822851 15319866 17781237
9407 17781237 18645677 17928631 16051517 13823057 12362883 12478490 13934444 15612947 16518964
9398 16518964 16430628 15585481 14156306 12282252 10350525 8957104 8644048 9691756 11863996
9389 11863996 14192167 15345086 14573207 12208244 9076548 5626730 1836302 -2270791
9381 -2270791 -6314349 -9607469 -11310845 -10833706 -8432834 -5158737 -1791551 1926172
9373 1926172 6487174 11282373 14790292 16142362 15824141 14654449 12753039 9886810
9365 9886810 6249224 2356292 -1427786 -4653858 -6331940 -5463676 -2221149 1825900
9357 1825900 4921315 6462601 7150999 8076099 9784036 12074719 14463450 16678568 18636394
9348 18636394 20029178 20222422 18752509 15828129 12192095 8567929 5355639 2704199
9340 2704199 603557 -1094789 -2521366 -3570472 -3945390 -3452973 -2174006 -361565 1703472
9331 1703472 3729715 5378087 6252076 5949284 4266725 1511463 -1452506 -3662971 -4631932
9322 -4631932 -4436462 -3377356 -1771533 -30592 1396759 2348592 3032880 3574818 3580570
9313 3580570 2411153 -18064 -2800181 -4481280 -4011643 -1417286 2292706 5881601
9305 5881601 8736560 11151666 13792066 16801277 19392382 20354811 19033507 15857819
9297 15857819 11930647 8128390 4638086 1345607 -1460536 -2916600 -2125751 1198050
9289 1198050 6571029 12982400 19149208 23782715 26118568 26452774 25923885 25395719 24518659
9280 24518659 22115826 17537416 11447471 5281044 237119 -3093508 -4568292 -4498909
9272 -4498909 -3738000 -3211404 -3073419 -2528864 -732258 2170011 4973693 6339207 5806632
9263 5806632 4109989 2622460 2356561 3295879 4597810 5349216 5018652 3311492 -2285
9254 -2285 -4854028 -10627157 -16406464 -21527772 -25879738 -29802847 -33733040 -37685181 -40877362
9245 -40877362 -42082435 -40708727 -37538358 -34186375 -31857844 -30781461 -30624027 -30933801
9237 -30933801 -31054999 -30102008 -27519923 -23662966 -19513779 -15665978 -11636233 -6306986
9229 -6306986 840000 8912308 16133359 21236823 24187637 25429890 24773144 21557716
9221 21557716 15945938 9518273 4250353 1108843 -161427 -191565 698651 2553703 5617921
9212 5617921 10116425 15768801 21335903 24939435 25180623 22082565 17004352 11673667
9204 11673667 7110834 3138486 -1167186 -6289227 -11320156 -14322387 -13861603 -10218463
9196 -10218463 -5086729 -291710 3009065 4159681 2727291 -1205763 -6682588 -12234337
9188 -12234337 -16730429 -19750794 -21183900 -20808514 -18514720 -14780712 -10598665 -6797680
9180 -6797680 -3519825 -407167 2757751 5620357 7402494 7474644 5866330 3286051 663570
9171 663570 -1337930 -2492995 -2992379 -3426667 -4579659 -6858586 -9836077 -12519599 -14058122
9162 -14058122 -13991869 -11968865 -7808798 -2150964 3375920 7168567 8845183 9232212 9356361
9153 9356361 9769020 10624607 11794240 12729270 12636625 11065528 8137577 4138095 -718758
9144 -718758 -5841151 -9940905 -11740175 -11120765 -9323398 -7890538 -7483557 -7673587 -7636503
9135 -7636503 -6889872 -5427334 -3331714 -446014 3469023 8292109 13377600 17856074
9127 17856074 21024876 22505494 22260252 20567911 17803915 14080835 9224393 3253899
9119 3253899 -3259226 -9542739 -15249580 -20445206 -24928765 -27840929 -28168377 -25614582
9111 -25614582 -20898323 -15232646 -9561472 -4250048 602671 4660105 7214641 7563763
9103 7563763 5549963 1877855 -1940569 -4086415 -3379950 -210963 3395279 4891751
9095 4891751 2703843 -3043962 -10914027 -19121622 -26396188 -32277958 -36684091 -39174615
9087 -39174615 -38849626 -35216241 -29034974 -21970842 -15377786 -9674512 -4865339 -1199933
9079 -1199933 983221 1827211 1994111 2077961 2115478 1702014 542652 -1080826 -2356232
9070 -2356232 -2523926 -1505263 18582 1125986 1258811 472669 -708433 -1723721 -2489269
9061 -2489269 -3523644 -5359963 -7746599 -9573891 -9647803 -7441463 -3236359 2021575 6870154
9052 6870154 9873231 10618855 10158877 10066408 10974836 12269637 13187867 13837212 14917918
9043 14917918 16676418 18458304 19285327 18599369 16291508 12224456 6174047 -1505952
9035 -1505952 -9351120 -15310922 -18018234 -17595077 -15401273 -13238385 -12623669 -14207268 -17436768
9026 -17436768 -20896841 -23271135 -24055136 -23424094 -21744142 -19409988 -16850359 -14276113
9018 -14276113 -11462582 -8086746 -4334370 -1034813 782323 413727 -2184160 -6286677
9010 -6286677 -10723066 -14602400 -17715927 -20060266 -21144183 -20146109 -16775984 -11719534
9002 -11719534 -6237305 -1515917 1799834 3946187 5954155 8723603 11974826 14508754
8994 14508754 15756547 16735267 19155339 23802926 30042279 36578950 42229220 46063079
8986 46063079 47412622 46152364 42943327 39043793 35736873 33708206 32743577 32014774
8978 32014774 30824417 29199543 27802202 27279796 27633700 28051067 27309278 24584257 20154686
8969 20154686 15356040 11695359 9897564 9721332 10488707 11571006 12396292 12296128 10678744
8960 10678744 7519789 3689756 681733 -220069 1203907 3868960 6006306 6269423
8952 6269423 4563666 1985572 -62712 -796807 -233558 1269122 3327175 5375208 6627569
8943 6627569 6600130 5612738 4517646 3982516 4265677 5570430 8192427 12154281 16905796
8934 16905796 21526262 25180568 27493871 28731178 29546351 30212780 30065909 28039812 23835164
8925 23835164 18257861 12404815 7002144 2691191 328385 403183 2369299 5045678
8917 5045678 7648444 10152405 12798769 15605546 18245574 20014729 19969603 17529163 13111849
8908 13111849 8044105 3852913 1708061 2186011 5002077 8932765 12484511 14891473
8900 14891473 16308862 17101512 17377739 17316216 17435496 18146592 19280757 20390864 21331534
8891 21331534 22196047 22824409 22819777 22127165 21248421 20673219 20260713 19382914 17648248 15381836
8881 15381836 13416507 12480115 12764786 14023143 16032371 18863067 22520078 26275523
8873 26275523 28631282 28359340 25754511 22709362 21374967 22687320 26026922 29930730
8865 29930730 32968003 34311363 33988086 32641468 30794506 28361660 25104121 21421039
8857 21421039 18250958 16139221 14759586 13362303 11248588 7814285 2882578 -2560896
8849 -2560896 -6514394 -7471106 -5567682 -1857315 3058877 8931950 14745376 18826846
8841 18826846 20471951 20831989 21773152 24189604 27625199 31038796 33513633 34567914
8833 34567914 34343909 33528813 32792629 32205184 31235190 29240139 25974123 21887050 18068374
8824 18068374 15633544 14878528 15098039 15363004 15350030 15322380 15575177 16167014 16974129 17609680
8814 17609680 17367458 15719171 13058219 10654144 9581733 9760908 10211349 10166924 9747353
8805 9747353 9588131 10097962 11199009 12524119 13534225 13528782 11983310 9087465 5672837
8796 5672837 2335698 -1162257 -5259964 -9463593 -12311596 -12686589 -10977757 -8793647
8788 -8793647 -7612856 -7741075 -8401226 -8696341 -8512678 -8486635 -9028082 -9505428 -8714455 -6294493
8778 -6294493 -3505713 -2419698 -4326134 -8876403 -14557820 -19821616 -23804821 -26192014
8770 -26192014 -26725937 -25233996 -22208953 -18914318 -16415902 -14610167 -12676445 -10476881
8762 -10476881 -8974551 -9092157 -10616366 -12474854 -13662371 -13601291 -12150494 -9969445 -8682100
8753 -8682100 -9848874 -13383607 -17279307 -19211159 -18439191 -16233705 -14727261 -15429442 -18493345
8744 -18493345 -22928516 -27314167 -30494595 -32023381 -32308679 -32307305 -32699085 -33098896 -32239272
8735 -32239272 -29214590 -24558480 -19933568 -16730748 -15025453 -13820327 -12174747 -10153119
8727 -10153119 -8845146 -9506943 -12581674 -17427252 -22829650 -27628047 -30972995 -32447934
8719 -32447934 -32301950 -31444341 -30864884 -30917008 -31188336 -31010683 -30050090 -28543136 -27085408
8710 -27085408 -26072510 -25231554 -23859239 -21667844 -19184332 -17061424 -15183404 -12809767
8702 -12809767 -9505418 -5517633 -1216382 3409803 8536708 14135695 20073961 26317506
8694 26317506 32678512 38429245 42503550 44265893 44094131 43255426 43255148 45140118 49076518
8685 49076518 54298867 59404620 62888279 63730348 61799656 57865421 53204880 49016050
8677 49016050 45909775 43681715 41486696 38379816 33892220 28218779 21992098 16036668
8669 16036668 11303041 8691270 8549363 10231405 12279960 13238188 12528351 10819179 9642063
8660 9642063 10438864 13658973 18590256 23977400 28753032 32298389 34331795 34785251 33755306
8651 33755306 31510799 28620997 26011870 24556635 24397102 24842095 25079689 24766698 23781242
8642 23781242 21807705 18643172 14772677 11211188 8816050 8064285 9292318 12526281
8634 12526281 16949896 21079459 23862296 25511870 27203901 30116125 34624018 39913584
8626 39913584 44228028 45995355 45116205 42950157 40821469 38796088 36123860 32489291
8618 32489291 28397410 24574302 21497216 19439094 18459502 18225186 18212396 18277777 18775006
8609 18775006 19899460 21099591 21420905 20464234 18837899 17533840 16868754 16158702 14527317
8600 14527317 11939345 9228881 7098368 5365429 3396033 1112885 -715046 -1226103
8592 -1226103 -388753 826393 1143164 -40025 -2201917 -4232321 -5453660 -5993088 -6104950
8583 -6104950 -5466518 -3526261 -405644 3018118 5984389 8384523 10298260 11477599
8575 11477599 11687779 11280643 10934694 10853910 10617753 9884527 8891202 8068701 7364237 6137366
8565 6137366 3662415 -312980 -5320700 -10290796 -13964457 -15369183 -14080043 -10315655
8557 -10315655 -5095966 -225419 2446554 2241524 129282 -2162632 -3414955 -3282129
8549 -3282129 -1925290 128088 1943881 2724279 2594306 2362127 2307162 1740435 141642
8540 141642 -1718374 -2351174 -1083480 1405097 3902090 5537499 5938745 5117181 3459366
8531 3459366 1561690 -127760 -1438481 -2310014 -2706521 -2644156 -2033576 -517540 2235772
8522 2235772 6050216 10318073 14543784 18468576 21619620 23156468 22386783 19187978
8514 19187978 13802729 6570956 -1862294 -10297641 -17238081 -21411446 -22172633 -19887739
8506 -19887739 -16172157 -13262783 -12504615 -13385330 -14307366 -14231726 -13348215 -12386783 -11816216
8497 -11816216 -11818679 -12621340 -14492055 -17374315 -20559765 -22783078 -22950012 -21141364 -18861829
8488 -18861829 -17932168 -18976674 -21108181 -22988875 -23827462 -23333613 -21328585 -18007114 -14487044
8479 -14487044 -12547763 -13495299 -17306504 -22869508 -28841507 -34156781 -37966478 -39567555
8471 -39567555 -38676244 -35669179 -31275647 -25894416 -19281285 -10989025 -1080828 9627574
8463 9627574 19948331 28831577 35529833 39435233 39962314 36762715 30176612 21517355
8455 21517355 12861601 6398213 3645289 4806160 8520465 12353761 14048100 12754806
8447 12754806 9211091 4805020 617882 -2709305 -4681770 -5034018 -4100753 -2734462
8439 -2734462 -1646152 -914862 -213233 610393 1291404 1406883 705676 -846475 -3164123
8430 -3164123 -5952895 -8553933 -10267562 -11196816 -12610123 -15905734 -20945570 -25719571
8422 -25719571 -28008427 -27319425 -25063682 -23097694 -22397700 -22894823 -23982471 -24989173 -25531030
8413 -25531030 -25718712 -25935673 -26273065 -26262072 -25262682 -23088422 -20267066 -17791081 -16559034
8404 -16559034 -16834499 -18160085 -19892010 -21764724 -23706721 -25145606 -24909711 -22069452
8396 -22069452 -16699325 -9724383 -2418847 3624786 6531819 5108022 134037 -5751255
8388 -5751255 -9948297 -11717189 -12113162 -12460263 -13148968 -13602803 -12857001 -10148140 -5477836
8379 -5477836 75211 4876529 7945440 9634736 10975173 12526139 14125790 15559997
8371 15559997 16943028 18298485 19192771 19139197 18214027 17006343 16051592 15548197 15550299
8362 15550299 16144983 17371558 19137421 21258967 23445028 25228585 26127403 26023003 25305139
8353 25305139 24526588 23924576 23308206 22339985 20847824 18915962 16812795 14894206 13473262
8344 13473262 12585111 11784125 10319895 7768515 4551478 1653638 -281949 -1458475
8336 -1458475 -2450335 -3411275 -3935501 -3552346 -2085265 441684 3982190 8482352 13870203
8327 13870203 20029331 26596738 32800572 37775192 41166198 43260818 44435617 44632406
8319 44632406 43412372 40273092 34823469 27012969 17528419 7765997 -1003536 -8465422
8311 -8465422 -15026367 -20829819 -25346795 -27966051 -28615796 -27632700 -25315307 -21869198 -17617426
8302 -17617426 -12985232 -8320739 -3908251 -89253 2824572 4746915 5816870 6298743
8294 6298743 6616661 7279157 8374626 9112821 8237354 5115455 310440 -4913978 -9360369
8285 -9360369 -12145137 -12746878 -11354108 -9050190 -7201358 -6542398 -6966015 -7991079 -9072768
8276 -9072768 -9609072 -9214829 -8146871 -7048528 -6093129 -4770528 -2773036 -724927 344595
8267 344595 44712 -1169225 -2581105 -3596042 -3733871 -2811300 -1202146 566413 2700184
8258 2700184 6244711 11900262 18765747 24512834 26942638 25473142 21315345 16401842
8250 16401842 12153444 9076369 7184762 6432256 6642231 7334469 7959184 8250452 8139553
8241 8139553 7459255 6096665 4419832 3124661 2478599 2022123 1230962 214279 -487711
8232 -487711 -550470 29022 1286978 3260877 5488664 6875453 6314278 3418309 -1303559
8223 -1303559 -6703846 -11297609 -13660240 -13082975 -10115405 -6378638 -3638139 -2859520 -3924229
8214 -3924229 -6001484 -8095608 -9399540 -9438135 -8130272 -5786925 -2952046 -101652 2547956
8205 2547956 4878826 6532140 6922256 5779326 3603924 1338893 -448756 -1844245
8197 -1844245 -2991639 -3519357 -2791104 -578479 2678853 6023625 8091179 7402855 3298137
8188 3298137 -3142500 -9475631 -13527911 -14635369 -13386419 -10619525 -6911022 -2665737
8180 -2665737 1755609 6033847 9929631 13464268 17056518 21060824 24925569 27216329
8172 27216329 26930964 24604981 21739767 19335957 17387621 15561767 13732553 11810202
8164 11810202 9588212 6940328 3841280 186645 -3905579 -7437408 -8682161 -6491301
8156 -6491301 -1452519 4360800 8702980 10286332 9029096 5560095 555803 -5430323
8148 -5430323 -11543752 -16467315 -19261770 -20391572 -21388963 -23267447 -25604127 -27338870
8140 -27338870 -28046704 -28122916 -28084308 -28109992 -28064446 -27542504 -25939815 -22857630 -18607726 -14280919
8130 -14280919 -11306544 -10790458 -12851061 -16299499 -19161387 -19910631 -18413434 -15821406
8122 -15821406 -13743707 -13429919 -15238492 -18489251 -21929331 -24574588 -26095670 -26457988
8114 -26457988 -25570199 -23497579 -20718844 -17889847 -15534470 -14082022 -13744586 -13919999 -13076821
8105 -13076821 -9939754 -4894424 180239 3557262 4867440 4721576 3618082 1542285
8097 1542285 -1465446 -4592680 -6316878 -5429807 -2144929 1935944 5097556 6684552
8089 6684552 7046121 6716058 5931419 4643974 2526752 -971147 -6164982 -12607978 -19149942
8080 -19149942 -24474468 -27526297 -27721657 -25093619 -20150791 -13432774 -5473571 2593348
8072 2593348 8942131 12279414 13031244 12717840 12248493 11446140 10148921 8946727 8580809
8063 8580809 9237969 10704127 12653443 14502869 15565970 15788889 15901484 16395398 16685811
8054 16685811 15696656 12991344 8978676 4407108 229874 -2259520 -1862316 1734597
8046 1734597 7800995 15114187 22415561 28558608 32822478 35318438 36798271 37808206
8038 37808206 38056937 36630622 32747860 26384459 18407355 10208802 3092257 -2150671
8030 -2150671 -5222207 -6100175 -4995904 -2481167 495630 2823079 3576977 2369222 -493294
8021 -493294 -4202313 -7873307 -10896245 -13139154 -15082023 -17651793 -21513527 -26347580
8013 -26347580 -31037927 -34670851 -37115675 -38568094 -38914504 -37816426 -35152590 -31113464
8005 -31113464 -26159543 -21285386 -18100263 -18031839 -21165118 -25952285 -30099713 -31800665
7997 -31800665 -30531737 -27169613 -23343706 -20261411 -17929242 -15550689 -12568899 -9087280
7989 -9087280 -5393309 -1526325 2503223 6364208 9553654 11808289 13183464 13760479
7981 13760479 13441962 12093475 9789177 6772744 3134372 -1303081 -6527385 -11762136
7973 -11762136 -15627578 -17052629 -15906695 -12673549 -7798289 -1627145 5206141 11728661
7965 11728661 17034157 20619479 22443029 22896404 22629669 22061927 20952564 18615334 14618296
7956 14618296 9208877 3139553 -2750185 -7838800 -11811033 -14425996 -15080549 -12795382
7948 -12795382 -7036874 1320416 10036943 16656486 19729832 19274993 16466444 12872768
7940 12872768 9634286 7174374 5678981 5587641 7228985 10046500 12644070 13753252
7932 13753252 12936269 10423222 6794203 3048437 539499 369934 2848334 7583842
7924 7583842 13813100 20446758 26162450 29941961 31567890 31444111 30052080 27772192
7916 27772192 25041629 22291255 19642838 16868854 13723888 10225448 6658833 3516203
7908 3516203 1497842 1366301 3498353 7405263 11758975 15171674 17211703 18636215
7900 18636215 20430779 22592091 24004763 23515128 20965425 17242254 13645077 11285750
7892 11285750 10698738 11637425 13274413 14777818 15687043 15762336 14795798 12855393 10556993
7883 10556993 8728942 7692686 6980430 5789417 3668294 809725 -2232705 -5074415
7875 -5074415 -7683693 -9963190 -11295857 -10845991 -8423525 -4833757 -1286810 1322344
7867 1322344 2561425 2394352 1310121 184687 -448066 -888051 -1704475 -2803897 -3423539
7858 -3423539 -3011292 -1815734 -664828 -460194 -1797384 -4652418 -8298326 -11732778 -14247170
7849 -14247170 -15508481 -15351267 -13932592 -12033407 -10693648 -10352721 -10619748 -10941441 -11128121
7840 -11128121 -11126372 -10752975 -10024391 -9513336 -10014853 -11882068 -14813468 -18128657 -21083714
7831 -21083714 -23130936 -24232622 -25006410 -26417693 -29184488 -33302568 -37925280 -41699595
7823 -41699595 -43503385 -43076252 -40928810 -37734486 -34098780 -30896870 -29255280 -29665392
7815 -29665392 -31179254 -31812220 -29829687 -24718943 -17361345 -9680085 -3819934 -888403
7807 -888403 -141066 320772 1793138 3995568 5845317 6842977 7410525 8069831 8705080
7798 8705080 8721469 7671690 5569721 2777148 -123891 -2318192 -2936471 -1628939 916008
7789 916008 3196967 3871611 2605110 -7571 -3232995 -6737016 -10315544 -13326948 -14740543
7780 -14740543 -13936311 -11346513 -8074253 -4834602 -1430835 2701197 7675500 12995652
7772 12995652 17896963 21536756 23109122 22348269 20020215 17475431 15478429 13735278
7764 13735278 11709583 9552253 7955769 7359843 7591409 8032128 7779213 5885578 2033886
7755 2033886 -2872108 -7099456 -9259300 -9082262 -7245162 -4816663 -2870722 -2167727 -2823518
7746 -2823518 -4283715 -5708661 -6383899 -5893179 -4204762 -1716948 979747 3566747 6149871
7737 6149871 8828465 11170801 12266789 11402191 8736545 5304903 2232766 -152509
7729 -152509 -2403261 -5150672 -8384348 -11577968 -14238176 -16090726 -17011053 -17210013 -17342475
7720 -17342475 -17881890 -18315076 -17447614 -14706323 -10782683 -6860812 -3670849 -1552033 -921780
7711 -921780 -2096010 -4792529 -8259469 -11863310 -15265555 -18145702 -20128852 -21009092 -20794576
7702 -20794576 -19512736 -17097937 -13363232 -7971933 -748771 7614207 15378199 20782112
7694 20782112 23260538 23347391 21584268 18127931 13439532 8632867 4710953 1775939
7686 1775939 -745371 -3399650 -6410139 -9598020 -12146713 -12742420 -10513785 -5877199
7678 -5877199 -204178 5247843 9832607 13189230 14962438 14996447 13546943 11180411 8552370
7669 8552370 6186567 4226832 2444422 749436 -327584 34728 2074625 5139695
7661 5139695 8288668 10943829 12929313 14265625 15186626 16109059 17255762 18372319 19039248
7652 19039248 19214093 19244981 19320310 19059587 17735370 14897617 10815801 6345097 2312938
7643 2312938 -1018490 -3899967 -6591603 -9047456 -11067274 -12523895 -13318076 -13270321 -12216435
7634 -12216435 -10127535 -7047940 -3081155 1355396 5316548 7559323 7088118 3632424
7626 3632424 -2075383 -8358537 -13336878 -16142579 -17431232 -18395074 -19307507 -19362734 -17884625
7617 -17884625 -15201187 -12183918 -9399210 -7033273 -5256908 -4137330 -3312080 -2269191
7609 -2269191 -1068099 -416973 -803072 -1725529 -2020384 -924208 1307461 3829085 6139247
7600 6139247 8521915 11576680 15370103 19101292 21613714 22238520 21188815 19185002
7592 19185002 16671810 13388335 8843420 3347789 -1598983 -4310989 -4376363 -2855774
7584 -2855774 -986649 912364 3032689 5018333 5870361 4853039 2128431 -1435096
7576 -1435096 -4694965 -6557444 -6456194 -4781529 -2520462 -249876 2261049 5276540
7568 5276540 8249302 10084251 10120101 8643776 6609990 5058521 4518291 4527504 3795816
7559 3795816 1285768 -2710843 -6768974 -9603676 -10902081 -10956687 -9982700 -8100566 -5685653
7550 -5685653 -3315726 -1422739 -277842 -246103 -1663221 -4309227 -7279058 -9654720 -11254777
7541 -11254777 -12538009 -13810535 -14774690 -14984920 -14598597 -14445967 -15282650 -17022491 -18704506
7532 -18704506 -19156264 -17764094 -14852382 -11512497 -8979337 -7914789 -8137393 -9041341 -10255805
7523 -10255805 -11816548 -13718192 -15479630 -16305741 -15681314 -13775924 -11330509 -9214274
7515 -9214274 -8004805 -7803189 -8333541 -9229388 -10260299 -11278102 -11954197 -11659141 -9741146
7506 -9741146 -6027350 -1053025 4273564 9261800 13638038 17150814 19182432 19052569
7498 19052569 16780586 13324452 9874626 6980310 4454093 1945008 -630646 -3083303
7490 -3083303 -4999008 -5755306 -4844575 -2369623 1006769 4764632 8940954 13640358 18390571
7481 18390571 22314165 24795824 25661093 24864532 22489892 19106769 15707252 13146391
7473 13146391 11922896 12448621 14861796 18165044 20054468 18379033 12939772 5632873
7465 5632873 -1093442 -5700526 -7820531 -7819627 -6458427 -4712354 -3555411 -3742332 -5606736
7456 -5606736 -8849357 -12566541 -15730921 -17719172 -18341938 -17612581 -15839172 -13792555 -12248753
7447 -12248753 -11247142 -10210970 -8922474 -7926963 -7761162 -8272708 -9106363 -10477692 -12914793
7438 -12914793 -16388971 -20197638 -23669795 -26582818 -28935170 -30771196 -32289911 -33663269
7430 -33663269 -34503902 -33780836 -30505349 -24442226 -16189182 -6862219 2233054 10065312
7422 10065312 16458565 22172532 28139800 34552763 40719763 45646472 48573349 49112737
7414 49112737 47302606 43794192 39856860 36865648 35547828 35705955 36738768 38367820
7406 38367820 40665773 43368184 45512910 46114463 45096673 43198359 40949079 38137768
7398 38137768 34460687 30322980 26628060 23901091 21915292 20107062 18073106 15685746
7390 15685746 13028781 10325815 7748867 5232335 2666549 362367 -899952 -529502
7382 -529502 1175357 3095288 4053964 3524191 1809047 -167052 -1230610 -476935 2200403
7373 2200403 6016917 9918919 13474748 17157004 21661436 26915088 31783868 34774878
7365 34774878 35042458 32800692 28924529 24265364 19301246 14268641 9456183 5280562
7357 5280562 2058568 -284490 -2257250 -4505453 -7397773 -10843100 -14495359 -18115881
7349 -18115881 -21648837 -24845806 -26871903 -26528936 -23117848 -17152659 -10180323 -3884756
7341 -3884756 691321 3333630 4481217 4988956 5765898 7268870 9228679 10925769 11733195
7332 11733195 11399055 10020791 8067168 6483604 6465512 8751579 12976768 17739972 21388746
7323 21388746 22898733 22243751 20126620 17402518 14696492 12453721 11108327 10858454
7315 10858454 11152571 10719485 8581668 5158572 2090816 743535 922515 1098455 -268689
7306 -268689 -3684842 -8556310 -13751878 -18232229 -21476450 -23561838 -24900126 -25953639
7298 -25953639 -27198625 -29070566 -31548009 -33756716 -34322840 -32359864 -28112183 -22748928
7290 -22748928 -17822702 -14888686 -15047809 -18270367 -23161637 -27751334 -30739396 -32071128
7282 -32071128 -32506714 -32784633 -33029514 -32685251 -31014048 -27847018 -23899609 -20293260 -17779824
7273 -17779824 -16374462 -15470264 -14159873 -11746209 -8321814 -4798230 -2135912 -654446
7265 -654446 -270430 -1033209 -2850107 -4857787 -5871298 -5739955 -5706663 -7049216 -9732054
7256 -9732054 -12703296 -15109408 -16788417 -17911341 -18709306 -19434002 -20078761 -20160578 -19230527
7247 -19230527 -17618657 -16199640 -15262099 -14007223 -11447222 -7584532 -3461760 -195192
7239 -195192 1795881 2684225 2685618 1830000 247961 -1545888 -2949056 -3954140 -5313648
7230 -5313648 -7737725 -10930633 -13606397 -14449644 -12918147 -9241878 -4051676 1846674
7222 1846674 7685260 13071292 18012512 22348299 25250278 25672739 23477817 19899433
7214 19899433 16606835 14297817 12428201 10417504 8869437 9205265 11962334 15721409
7206 15721409 18054044 17622637 15309688 13381975 13687549 16521772 20823538 25147125
7198 25147125 28437841 30065252 29408196 25815277 19273411 10998132 2951152 -3418343
7190 -3418343 -7787514 -10286240 -10617768 -8268389 -3502683 2256620 7207922 10236749
7182 10236749 11320117 11272805 11257018 12138111 13767888 14821207 13730006 10084346 5039623
7173 5039623 210914 -3686589 -6922355 -9727322 -11698858 -12350535 -11810193 -10595970 -8926314
7164 -8926314 -6697557 -4115927 -1925975 -843817 -977203 -1865383 -2798565 -2946995 -1489351
7155 -1489351 1984479 7109561 12846342 17942000 21439406 23144130 23838657 24784198 26662467
7146 26662467 29060369 31168223 32738265 33950795 34478549 33286785 29611791 23823082
7138 23823082 17099912 10483383 4396372 -1237014 -6770748 -12626058 -18973026 -25583081
7130 -25583081 -32139727 -38627558 -45225018 -51848867 -57980304 -62923161 -66099973 -67169857
7122 -67169857 -66060828 -62884958 -57705348 -50531750 -41826782 -32897936 -25279944 -19484562
7114 -19484562 -14627522 -9503970 -3817188 1802674 6595649 10035730 11665612 11313505
7106 11313505 9755542 8716513 9719403 12868657 16804404 19657062 19957483 17035854
7098 17035854 11145968 3371787 -4871679 -12462101 -18687210 -22878963 -24364918 -23103998
7090 -23103998 -20253346 -17796281 -17442992 -19741692 -23897888 -28162897 -30636762 -30310773
7082 -30310773 -27669076 -24147568 -20893074 -18185712 -15999845 -14567935 -13928056 -13191114
7074 -13191114 -10926427 -6511611 -841490 4421843 8115546 10140214 11233744 12487638
7066 12487638 14780891 18177493 21753883 24245440 25048964 24632663 23986669 23667379 23313106
7057 23313106 22094481 19724226 16970053 14955198 13925544 12980953 11134460 8305579
7049 8305579 5007040 1388767 -2874124 -7773192 -12537773 -16219627 -18462553 -19533564
7041 -19533564 -19754944 -19045337 -16966578 -13231251 -8291902 -3377955 290328 2374649
7033 2374649 3338043 3548199 2837094 1134393 -759766 -1397050 281705 4175390 9127337
7024 9127337 13648495 16684829 17958791 17710799 16168041 13335820 9268520 4378930
7016 4378930 -559041 -4589855 -6827055 -6884379 -5254575 -3038915 -1080350 499173 1772196
7007 1772196 2313127 1412053 -1077895 -4407526 -7460324 -9439034 -10155914 -10016049 -9784970
6998 -9784970 -10037418 -10572998 -10443150 -8697830 -5137868 -395277 4584979 9124697 13040960
6989 13040960 16427111 19217291 21020728 21509616 20973865 20342397 20553477 21908674 23996416
6980 23996416 26128351 27871804 29359231 31177132 33766311 36697319 38589466 38051759
6972 38051759 34915870 30445808 26112802 22150069 17521916 11392908 4382704 -1849521
6964 -1849521 -6073622 -8234244 -8909667 -8576388 -7550611 -6161414 -4589152 -2763303 -733529
6955 -733529 1078641 2345492 3347858 4574975 5871527 6422018 5637098 3713312 1307256
6946 1307256 -914867 -2296006 -2262251 -812785 1179578 2415146 1917797 -604090 -4755480
6937 -4755480 -9498014 -13389181 -15203689 -14504659 -11633347 -7316433 -2468771 1765380
6929 1765380 4169660 3938907 1123017 -3311416 -7845708 -11067728 -12335515 -12019792 -11134839
6920 -11134839 -10688072 -11241504 -12815899 -14979856 -17073735 -18598160 -19569845 -20512643 -22040440
6911 -22040440 -24373659 -27168049 -29757218 -31606174 -32621025 -33071415 -33248451 -33255907 -33130771
6902 -33130771 -33014380 -33007051 -32825955 -31800947 -29434680 -26002543 -22446727 -19564460 -17380788
6893 -17380788 -15438025 -13605373 -12379636 -12388895 -13848489 -16573561 -20219025 -24257069 -27922629
6884 -27922629 -30530537 -31844220 -31934252 -30768091 -28238954 -24597110 -20545506 -16780387
6876 -16780387 -13550876 -10610758 -7367926 -3182577 2002061 7128814 10497630 11127650
6868 11127650 9550429 7086304 4544979 1875439 -1152067 -4384404 -7447050 -10113235
6860 -10113235 -12335454 -14105382 -15495690 -16788721 -18344297 -20164115 -21561266 -21390406
6852 -21390406 -18778075 -13696555 -6836170 939963 8826981 15884445 21041909 23591527
6844 23591527 23613965 21834764 19202591 16651086 14912393 14134025 13672491 12561766 10328932
6835 10328932 7300345 4165237 1409984 -820527 -2505477 -3514186 -3526182 -2131922
6827 -2131922 914186 5442366 10830961 16231367 20884558 24314199 26295167 26686426
6819 26686426 25368709 22423696 18353467 14016849 10274309 7623028 5999765 4796060
6811 4796060 3228880 1036915 -1116009 -2167993 -1713008 -417407 595647 564300 -629005
6802 -629005 -2499579 -4021095 -3998743 -1831783 2069151 6702058 11102485 14465564 16103760
6793 16103760 15794929 14063428 11726616 9231722 6763526 4826405 4149457 4880496 6258690
6784 6258690 7247534 7237955 6099988 3971298 1246694 -1523026 -4051361 -6510418 -9042984
6775 -9042984 -11163488 -11965094 -11078816 -9316701 -8155606 -8444009 -9640259 -10438606 -10096412
6766 -10096412 -8909181 -7387800 -5441649 -2728587 550223 3808973 6953532 10483936
6758 10483936 14546912 18333462 20648279 20764517 18585681 14412395 8902562 2986286
6750 2986286 -2570119 -7462296 -11570340 -14606475 -16273340 -16591610 -15835647 -14307977 -12388994
6741 -12388994 -10576682 -9120732 -7683755 -5625875 -2585749 1322395 5583144 9206860
6733 9206860 10895143 9962502 7212772 4381097 2427746 710169 -1886075 -5271672
6725 -5271672 -7973036 -8555593 -6970039 -4529321 -2831123 -2765954 -4269298 -6633465 -8926024
6716 -8926024 -10362507 -10665387 -10186809 -9491259 -8714787 -7537582 -5912083 -4516990 -4171927
6707 -4171927 -5026295 -6754826 -9360336 -13057449 -17141646 -19651230 -18840406 -14913564 -9908046
6698 -9908046 -5906692 -3648789 -2728147 -2580213 -3003200 -3984536 -5356537 -6662171 -7261870
6689 -7261870 -6580093 -4351386 -754819 3583117 7766030 11062035 13347281 14995086
6681 14995086 16154610 16297849 14750239 11543514 7375881 2802243 -1991118 -6430015
6673 -6430015 -9160414 -9028491 -6361411 -2840662 -81765 1384671 1843950 1666733 1121197
6664 1121197 593665 556333 1213024 2307411 3378859 4243389 5233875 6909189 9454934
6655 9454934 12419408 15145818 17435110 19663726 22257171 25154530 27772146 29378233
6647 29378233 29522437 28224510 25769557 22338897 18066270 13624826 10435545 9747576
6639 9747576 11456402 14238869 16933788 19364338 21695911 23590317 24493374 24463630 24205492
6630 24205492 24340303 24961311 25803724 26543134 26999068 27291591 27677581 27999139 27497075
6621 27497075 25489883 22046242 17663773 12615872 7194696 2330793 -927673 -2715897
6613 -2715897 -4351589 -6647695 -8823386 -9544099 -8525370 -6553813 -4361416 -2232828
6605 -2232828 -581472 -135053 -1289148 -3639714 -6286837 -8322414 -9012598 -7961550 -5405746
6596 -5405746 -2192346 728474 2756340 3648694 3401288 2304709 868457 -655800 -2654018
6587 -2654018 -5752424 -9878025 -13830190 -15956650 -15295301 -12060129 -7184599 -1695199
6579 -1695199 3373810 6814464 7574975 5547343 1882238 -1757183 -4406166 -6351357
6571 -6351357 -8566013 -11565747 -14665684 -16315393 -15319787 -11870695 -7357964 -3154377
6563 -3154377 311443 3279937 5693315 6714779 5221272 778509 -5708247 -12207515
6555 -12207515 -16610653 -17895842 -16480963 -13599585 -10474587 -7975850 -6611299 -6450058
6547 -6450058 -7073560 -7801096 -8013463 -7324743 -5730622 -3765498 -2224812 -1350213 -369283
6538 -369283 1813776 5432640 9550203 12847206 14459169 14155191 12161948 9000741 5245446
6529 5245446 1265888 -2673254 -6056862 -8134601 -8433915 -7116495 -4793282 -2199564
6521 -2199564 -62351 1083829 1191895 620291 -394268 -1908161 -3674158 -4673382 -3717283
6512 -3717283 -530577 4053613 8953620 13573511 17642648 20702390 22065904 21261408
6504 21261408 18405106 14164175 9386191 4686890 327597 -3517544 -6461425 -8039473
6496 -8039473 -8198713 -7530508 -6918265 -6983832 -7861052 -9306923 -10834344 -11815809 -11772709 -10798893
6486 -10798893 -9658971 -9250655 -9778576 -10387423 -9650888 -6579279 -1414546 4328243 8630134
6477 8630134 10114583 8795704 5798983 2278518 -1371370 -5201613 -8853753 -11431391
6469 -11431391 -12308034 -11701027 -10188701 -7919172 -4643852 -356363 4566007 9843179
6461 9843179 15379438 20615299 24231609 25052389 23264988 20449490 18351162 17774911 18551120
6452 18551120 20127317 21923171 23294673 23490761 21818683 17943529 12168524 5456004
6444 5456004 -1042153 -6725979 -11850051 -17001543 -22327398 -27385570 -31634379 -34753779
6436 -34753779 -36391360 -35909825 -32786453 -27351955 -20933648 -15058884 -10425262 -6607148
6428 -6607148 -2722995 1630816 6085984 10085805 13662458 17496753 22144041 27286183
6420 27286183 31854796 34868484 36098330 36059324 35636394 35787288 37290205 40355562 44329678
6411 44329678 47913796 49851505 49508036 46908505 42414011 36513590 29912881 23660916
6403 23660916 18984648 16819542 17374558 20097296 24055421 28349185 32161826 34509137
6395 34509137 34180161 30230283 22769824 13344269 4437383 -1657918 -3850185 -2543491
6387 -2543491 780163 4241060 6133877 5369706 1852672 -3418336 -8842793 -13154602
6379 -13154602 -16043608 -17861871 -18785581 -18451885 -16497874 -13280710 -9854098 -7252195
6371 -7252195 -5900231 -5565926 -5534177 -4811819 -2675043 505398 3122599 3528467 1585974
6362 1585974 -1121276 -2629241 -1925423 887673 5026414 9153591 11570992 11198758 8641243
6353 8641243 5877376 4637828 5222587 6820622 8456024 9388508 9136827 7783504 6261834
6344 6261834 5924180 7662132 11483475 16725396 22373617 27330564 30848094 32838667
6336 32838667 33561186 33071315 31351436 28969577 27072617 26412022 26655515 26920772 26747019
6327 26747019 26280106 25744517 25096896 24115868 22557178 20280761 17429016 14349464 11096900
6318 11096900 7188166 2257521 -3025739 -7007576 -8097982 -5657278 -94147 7365732
6310 7365732 14930631 20841039 24181639 24998707 23519062 19677568 13855311 7834924
6302 7834924 4350664 5362529 10840975 19132447 28117254 35950513 41284556 43485944
6294 43485944 42761139 39736069 34808183 28225099 20958863 15065440 12541504 13653364
6286 13653364 16668989 19366266 20625972 20588614 19798546 18671870 17590717 16924458 16751894
6277 16751894 16840692 17082093 17762467 19209634 21242962 23134141 24140828 24036384 23112807
6268 23112807 21697926 19741126 16976322 13498017 10019179 7436011 6189991 6063708
6260 6063708 6379527 6270430 5076505 2910802 804112 -67659 615483 2256797 4155317
6251 4155317 5992932 7533517 8371603 8293130 7614779 6876639 6339630 5963789 5692021
6242 5692021 5534383 5526624 5854791 6943729 9187727 12554327 16517798 20335009 23370804
6233 23370804 25330562 26348227 26856800 27389286 28547972 30913138 34481343 38088934
6225 38088934 39892724 38824753 35398026 30906039 26225797 21779168 18213541 16311538
6217 16311538 16166555 17063153 18384489 20145891 22320643 24065824 24183186 22343024 19460241
6208 19460241 16673050 14090720 10713337 5592090 -991818 -7479532 -12066632 -13789273
6200 -13789273 -12826687 -10064978 -6477000 -2737061 819619 4019528 6746376 9042571
6192 9042571 11108697 12931259 13992935 13715446 12246404 10449012 8980986 7743974
6184 7743974 6441949 5302754 4911650 5585350 7185172 9204536 10615805 9933786 6105905
6175 6105905 -462152 -7920270 -13931325 -16610543 -15170957 -10396555 -4339302 1154364
6167 1154364 5768537 10284492 15092909 19754875 23799595 26992511 28689751 27962836
6159 27962836 24939323 21305611 18793971 17573318 16620569 15145570 12977623 10033094
6151 10033094 6403376 2981368 1162931 1580323 3490954 5527231 6704888 6705015 5721772
6142 5721772 4327824 3165869 2459666 1947501 1438128 1250973 1902937 3410820 5007677
6133 5007677 5540688 4208403 1095374 -2934621 -6944790 -10521747 -13607973 -15946149
6125 -15946149 -17133265 -17374238 -17786532 -19505125 -22503978 -25624051 -27859295 -29380565
6117 -29380565 -31115873 -33454451 -35589938 -36136430 -34204647 -29868526 -23929985 -17609111
6109 -17609111 -12380247 -9534488 -9359479 -10683590 -11516304 -10388473 -7163781 -2661011
6101 -2661011 2301472 7364965 12279339 16384089 18625589 18074488 14384325 7913025
6093 7913025 -275606 -8430964 -14508835 -17097260 -16220084 -13172964 -9499357 -6119760
6085 -6119760 -3312501 -1250380 -388575 -1355614 -4459720 -9214551 -14398398 -18772470 -21811476
6076 -21811476 -23671708 -24566523 -24455984 -23339957 -21472221 -19074182 -16090821 -12478870
6068 -12478870 -8558555 -4807261 -1401393 1769541 4637206 6693461 7232995 5819660
6060 5819660 2660142 -1290649 -4647980 -6205909 -5282706 -1540126 5154302 14253528
$$ [...]
##END NTUPLES=NMR SPECTRUM
##END=
