##TITLE=31Pdec_AP-17KHCl
 D2O 
  24 sc
 24.10.2023
##JCAMPDX= 6.0         $$ Bruker NMR JCAMP-DX V2.0
##DATA TYPE= NMR SPECTRUM
##DATA CLASS= NTUPLES
##ORIGIN= UXNMR, Bruker Analytische Messtechnik GmbH
##OWNER= root
$$ XWIN-NMR		Version 3.5
$$ Tue Oct 24 14:41:47 2023 Russian Standard Time (UT+4h)  she@DPX200
##.OBSERVE FREQUENCY= 81.013821
##.OBSERVE NUCLEUS= ^31P
##.ACQUISITION MODE= SIMULTANEOUS
##.ACQUISITION SCHEME= undefined
##.AVERAGES= 24
##.DIGITISER RES= 16
##SPECTROMETER/DATA SYSTEM= spect
##.PULSE SEQUENCE= zgpg30
##.SOLVENT NAME= CDCl3
##.SHIFT REFERENCE= (INTERNAL, CDCl3, 0, 248.564)
##AUDIT TRAIL= $$ (NUMBER, WHEN, WHO, WHERE, WHAT)
$$ ##TITLE= Audit trail, XWIN-NMR		Version 3.5
$$ ##JCAMPDX= 5.01
$$ ##ORIGIN= Bruker BioSpin GmbH
$$ ##OWNER= she
$$ F:/spectra/data/she/nmr/P31/1/pdata/1/auditp.txt
$$ ##AUDIT TRAIL=  $$ (NUMBER, WHEN, WHO, WHERE, WHAT)
(   1,<2023-10-24 14:40:41.71 +0400>,<she>,<DPX200>,
      <created by zg, POWCHK disabled, PULCHK disabled
       configuration hash MD5:
       00 E9 B6 7A A2 85 ED C7 34 08 36 98 17 FE 4E 26
       data hash MD5: 32K
       E1 4F 85 BA CE AE F4 F4 ED 28 7A CE 51 D7 7A 2C>)
(   2,<2023-10-24 14:40:45.09 +0400>,<she>,<DPX200>,
      <Start of raw data processing
       efp BC_mod = 2 LB = 5 FT_mod = 6 PKNL = 1 PHC0 = -10662.88 PHC1 = 76.0864 SI = 64K 
       data hash MD5: 64K
       AB 16 5E 58 8C E1 26 6A 1E 60 74 CA 4C 5D A9 80>)
(   3,<2023-10-24 14:41:01.26 +0400>,<she>,<DPX200>,
      <pk PHC0 = -14.74259 PHC1 = 0 
       data hash MD5: 64K
       7E 70 8F 3C E8 66 D5 FF 02 D2 76 E5 3D AD 4F 32>)
(   4,<2023-10-24 14:41:16.76 +0400>,<she>,<DPX200>,
      <abs ABSG = 5 
       data hash MD5: 64K
       F6 EF 7A F5 E1 BD 00 9B 5A 8F AE E0 49 3A 32 26>)
$$ ##END=
$$ 
$$ hash MD5
$$ 84 24 C5 7E A7 45 FA 7A 9C 50 68 FA FE B1 75 D3
##$RELAX= 
##$RELAX= 
##$RELAX= 
##$RELAX= 
##$RELAX= 
##$RELAX= 
##$RELAX= 
##$RELAX= 
##$RELAX= 
$$ Bruker specific parameters
$$ --------------------------
##$DU= <F:/spectra>
##$EXPNO= 1
##$NAME= <P31>
##$PROCNO= 1
##$TYPE= <nmr>
##$USER= <she>
##$AMP= (0..31)
100 100 100 100 100 100 100 100 100 100 100 100 100 100 100 100 100 100 
100 100 100 100 100 100 100 100 100 100 100 100 100 100 
##$AQSEQ= 0
##$AQ_mod= 1
##$AUNM= <au_zg>
##$AUTOPOS= <>
##$BF1= 81.014009
##$BF2= 200.13
##$BF3= 200.13
##$BF4= 200.13
##$BF5= 200.13
##$BF6= 200.13
##$BF7= 200.13
##$BF8= 200.13
##$BYTORDA= 1
##$CFDGTYP= 0
##$CFRGTYP= 5
##$CHEMSTR= <none>
##$CNST= (0..31)
1 1 145 1 1 1 1 1 1 1 1 1 1 1 1 1 1 1 1 1 1 1 1 1 1 1 1 1 1 1 1 1 
##$CPDPRG= <waltz16>
##$CPDPRG1= <>
##$CPDPRG2= <waltz16>
##$CPDPRG3= <>
##$CPDPRG4= <mlev>
##$CPDPRG5= <mlev>
##$CPDPRG6= <mlev>
##$CPDPRG7= <mlev>
##$CPDPRG8= <mlev>
##$CPDPRGB= <>
##$CPDPRGT= <>
##$D= (0..31)
0 1 0 0 0 0 0 0 0 0 0 0.03 2e-05 3e-06 0 0 0 0 0 0 0 0 0 0 0 0 0 0 0 0 
0 0 
##$DATE= 1698144041
##$DBL= (0..7)
120 120 120 11 120 120 24 19 
##$DBP= (0..7)
150 150 150 150 150 150 150 150 
##$DBP07= 0
##$DBPNAM0= <>
##$DBPNAM1= <>
$$ [...]
##$SUBNAM3= <"">
##$SUBNAM4= <"">
##$SUBNAM5= <"">
##$SUBNAM6= <"">
##$SUBNAM7= <"">
##$SUBNAM8= <"">
##$SUBNAM9= <"">
##$SW= 501.771253377433
##$SWIBOX= (0..15)
0 1 3 0 0 0 0 0 0 0 0 0 0 0 0 0 
##$SW_h= 40650.406504065
##$TD= 32768
##$TD0= 1
##$TE= 0
##$TE2= 300
##$TE3= 300
##$TEG= 300
##$TL= (0..7)
0 120 53 12 22 120 120 120 
##$TP= (0..7)
150 150 150 150 150 150 150 150 
##$TP07= 0
##$TPNAME0= <>
##$TPNAME1= <>
##$TPNAME2= <>
##$TPNAME3= <>
##$TPNAME4= <>
##$TPNAME5= <>
##$TPNAME6= <>
##$TPNAME7= <>
##$TPOAL= (0..7)
0.5 0.5 0.5 0.5 0.5 0.5 0.5 0.5 
##$TPOFFS= (0..7)
0 0 0 0 0 0 0 0 
##$TUNHIN= 0
##$TUNHOUT= 0
##$TUNXOUT= 0
##$USERA1= <user>
##$USERA2= <user>
##$USERA3= <user>
##$USERA4= <user>
##$USERA5= <user>
##$V9= 5
##$VALIST= <valist>
##$VCLIST= <CCCCCCCCCCCCCCC>
##$VD= 0
##$VDLIST= <DDDDDDDDDDDDDDD>
##$VPLIST= <PPPPPPPPPPPPPPP>
##$VTLIST= <TTTTTTTTTTTTTTT>
##$WBST= 1024
##$WBSW= 4
##$XGAIN= (0..3)
0 0 0 0 
##$XL= 0
##$YL= 0
##$YMAX_a= 2412
##$YMIN_a= -3309
##$ZGOPTNS= <>
##$ZL1= 120
##$ZL2= 120
##$ZL3= 120
##$ZL4= 120
##$ABSF1= 248.5645
##$ABSF2= -253.2056
##$ABSG= 5
##$ABSL= 3
##$ALPHA= 0
##$AQORDER= 0
##$ASSFAC= 0
##$ASSFACI= 0
##$ASSFACX= 0
##$ASSWID= 0
##$AUNMP= <proc_1d>
##$AZFE= 0.1
##$AZFW= 0.5
##$BCFW= 0
##$BC_mod= 2
##$BYTORDP= 0
##$COROFFS= 0
##$CY= -3
##$DATMOD= 1
##$DC= 0
##$DFILT= <>
##$DTYPP= 0
##$F1P= 0
##$F2P= 0
##$FCOR= 1
##$FTSIZE= 65536
##$FT_mod= 6
##$GAMMA= 0
##$GB= 0
##$INTBC= 1
##$INTSCL= 6.047779e-11
##$ISEN= 30
##$LB= 5
##$LEV0= 0
##$LPBIN= 0
##$MAXI= 10000
##$MC2= 0
##$MEAN= 0
##$ME_mod= 0
##$MI= 50
##$NCOEF= 0
##$NC_proc= -7
##$NLEV= 6
##$NOISF1= 182.463
##$NOISF2= 159.3651
##$NSP= 0
##$NTH_PI= 0
##$NZP= 0
##$OFFSET= 248.5645
##$PC= 4
##$PHC0= -10677.62
##$PHC1= 76.0864
##$PH_mod= 1
##$PKNL= yes
##$PPARMOD= 0
##$PSCAL= 0
##$PSIGN= 0
##$REVERSE= no
##$SF= 81.0140089999694
##$SI= 65536
##$SIGF1= 159.3651
##$SIGF2= -187.1042
##$SINO= 113.3802
##$SIOLD= 16384
##$SREGLST= <1H.CDCl3>
##$SSB= 0
##$STSI= 65536
##$STSR= 0
##$SW_p= 40650.406504065
##$SYMM= 0
##$S_DEV= 0
##$TDeff= 32768
##$TDoff= 0
##$TI= <>
##$TILT= no
##$TM1= 0
##$TM2= 0
##$TOPLEV= 0
##$USERP1= <user>
##$USERP2= <user>
##$USERP3= <user>
##$USERP4= <user>
##$USERP5= <user>
##$WDW= 1
##$XDIM= 65536
##$YMAX_p= 403112133
##$YMIN_p= -6262195
$$ End of Bruker specific parameters
$$ ---------------------------------
##NTUPLES= NMR SPECTRUM
##VAR_NAME=  FREQUENCY,     SPECTRUM/REAL,   SPECTRUM/IMAG
##SYMBOL=    X,             R,               I
##VAR_TYPE=  INDEPENDENT,   DEPENDENT,       DEPENDENT
##VAR_FORM=  AFFN,          ASDF,            ASDF
##VAR_DIM=   65536,         65536,           65536
##UNITS=     HZ,            ARBITRARY UNITS, ARBITRARY UNITS
##FACTOR=    0.620285442955139, 1,           1
##FIRST=     20137.2065510682, 0,            0
##LAST=      -20513.1999529968, 0,           0
##MIN=       -20513.1999529968, -6262195,    0
##MAX=       20137.2065510682, 403112133,    0
$$ Real data points
##PAGE= N=1
##DATA TABLE= (X++(R..R)), XYDATA
$$ [...]
39784A73935k3231n2991q0469j08388j22206j08755o9443k7695k3967q2030j69326
$$ 173935 150704 97713 17244 -91144 -213350 -322105 -391548 -419243 -443210 -525240 -694566
39773f94566k08415j48429k2337Q0622J00717N7667J6641J6565L7663L1012l0151
$$ -694566 -902981 -1051410 -1073747 -993125 -892408 -834741 -818100 -801535 -763872 -732860 -763011
39762g63011j26203k06523k24673j66755n5925O7369J70960K39626K66303K47430
$$ -763011 -889214 -1095737 -1320410 -1487165 -1543090 -1475721 -1304761 -1065135 -798832 -551402
39752e51402J90842J16157L6591n1261j46273k18492k26502j63172p0209k056
$$ -551402 -360560 -244403 -207812 -259073 -405346 -623838 -850340 -1013512 -1083721 -1085777
39742a085777J6354J84o328N0302J94540L81594N10910N03973L66289J61680n6933
$$ -1085777 -1069423 -1069239 -1075567 -1025265 -830725 -449131 61779 565752 932041 1093721 1036788
39731A036788k63227m14716m41467l07356o9224J49646K49078K10620Q0206q1631
$$ 1036788 773561 358845 -82622 -389978 -459202 -309556 -60478 150142 230348 148717
39721A48717k22235k90421k44364q8918J01814K23529K18606J14037j4761j05945
$$ 148717 -73518 -363939 -608303 -697221 -595407 -371878 -153272 -39235 -53996 -159941
39711a59941j36986j13390n6291K560L4495K9896n503o6565j47780k26953k66890
$$ -159941 -296927 -410317 -466608 -464048 -429553 -399657 -405160 -471725 -619505 -846458 -1113348
39700a113348k43655j67536p0842K0519J00462J73594K37291K72379K54097J78139
$$ -1113348 -1357003 -1524539 -1595381 -1574862 -1474400 -1300806 -1063515 -791136 -537039 -358900
39690c58900P3492j9835q6638j40528j90389k16523j91398j17650l1759L1251
$$ -358900 -285408 -305243 -391881 -532409 -722798 -939321 -1130719 -1248369 -1280128 -1248877
39680a248877O5740Q2847Q0870M4228k5798r4608j21932j01036n8783k2150j066
$$ -1248877 -1183137 -1100290 -1019420 -975192 -1000990 -1095598 -1217530 -1318566 -1377349 -1399499 -1400565
39669a400565j605l1245q0414j18575j24791j08390q4911m7947J4407Q9477J53803
$$ -1400565 -1402170 -1433415 -1513829 -1632404 -1757195 -1865585 -1950496 -1998443 -1984036 -1894559 -1740756
39658a740756K09166K74760L43633L77199L50909K80827J95656J05662J2284p0919
$$ -1740756 -1531590 -1256830 -913197 -535998 -185089 95738 291394 397056 409340 338421
39648C38421j22471j26447p5629J9599J16355J59454J38950J10237J30582J85166
$$ 338421 215950 89503 13874 33473 149828 309282 448232 558469 689051 874217
39638H74217K01764J35798J8549p7343r7892l2935R0240K20512L02410L01756
$$ 874217 1075981 1211779 1230328 1152985 1055093 1022158 1112398 1332910 1635320 1937076
39628A937076K19137Q0598p8624k20877l09251l19509k55301j49129m3436L0459
$$ 1937076 2156213 2236811 2158187 1937310 1628059 1308550 1053249 904120 860684 891143
39618H91143N4136J1497j01210k40248l09359k30472l3633J48669J98313J12846
$$ 891143 945279 956776 855566 615318 305959 75487 41854 190523 388836 501682
39608E01682j8907j19544j77587k16202k43318k38343j69910k6222J56455L01514
$$ 501682 482775 363231 185644 -30558 -273876 -512219 -682129 -708351 -551896 -250382
39598b50382L51761L20829K62148J91068P3907r5568k48002k98491k36028j24446
$$ -250382 101379 422208 684356 875424 949331 853763 605761 307270 71242 -53204
39588e3204k7083L8942Q1378J05116J20149J50766K11013K75208K90819K26511
$$ -53204 -80287 -41345 40033 145149 265298 416064 627077 902285 1193104 1419615
39578A419615J01813l3615j44002k23116k69629k66844k05513j19026o7437p5679
$$ 1419615 1521428 1487813 1343811 1120695 851066 584222 378709 259683 192246 116567
39568A16567j08542j23175j27417j60709k27679k80364k67959j81249m7286R2425
$$ 116567 8025 -115150 -242567 -403276 -630955 -911319 -1179278 -1360527 -1407813 -1315388
39558a315388J90656K10778J57020P5692R364m0937r6077j54668j84771j52090
$$ -1315388 -1124732 -913954 -756934 -681242 -671878 -712815 -808892 -963560 -1148331 -1300421
39548a300421m5922J08245K46192K93256K26188J05924K5920K6120P2235J08956
$$ -1300421 -1346343 -1238098 -991906 -698650 -472462 -366538 -340618 -314498 -242263 -133307
39538a33307J05255N3198l6803j24553j55426j11438l2105K8293M4480J0495q0630
$$ -133307 -28052 25146 -11657 -136210 -291636 -403074 -435179 -406886 -362406 -351911 -432541
39527d32541k14108l28163l51147k67416j24690J9519J34060K01781K06980J51533
$$ -432541 -646649 -974812 -1325959 -1593375 -1718065 -1698546 -1564486 -1362705 -1155725 -1004192
39517a004192O5352j3722o2485p1795l9732K3566R4465J51455J90192K18185K37479
$$ -1004192 -938840 -952562 -1015047 -1086842 -1126574 -1103008 -1008543 -857088 -666896 -448711 -211232
39506b11232K35679J92503R6470m0266j83117k92592l39345l08163k05809p2468
$$ -211232 24447 216950 313420 273154 90037 -202555 -541900 -850063 -1055872 -1128340
39496a128340L6008R8219J45894K09633K60476K40012J44032L6765k6606n4611
$$ -1128340 -1092332 -994113 -848219 -638586 -378110 -138098 5934 42699 16093 -38518
39486c8518q0189j02505r9894p9897q0301j22669j90444k55696l08715l53067
$$ -38518 -118707 -221212 -321106 -401003 -481304 -603973 -794417 -1050113 -1358828 -1711895
39476a711895l79728l55276k44675n5550J43842K69635K94577K65821K48136K63617
$$ -1711895 -2091623 -2446899 -2691574 -2747124 -2603282 -2333647 -2039070 -1773249 -1525113 -1261496
39466a261496K88895K88246K38316J43026M2316j2088j0375j010l4636j03962
$$ -1261496 -972601 -684355 -446039 -303013 -260697 -272785 -283160 -284170 -318806 -422768
39456d22768j56667j52001q4451K8228J47500K16879K02101J33164P7607O6932
$$ -422768 -579435 -731436 -815887 -787659 -640159 -423280 -221179 -88015 -10408 56524
39446E6524P2463N3786J730p1358j51736k20545k56690k62828k69157k92452l07182
$$ 56524 128987 182773 184503 113145 -38591 -259136 -515826 -778654 -1047811 -1340263 -1647445
39435a647445k77838k07678j32194o9595l224P9809J51750J65353J11485L9493
$$ -1647445 -1925283 -2132961 -2265155 -2334750 -2337974 -2258165 -2106415 -1941062 -1829577 -1790084
39425a790084N751N279k6977j37910k92514l99566l88157k48059j9374K23417
$$ -1790084 -1784333 -1779054 -1806031 -1943941 -2236455 -2636021 -3024178 -3272237 -3291611 -3068194
39415c068194L89913M25190L59184K75670K21247J76316J25298J04455J38144
$$ -3068194 -2678281 -2253091 -1893907 -1618237 -1396990 -1220674 -1095376 -990921 -852777
39406h52777J65402R6622n7176j70159j39564Q79J33226J92296K14091K59264
$$ -852777 -687375 -590753 -647929 -818088 -957652 -956773 -823547 -631251 -417160 -157896
39396a57896L27543L61340L15549K08068J03789N5327N9039O6713L8980j4442
$$ -157896 169647 530987 846536 1054604 1158393 1213720 1272759 1339472 1378452 1364010
39386A364010m6191j6496P4242J86778K65367K65374J77989L6377j10287k34592
$$ 1364010 1317819 1301323 1375565 1562343 1827710 2093084 2271073 2307450 2197163 1962571
39376A962571l38030m21679m66073m51741l88455l07623k29048j49548o2496K5270
$$ 1962571 1624541 1202862 736789 285048 -103407 -411030 -640078 -789626 -852122 -826852
39366h26852R5965J28630J08191M4157k0703m1393j6013J7991L7151N8554J02825
$$ -826852 -730887 -602257 -494066 -449909 -470612 -512005 -528018 -510027 -472876 -414322 -311497
39355c11497J54939J80084J58480Q3429n4415k47905m45378n72522n88253n05552
$$ -311497 -156558 23526 182006 265435 211020 -36885 -482263 -1054785 -1643038 -2148590
39345b148590l65352k11936q6814j5153J0973J9309K5855L2003M6011P9290J20326
$$ -2148590 -2513942 -2725878 -2812692 -2827845 -2816872 -2797563 -2771708 -2739705 -2693694 -2614404 -2494078
39334b494078J42993J50772J85408K76432M02172N13018N71518N56646M57309
$$ -2494078 -2351085 -2200313 -2014905 -1738473 -1336301 -823283 -251765 304881 762190
39325G62190K92277J23586J8648n689J0848J7112j0407o3385j15012j38069j28784
$$ 762190 1054467 1178053 1196701 1191012 1201860 1218972 1208565 1145180 1030168 892099 763315
39314G63315j18217j46699k19102k93130l19571k91001k44362k15961k02100j70965
$$ 763315 645098 498399 279297 -13833 -333404 -624405 -868767 -1084728 -1286828 -1457793
39304a457793j08347l6924J4451M6028Q0192J32779K09355L19224M65277O16222
$$ -1457793 -1566140 -1603064 -1588613 -1542585 -1462393 -1329614 -1120259 -801035 -335758 280464
39294B80464P10152O95728N65233L56839J42888J752l8500l6442q4420k05278
$$ 280464 990616 1686344 2251577 2608416 2751304 2753056 2714556 2678114 2593694 2388416
39284B388416l27960l75878l46189k84383k19378j59475j25632j42542k00216
$$ 2388416 2060456 1684578 1338389 1054006 834628 675153 549521 406979 206763
39275B06763k56169k75492k47246j69737m9333Q2724J73674J78696Q7041o6443
$$ 206763 -49406 -324898 -572144 -741881 -791214 -708490 -534816 -356120 -269079 -335522
39265c35522k04894k45868j62941q773J35519K21701K36696J78088O4468n0296
$$ -335522 -540416 -786284 -949225 -957998 -822479 -600778 -364082 -185994 -121526 -171822
39255a71822j19211j55403k05025k69512k94525k39937j23768R306J26211K03272
$$ -171822 -291033 -446436 -651461 -920973 -1215498 -1455435 -1579203 -1569897 -1443686 -1240414
39245a240414K24186K00095J67060J50499J52561J74566K14945K36493J80367
$$ -1240414 -1016228 -816133 -649073 -498574 -346013 -171447 43498 279991 460358
39236D60358L8721j20125k25323k72233k91485k85769k40164j71430j16368p5473
$$ 460358 499079 378954 153631 -118602 -410087 -695856 -936020 -1107450 -1223818 -1299291
39226a299291j2090Q5116J71866J93457J40909N4318j5090m0991l3088k0745k4954
$$ -1299291 -1311381 -1226265 -1054399 -860942 -720033 -665715 -680805 -721796 -754884 -775629 -800583
39215h00583m7936q4281j22228j30023p2521L5562J19777J25968R4832J14884
$$ -800583 -848519 -932800 -1055028 -1185051 -1257572 -1222010 -1102233 -976265 -881433 -766549
39205g66549K06411K97152L20349K91836K66744K54744K13582J12616k6250j46745
$$ -766549 -560138 -262986 57363 349199 615943 870687 1084269 1196885 1170635 1023890
39195A023890j95769j44604M453K16123M24278N45140N12544L28350Q0683j12449
$$ 1023890 828121 683517 687970 904093 1328371 1873511 2386055 2714405 2795088 2682639
39185B682639j93680j92146j58218r9117J468J21784J96160J74505O8056o6074
$$ 2682639 2488959 2296813 2138595 2039478 2040946 2162730 2358890 2533395 2601451 2535377
39175B535377j68406k04759j75898j17783q2262r8317j46792j78428j60579j06939
$$ 2535377 2366971 2162212 1986314 1868531 1786269 1687952 1541160 1362732 1202153 1095214
39165A095214o2420n8570q3089r4815o9949k9060j4074m3305r6504j39029j46831
$$ 1095214 1032794 974224 891135 796320 726371 697311 683237 639932 543428 404399 257568
39154B57568j06588r321J39792L07367M38397M82455M18057K62208O4456j14117
$$ 257568 150980 141659 281451 588818 1027215 1509670 1927727 2189935 2254391 2140274
39144B140274k28347k62944k26724j46920p2684o0315j25294k11095k34074j69650
$$ 2140274 1911927 1648983 1422259 1275339 1202655 1142340 1017046 805951 571877 402227
39134D02227p5106j8931j0903j6283j1123P990N0368J22007J86267J75657O5531
$$ 402227 327121 308190 297287 281004 269881 277871 328239 450246 636513 812170 877701
39123H77701q7728k02850k49048k45143k07016j34963n0375k844j6743n0570l7998
$$ 877701 789973 587123 338075 92932 -114084 -249047 -299422 -302266 -319009 -369579 -407577
39112d07577L0746Q9912P1467j3789q4506p8305j7356K4706Q138l9817p2750q1132
$$ -407577 -376831 -286919 -215452 -229241 -313747 -392052 -409408 -384702 -376564 -416381 -489131 -570263
39100e70263r0304j20994j68856k13299k28063j86649p7446P6777K20824K97981
$$ -570263 -660567 -781561 -950417 -1163716 -1391779 -1578428 -1655874 -1579097 -1358273 -1060292
39090a060292K87590K20809J57788J35236J30666R2579J3697m6192k9733M3779
$$ -1060292 -772702 -551893 -394105 -258869 -128203 -35624 -21927 -68119 -97852 -54073
39080e4073J04552J23086J34386J63944J71389R9436m0696j66308k04151j53550
$$ -54073 50479 173565 307951 471895 643284 742720 702024 535716 331565 178015
39070A78015p0932j3777o069m0579r7197j57737k10513k47188k59627k41637j94190
$$ 178015 107083 93306 87237 46658 -50539 -208276 -418789 -665977 -925604 -1167241 -1361431
39059a361431j32055q7764j00111j81212k89541l49601l12510j96524o4702L0831
$$ -1361431 -1493486 -1581250 -1681361 -1862573 -2152114 -2501715 -2814225 -3010749 -3075451 -3044620
39049c044620Q0677J10391J55505K34794L29644L90446L78927L07854K29805J87103
$$ -3044620 -2963943 -2853552 -2698047 -2463253 -2133609 -1743163 -1364236 -1056382 -826577 -639474
39039f39474J83018J98506K16993K25270K07989J58732R0430K0773m9715j31754
$$ -639474 -456456 -257950 -40957 184313 392302 551034 641464 662237 612522 480768
39029D80768k19670k83477k94481k50193j67752o1030O4987J99842L19218L95023
$$ 480768 261098 -22379 -316860 -567053 -734805 -795835 -730848 -531006 -211788 183235
39019A83235M09295L58191K50797J08392m1017j72145k62683k85759k19615q0170
$$ 183235 592530 950721 1201518 1309910 1268893 1096748 834065 548306 328691 248521
39009B48521O4920J36036J02459m93j06460j56483j17163J689J35086J98151J59128
$$ 248521 313441 449477 551936 551443 444983 288500 171337 173026 308112 506263 665391
38998F65391O6816q509m4476o1124p1737p4597q2727j21092j88547k53843k96502
$$ 665391 732207 723698 679222 618098 546361 471764 389037 267945 79398 -174445 -470947
38987d70947l20162l15264k46761j09090L1740R1357N9760J1333J9081Q3770J55435
$$ -470947 -791109 -1106373 -1353134 -1462224 -1430484 -1339127 -1279367 -1268034 -1248953 -1165183 -1009748
38976a009748J99099K14971K03501J43466K6208r9298j46748p5822N7667J54567
$$ -1009748 -810649 -595678 -392177 -248711 -222503 -321801 -468549 -544371 -486704 -332137
38966c32137J68655J30074Q2103L1583k7795q0431j07179j18521j38113j64713
$$ -332137 -163482 -33408 48695 80278 52483 -27948 -135127 -253648 -391761 -556474
38956e56474j80626j89721k12045k39740k34652j83357j25701j08031j27273j42724
$$ -556474 -737100 -926821 -1138866 -1378606 -1613258 -1796615 -1922316 -2030347 -2157620 -2300344
38946b300344j29193r4058m7310J9051J11907K09587K65200K39816J34817m065
$$ -2300344 -2429537 -2523595 -2570905 -2551854 -2439947 -2230360 -1965160 -1725344 -1590527 -1594592
38936a594592j14591j55022j21162l7561N7914J25048J39310J18439J24354K11861
$$ -1594592 -1709183 -1864205 -1985367 -2022928 -1965014 -1839966 -1700656 -1582217 -1457863 -1246002
38926a246002L58872M58678M06212K03436k8830j52653j23195J571J36630K28261
$$ -1246002 -887130 -428452 -22240 181196 152366 -287 -123482 -121911 14719 242980
38916B42980K49503J88800P3703k0574k7953M1985J18926J51461J47260J35540
$$ 242980 492483 681283 754986 734412 706459 748444 867370 1018831 1166091 1301631
38906A301631J22843R9904O7941L7827J4624m226k6117o6803j39708k27351k79694
$$ 1301631 1424474 1524378 1592319 1630146 1644770 1640544 1614427 1547624 1407916 1180565 900871
38895I00871k62242j98618j46027j31488j28780r7506k9929M2985Q0691O4988
$$ 900871 638629 440011 293984 162496 33716 -63790 -93719 -50734 29957 94945
38885I4945J0013n5294j12601j57199j80102j66551j20604p0331k7996L9012J67375
$$ 94945 104958 49664 -62937 -220136 -400238 -566789 -687393 -757724 -785720 -746708 -579333
38874e79333L30455M40634M27357K94102R5950j10768k80587l69217l52297k60904
$$ -579333 -248878 191756 619113 913215 1009165 898397 617810 248593 -103704 -364608
38864c64608j74095j54881j92019k13039j59056m4678N8679R5466P4698M7314
$$ -364608 -538703 -693584 -885603 -1098642 -1257698 -1302376 -1243697 -1148231 -1073533 -1026219
38854a026219M8290P0258Q5178P7384N6465M8702P5153J27561J66161J53064R0269
$$ -1026219 -977929 -907671 -822493 -745109 -688644 -639942 -564789 -437228 -271067 -118003 -27734
38843b7734J6343l3423n0926l9260P827R5708K03111K78163K66064J48814l0800
$$ -27734 -11391 -44814 -95740 -135000 -127173 -31465 171646 449809 715873 864687 833887
38832H33887j84880k36622j74480n0348P3513J63996K06120J83223R6861k805
$$ 833887 649007 412385 237905 187557 261070 425066 631186 814409 911270 908465
38822I08465m1842N166Q2899J12490P3909J4973j6854k6407m4351p3327r0752
$$ 908465 866623 871789 954688 1067178 1141087 1156060 1139206 1112799 1068448 995121 904369
38811I04369r8187j30680k02116k69112k73859k05239r2629M1234J81628K84468
$$ 904369 806182 675502 473386 204274 -69585 -274824 -367453 -326219 -144591 139877
38801A39877K89529J91107N9552l4480r1048j48832k07861k26457j87653j26660
$$ 139877 429406 620513 680065 645585 554537 405705 197844 -28613 -216266 -342926
38791c42926q2192n0739n389N9294J17902J40054J15604O3895K6571L9714R8969
$$ -342926 -425118 -475857 -481246 -421952 -304050 -163996 -48392 15503 42074 81788 180757
38780A80757J55585J56866R0226j3998j12420j71942j76024j30596o6695j7844
$$ 180757 336342 493208 583434 569436 457016 285074 109050 -21546 -88241 -106085
38770a06085J6522P2142J69016K67042K92499K12397O8674o4162j39910j55435
$$ -106085 -89563 -17421 151595 418637 711136 923533 992207 928045 788135 632700
38760F32700j29983r2752p7304r8419j32463j42565j25468j10897j10962r8790
$$ 632700 502717 409965 332661 234242 101779 -40786 -166254 -277151 -388113 -486903
38750d86903n2607N063L8786N6720J05828K10213L33818M07501L82708K63648
$$ -486903 -539510 -534447 -495661 -438941 -333113 -122900 210918 618419 1001127 1264775
38740A264775J02673l6005j19370j51994j38177o1011P5337K01101K25578J36261
$$ 1264775 1367448 1331443 1212073 1060079 921902 860891 936228 1137329 1362907 1499168
38730A499168J7195m8696o4050q2045j21375j58049j84388k23732k76369k92299
$$ 1499168 1516363 1467667 1403617 1321572 1200197 1042148 857760 634028 357659 65360
38720F5360k24358q5601P2267K20598L58618M58873M51121K93134M4479j63600
$$ 65360 -158998 -244599 -172332 48266 406884 865757 1316878 1610012 1654491 1490891
38710A490891k40364k01202j19301l9415M0854J26132J96894K31104K25735J89247
$$ 1490891 1250527 1049325 930024 890609 931463 1057595 1254489 1485593 1711328 1900575
38700A900575J34826R0159Q8779J30415J63597J29517K0144j17535k23611k58558
$$ 1900575 2035401 2125560 2214339 2344754 2508351 2637868 2658012 2540477 2316866 2058308
38690B058308k13173j15839k8110m839m8227j14249j65561k01219k32525k50849
$$ 2058308 1845135 1729296 1701186 1696347 1648120 1533871 1368310 1167091 934566 683717
38680F83717k30825j56445m2876N4660O0414o0841k48406l77116l67479k53382
$$ 683717 452892 296447 253571 308231 368645 307804 59398 -317718 -685197 -938579
38670i38579j29631n5874l3445m8754r2885j38450j37793o3814O2037J87684K61274
$$ -938579 -1068210 -1124084 -1157529 -1206283 -1299168 -1437618 -1575411 -1639225 -1577188 -1389504 -1128230
38659a128230K47293J41103j9717j76636k92984l61689l71597l00216j59563j9762
$$ -1128230 -880937 -739834 -759551 -936187 -1229171 -1590860 -1962457 -2262673 -2422236 -2441998
38649b441998M8103M2376J5505k501l0487q3885j31930j27570o1571L2437J15972
$$ -2441998 -2393895 -2351519 -2336014 -2338515 -2369002 -2452887 -2584817 -2712387 -2773958 -2741521 -2625549
38638b625549J69944J86438J58987R2616J6540k5505m965O9018J56649K19051
$$ -2625549 -2455605 -2269167 -2110180 -2017564 -2001024 -2026529 -2031494 -1962476 -1805827 -1586776
38628a586776K46745K60769K86114L20423L27986K71110J51536J1647j14016k35057
$$ -1586776 -1340031 -1079262 -793148 -472725 -144739 126371 277907 289554 175538 -59519
38618e9519l71299m90919n19294m22763k54013r2988L0481J26658J86634J83185
$$ -59519 -430818 -921737 -1441031 -1863794 -2117807 -2210795 -2180314 -2053656 -1867022 -1683837
38608a683837J27475P6340O6926P6820O5206K4654k6337p4458j10069j16636r3160
$$ -1683837 -1556362 -1480022 -1413096 -1336276 -1271070 -1246416 -1272753 -1347211 -1457280 -1573916 -1667076
38597a667076p6793j11888j93172k57808k37325j10869Q1834K63344L64153L72726
$$ -1667076 -1743869 -1855757 -2048929 -2306737 -2544062 -2654931 -2573097 -2309753 -1945600 -1572874
38587a572874L45832L52075L98976M27462L80728K65034J37596M7968O77l2392
$$ -1572874 -1227042 -874967 -475991 -48529 332199 597233 734829 782797 783474 751082
38577G51082p4621j21873j53493j61979j64369j78998j96857j86990j30311l9622
$$ 751082 676461 554588 401095 239116 74747 -104251 -301108 -488098 -618409 -658031
38567f58031N3712J22829J52384J33577O4080m3378j53016k11201j72926l9296
$$ -658031 -604319 -481490 -329106 -195529 -131449 -174827 -327843 -539044 -711970 -751266
38557g51266J28226K43656K60856K06979J50306J33807J41268J28533Q1617L0958
$$ -751266 -623040 -379384 -118528 88451 238757 372564 513832 642365 723982 754940
38547G54940J772l5015j36466l06329m61719m99854l91576j98659j1293J14483
$$ 754940 756712 721697 585231 278902 -182817 -682671 -1074247 -1272906 -1284199 -1169716
38537a169716J70902J82607J84826J96523K03308J77903J22735P6167O4848O3680
$$ -1169716 -998814 -816207 -631381 -434858 -231550 -53647 69088 145255 210103 273783
38527B73783K2169p1788j71286k19132k06367j71334j44395j10360l7899O3983
$$ 273783 295952 224164 52878 -166254 -372621 -543955 -688350 -798710 -836609 -772626
38517g72626J42797J61342J36465J03846O7231J3028l8656m0908J4217P3658Q5428
$$ -772626 -629829 -468487 -332022 -228176 -160945 -147917 -186573 -227481 -213264 -139606 -54178
38506e4178N2974M570o1858j65208k86664l71912l93053l75641l52809l18986
$$ -54178 -1204 3366 -58492 -223700 -510364 -882276 -1275329 -1650970 -2003779 -2322765
38496b322765k45505j23513K5242J65997K62923K88156K44453J77975J47562J73179
$$ -2322765 -2568270 -2691783 -2666541 -2500544 -2237621 -1949465 -1705012 -1527037 -1379475 -1206296
38486a206296K23351K53897K47058K11700J63043J14418P7636N4674L0728j1568
$$ -1206296 -982945 -729048 -481990 -270290 -107247 7171 84807 139481 170209 158641
38476A58641o9511j21968j54267j69205j68520j37620o3660L5938J18958J57531
$$ 158641 89130 -32838 -187105 -356310 -524830 -662450 -726110 -690172 -571214 -413683
38466d13683J62921J66186J81210J94415J86611J54069J05665M9130j0753o5208
$$ -413683 -250762 -84576 96634 291049 477660 631729 737394 786524 775771 710563
38456G10563j06211j40238j81942k22328k16860j30639K326Q9779O7863l4620
$$ 710563 604352 464114 282172 59844 -157016 -287655 -285329 -195550 -127687 -162307
38446a62307j31270j64833j43640j07711q8857j01290j37216j57769j14417j316
$$ -162307 -293577 -458410 -602050 -709761 -798618 -899908 -1037124 -1194893 -1309310 -1310626
38436a310626J28584K18364K61892K78958K51619J29512q9070l15784m41388m36139
$$ -1310626 -1182042 -963678 -701786 -422828 -171209 -41697 -130767 -446551 -887939 -1324078
38426a324078l61659k92158k45575j89109q8873N3787K00287L01129L34785L26841
$$ -1324078 -1685737 -1977895 -2223470 -2412579 -2501452 -2447665 -2247378 -1946249 -1611464 -1284623
38416a284623L21998L34662L40729L21686K94866K82340K66831K07897J01451
$$ -1284623 -962625 -627963 -287234 34452 329318 611658 878489 1086386 1187837
38407A187837k258n0630m4872l5662p1151j53802k39353k72731k32784j48307
$$ 1187837 1185579 1134949 1090077 1054415 983264 829462 590109 317378 84594 -63713
38397f3713o8366j8098J1382L5704N4513N6743L5502n325m9959p7556q1751p9509
$$ -63713 -132079 -150177 -138795 -103091 -48578 8165 43667 38342 -11617 -89173 -170924 -250433
38385b50433q5109q2307m5710J6811P7574J44071K52093L84396M45428L62234
$$ -250433 -335542 -417849 -463559 -446748 -369174 -225103 26990 411386 856814 1219048
38375A219048J83818L5066j4583J434J3690j5254q2450j55373j85927j55945j18644
$$ 1219048 1402866 1437932 1423349 1424783 1438473 1423219 1340769 1185396 999469 843524 724880
38364G24880j57437k89580m39468n14692m76842l34726j18037J14371K79325L26345
$$ 724880 567443 277863 -161605 -676297 -1153139 -1487865 -1605902 -1491531 -1212206 -885861
38354h85861K81338K11561J58355J17779O6464j3598j16544j96526j88208p0089
$$ -885861 -604523 -392962 -234607 -116828 -50364 -63962 -180506 -377032 -565240 -635329
38344f35329J02183K45270L18952L30688K92322K07526R6557m66n5207p1547p3564
$$ -635329 -533146 -287876 31076 361764 654086 861612 958169 957703 902496 830949 757385
38333G57385q5420j19477j68466k08106k16174j87231j26827m6064K8821O1069
$$ 757385 671965 552488 384022 175916 -40258 -227489 -354316 -400380 -371559 -310490
38323c10490L9445j98r386K1981O0512O1912l953j36096k81927l53264l03643
$$ -310490 -271045 -271243 -280629 -258648 -198136 -136224 -140177 -276273 -558200 -911464 -1215107
38312a215107j87239j06569j00991j17453q8990m142J05368K02189K50520K24874
$$ -1215107 -1402346 -1508915 -1609906 -1727359 -1816349 -1820491 -1715123 -1512934 -1262414 -1037540
38302a037540J42241O1211J9701q008o2666j24458j24286l2318R6365J76449J72673
$$ -1037540 -895299 -834088 -814387 -822395 -885061 -1009519 -1133805 -1166123 -1069758 -893309 -720636
38291g20636J14008M7811L410n305K8688R2992J47157J49852R7030J7125p1288
$$ -720636 -606628 -558817 -555407 -560712 -532024 -439032 -291875 -142023 -44993 -27868 -99156
38280i9156j71333k66783l00898k30614q9781L7646J06736J40855J69390J77492
$$ -99156 -270489 -537272 -838170 -1068784 -1158565 -1120919 -1014183 -873328 -703938 -526446
38270e26446J41226Q2095M8687N0238L9061l2170j50157k46493k59803j90389
$$ -526446 -385220 -303125 -254438 -204200 -165139 -197309 -347466 -593959 -853762 -1044151
38260a044151r4066k1980K9172R9834K06291L14640L80681L97099L87378L67502
$$ -1044151 -1138217 -1160197 -1131025 -1031191 -824900 -510260 -129579 267520 654898 1022400
38250A022400L34234K83743K16671J20566k7759k22352m01697m87722m58682l68615
$$ 1022400 1356634 1640377 1857048 1977614 1949855 1727503 1325806 838084 379402 10787
38240A0787k85532k25435j64210j01133p7957j27628k28774l23058l56177k90561
$$ 10787 -274745 -500180 -664390 -765523 -843480 -971108 -1199882 -1522940 -1879117 -2169678
38230b169678j12210J36720L47883M16752L36958K03558J17279J03867J24068
$$ -2169678 -2281888 -2145168 -1797285 -1380533 -1043575 -840017 -722738 -618871 -494803
38221d94803J29135R2423J3460q2624j55830j78115j53592j13095r1807j03688
$$ -494803 -365668 -273245 -259785 -342409 -498239 -676354 -829946 -943041 -1034848 -1138536
38211a138536j25084j11353m7072K8324O6172O8448P0097P0587K9905n9139j42858
$$ -1138536 -1263620 -1374973 -1422045 -1393721 -1327549 -1259101 -1189004 -1118417 -1088512 -1147651 -1290509
38200a290509j75014j73544j78245j85336j62125j03321l2599L8220J14291J90274
$$ -1290509 -1465523 -1639067 -1817312 -2002648 -2164773 -2268094 -2300693 -2262473 -2148182 -1957908
38190a957908K52577L05397L62303M10771M13048L46793K25029P6240p3531j98577
$$ -1957908 -1705331 -1399934 -1037631 -626860 -213812 132981 358010 434250 360719 162142
38180A62142k77321l07548l06437k91374k66496k24191j53520n6891L4564Q0385
$$ 162142 -115179 -422727 -729164 -1020538 -1287034 -1511225 -1664745 -1721636 -1687072 -1606687
38170a606687Q0655Q5115J26400J61195J12355l4773k05613l01066k65890j09347
$$ -1606687 -1526032 -1440917 -1314517 -1153322 -1040967 -1075740 -1281353 -1582419 -1848309 -1957656
38160a957656R9523K58080K95733K30429J36721N6548k4675j10232j48190q5604
$$ -1957656 -1858133 -1600053 -1304320 -1073891 -937170 -880622 -905297 -1015529 -1163719 -1249323
38150a249323N8323K01033K67478K39805J56704Q2481O1878Q5503J04985Q9665
$$ -1249323 -1191000 -989967 -722489 -482684 -325980 -243499 -181621 -96118 8867 98532
38140I8532N7213M4069O3628J00397J23481R4847r554j62394k82325k94602j98325
$$ 98532 155745 199814 263442 363839 487320 582167 572613 410219 127894 -166708 -365033
38129c65033o8708K784k3863j05145j41509o0643J10428K69735L41925L33289
$$ -365033 -433741 -430957 -454820 -559965 -701474 -762117 -651689 -381954 -40029 293260
38119B93260K82776K00710Q5420l2774j09549j38949j52159j67080j67600j31679
$$ 293260 576036 776746 862166 829392 719843 580894 428735 261655 94055 -37624
38109c7624n7686L3935J07286J29438J04092P4073O3583L3490o6276k05256k80995
$$ -37624 -95310 -61375 45911 175349 279441 353514 417097 450587 384311 179055 -101940
38098a01940k34169j19376l9059l2280n5061n6479m4369o7669j44761k23530k26060
$$ -101940 -336109 -455485 -494544 -526824 -581885 -638364 -682733 -750402 -895163 -1118693 -1344753
38087a344753j35850k3109L2328K8786L0489P8686J46277J81214J65421J22986
$$ -1344753 -1480603 -1503712 -1471384 -1442598 -1412109 -1333423 -1187146 -1005932 -840511 -717525
38077g17525R2686R9302J32411J48413J11470L3325m5840j06691j47093j36389
$$ -717525 -624839 -525537 -393126 -244713 -133243 -99918 -145758 -252449 -399542 -535931
38067e35931k7982J61614L32926L99010L71628L20355K75754K13639J13647j3466
$$ -535931 -563913 -402299 -69373 329637 701265 1021620 1297374 1511013 1624660 1611194
38057A611194j48507k70714l43535l36081k70073k14217k16136k55929k73321
$$ 1611194 1462687 1191973 848438 512357 242284 28067 -188069 -443998 -717319
38048g17319k27161j29473l8169j2275n2966r3027o9527k749K8554r016o1502
$$ -717319 -944480 -1073953 -1112122 -1124397 -1177363 -1270390 -1339917 -1342666 -1314112 -1323128 -1384630
38037a384630o0258j636O4197R2274O6493n791q6717j11885m1815Q6757J86805
$$ -1384630 -1444888 -1446524 -1382327 -1290053 -1223560 -1229351 -1316068 -1427953 -1469768 -1383011 -1196206
38026a196206K04752J64016J25571J22618J39662J43760J26090J09298J12017
$$ -1196206 -991454 -827438 -701867 -579249 -439587 -295827 -169737 -60439 51578
38017E1578J14699Q0072R477m8339n9894n0934o0826p8474o6225l4581m0240j03045
$$ 51578 166277 246349 255826 207487 147593 96659 35833 -42641 -108866 -143447 -183687 -286732
38005b86732j75455k16144k47828l03888l50570l12975j70243J5943J67792K52631
$$ -286732 -462187 -678331 -926159 -1230047 -1580617 -1893592 -2063835 -2047892 -1880100 -1627469
37995a627469K77308K59566K20245J77628J31750P1202Q039j4162L3492J23317
$$ -1627469 -1350161 -1090595 -870350 -692722 -560972 -489770 -481731 -495893 -462401 -339084
37985c39084J94473K11382J83037J32203O7198j2571r8041j66060j92252j71704
$$ -339084 -144611 66771 249808 382011 449209 436638 338597 172537 -19715 -191419
37975a91419j30921j09716j18444j19051o5407L7740J32065J65269J39660R8261
$$ -191419 -322340 -432056 -550500 -669551 -734958 -697218 -565153 -399884 -260224 -161963
37965a61963P9786R7237J44872K05017K48514K44661J82490Q5039P99k8004j965
$$ -161963 -82177 15060 159932 364949 613463 858124 1040614 1125653 1126452 1098448 1096483
37954A096483K8753P288p3020j62670k09321k01200j51175o5112M3743J23014
$$ 1096483 1125236 1132524 1059504 896834 687513 486313 335138 270026 313769 436783
37944D36783J08800J938j10444j34315o1217L3395P4357N3688K2330L6704J14312
$$ 436783 545583 547521 437077 302762 241545 274940 349297 402985 425315 462019 576331
37933E76331K22215K98048K91360J97482N6296p9318j72354k08002j89019j35145
$$ 576331 798546 1096594 1387954 1585436 1641732 1562414 1390060 1182058 993039 857894
37923H57894q0880o0649q7429j42647j86768j85127j33131o0283l114L2018P3882
$$ 857894 777014 716365 628936 486289 299521 114394 -18737 -79020 -82134 -50116 23766
37912B3766J45093K21221K48843K08955J41975R1973M3245n2854j87296k71442
$$ 23766 168859 390080 638923 847878 989853 1081826 1125071 1072217 884921 613479
37902F13479k33621j11484r109K6928M3791R0022J35474J14763K1550p9674j26138
$$ 613479 379858 268374 259265 286193 329984 420006 555480 670243 691793 612119 485981
37891D85981j08371n2711J4773P8298J29296J64843J77967J49032O5527m6013
$$ 485981 377610 324899 339672 417970 547266 712109 890076 1039108 1104635 1058622
37881A058622j30126j55839j43471j28167j16222r4600o6810n3397o0242o7456
$$ 1058622 928496 772657 629186 501019 384797 290197 223387 169990 109748 42292
37871D2292n3204j6402K5528N1782N2446L7661L1867N0108Q0657R6691P9463K3530
$$ 42292 -10912 -27314 -1786 49996 102442 140103 171970 222078 302735 399426 478889 502419
37859E02419o7026j68908k36808k40273k07220k02608k50054k96704k74189j76919
$$ 502419 435393 266485 29677 -210596 -417816 -620424 -870478 -1167182 -1441371 -1618290
37849a618290n6920M6088J37394K27434K89453K80170J96164R1684L3855M4424
$$ -1618290 -1675210 -1629122 -1491728 -1264294 -974841 -694671 -498507 -406823 -372968 -328544
37839c28544Q8468J15695J04283O2906M105o3693j14259r5174L3950K48604M53491
$$ -328544 -240076 -124381 -20098 42808 46913 -16780 -131039 -226213 -192263 56341 509832
37828E09832N39248M55111K39974p473j92878k75952k73859k30166j85254j62142
$$ 509832 1049080 1504191 1744165 1736692 1543814 1267862 994003 763837 578583 416441
37818D16441j56081j33098o0936M5159J24975J39178J17947J22650J71948K32007
$$ 416441 260360 127262 66326 111485 236460 375638 493585 616235 788183 1020190
37808A020190K68495K72090K34059J40620R793j00835j50597j57867j61292j62622
$$ 1020190 1288685 1560775 1794834 1935454 1945247 1844412 1693815 1535948 1374656 1212034
37798A212034j41661j10448j07927j38957j57317j21990m1504N0688J35780K02912
$$ 1212034 1070373 959925 851998 713041 555724 433734 392230 442918 578698 781610
37788G81610K27497J90387J13491M7750K0361J2403o921m2996q3408j26429j81448
$$ 781610 1009107 1199494 1312985 1360735 1381096 1393499 1386578 1343582 1260174 1133745 952297
37777I52297k43037k81942k69722k05155j12310k2221L4603K8492n2898j77986
$$ 952297 709260 427318 157596 -47559 -159869 -182090 -147487 -118995 -171893 -349879
37767c49879k74596k78768j86267n2902N5010J07732J17039J08568R7124Q5071
$$ -349879 -624475 -903243 -1089510 -1142412 -1087402 -979670 -862631 -754063 -656939 -571868
37757e71868P4020O7821O1977M0666l020m7423o0206l9678j9915k3352k5442J4851
$$ -571868 -497848 -430027 -368050 -327384 -330404 -377827 -438033 -477711 -497626 -520978 -546420 -531569
37745e31569J01628K01289K85776L47645L72685L31872K19386Q0728j6150l3037
$$ -531569 -429941 -228652 57124 404769 777454 1109326 1328712 1409440 1393290 1360253
37735A360253J9560J00140J60276J62711R3994l4044j90502l27065l87504l46622
$$ 1360253 1379813 1479953 1640229 1802940 1896934 1862890 1672388 1345323 957819 611197
37725F11197k45640j58588j09719n5340L2291J01753Q7061J1006l2738J587O3996
$$ 611197 365557 206969 97250 41910 74201 175954 263015 274021 241283 242870 306866
37714C06866Q8003O4234J2393o8240j75319k61743k69036j95054r0798L191P8740
$$ 306866 394869 459103 471496 403256 227937 -33806 -302842 -497896 -588694 -585503 -506763
37703e06763J22457J03532J6400r7799j94387k65432l15017l18685k43871j07098
$$ -506763 -384306 -280774 -264374 -362173 -556560 -821992 -1137009 -1455694 -1699565 -1806663
37693a806663K0228P4342N4472J1605n771R516K7963K0381n404o295M7478J27408
$$ -1806663 -1786435 -1712093 -1657621 -1646016 -1651787 -1642271 -1614308 -1593927 -1599331 -1605626 -1558148 -1430740
37681a430740J68519J42962R3272P7048R5294J01934P6956N5064P0063J00420
$$ -1430740 -1262221 -1119259 -1025987 -948939 -853645 -751711 -674755 -619691 -549628 -449208
37671d49208R6845M8896o227l7683n1532n7788l8000K5227R8681J12661L5595
$$ -449208 -352363 -303467 -309694 -347377 -398909 -456697 -494697 -469470 -370789 -258128 -222533
37660b22533q3006j55973j34799l6346Q6870J79255J94092J10582l8660j72572
$$ -222533 -305539 -461512 -596311 -632657 -545787 -366532 -172440 -61858 -100518 -273090
37650b73090k20055j77392r8433l3258P381L0414K9763o320o7756j17996j17531
$$ -273090 -493145 -670537 -768970 -802228 -794847 -764433 -734670 -740990 -808746 -926742 -1044273
37639a044273n0615N9879J55368J72604R3909k9339j14968j17104n2265L4725
$$ -1044273 -1094888 -1035009 -879641 -707037 -613128 -642467 -757435 -874539 -926804 -892079
37629h92079J14254J76575K09935J95728J32258N3127N832L464M630m3916j42623
$$ -892079 -777825 -601250 -391315 -195587 -63329 -10202 -4370 -906 3724 -40192 -182815
37618a82815k30893k50695k05095j41869r2663m8718R754Q4422J62584K30007
$$ -182815 -413708 -664403 -869498 -1011367 -1104030 -1152748 -1142994 -1058572 -895988 -665981
37608f65981K72096K76283K40209J68084O0580p2073j85820k23602j82092j35326
$$ -665981 -393885 -117602 122607 290691 351271 279198 93378 -130224 -312316 -447642
37598d47642j60466k47051l08236k81440j90998j06524o7071o2033o5211n9959
$$ -447642 -608108 -855159 -1163395 -1444835 -1635833 -1742357 -1809428 -1871461 -1936672 -1996631
37588a996631l3526K9193J31484K47319L26727L26848K45905J30513M5189K5980
$$ -1996631 -2030157 -2000964 -1869480 -1622161 -1295434 -968586 -722681 -592168 -546979 -520999
37578e20999N7211Q9800Q2531L2903k2492l7355L541O5125Q9702N3513o522l0689
$$ -520999 -463788 -373988 -291457 -258554 -281046 -318401 -314860 -249735 -160033 -106520 -113042 -143731
37566a43731K355O4787J27660J95646K77719L42332L35823K49444J38478N8336
$$ -143731 -141376 -76589 51071 246717 524436 866768 1202591 1452035 1590513 1648849
37556A648849M091o3244j47752k09033k17512j85394j35591p1070R655R3527J70084
$$ 1648849 1652940 1589696 1441944 1232911 1015399 830005 694414 623344 632999 726526 896610
37545H96610K42125K89891K47760O5545k03148m16845m73810m02616l09669k61509
$$ 896610 1138735 1428626 1676386 1741931 1538783 1121938 648128 245512 -64157 -325666
37535c25666k45706k30359k19912k38521k80061k95576k32704q8140P2885J53981
$$ -325666 -571372 -801731 -1021643 -1260164 -1540225 -1835801 -2068505 -2156645 -2083760 -1929779
37525a929779J05134k2834j10546p4105O0069J89922K41826K28282K08685K18896
$$ -1929779 -1824645 -1847479 -1958025 -2032130 -1972061 -1782139 -1540313 -1312031 -1103346 -884450
37515h84450K50578K75467K61666J77229J7019j59878k47924j78992J4917K35157
$$ -884450 -633872 -358405 -96739 80490 97509 -62369 -310293 -489285 -474368 -239211
37505b39211M03428N02764N48715N51794N13056M33052L12521J56714j2075j56991
$$ -239211 164217 666981 1215696 1767490 2280546 2713598 3026119 3182833 3170758 3013767
37495C013767k50359k89883k91670k80665k87024l26015l66807l45187k35828
$$ 3013767 2763408 2473525 2181855 1901190 1614166 1288151 921344 576157 340329
37486C40329j01063l7177p2424j44765j81335j66823j21637n0267N1146J51364
$$ 340329 239266 202089 129665 -15100 -196435 -363258 -484895 -535162 -484016 -332652
37476c32652J90722J41087L4583p5930j61257k07787j93377j07638P021P1393
$$ -332652 -141930 -843 33740 -42190 -203447 -411234 -604611 -712249 -705228 -633835
37466f33835M7800j2297j9541N9188J74692K59726K95259L03350K96734K61745
$$ -633835 -586035 -598332 -617873 -558685 -383993 -124267 170992 474342 771076 1032821
37456A032821J86770Q3013k8376j29178j95316j99835j49629j05430j29017k01889
$$ 1032821 1219591 1302604 1274228 1145050 949734 749899 600270 494840 365823 163934
37446A63934k24838j21328O9575K23647K52943J82386J07025R0529J13313J08244
$$ 163934 -60904 -182232 -112657 110990 363933 546319 653344 743873 857186 965430
37436I65430L2454r5128k12908k62204k19337j01506M3768J59355K08781K00365
$$ 965430 997884 902756 689848 427644 208307 106801 150569 309924 518705 719070
37426G19070J79026J85932K23325K57511K51193J92684J02926K0008l0550n7922
$$ 719070 898096 1084028 1307353 1564864 1816057 2008741 2111667 2131675 2101125 2043203
37416B043203r2922j45065j79310j48589n0052N9561J06580N7035o0596j76854
$$ 2043203 1950281 1805216 1625906 1477317 1427265 1486826 1593406 1650441 1589845 1412991
37406A412991k27895j96562j18850n2108l5653p4287j43789k04557k22902j94287
$$ 1412991 1185096 988534 869684 817576 781923 707636 563847 359290 136388 -57899
37396e7899j42986r3171n0266j6149k047q025q165J7957N3008O9049P0959P5606
$$ -57899 -200885 -294056 -344322 -360471 -362518 -370543 -378708 -360751 -307743 -238694 -167735 -92129
37384i2129O2501j801q9190j18826o0685K1173N7488N8858P5224J13349J41290
$$ -92129 -29628 -31429 -120619 -239445 -300130 -278957 -221469 -162611 -87387 25962 167252
37373A67252J42448J16118N2687l6187q4034l0012R1062J75942J72369J21032
$$ 167252 309700 425818 478505 442318 358284 328272 419334 595276 767645 888677
37363H88677P9576O2198O1157O7218N1692j2111q4619p8095K2835J14118R5378
$$ 888677 968253 1030451 1091608 1158826 1210518 1198407 1113788 1035693 1058528 1172646 1268024
37352A268024o323r3006j34814j78826k40162k67612k28759j60959j10323p1176
$$ 1268024 1261701 1168695 1033881 855055 614893 347281 118522 -42437 -152760 -223936
37342b23936k0170K6782L1863q192n7125q5545r7906j12426j30594j32539r8889
$$ -223936 -244106 -217324 -185461 -193653 -250778 -336323 -434229 -546655 -677249 -809788 -908677
37331i08677l6159K2025M6005M2843N0785J00344J86865K78392L40516L56283
$$ -908677 -944836 -922811 -876806 -833963 -783178 -682834 -495969 -217577 122939 479222
37321D79222L34961L01913K69290K20351J37549M0340k9123n9123p8490j03985
$$ 479222 814183 1116096 1385386 1605737 1743286 1783626 1754503 1695380 1616890 1512905
37311A512905j10200p8201m9312q8403j93112k73884k40295r3094P6670J65990
$$ 1512905 1402705 1324504 1275192 1186789 993677 719793 479498 386404 463074 629064
37301F29064J33557J8483r4068j35716j05284o0246m9948o2687n1681l954M4170
$$ 629064 762621 781104 687036 551320 446036 385790 335842 273155 221474 217520 261690
37290B61690O3564P1125R0224R9422N8311k6110j00342j33662j44917j49171j24426
$$ 261690 325254 396379 486603 586025 644336 618226 517884 384222 239305 90134 -34292
37279c4292o1326n299k294k8066k6081m189l1935j31881k29846k40349j61754
$$ -34292 -95618 -100917 -103211 -131277 -157358 -161547 -193482 -325363 -555209 -795558 -957312
37268i57312n8778J4089L9504J9876k2771m2703m389Q0550J69953K30921K41325
$$ -957312 -1016090 -1002001 -962497 -942621 -965392 -1008095 -1012484 -931934 -761981 -531060 -289735
37257b89735J77191M2075j00276j68423j44669q1637k7384J9362P6540J43743
$$ -289735 -112544 -70469 -170745 -339168 -483837 -565474 -592858 -573496 -496956 -353213
37247c53213K12711K74179K98003K46253J30990K2900k9833o1988j35542k48323
$$ -353213 -140502 133677 431680 677933 808923 831823 801990 740002 604460 356137
37237C56137l38329l61713l24398k46590j41306l1781M6389P0895M1811k7122
$$ 356137 17808 -343905 -668303 -914893 -1056199 -1087980 -1041591 -970696 -928885 -956007
37227i56007r8082j04078l395J53999K58993K58642K03215J65305J55249J41561
$$ -956007 -1054089 -1158167 -1161562 -1007563 -748570 -489928 -286713 -121408 33841 175402
37217A75402J13391Q3017N3052K0743k550j0592k3045n1086o2477k7928R139l3722
$$ 175402 288793 371810 424862 445605 443055 432463 409418 358332 295855 267927 277066 243344
37205B43344j64074k82500k87263j78692m0292N1809P5050M4602r558n3246o1639
$$ 243344 79270 -203230 -490493 -669185 -709477 -657668 -582618 -538016 -547574 -600820 -662459
37194f62459k9626L3770J11151J71573J78661J22728L6168l8889r1822j38146
$$ -662459 -692085 -658315 -547164 -375591 -196930 -74202 -38034 -76923 -168745 -306891
37184c06891j79592j87918j33232k2521R2037J47466J24930P2375N7204R2234
$$ -306891 -486483 -674401 -807633 -830154 -738117 -590651 -465721 -393346 -336142 -243908
37174b43908J28487J28763J19107J44508J99002K33785K19127J61152O9335m4360
$$ -243908 -115421 13342 132449 276957 475959 709744 928871 1090023 1159358 1114998
37164A114998j30771j19765J635J57042K50048K44721J66005N8650k4525l0649
$$ 1114998 984227 864462 866097 1023139 1273187 1517908 1683913 1742563 1718038 1687389
37154A687389M4693J28010J34059O2144j2476m2893n9471j00884j43748j36182
$$ 1687389 1732082 1860092 1994151 2056295 2043819 2000926 1941455 1840571 1696823 1560641
37144A560641p3881l911L6869N3809O5360O6970K9627p6249k49185m32981n33086
$$ 1560641 1486760 1482849 1519718 1573527 1638887 1705857 1735484 1659235 1410050 977069 443983
37133D43983m83741l07532r6803O3659J43766J50015R6529Q706p0763j08289j08967
$$ 443983 -39758 -347290 -444093 -380434 -236668 -86653 9876 18582 -52181 -160470 -269437
37122b69437j04833j16277j35637j42539j20012n6663M9404J77999K84607L23266
$$ -269437 -374270 -490547 -626184 -768723 -888735 -945398 -895994 -717995 -433388 -110122
37112a10122K79609J83338Q6065K3595k044o881j71J9605N3429J00150J63054
$$ -110122 169487 352825 438890 462485 460441 453560 453389 472994 526423 626573 789627
37101G89627K42301L20056L70402L89232L97084M04087L90718L36999K53554J65916
$$ 789627 1031928 1351984 1722386 2111618 2508702 2912789 3303507 3640506 3894060 4059976
37091D059976Q4953J7308j0289K4997R2604J19231O5090l2202j00355r4476m501
$$ 4059976 4144929 4162237 4151948 4176945 4269549 4388780 4453870 4421668 4321313 4226837 4222336
37080D222336J64063L80402N77624O97328P52267Q16282R46471J140996J370777
$$ 4222336 4386399 4766801 5344425 6041753 6794020 7610302 8556773 9697769 11068546
37071A1068546J600373J744728J651119J200147M44010l93254j074743j495463
$$ 11068546 12668919 14413647 16064766 17264913 17708923 17315669 16240926 14745463
37063A4745463j677221j677036j542809j329750j100850q96389p27513o02369
$$ 14745463 13068242 11391206 9848397 8518647 7417797 6521408 5793895 5191526
37055E191526n32307n08036m97729m80554m61366m43389m10649l52818k86017
$$ 5191526 4659219 4151183 3653454 3172900 2711534 2268145 1857496 1504678 1218661
37046A218661k28797j73325j02385k4109L2724N3667N0697M2231L7034L5790L3196
$$ 1218661 989864 816539 714154 690045 722769 776436 827133 869364 906398 942188 975384
37035I75384J8257j4006m8227n5183j6723N7169J33380J76890J75549J49283J28629
$$ 975384 993641 979635 931408 876225 859502 916671 1050051 1226941 1402490 1551773 1680402
37024A680402J21651J10809Q2607M4980J3172p98K0557R0089J79987K24540J87615
$$ 1680402 1802053 1912862 1995469 2040449 2053621 2052823 2073380 2163469 2343456 2567996 2755611
37013B755611J06992M1274o477p1415j47160j76452j31257n7444j4942k154L2121
$$ 2755611 2862603 2903877 2897400 2825985 2678825 2502373 2371116 2313672 2298730 2296576 2328697
37002B328697J15742K17616K83764K93834K77594K80413L17193L63104L84610
$$ 2328697 2444439 2662055 2945819 3239653 3517247 3797660 4114853 4477957 4862567
36993D862567L68237L22259K74143K73607L66013N34962O91207P49610P05008
$$ 4862567 5230804 5553063 5827206 6100813 6466826 7001788 7692995 8442605 9147613
36984I147613O06164M74964K91622M9718k18058m69896o73804p98302q25613p79979
$$ 9147613 9753777 10228741 10520363 10570081 10352023 9882127 9208323 8410021 7584408 6804429
36974F804429p05382o09075m64806k78820j11490j9101q359n6633j33584j87093
$$ 6804429 6099047 5489972 5025166 4746346 4634856 4615755 4607396 4550763 4417179 4230086
36964D230086j57245m0117R3065J72064J98518K13288K19264J73222M4791j42175
$$ 4230086 4072841 4032724 4125789 4297853 4496371 4709659 4928923 5102145 5146936 5004761
36954E004761l21290m23196m17720l33804k29828j37030m3566O7361J87540K93268
$$ 5004761 4683471 4260275 3842555 3508751 3278923 3141893 3098327 3165688 3353228 3646496
36944C646496L55750L39734K29831P1212n0244q4329m6267L0365J22541J88629
$$ 3646496 4002246 4341980 4571811 4643023 4592779 4508450 4462183 4492548 4615089 4803718
36934D803718J72434P6080j6184l1574P216L2379L1440M7798J03674J73581K26238
$$ 4803718 4976152 5052232 5036048 5004474 5011690 5044069 5075509 5123307 5226981 5400562 5626800
36923E626800K50592K41256J90054R7076k1306j27031j59742p0709J22295L33885
$$ 5626800 5877392 6118648 6308702 6405778 6384472 6257441 6097699 6026990 6149285 6483170
36913F483170M79239N25408M77862L61921K33256J60668J70999K42909L65139
$$ 6483170 6962409 7487817 7965679 8327600 8560856 8721524 8892523 9135432 9500571
36904I500571N51935P86332J008863J188977J349530J498337J609502J705758
$$ 9500571 10052506 10838838 11847701 13036678 14386208 15884545 17494047 19199805
36896A9199805J871880K126322K355400K446432K430392K438543K585445K944493
$$ 19199805 21071685 23198007 25553407 27999839 30430231 32868774 35454219 38398712
36888C8398712L544102M307067N077904N797536O575970P525741Q638884R923884
$$ 38398712 41942814 46249881 51327785 57125321 63701291 71227032 79865916 89789800
36880H9789800J1531849J3615284J6186275J9250214K2924489K7241072L1946809
$$ 89789800 101321649 114936933 131123208 150373422 173297911 200538983 232485792
36873B32485792L6541609M0036917M0267782L4095613J9684420p78231k1277371
$$ 232485792 269027401 309064318 349332100 383427713 403112133 402333902 381056531
36866C81056531l5753411m1932857m1600976l7889293l2958958k7798622k2960725
$$ 381056531 345303120 303370263 261769287 223879994 190921036 163122414 140161689
36859A40161689j8811777j5425540j2712406j0623005r086438p907816o901495
$$ 140161689 121349912 105924372 93211966 82588961 73502523 65594707 58693212
36852E8693212o031783n312147m676109m056707l492607l044999k684299k348454
$$ 58693212 52661429 47349282 42673173 38616466 35123859 32078860 29394561 27046107
36844B7046107k042181j796761j597102j424417j311220j281690j286935j259993
$$ 27046107 25003926 23207165 21610063 20185646 18874426 17592736 16305801 15045808
36836A5045808j188608j086547r50865p99526o91866o51688o20516n44801m61730
$$ 15045808 13857200 12770653 11819788 11020262 10328396 9676708 9056192 8511391 8049661
36827H049661m39860m78247n24777n56961n82342n86213n38712m39877l14179
$$ 8049661 7609801 7131554 6606777 6049816 5467474 4881261 4342549 3902672 3588493
36818C588493j77269m4201N2376R0504Q7026O7544L1461k5945q6919j39055j99433
$$ 3588493 3411224 3367023 3419399 3509903 3596929 3664473 3695934 3669989 3583070 3444015 3244582
36807C244582k74697l24730l05239k26832j40402q6403q5440j45105k36047k88665
$$ 3244582 2969885 2645155 2339916 2113084 1972682 1886279 1800839 1655734 1419687 1131022
36797A131022k56671j65053o2354M1151J41024J80812J00698o0339j78476j76911
$$ 1131022 874351 709298 646944 688095 829119 1009931 1110629 1050290 871814 694903
36787F94903r5945j9769J6161K1326J303m1957p9551o7626M707J00894J75008
$$ 694903 598958 579189 595350 616676 617979 576022 496471 428845 433552 534446 709454
36776G09454K09920K13776J95333J58191J13606Q0416O6463O2091N7875N5451
$$ 709454 919374 1133150 1328483 1486674 1600280 1680696 1747159 1809250 1867125 1922576
36766A922576N2278L1760j5238o8843r3382o1927L7169J87960L19520L28127J75965
$$ 1922576 1974854 2006614 1991376 1922533 1829151 1767224 1804393 1992353 2311873 2640000 2815965
36755B815965m6660k02647k40955k06741j43439n5417L5148P6181N8613L7237
$$ 2815965 2769305 2566658 2325703 2118962 1975523 1920106 1955254 2031435 2090048 2127285
36745B127285M4687M0442j6708r7091j45245j53104j43419j20692q6683o6276
$$ 2127285 2171972 2212414 2195706 2098615 1953370 1800266 1656847 1536155 1449472 1383196
36735A383196o2788k0939R9626K32157K53969J34539k2375r6362o7963o703K1112
$$ 1383196 1320408 1299469 1399095 1631252 1885221 2019760 1997385 1901023 1833060 1826357 1847469
36724A847469J1920J0447N0094J05462J12146M3063n2156j03607r8805p6552o0139
$$ 1847469 1859389 1869836 1919930 2025392 2137538 2180601 2128445 2024838 1926033 1849481 1789342
36713A789342l6173J281K3623J196n3243q7812n7791K7414J01944J01545L0161
$$ 1789342 1753169 1754450 1778073 1779269 1726026 1638214 1580423 1607837 1709781 1811326 1841487
36702A841487m7765q5498r6627j08473j12106r0200o3133o4593q8503j00506r0888
$$ 1841487 1793722 1708224 1611597 1503124 1391018 1300818 1237685 1173092 1084589 984083 893195
36691H93195p9286p8438r1596j34299k12506k80231k65465j51629k079J06351
$$ 893195 813909 735471 643875 509576 297070 16839 -248626 -400255 -402334 -295983
36681b95983J49468J51741J44207J36417J13643N8886j2643n5139m9386l8214
$$ -295983 -146515 5226 149433 285850 399493 458379 445736 390597 341211 302997
36671C02997o8751j14633j02735j2635J01957J96063K82227L75157M37176M16061
$$ 302997 234246 119613 16878 4243 106200 302263 584490 959647 1396823 1812884
36661A812884L07881J49218k9634k08972l52391m13123l73447k61237j26554j0412
$$ 1812884 2120765 2269983 2240349 2031377 1678986 1265863 892416 631179 504625 494213
36651D94213P1192J27926J80775K38297K84206K88223K27090R9648o7965k30532
$$ 494213 565405 693331 874106 1112403 1396609 1684832 1911922 2011570 1943605 1713073
36641A713073l46273l96736l87016l36584k75471k33429k14253j89716j36822
$$ 1713073 1366800 970064 583048 246464 -29007 -262436 -476689 -666405 -803227
36632h03227p0985j9708K6079J02144K12455L12301L57181L41025K76844J69552
$$ -803227 -874212 -893920 -867841 -765697 -553242 -240941 116240 457265 734109 903661
36622I03661K9872j03046j78295j72505j03609j0160P3917J24201J14332J7742
$$ 903661 933533 830487 652192 479687 376078 365918 439835 564036 678368 696110
36612F96110j56035l27234l85568k94201j33567r034O6379J56228K84300L93181
$$ 696110 540075 212841 -172727 -466928 -600495 -609529 -543150 -386922 -102622 290559
36602B90559M25131L86500L08153J92380L7864j18840k33314l08609l80145m50311
$$ 290559 715690 1102190 1410343 1602723 1640587 1521747 1288433 979824 599679 149368
36592A49368m70779l93300k19272j760J82809K69239K37419J27912J7941l1554
$$ 149368 -321411 -714711 -933983 -935743 -752934 -483695 -246276 -118364 -100423 -131977
36582a31977j7455Q004j5066r5889j78470j91343j09811L7050K06209L61714M62124
$$ -131977 -149432 -141428 -156494 -252383 -430853 -622196 -732007 -694957 -488748 -127034 335090
36571C35090M65522L66711K09864M7418r9762k29531l24895l57728l25565k70894
$$ 335090 800612 1167323 1377187 1424605 1324843 1095312 770417 412689 87124 -183770
36561a83770k55520l08172l90387m21516l51175k02670l4620J22971K67765L77631
$$ -183770 -439290 -747462 -1137849 -1559365 -1910540 -2113210 -2147830 -2024859 -1757094 -1379463
36551a379463M11996L67809K93679K34355J96103J79544K02966K63120L04655
$$ -1379463 -967467 -599658 -305979 -71624 124479 304023 506989 770109 1074764
36542A074764K63234J23701q2125l07021m93051n78342n41768m27921k96152j59392
$$ 1074764 1337998 1461699 1379574 1072553 579502 1160 -540608 -968529 -1264681 -1424073
36532a424073l452J53324K63266L07004L08384K88822K39745J48790K9053q6180
$$ -1424073 -1427525 -1274201 -1010935 -703931 -395547 -106725 133020 281810 310863 224683
36522B24683j62709j78989j38330o9946l552N7999J29558K09491K66100K58312
$$ 224683 61974 -117015 -255345 -325291 -328843 -270844 -141286 68205 334305 592617
36512E92617J68088K3078j09156j67846j50602j03616n8563r812L8365N0075J5412
$$ 592617 760705 783783 674627 506781 356179 252563 194000 184188 222553 272628 288040
36501B88040j4127N104M1205M6574N3030J28141K46254K90194K02632O4212j1228
$$ 288040 273913 279017 320222 366796 419826 547967 794221 1084415 1287047 1351259 1340031
36490A340031j21M6661Q5268R6446O6711P275l5958m0544n1744j17714j98410
$$ 1340031 1339910 1386571 1471839 1568285 1634996 1642271 1606313 1565769 1514025 1396311 1197901
36479A197901j94434o2040J48317L61402N27726N99799N27076L17995O8869j17690
$$ 1197901 1003467 941427 1089744 1451146 1978872 2578671 3105747 3423742 3492611 3374921
36469C374921k30970l33937m57657n53982n59235m71154l42650k18182j00653
$$ 3374921 3143951 2810014 2352357 1798375 1239140 767986 425336 207154 106501
36460A06501K2364J40736K21425K43107K26069K22837K70218L44369L69217K81895
$$ 106501 128865 269601 491026 734133 960202 1183039 1453257 1797626 2166843 2448738
36450B448738R3909j15898k67460l34958l46969l50823l78293m25656m54014m20110
$$ 2448738 2542647 2426749 2159289 1824331 1477362 1126539 748246 322590 -131424 -551534
36440e51534l18998j90385p6886J2199Q8233J53050J99953K30901K47565K31238
$$ -551534 -870532 -1060917 -1137803 -1125604 -1037371 -884321 -684368 -453467 -205902 25336
36430B5336J59067M3493o8081j41017j81248k04816j98603j32448o172J32884
$$ 25336 184403 227896 159815 18798 -162450 -367266 -565869 -698317 -704489 -571605
36420e71605K25097K44354K05417J36753O3722J9443M2394J30355K06896J78757
$$ -571605 -346508 -102154 103263 240016 303738 323181 365575 495930 702826 881583
36410H81583M2739r9096j53509j33450j13380j23344j35402j32263j29812j33062
$$ 881583 924322 825226 671717 538267 424887 301543 166141 33878 -95934 -228996
36400b28996j23750r9401p7342n2217j193N4147M8387l4674j20773j38437j09864
$$ -228996 -352746 -452147 -529489 -581706 -582899 -528752 -480365 -515039 -635812 -774249 -884113
36389h84113r7594r6386m5243O3717J53918J55240Q1297P13l2459l427P3336J59215
$$ -884113 -981707 -1078093 -1123336 -1059619 -905701 -750461 -669164 -668451 -700910 -704337 -631001 -471786
36377d71786K02911J76116J01092L0938l87k792k968R39M2917J36932K34231K60760
$$ -471786 -268875 -92759 8333 39271 38884 36092 33124 34063 76980 213912 448143 708903
36365G08903K00705J14293O1083L6194L794l8205o3251o3677m9929j5057N0305
$$ 708903 909608 1023901 1084984 1121178 1124972 1086767 1023516 959839 909910 894853 945158
36354I45158J05755P3927p3013k69424m14215m46336l53096j45615J34538L98694
$$ 945158 1050913 1124840 1051827 782403 368188 -78148 -431244 -576859 -442321 -43627
36344d3627N40412N00062L05063N5172j36171k12946k08160j96011k06232k01257
$$ -43627 496785 996847 1301910 1357082 1220911 1007965 799805 603794 397562 196305
36334A96305j42374m9276K7421O9305R4845J14029J13446Q6713M9463J6236j3959
$$ 196305 53931 4655 32076 101381 196226 310255 423701 510414 559877 576113 562154
36323E62154l9247m3535j8729J7536M4689O9492J11932J63499J83453J46066P3853
$$ 562154 522907 479372 460643 478179 522868 592360 704292 867791 1051244 1197310 1271163
36312A271163Q423l8399q2427j23179j32353r6063m5183k7606o6612j58936k88629
$$ 1271163 1279586 1241187 1158760 1035581 903228 807165 761982 734376 667764 508828 220199
36301B20199m16641m79858m42972l46580k64361k12151j41047k6066Q7703J48985
$$ 220199 -196442 -676300 -1119272 -1465852 -1730213 -1942364 -2083411 -2109477 -2021774 -1872789
36291a872789J65138J70207J68789J56879J66629K30825L13944L37902K82128
$$ -1872789 -1707651 -1537444 -1368655 -1211776 -1045147 -814322 -500378 -162476 119652
36282A19652K06293J60942J26992P0946J4706O024M3177P4426O7042L9385K0547
$$ 119652 325945 486887 613879 684825 699531 705555 748732 823158 890200 929585 950132
36271I50132Q175k2585q8093j84384k89079l61791l56208k53062q4302Q5766K07848
$$ 950132 958307 935722 847629 663245 374166 12375 -343833 -596895 -681197 -595431 -387583
36260c87583K73635K98582K92043K52713J87177J21322R0416J19228K04441L05576
$$ -387583 -113948 184634 476677 729390 916567 1037889 1128305 1247533 1451974 1757550
36250A757550L58251L16807J94135N0656o1390j33109j78772k04248k11468k14673
$$ 1757550 2115801 2432608 2626743 2677399 2616009 2482900 2304128 2099880 1888412 1673739
36240A673739k25879k31663k08205j54217q4430M674J29067K68402L53752L27490
$$ 1673739 1447860 1216197 1007992 853775 769345 774019 903086 1171488 1525240 1852730
36230A852730K05405O6403j2888j1823K7311L6858j5272r0979j20628q1151j6443
$$ 1852730 2058135 2124538 2111650 2099827 2127138 2163996 2148724 2057745 1937117 1855966 1839523
36219A839523K5170M2679N2778M1903j3006r1843j41795j39806j09891p7019m0354
$$ 1839523 1864693 1907372 1960150 2002053 1989047 1897204 1755409 1615603 1505712 1428693 1388339
36208A388339o98K3465K8811M5176Q9681J21797Q1981k4812j14799j07381p219
$$ 1388339 1387641 1411106 1439917 1485093 1574774 1696571 1778552 1753740 1638941 1531560 1524341
36197A524341J03874J44078R0420k5978j59284k75322l53314l81108l55046k79315
$$ 1524341 1628215 1772293 1862713 1836735 1677451 1402129 1048815 667707 312661 33346
36187C3346j64213l1004Q3117J39934J30859Q6717M9385M0669O4254J19634J89922
$$ 33346 -130867 -161871 -78754 61180 192039 278756 328141 368810 433064 552698 742620
36176G42620K23601J62505K973j89331l41425m37911n08866n63326n57414m35009
$$ 742620 966221 1128726 1131699 942368 600943 163032 -345834 -909160 -1466574 -1901583
36166a901583j91382J06459L57461M86406M80315L81150K50193J36336O4029L2424
$$ -1901583 -2092965 -1986506 -1629045 -1142639 -662324 -281174 -30981 105355 169384 201808
36156B01808J7889j1260o4721j09771r1524J2201J52106K31636J83020K5342j54708
$$ 201808 219697 208437 143716 33945 -57579 -45378 106728 338364 521384 546726 392018
36145C92018k78307l23601l04815k29866j03565L6431J20228J00791K031r4248
$$ 392018 113711 -209890 -514705 -744571 -848136 -811705 -691477 -590686 -588655 -682903
36135f82903j07468j5202J24751K05650J53576l9j38990j72178j14394m6145j1558
$$ -682903 -790371 -805573 -680822 -475172 -321596 -321635 -460625 -632803 -747197 -793342 -804900
36124h04900J7856Q8370K05456L30827M06525L74814K10728l5871k49269l33051
$$ -804900 -787044 -698674 -493218 -162391 244134 618948 829676 793805 544536 211485
36114B11485k89869k01818j38135j03496p1326l3031K678L5023O7910Q8164P1105
$$ 211485 -78384 -280202 -418337 -521833 -593159 -626190 -623512 -588489 -520579 -432415 -361310
36103c61310J1667o5121j28831j67808j86001j87116j68085j23703n8858k462
$$ -361310 -349643 -414764 -543595 -711403 -897404 -1084520 -1252605 -1376308 -1435166 -1437628
36093a437628J484n9340j28265j22238k9599O1716O2017j2896o6559m2766J9512
$$ -1437628 -1436144 -1495484 -1623749 -1745987 -1775586 -1713870 -1651853 -1664749 -1731308 -1774074 -1754562
36082a754562N4329M9880M2855O2868J07916J56720J81931J62346J02134L2264
$$ -1754562 -1700233 -1650353 -1607498 -1544630 -1436714 -1279994 -1098063 -935717 -833583 -801319
36072h01319j8812m5946n0812k5770K6018P2692Q4838P6001Q3153J09796J18411
$$ -801319 -820131 -866077 -916889 -942659 -916641 -843949 -759111 -683110 -599957 -490161 -371750
36061c71750Q5127L5204J0337J6714J8843k1598j05588j88425k12832j63078q5458
$$ -371750 -286623 -251419 -241082 -224368 -205525 -227123 -332711 -521136 -733968 -897046 -982504
36050i82504l9749l0802q620O0024J44851J91028J84001J53492J25176R5178N3648
$$ -982504 -1022253 -1053055 -1061675 -1001651 -856800 -665772 -481771 -328279 -203103 -107925 -54277
36039e4277J0052j9918m4405r4885j85705k78303l00743k13821n2383J07684K14380
$$ -54277 -44225 -64143 -108548 -203433 -389138 -667441 -968184 -1182005 -1234388 -1126704 -912324
36028i12324K58049K41148J66693O3230j5730m2982m6972o4438q1909n6384J5362
$$ -912324 -654275 -413127 -246434 -183204 -198934 -241916 -288888 -353326 -435235 -491619 -476257
36017d76257Q2118R3556M1496n4160j66354k57466k89545k63984k32208k41997
$$ -476257 -394139 -300583 -259087 -313247 -479601 -737067 -1026612 -1290596 -1522804 -1764801
36007a764801k82767l02087k64328j72683m7931Q0961J65564J55125M8694q4149
$$ -1764801 -2047568 -2349655 -2613983 -2786666 -2834597 -2753636 -2588072 -2432947 -2384253 -2468402
35997b468402j56138j36139o3959P76L2732M8137P3613J16020J59477J85800J95005
$$ -2468402 -2624540 -2760679 -2824638 -2823862 -2791130 -2742993 -2669380 -2553360 -2393883 -2208083 -2013078
35986b013078K05930K37624K88758L30817L20696K29761P3994q2171j62121j28062
$$ -2013078 -1807148 -1569524 -1280766 -949949 -629253 -399492 -325498 -407669 -569790 -697852
35976f97852l037J49934K66684L11164K85411K16468J25464R053j39101k92797
$$ -697852 -700889 -550955 -284271 26893 312304 528772 654236 663289 524188 231391
35966B31391m00301m32458m03320l33887k20465n8937J22883K88226M31722N59859
$$ 231391 -168910 -601368 -1004688 -1338575 -1559040 -1617977 -1495094 -1206868 -775146 -215287
35956b15287O37510N98582M23455J74526n9775k29101l19157l26241k68574k00110
$$ -215287 422223 1020805 1444260 1618786 1559011 1329910 1010753 684512 415938 215828
35946B15828j72960j88459k08718k07916j87333j50958j01207n9323n6216r1000
$$ 215828 42868 -145591 -354309 -562225 -749558 -900516 -1001723 -1061046 -1117262 -1208262
35936a208262j20883j02603k8217Q1786J95374K70310K68356J93953J06976P3960
$$ -1208262 -1329145 -1431748 -1459965 -1378179 -1182805 -912495 -644139 -450186 -343210 -269250
35926b69250J05283J47537J32736L3449j12656k19601k09700p6544J06789K50485
$$ -269250 -163967 -16430 116306 149755 37099 -182502 -392202 -468746 -361957 -111472
35916a11472L14652L11868K65572J89473R8143Q609p5000j60379k43179k95941
$$ -111472 203180 515048 780620 970093 1068236 1076845 1001845 841466 598287 302346
35906C02346k87204k07430q0681L8410Q8779N0556k5085n6446j5781M1202M2578
$$ 302346 15142 -192288 -272969 -234559 -145780 -95224 -120309 -176755 -192536 -151334 -108756
35895a08756j7946q1898r5296n5778K836M9049P2485Q0427Q2954P5670M0503k3660
$$ -108756 -126702 -208600 -303896 -359674 -356838 -307789 -235304 -154877 -71923 3747 44250 20590
35883B0590p5675o0774K5683J19316J44553Q1749l0410j39601k04885j91634q1965
$$ 20590 -55085 -115859 -90176 29140 173693 255442 225032 85431 -119454 -311088 -393053
35872c93053R1662K44529K98680K47416J51205P0731J4667m5500j23479j94518
$$ -393053 -301391 -56862 241818 489234 640439 711170 725837 680337 556858 362340
35862C62340k22666k01283j59466j29019j09442o9920J1237J11737J80199J94796
$$ 362340 139674 -61609 -221075 -350094 -459536 -529456 -518219 -406482 -226283 -31487
35852c1487J99257K59892L80357M79931M76150L76742K63448J88613J19442n028
$$ -31487 167770 427662 808019 1287950 1764100 2140842 2404290 2592903 2712345 2707317
35842B707317j89167l72938m91155n20702m83379m25156l83593l52227k79737
$$ 2707317 2518150 2145212 1654057 1133355 649976 224820 -158773 -511000 -790737
35833g90737j23433R9177L26629N10991O37479O98836O85536O05505M84289L37542
$$ -790737 -914170 -814993 -488364 22627 660106 1358942 2044478 2649983 3134272 3471814
35823C471814J65348k4656k15553m00740n66406o52094n86846l96202k21414j77369
$$ 3471814 3637162 3612506 3396953 2996213 2429807 1777713 1190867 794665 573251 395882
35813C95882k21656k22656j35771m0619l737J6308R0850K05951K79275K63860
$$ 395882 174226 -48430 -184201 -224820 -228557 -212249 -121399 84552 363827 627687
35803F27687J83686P7580m1325j61096k45861k60923k09487j29266o1609l2727
$$ 627687 811373 888953 847628 686532 440671 179748 -29739 -159005 -220614 -253341
35793b53341m8602q5640r2190k8942P9352J53547J42914Q5750O1211Q7538J03181
$$ -253341 -301943 -387583 -479773 -508715 -429363 -275816 -132902 -47152 14059 101597 204778
35782B04778N7124j6928m0175K0508J26720K14849K39737J88615Q9306J592l4146
$$ 204778 261902 244974 204799 225307 352027 566876 806613 995228 1084534 1086126 1051980
35771A051980m3442q3031j56178j97138j53847n6053J9348K8651j2915o3270q2290
$$ 1051980 1008538 925507 769329 572191 418344 362291 381639 410290 397375 334105 251815
35760B51815m1433N8957J71488K20857J60105J2754j40970k21688k03036j18662
$$ 251815 210382 269339 440827 661684 821789 834543 693573 471885 268849 150187
35750A50187k8355J7852n169q6499j66180j60488m0344J18868K01896J71821R0911
$$ 150187 121832 139684 134515 48016 -118164 -278652 -318996 -200128 1768 173589 264500
35739B64500K5127j7812l3836L0116K07377M16682N12429M43836L09654K30257
$$ 264500 289627 271815 237979 268095 475472 892154 1404583 1848419 2158073 2388330
35729B388330K09057J57667K8528j27287k31966k67158k70154k71949k69417k52732
$$ 2388330 2597387 2755054 2783582 2656295 2424329 2157171 1887017 1615068 1345651 1092919
35719A092919k32174k27435k45285k76220k97494k68744j49008M7925K21890K51404
$$ 1092919 860745 633310 388025 111805 -185689 -454433 -603441 -555516 -333626 -82222
35709h2222J10532r7272k33523k35893j32154J9401J71763K91857L62211L86173
$$ -82222 28310 -68962 -302485 -538378 -670532 -651131 -479368 -187511 174700 560873
35699E60873L73385L21430K27395J11736J0372n6372r2413j09776j22611j50971
$$ 560873 934258 1255688 1483083 1594819 1605191 1548819 1456406 1346630 1224019 1073048
35689A073048k05127k63736k89576k72670k40792k23373k21633k16961j90349
$$ 1073048 867921 604185 314609 41939 -198853 -422226 -643859 -860820 -1051169
35680a051169j30028m1357M2525Q0527O7820M5523N3609Q6662J08122R5135N4840
$$ -1051169 -1181197 -1222554 -1180029 -1099502 -1031682 -986159 -932550 -845888 -737766 -642631 -587791
35669e87791P675k6909l2045L119P7834J80589K89769L71301L91870L50251K85513
$$ -587791 -580116 -607025 -639070 -635951 -558117 -377528 -87759 283542 675412 1025663 1311176
35658A311176K34787J87444J03064k2953j35052j72902j38371r1426q5604j24083
$$ 1311176 1545963 1733407 1836471 1813518 1678466 1505564 1367193 1275767 1190163 1066080
35648A066080j78867k31700k78612l02369k67115j56642q671J07633J50486J30349
$$ 1066080 887213 655513 376901 74532 -192583 -349225 -357896 -250263 -99777 30572
35638C0572P8806J6455l6161m1898K1824J15716J58955J17149M8131L3045P1846
$$ 30572 109378 125833 89672 47774 69598 185314 344269 461418 509549 542594 614440
35627F14440P6999k6105k16554m01852m99759m83053l68986j96998j3935J43922
$$ 614440 691439 665334 448780 46928 -452831 -935884 -1304870 -1501868 -1515803 -1371881
35617a371881K61800L30518L27353K35984Q8028l9843q5683m9662K2399Q4750
$$ -1371881 -1110081 -779563 -452210 -216226 -128198 -168041 -253724 -303386 -280987 -196237
35607a96237J11017R0560L2928k7898n6492m9923l8788n0961p9894q9190m5401
$$ -196237 -85220 5340 38268 10370 -46122 -96045 -134833 -185794 -265688 -354878 -400279
35596d00279M9277J50779K03196J81293J02866L954q2096j20641q3310J2198Q8478
$$ -400279 -351002 -200223 2973 184266 287132 291086 208990 88349 5039 17237 105715
35585A05715P4566j1721p9690p1646k2705k104k7023o1404p5800o8795l5341M4250
$$ 105715 180281 168560 88870 17224 -5481 -7585 -34608 -96012 -171812 -240607 -275948 -231698
35573b31698J67050K84814L42040L28539K78093K20597J53551O3531l8338j12417
$$ -231698 -64648 220166 562206 890745 1168838 1389435 1542986 1606517 1568179 1455762
35563A455762j20926o2618J6809N0924M679q7969j46099j15402k0381O4551R2812
$$ 1455762 1334836 1272218 1289027 1339951 1344630 1256661 1110562 995160 974779 1039330 1132142
35552A132142Q4542R2044J42146K13859K55917K19742R2419q6751k48111l42285
$$ 1132142 1216684 1308728 1450874 1664733 1920650 2140392 2232811 2146060 1897949 1555664
35542A555664l70471l65757l56250l50799l44161l21425k67862j91107j26716
$$ 1555664 1185193 819436 463186 112387 -231774 -553199 -821061 -1012168 -1138884
35533a138884j03442j03618p4496J5273J36998K20985K12034J13760j2020r2227
$$ -1138884 -1242326 -1345944 -1420440 -1405167 -1268169 -1047184 -835150 -721390 -733410 -825637
35523h25637r6415m5142K8765J07934J74745J97049J58003Q8792M4547N1151R4806
$$ -825637 -922052 -967194 -938429 -830495 -655750 -458701 -300698 -211906 -167359 -116208 -21402
35512b1402J51849J99223K04666J47874N8470m002k2179l9570q8001j30727j12048
$$ -21402 130447 329670 534336 682210 740680 736678 714499 674929 586928 456201 344153
35501C44153m2440P100o103m7382n4786j5739K1118k7q9232k06201k92280k99929
$$ 344153 301713 308813 302710 255328 200542 184803 205921 205894 116662 -89539 -381819 -681748
35489f81748k05494k3079J77869K89357K36255M2669j87610l60789m49926m69838
$$ -681748 -887242 -910321 -732452 -443095 -206840 -164171 -351781 -712570 -1162496 -1632334
35479a632334m32119l43881k25893j04783L692Q7821J32066J37403J35987J59193
$$ -1632334 -2064453 -2408334 -2634227 -2739010 -2735318 -2647497 -2515431 -2378028 -2242041 -2082848
35469b082848J98473K24094K36974K68961L25345L56473L03435J56479m1237k28376
$$ -2082848 -1884375 -1660281 -1423307 -1154346 -829001 -472528 -169093 -12614 -53851 -282227
35459b82227l50029l71038k97326j83952r7467n9903l9693R09O6109J39857K16338
$$ -282227 -632256 -1003294 -1300620 -1484572 -1582039 -1641942 -1681635 -1680726 -1614617 -1474760 -1258422
35448a258422K93851L49333L52236L13969K97797L56773M70550N59803N54857
$$ -1258422 -964571 -615238 -263002 50967 348764 705537 1176087 1735890 2290747
35439B290747M37291K32988k619j97179l00519l30450l56712m21677m94238n16255
$$ 2290747 2728038 2961026 2958407 2761228 2460709 2130259 1773547 1351870 857632 341377
35429C41377m71504l83980k67342j14498O0844K04845K64133K35673J67698J17936
$$ 341377 -130127 -514107 -781449 -895947 -835103 -630258 -366125 -130452 37246 155182
35419A55182J13926J43948J76703J89067J77332J46509R9702M5053L745m586J3586
$$ 155182 269108 413056 589759 778826 956158 1102667 1202369 1247422 1251167 1246581 1260167
35408A260167K5615K152n6134j20943j62039j71487j65467j61815j57832j37063
$$ 1260167 1285782 1287934 1231800 1110857 948818 777331 611864 450049 292217 155154
35398A55154r7379o0214m7259o0041q8580j24526j54285j56061j23503q1144n5322
$$ 155154 57775 -2439 -49698 -109739 -198319 -322845 -477130 -633191 -756694 -837838 -893160
35387h93160l8503n311M5484R5394J48739K31818L37162M02646L71796K56837
$$ -893160 -931663 -936974 -891490 -796096 -647357 -415539 -78377 324269 696065 952902
35377I52902J20850J2025o4366j23042j72238k04511j97237j33196l9985P684
$$ 952902 1073752 1085777 1021411 898369 726131 521620 324383 191187 151202 158886
35367A58886l9348j31885j59635p2894O3208J51120J66533J56800J62241J81727
$$ 158886 119538 -12347 -171982 -244876 -181668 -30548 135985 292785 455026 636753
35357F36753K08667K55272L24234L83949L92954L36332K27020Q9287m1995j24433
$$ 636753 845420 1100692 1424926 1808875 2201829 2538161 2765181 2854468 2812473 2688040
35347B688040j41100j29044j48544k16261k87851l15533l03509k89693k87060
$$ 2688040 2546940 2417896 2269352 2053091 1765240 1449707 1146198 856505 569445
35338E69445k69430k16686j51112j15566j27484j68808k13219k43444k41138j85317
$$ 569445 300015 83329 -67783 -183349 -310833 -479641 -692860 -936304 -1177442 -1362759
35328a362759q1786J6241M4117q016p8284r3204l9129L2786O6937O0426O1101
$$ -1362759 -1444545 -1428304 -1384187 -1392203 -1470487 -1563691 -1602820 -1570034 -1503097 -1442671 -1381570
35317a381570J12871K04646K78098K90441K60351K37432K35642K25188J91920
$$ -1381570 -1268699 -1064053 -785955 -495514 -235163 2269 237911 463099 655019
35308F55019J67434J78993J99371J78028J01772r038j44759l00310m31614m72596
$$ 655019 822453 1001446 1200817 1378845 1480617 1471579 1326820 1026510 594896 122300
35298A22300m13156l21878k70104k61748k53973k13767j30073k570J44009K52523
$$ 122300 -290856 -612734 -882838 -1144586 -1398559 -1612326 -1742399 -1744969 -1600960 -1348437
35288a348437K78434K37370J79424J23609N0951l7794r6132q3783k3986J5767
$$ -1348437 -1070003 -832633 -653209 -529600 -478649 -516443 -612575 -696358 -720344 -704577
35278g04577j976m5031n1735l977M9189M4436k5786j04430j27749q1474k227O0570
$$ -704577 -706553 -751584 -803319 -807296 -758107 -713671 -739457 -843887 -971636 -1053110 -1055337 -994767
35266i94767Q0307O6281N0637N3892N9941L4372l4293j26990k22685l05791l41139
$$ -994767 -914460 -848179 -797542 -743650 -683709 -649337 -683630 -810620 -1033305 -1339096 -1680235
35255a680235k79714j16382P8355K08951K26809J43473L225j31253j95585j70655
$$ -1680235 -1959949 -2076331 -1997976 -1789025 -1562216 -1418743 -1415518 -1546771 -1742356 -1913011
35245a913011j06669o7666n6942k4340O4063J96617L44354M74682N37902M89561
$$ -1913011 -2019680 -2087346 -2144288 -2168628 -2104565 -1907948 -1563594 -1088912 -551010 -61449
35235f1449L47786J99172J26917J46031K10254K55338K30272J21366l1067j57918
$$ -61449 286337 485509 612426 758457 968711 1224049 1454321 1575687 1544620 1386702
35225A386702k19961k30455k17276j89135j49763j13924q3794l1061O6517J78966
$$ 1386702 1166741 936286 719010 529875 380112 266188 182394 151333 217850 396816
35215C96816K41974K24415J63888J32837J74539K66628L39479L34755K52727J41902
$$ 396816 638790 863205 1027093 1159930 1334469 1601097 1940576 2275331 2528058 2669960
35205B669960M7225j9993o6720r7247j13503j13447p9367O923J18999J79866J31475
$$ 2669960 2717185 2697192 2630472 2533225 2419722 2306275 2226908 2233831 2352830 2532696 2664171
35194B664171K051j20812j79502j86548j80351j69696j32528n2546N5802J53149
$$ 2664171 2666222 2545410 2365908 2179360 1999009 1829313 1696785 1644239 1700041 1853190
35184A853190K01763J94417J62044J45847J53949J47305P6720n8665j89250k21658
$$ 1853190 2054953 2249370 2411414 2557261 2711210 2858515 2935235 2876570 2687320 2465662
35174B465662j22120M2953J58041J55586O0999n1348j28081j57689j44461q9750
$$ 2465662 2343542 2386495 2544536 2700122 2761121 2709773 2581692 2424003 2279542 2189792
35164B189792m713P3234R2917K8618q9341j89643k18492j87731j58970j79053
$$ 2189792 2185079 2258313 2351230 2379848 2290507 2100864 1882372 1694641 1535671 1356618
35154A356618k38767k94014l12301k89776k33687j44998k4417J07449K04608K24285
$$ 1356618 1117851 823837 511536 221760 -11927 -156925 -181342 -73893 130715 355000
35144C55000J67713P9930l624r5605k19748l48853m16463l91889l06667j96989
$$ 355000 522713 602643 599019 503414 283666 -65187 -481650 -873539 -1180206 -1377195
35134a377195o1291R9384K34972K83967K47137J90134J74515K07921K54948K70989
$$ -1377195 -1438486 -1339102 -1104130 -820163 -573026 -382892 -208377 -456 254492 525481
35124E25481K26169J20268j6763j45002k34345k67486k47413k14682k27194k90858
$$ 525481 751650 871918 855155 710153 475808 208322 -39091 -253773 -480967 -771825
35114g71825l29758k64539j12505K7320Q3637O8289K5737k3263p4039j19419j65411
$$ -771825 -1101583 -1366122 -1478627 -1451307 -1367670 -1299381 -1273644 -1296907 -1370946 -1490365 -1655776
35103a655776k32073l09312l37929k67798j20482L2830J41868K00165K14486J89913
$$ -1655776 -1887849 -2197161 -2535090 -2802888 -2923370 -2890540 -2748672 -2548507 -2334021 -2144108
35093b144108J45452J11220R8159R0180P5683P0660R8870J57747K13315K26666
$$ -2144108 -1998656 -1887436 -1789277 -1699097 -1623414 -1552754 -1453884 -1296137 -1082822 -856156
35083h56156J85493J17164P2026Q4232J42252J99951K17936J92319J47707J12377
$$ -856156 -670663 -553499 -481473 -397241 -254989 -55038 162898 355217 502924 615301
35073F15301J00962J09242J16958J00718N3537q295o4923j21300k06075l29532
$$ 615301 716263 825505 942463 1043181 1096718 1088423 1023500 902200 696125 366593
35063C66593m43532m62036l40133j31408M7422J11863O3160m2565j48776k13748
$$ 366593 -76939 -538975 -879108 -1010516 -963094 -851231 -788071 -830636 -979412 -1193160
35053a193160k06435j26630k5795K4700n81n8572q3375m1785N3462J61678K35539
$$ -1193160 -1399595 -1526225 -1552020 -1527320 -1527901 -1586473 -1669848 -1711633 -1658171 -1496493 -1260954
35042a260954K43777J91340J14372N0581K0368L2286Q3450J45174J70666J36571
$$ -1260954 -1017177 -825837 -711465 -660884 -640516 -608230 -524780 -379606 -208940 -72369
35032g2369O6309R86l6821m1228j5745N354m0161j68709k92572k92350j56579
$$ -72369 -6060 -5074 -41895 -83123 -98868 -93514 -133675 -302384 -594956 -887306 -1043885
35021a043885O63P8253R4494J25752J85665K15909J73321P5466l2667j12791j33815
$$ -1043885 -1043222 -964969 -870475 -744723 -559058 -343149 -169828 -94362 -127029 -239820 -373635
35010c73635p9804K8892J46358K40526L04766L34894L24638K88088K55353K31854
$$ -373635 -453439 -424547 -278189 -37663 267103 601997 926635 1214723 1470076 1701930
35000A701930J85276Q9655l3473j33214j78674j79292j62972j41549r6619m560
$$ 1701930 1887206 1976861 1943388 1810174 1631500 1452208 1289236 1147687 1051068 1046508
34990A046508J17490K05675K12463J65440J31436J27685J10561N7464Q972L615
$$ 1046508 1163998 1369673 1582136 1747576 1879012 2006697 2117258 2174722 2183694 2187309
34980B187309J4997n055n1422q1059q5623r9522j40115j86309k21758k56349k89586
$$ 2187309 2202306 2197251 2145829 2064770 1979147 1879625 1739510 1553201 1331443 1075094 785508
34969G85508k88818k29070j33787n4213k1030l2620p6835j42098k10345k57546
$$ 785508 496690 267620 133833 79620 58590 25970 -50865 -192963 -403308 -660854
34959f60854k66385k31924j55753m5278P4979J58159J58119P3215l4241q1356
$$ -660854 -927239 -1159163 -1314916 -1360194 -1285215 -1127056 -968937 -895722 -929963 -1011319
34949a011319m1226L2157O7593N5868M7845Q0407J29647J43082R6880R447q4139
$$ -1011319 -1052545 -1020388 -952795 -896927 -849082 -768675 -639028 -495946 -399066 -389619 -473758
34938d73758j52712j72515j31278l6759Q3105J92057K61964K87210K87929K92421
$$ -473758 -626470 -798985 -930263 -967022 -883917 -691860 -429896 -142686 145243 437664
34928D37664L10015L25893L25648L13749K96912K59882J79687O6323l1407p4418
$$ 437664 747679 1073572 1399220 1712969 2009881 2269763 2449450 2515773 2484366 2409948
34918B409948p7343r0688j45752k30601l13154l66210l67510l00698j76368m3806
$$ 2409948 2332605 2241917 2096165 1865564 1552410 1186200 818690 517992 341624 297818
34908B97818L5517K9520m8483j51449k19736k12439j42686p2875m9765m9214j1778
$$ 297818 333335 362855 314372 162923 -56813 -269252 -411938 -484813 -534578 -583792 -595570
34897e95570P0727J40158J51933J32931J35681J61782J63261J08869K1845m4107
$$ -595570 -524843 -384685 -232752 -99821 35860 197642 360903 469772 491617 447510
34887D47510m7563J3474R5141J33833J01275L3355j2540k3764l5746p4855j25935
$$ 447510 399947 413421 508562 642395 743670 777025 764485 740721 704975 630120 504185
34876E04185j60482j69747j57775j24251p3037k4838l318j3550m5313r1027j48559
$$ 504185 343703 173956 16181 -108070 -181107 -205945 -209263 -222813 -268126 -359153 -507712
34865e07712k11907k71181l18024l39146l09862k13850p4697N0068J21587J57967
$$ -507712 -719619 -990800 -1308824 -1647970 -1957832 -2171682 -2246379 -2196311 -2074724 -1916757
34855a916757K04503K70456L14938K98205K26542J36241N3283j1731m4792l4792
$$ -1916757 -1712254 -1441798 -1126860 -828655 -602113 -465872 -412589 -424320 -469112 -503904
34845e03904L267L9070O7158J13501J92904K79997L34023L36007K92190K20590
$$ -503904 -500637 -461567 -394409 -280908 -88004 191993 526016 862023 1154213 1374803
34835A374803J49343J09165J04258R9410N6591j8216p9968r5151p6454o6817r3487
$$ 1374803 1524146 1633311 1737569 1836979 1893570 1875354 1795386 1700235 1623781 1556964 1463477
34824A463477j35325j37930p2914J9206O4036L3354l2392q4457j14595j29244
$$ 1463477 1328152 1190222 1117308 1136514 1200550 1233904 1201512 1117055 1002460 873216
34814H73216j14669o2388k052L2273N3557J00384J73539K31287K41092J99323
$$ 873216 758547 696159 694107 726380 779937 880321 1053860 1285147 1526239 1725562
34804A725562J07434k6145j57660k27989k28495k13822k31429k64562k61077j97098
$$ 1725562 1832996 1806851 1649191 1421202 1192707 978885 747456 482894 221817 24719
34794B4719r8714j9675o829o5460j46155j82474j49887p3153K1538J32256K53649
$$ 24719 -73995 -93670 -100499 -165959 -312114 -494588 -644475 -717628 -696090 -563834 -310185
34783c10185L56200M08984M00308L27143J95322M6287m9994n8360j7246O530j6980
$$ -310185 46015 454999 855307 1182450 1377772 1424059 1374065 1315705 1298459 1304989 1288009
34772A288009p7691j58621k40386k92304k96493k75956k70295k86772k99558k92531
$$ 1288009 1210318 1051697 811311 519007 222514 -53442 -323737 -610509 -910067 -1202598
34762a202598k77470k69909k67870k54299k04131r6366N6402J94518K58359K56773
$$ -1202598 -1480068 -1749977 -2017847 -2272146 -2476277 -2572643 -2516241 -2321723 -2063364 -1806591
34752a806591K61168L15551L73941L50794K23795O0764n8272j22919j80423k54468
$$ -1806591 -1545423 -1229872 -855931 -505137 -281342 -220578 -278850 -401769 -582192 -836660
34742h36660l02781k65615j40118J1756J24736J84064K19715K63231L14546L42061
$$ -836660 -1139441 -1405056 -1545174 -1533418 -1408682 -1224618 -1004903 -741672 -427126 -85065
34732h5065L14612K40705J68724J32205J01726J5410j43199l23365m64218n41906
$$ -85065 229547 470252 638976 771181 872907 888317 745118 421753 -42465 -584371
34722e84371n53312m94798l85414k81232k27805k09448j75056j05004k5746L2510
$$ -584371 -1137683 -1632481 -2017895 -2299127 -2526932 -2736380 -2911436 -3016440 -3042186 -3009676
34712c009676O3939P9489R9710J49197K25582K75560K39401J30503L8352L4008
$$ -3009676 -2945737 -2866248 -2766538 -2617341 -2391759 -2116199 -1876798 -1746295 -1707943 -1673935
34702a673935R6926J54104J66725J48911J17958O7743k11n0805m5219J2162P4612
$$ -1673935 -1577009 -1422905 -1256180 -1107269 -989311 -921568 -921779 -972584 -1017803 -1005641 -931029
34691i31029R8164P0875o64j09497k36159l32491l45968k69244j52648n8483q584
$$ -931029 -832865 -761990 -762654 -872151 -1108310 -1440801 -1786769 -2056013 -2208661 -2267144 -2275728
34680b275728K0981O4129J30000J94868K20977J90299J28064Q9426J15496J99800
$$ -2275728 -2254747 -2190618 -2060618 -1865750 -1644773 -1454474 -1326410 -1236984 -1121488 -921688
34670i21688K92851L32301K75932J28915m7388j66287j75924r7369n305K6003
$$ -921688 -628837 -296536 -20604 108311 60923 -105364 -281288 -378657 -383962 -357959
34660c57959l3966j58874k81493l34022k91164j79906m9565O0295J25159J30597
$$ -357959 -391925 -550799 -832292 -1166314 -1457478 -1637384 -1686949 -1626654 -1501495 -1370898
34650a370898Q0986J0768k5328J8198J47589L16727M46412M75191M00346K62921
$$ -1370898 -1289912 -1279144 -1304472 -1286274 -1138685 -821958 -375546 99645 499991 762912
34640G62912R8013p8095k30708k93114k22667o3103P4463J01494K1441q3569j29454
$$ 762912 860925 782830 552122 259008 36341 -26762 47701 149195 170636 87067 -42387
34629d2387j00548m9992k8227j9480L0998J29122K03762J84326Q5569o607k3135
$$ -42387 -142935 -192927 -221154 -240634 -209636 -80514 123248 307574 393143 386536 363401
34618C63401K9530Q5943Q0620J500r8883j52163j44400j28076j56372k20719k63955
$$ 363401 392931 478874 559494 560994 462111 309948 165548 37472 -118900 -339619 -603574
34607f03574k38058j35700J5133J66663K73125L15253K98129K24607R7946l8431
$$ -603574 -841632 -977332 -962199 -795536 -522411 -207158 90971 315578 413524 375093
34597C75093j03064n5468M6535J04980Q7958M7600M1277O7018P7655L7090l8007
$$ 375093 272029 216561 263096 368076 456034 503634 544911 611929 689584 726674 688667
34586F88667q2328l9726P1854J73489K15827K23590K26690J92363P8068p7842
$$ 688667 606339 566613 638467 811956 1027783 1251373 1478063 1670426 1748494 1670652
34576A670652j83498k03340j80802j52067r9040l729J01556J61037J38244K1988
$$ 1670652 1487154 1283814 1103012 950945 851905 848176 949732 1110769 1249013 1271001
34566A271001j68692l69155m98075n25025m83924m10068l00740j54592j0497Q4389
$$ 1271001 1102309 733154 235079 -289946 -773870 -1183938 -1484678 -1639270 -1649767 -1565378
34556a565378J25308J47549J89304K67074L64136M29765M11618L01970J37016
$$ -1565378 -1440070 -1292521 -1103217 -836143 -472007 -42242 369376 671346 808362
34547H08362m6675k24129l52918l80756l03119j79034p2195q637m94n7841j46451
$$ 808362 761687 537558 184640 -196116 -499235 -678269 -750464 -759101 -759595 -817436 -963887
34536i63887j83527j22932j3278P1577J28241J99516K79457L05373K44972J42102
$$ -963887 -1147414 -1270346 -1283624 -1212047 -1083806 -884290 -604833 -299460 -54488 87614
34526H7614O5987M8667P6446J08538R5304J0125j17347k15129k31985j85399j45058
$$ 87614 153601 202268 278714 387252 482556 492681 375334 160205 -71780 -257179 -402237
34515d02237j69698k52381l21337l01832j82251j2765J52640K83609L43321K82389
$$ -402237 -571935 -824316 -1145653 -1447485 -1629736 -1642501 -1489861 -1206252 -862931 -580542
34505e80542J01054j09916k33460k24861j24381L541J06928J45858J11331M7692
$$ -580542 -479488 -589404 -822864 -1047725 -1172106 -1168565 -1061637 -915779 -804448 -756756
34495g56756J4341J7876J4141k2227o7519r1647r1064o8200j6962N1871J02846
$$ -756756 -742415 -724539 -710398 -732625 -800144 -891791 -982855 -1051055 -1068017 -1016146 -913300
34484i13300J17212J19118J39311J72804J94014J96189J90248J73163J22332K5997
$$ -913300 -796088 -676970 -537659 -364855 -170841 25348 215596 388759 511091 537088
34474E37088r0077j70676j72605j10488n7450p8501j58623k18502k07149j50710
$$ 537088 447011 276335 103730 -6758 -64208 -142709 -301332 -519834 -726983 -877693
34464h77693r5890l9714N0000J65198K52940K79794K63320K30055J75493Q7691
$$ -877693 -973583 -1013297 -963297 -798099 -545159 -265365 -2045 228010 403503 491194
34454D91194r600o5092n1185M878L9540j695j24887k75838l68518l41954k01629
$$ 491194 481594 416502 365317 370195 409735 408040 283153 7315 -361203 -703157 -904786
34443i04786r039J65693K83267L45190L81247M19869M50843M18530K74948M8602
$$ -904786 -913825 -748132 -464865 -119675 261572 681441 1132284 1550814 1825762 1874364
34433A874364j57402k49729k20128j34856o9044o0896j05146j64435j96473j92141
$$ 1874364 1716962 1467233 1247105 1112249 1043205 982309 877163 712728 516255 324114
34423C24114j81382j87176j89721j59746j10219q0254p6955p2721n9100o1407
$$ 324114 142732 -44444 -234165 -393911 -504130 -584384 -661339 -734060 -793160 -854567
34413h54567r1819j26014j37014j15098m4540R1566K59008L71988L85164L52759
$$ -854567 -946386 -1072400 -1209414 -1324512 -1369052 -1277486 -1018478 -646490 -261326 91433
34403I1433L52575L77342L48894K23259L4154j55868k96032l43012k75014j32360
$$ 91433 444008 821350 1170244 1393503 1427657 1271789 975757 632745 357731 225371
34393B25371n025M8517N3020P4660J46585K45961L23155L37075K74275J48840
$$ 225371 220346 268863 321883 396543 543128 789089 1112244 1449319 1723594 1872434
34383A872434j5237j96635l62530m55968m29205k96031j26585J9151J32079K22602
$$ 1872434 1857197 1660562 1298032 842064 412859 116828 -9757 9394 141473 364075
34373C64075K79281K82268K40711J89855J53672J26631Q8510K1026q9328k46800
$$ 364075 643356 925624 1166335 1356190 1509862 1636493 1725003 1746029 1656701 1409901
34363A409901m32342n96040o73418o23302m63240k68816j24166n9451l5850L681
$$ 1409901 977559 381519 -291899 -915201 -1378441 -1647257 -1771423 -1830874 -1866724 -1863043
34353a863043P0598J22468J16053N8459k702l4751m9859p4558j07801j28757j34201
$$ -1863043 -1792445 -1669977 -1553924 -1495465 -1498167 -1532918 -1582777 -1657335 -1765136 -1893893 -2028094
34342b028094j36685j23634n4316Q0994K23122K93380K70815K00542J39140J16231
$$ -2028094 -2164779 -2288413 -2342729 -2261735 -2038613 -1745233 -1474418 -1273876 -1134736 -1018505
34332a018505J37119J87358K28677K16331J35135J2530j02245j63618j46903o4690
$$ -1018505 -881386 -694028 -465351 -249020 -113885 -101355 -203600 -367218 -514121 -578811
34322e78811L3702J00540J33420J68576K30425L00260L32264K87742J61501m132
$$ -578811 -545109 -444569 -311149 -142573 87852 388112 720376 1008118 1169619 1165487
34312A165487j34549j76827j45697j02962r3638j18832j63875k22589k85957l30823
$$ 1165487 1030938 854111 708414 605452 511814 392982 229107 6518 -279439 -610262
34302f10262l34133k89711k10464j27331p9865q3033j01580q1774j2486O9652
$$ -610262 -944395 -1234106 -1444570 -1571901 -1651766 -1734799 -1836379 -1918153 -1930639 -1860987
34292a860987J38539K09025K93543L56680L40108K24355N1414j06770j97685k22967
$$ -1860987 -1722448 -1513423 -1219880 -863200 -523092 -298737 -247323 -354093 -551778 -774745
34282g74745k34046k79350l47449l76174l23620k13003j01767k7517P596K4423
$$ -774745 -1008791 -1288141 -1635590 -2011764 -2335384 -2548387 -2650154 -2677671 -2670075 -2645652
34272b645652N5064J21127K02247K41466K02780J14313L9928J9016M6561R6620
$$ -2645652 -2590588 -2469461 -2267214 -2025748 -1822968 -1708655 -1668727 -1649711 -1603150 -1506530
34262a506530J45612J80396J98988J99129J61787O3005q5842k26545k99455k90408
$$ -1506530 -1360918 -1180522 -981534 -782405 -620618 -557613 -643455 -870000 -1169455 -1459863
34252a459863k26260j47359r9624j24267k20776l31157l88776l75446l10090k00947
$$ -1459863 -1686123 -1833482 -1933106 -2057373 -2278149 -2609306 -2998082 -3373528 -3683618 -3884565
34242c884565m5964J28600K71953L56767L91328L80429L12391K00433J01780O5769
$$ -3884565 -3930529 -3801929 -3529976 -3173209 -2781881 -2401452 -2089061 -1888628 -1786848 -1721079
34232a721079Q0208R5254Q8869Q1136Q7050Q4870M5204k3344p4991p2033j9516
$$ -1721079 -1640871 -1545617 -1456748 -1375612 -1288562 -1203692 -1158488 -1181832 -1256823 -1328856 -1348372
34221a348372M4775Q4036Q3548N2739K0052J7275M9623Q2151P5401L7085J5555
$$ -1348372 -1303597 -1219561 -1136013 -1083274 -1063222 -1045947 -996324 -914173 -838772 -801687 -786132
34210g86132L3801N7252M7855K4859L4910P1497O8544j1529j16255j56867j08352
$$ -786132 -752331 -695079 -647224 -622365 -587455 -515958 -447414 -458943 -575198 -732065 -840417
34199h40417k8654J7863K8000M0444P1000R2178P4870K8312r099l402N7588J58568
$$ -840417 -869071 -851208 -823208 -782764 -711764 -619586 -544716 -516404 -525503 -528905 -471317 -312749
34187c12749K48146K54400J44857k6957j63220k17698k27926k48081k79082k78693
$$ -312749 -64603 189797 334654 307697 144477 -73221 -301147 -549228 -828310 -1107003
34177a107003k13566q1160R6061K70498L78129L79247K94558J87481J11161P6651
$$ -1107003 -1320569 -1401729 -1305668 -1035170 -657041 -277794 16764 204245 315406 392057
34167C92057N9870K8935k4186p1063p9949o5172p6284j25430j58988j27363n1814
$$ 392057 451927 480862 456676 385613 305664 240492 164208 38778 -120210 -247573 -299387
34156b99387J3408N6950J00680J31873J01675m246j36309k28645k42635j67420
$$ -299387 -285979 -229029 -128349 3524 105199 100953 -35356 -264001 -506636 -674056
34146f74056k4975J16713J82510J63439J19227R6539Q4013O2092M7391N4269N3819
$$ -674056 -699031 -582318 -399808 -236369 -117142 -20603 63410 125502 172893 227162 280981
34135B80981J6042l4410n2167m5105o5857j29956j82684j56243l4127J43932L13470
$$ 280981 297023 262613 210446 165341 99484 -30472 -213156 -369399 -403526 -259594 53876
34124E3876M14800M17470L34005K05024O9745m1931j00644r0971m1780j9421p0375
$$ 53876 468676 886146 1220151 1425175 1494920 1452989 1352345 1261374 1219594 1200173 1129798
34113A129798j76291k76141l26799l32271l19341l00097k65133k06559j36804
$$ 1129798 953507 677366 350567 18296 -301045 -601142 -866275 -1072834 -1209638
34104a209638q1734o1582q1942j32160j78872j71063q0806N1467J37707J30345
$$ -1209638 -1291372 -1352954 -1434896 -1567056 -1745928 -1916991 -1997797 -1946330 -1808623 -1678278
34094a678278P5714N6667R2096J21492Q7510M014o7564q5529n6286j3419J1006
$$ -1678278 -1602564 -1545897 -1453801 -1332309 -1244799 -1240785 -1308349 -1393878 -1450164 -1463583 -1452577
34083a452577K384k8551m9311k6083N3756J74814K99460L78767L75309K93339
$$ -1452577 -1450193 -1478744 -1528055 -1554138 -1500382 -1325568 -1026108 -647341 -272032 21307
34073B1307J82783R8497N4443K6777l939l2111n0226p1584j15651j79863k37000
$$ 21307 204090 302587 357030 383807 379868 347757 297531 225947 110296 -69567 -306567
34062c06567k54497k09535r7797N5348J96311K73735K73213K17684J41204P5721
$$ -306567 -561064 -770599 -868396 -813048 -616737 -343002 -69789 147895 289099 364820
34052C64820N3910R5027J76760K41428K46437J97992J24974L7179o9759j80103
$$ 364820 418730 513757 690517 931945 1178382 1376374 1501348 1538527 1468768 1288665
34042A288665k58554k90183k97667l06099l04378k58563j61489n4515Q292J2846
$$ 1288665 1030111 739928 442261 136162 -168216 -426779 -588268 -642783 -634491 -621645
34032f21645p003j3707n167k079j1650k6077m9948r7053j52343j71370j41850
$$ -621645 -628648 -642355 -647522 -649601 -661251 -687328 -737276 -834329 -986672 -1158042 -1299892
34021a299892j19345j65375k61164l20112k86306j88100q8448j4187N0586J26917
$$ -1299892 -1419237 -1584612 -1845776 -2165888 -2452194 -2640294 -2728742 -2742929 -2692343 -2565426
34011b565426K18714L13981L88057M10984L66855K67853J46770L9982k4337l6647
$$ -2565426 -2346712 -2032731 -1644674 -1233690 -866835 -598982 -452212 -412230 -436567 -473214
34001d73214j4057R912J1862o513k6896k6988J3925J04174K24287L29981L77597
$$ -473214 -487271 -477359 -465497 -472010 -498906 -525894 -511969 -407795 -183508 146473 524070
33990E24070L46922K48577J24395L2469K761n47m7951j60942k76352l08522k33405
$$ 524070 870992 1119569 1243964 1276433 1279194 1278647 1230696 1069754 793402 484880 251475
33979B51475j00182K2766R6965J24714J33014J42813J43606J07894L9404j0005
$$ 251475 151293 174059 271024 395738 528752 671565 815171 923065 962469 952464
33969I52464J0731R5825J88325K28807J86320O2865j05658k62577l69211m27352
$$ 952464 963195 1059020 1247345 1476152 1662472 1725337 1619679 1357102 987891 560539
33959E60539m50378m30132l57291k56846j67305r2591j1647O7455J04568Q6423
$$ 560539 110161 -319971 -677262 -934108 -1101413 -1194004 -1205651 -1138196 -1033628 -947205
33949i47205N1353M1268N9045Q5087J03437R5541M2696l9458r5906q9523m2153
$$ -947205 -895852 -854584 -795539 -710452 -607015 -511474 -468778 -508236 -604142 -693665 -735818
33938g35818P145N9195J33907K12181K46211K27026J99190J97477K03523J82685
$$ -735818 -728673 -669478 -535571 -323390 -77179 149847 349037 546514 750037 932722
33928I32722J37005R8890Q7498R2156R1817P5714M9734L4090M8895Q8861J14196
$$ 932722 1069727 1168617 1256115 1348271 1440088 1515802 1565536 1599626 1648521 1737382 1851578
33917A851578P8686l0180j82428l31214m36959m70645m14284k74472r2614P1030
$$ 1851578 1930264 1900084 1717656 1386442 949483 478838 64554 -209918 -302532 -231502
$$ [...]
##END NTUPLES=NMR SPECTRUM
##END=
