##TITLE=31Pdec_AP-17HK2_HCl
 D2O
  24 sc
 2.11.2023
##JCAMPDX= 6.0         $$ Bruker NMR JCAMP-DX V2.0
##DATA TYPE= NMR SPECTRUM
##DATA CLASS= NTUPLES
##ORIGIN= UXNMR, Bruker Analytische Messtechnik GmbH
##OWNER= root
$$ XWIN-NMR		Version 3.5
$$ Thu Nov  2 14:19:29 2023 Russian Standard Time (UT+4h)  she@DPX200
##.OBSERVE FREQUENCY= 81.013821
##.OBSERVE NUCLEUS= ^31P
##.ACQUISITION MODE= SIMULTANEOUS
##.ACQUISITION SCHEME= undefined
##.AVERAGES= 24
##.DIGITISER RES= 16
##SPECTROMETER/DATA SYSTEM= spect
##.PULSE SEQUENCE= zgpg30
##.SOLVENT NAME= D2O
##.SHIFT REFERENCE= (INTERNAL, D2O, 0, 248.564)
##AUDIT TRAIL= $$ (NUMBER, WHEN, WHO, WHERE, WHAT)
$$ ##TITLE= Audit trail, XWIN-NMR		Version 3.5
$$ ##JCAMPDX= 5.01
$$ ##ORIGIN= Bruker BioSpin GmbH
$$ ##OWNER= she
$$ F:/spectra/data/she/nmr/P31/1/pdata/1/auditp.txt
$$ ##AUDIT TRAIL=  $$ (NUMBER, WHEN, WHO, WHERE, WHAT)
(   1,<2023-11-02 14:18:06.73 +0400>,<she>,<DPX200>,
      <created by zg, POWCHK disabled, PULCHK disabled
       configuration hash MD5:
       00 E9 B6 7A A2 85 ED C7 34 08 36 98 17 FE 4E 26
       data hash MD5: 32K
       FF C0 83 3A AF CA D1 03 3B BF A6 15 6D 6C 9E B5>)
(   2,<2023-11-02 14:18:44.50 +0400>,<she>,<DPX200>,
      <Start of raw data processing
       efp BC_mod = 2 LB = 5 FT_mod = 6 PKNL = 1 PHC0 = -10662.43 PHC1 = 62.4902 SI = 64K 
       data hash MD5: 64K
       20 BC 92 92 20 AE 8B CE 7B 0C 1D 48 46 C7 6C 6C>)
(   3,<2023-11-02 14:18:55.62 +0400>,<she>,<DPX200>,
      <pk PHC0 = -11.45742 PHC1 = 0 
       data hash MD5: 64K
       3D 99 22 A3 33 B8 BF 05 DC AF 92 66 3A 3B 5A A3>)
(   4,<2023-11-02 14:19:05.46 +0400>,<she>,<DPX200>,
      <abs ABSG = 5 
       data hash MD5: 64K
       84 FA 70 FB FC 92 B4 83 6F AB D6 93 65 59 09 BD>)
$$ ##END=
$$ 
$$ hash MD5
$$ F2 86 E1 FE 3F DA 1E 2E 1D 90 32 D5 E4 54 8D 0D
##$RELAX= 
##$RELAX= 
##$RELAX= 
##$RELAX= 
##$RELAX= 
##$RELAX= 
##$RELAX= 
##$RELAX= 
##$RELAX= 
$$ Bruker specific parameters
$$ --------------------------
##$DU= <F:/spectra>
##$EXPNO= 1
##$NAME= <P31>
##$PROCNO= 1
##$TYPE= <nmr>
##$USER= <she>
##$AMP= (0..31)
100 100 100 100 100 100 100 100 100 100 100 100 100 100 100 100 100 100 
100 100 100 100 100 100 100 100 100 100 100 100 100 100 
##$AQSEQ= 0
##$AQ_mod= 1
##$AUNM= <au_zg>
##$AUTOPOS= <>
##$BF1= 81.014009
##$BF2= 200.13
##$BF3= 200.13
##$BF4= 200.13
##$BF5= 200.13
##$BF6= 200.13
##$BF7= 200.13
##$BF8= 200.13
##$BYTORDA= 1
##$CFDGTYP= 0
##$CFRGTYP= 5
##$CHEMSTR= <none>
##$CNST= (0..31)
1 1 145 1 1 1 1 1 1 1 1 1 1 1 1 1 1 1 1 1 1 1 1 1 1 1 1 1 1 1 1 1 
##$CPDPRG= <waltz16>
##$CPDPRG1= <>
##$CPDPRG2= <waltz16>
##$CPDPRG3= <>
##$CPDPRG4= <mlev>
##$CPDPRG5= <mlev>
##$CPDPRG6= <mlev>
##$CPDPRG7= <mlev>
##$CPDPRG8= <mlev>
##$CPDPRGB= <>
##$CPDPRGT= <>
##$D= (0..31)
0 1 0 0 0 0 0 0 0 0 0 0.03 2e-05 3e-06 0 0 0 0 0 0 0 0 0 0 0 0 0 0 0 0 
0 0 
##$DATE= 1698920286
##$DBL= (0..7)
120 120 120 11 120 120 24 19 
##$DBP= (0..7)
150 150 150 150 150 150 150 150 
##$DBP07= 0
##$DBPNAM0= <>
##$DBPNAM1= <>
$$ [...]
##$SUBNAM3= <"">
##$SUBNAM4= <"">
##$SUBNAM5= <"">
##$SUBNAM6= <"">
##$SUBNAM7= <"">
##$SUBNAM8= <"">
##$SUBNAM9= <"">
##$SW= 501.771253377433
##$SWIBOX= (0..15)
0 1 3 0 0 0 0 0 0 0 0 0 0 0 0 0 
##$SW_h= 40650.406504065
##$TD= 32768
##$TD0= 1
##$TE= 0
##$TE2= 300
##$TE3= 300
##$TEG= 300
##$TL= (0..7)
0 120 53 12 22 120 120 120 
##$TP= (0..7)
150 150 150 150 150 150 150 150 
##$TP07= 0
##$TPNAME0= <>
##$TPNAME1= <>
##$TPNAME2= <>
##$TPNAME3= <>
##$TPNAME4= <>
##$TPNAME5= <>
##$TPNAME6= <>
##$TPNAME7= <>
##$TPOAL= (0..7)
0.5 0.5 0.5 0.5 0.5 0.5 0.5 0.5 
##$TPOFFS= (0..7)
0 0 0 0 0 0 0 0 
##$TUNHIN= 0
##$TUNHOUT= 0
##$TUNXOUT= 0
##$USERA1= <user>
##$USERA2= <user>
##$USERA3= <user>
##$USERA4= <user>
##$USERA5= <user>
##$V9= 5
##$VALIST= <valist>
##$VCLIST= <CCCCCCCCCCCCCCC>
##$VD= 0
##$VDLIST= <DDDDDDDDDDDDDDD>
##$VPLIST= <PPPPPPPPPPPPPPP>
##$VTLIST= <TTTTTTTTTTTTTTT>
##$WBST= 1024
##$WBSW= 4
##$XGAIN= (0..3)
0 0 0 0 
##$XL= 0
##$YL= 0
##$YMAX_a= 3632
##$YMIN_a= -2275
##$ZGOPTNS= <>
##$ZL1= 120
##$ZL2= 120
##$ZL3= 120
##$ZL4= 120
##$ABSF1= 248.5645
##$ABSF2= -253.2056
##$ABSG= 5
##$ABSL= 3
##$ALPHA= 0
##$AQORDER= 0
##$ASSFAC= 0
##$ASSFACI= 0
##$ASSFACX= 0
##$ASSWID= 0
##$AUNMP= <proc_1d>
##$AZFE= 0.1
##$AZFW= 0.5
##$BCFW= 0
##$BC_mod= 2
##$BYTORDP= 0
##$COROFFS= 0
##$CY= -3
##$DATMOD= 1
##$DC= 0
##$DFILT= <>
##$DTYPP= 0
##$F1P= 0
##$F2P= 0
##$FCOR= 1
##$FTSIZE= 65536
##$FT_mod= 6
##$GAMMA= 0
##$GB= 0
##$INTBC= 1
##$INTSCL= 6.047779e-11
##$ISEN= 30
##$LB= 5
##$LEV0= 0
##$LPBIN= 0
##$MAXI= 10000
##$MC2= 0
##$MEAN= 0
##$ME_mod= 0
##$MI= 50
##$NCOEF= 0
##$NC_proc= -7
##$NLEV= 6
##$NOISF1= 182.463
##$NOISF2= 159.3651
##$NSP= 0
##$NTH_PI= 0
##$NZP= 0
##$OFFSET= 248.5645
##$PC= 4
##$PHC0= -10673.89
##$PHC1= 62.4902
##$PH_mod= 1
##$PKNL= yes
##$PPARMOD= 0
##$PSCAL= 0
##$PSIGN= 0
##$REVERSE= no
##$SF= 81.0140089999694
##$SI= 65536
##$SIGF1= 159.3651
##$SIGF2= -187.1042
##$SINO= 113.3802
##$SIOLD= 16384
##$SREGLST= <1H.CDCl3>
##$SSB= 0
##$STSI= 65536
##$STSR= 0
##$SW_p= 40650.406504065
##$SYMM= 0
##$S_DEV= 0
##$TDeff= 32768
##$TDoff= 0
##$TI= <>
##$TILT= no
##$TM1= 0
##$TM2= 0
##$TOPLEV= 0
##$USERP1= <user>
##$USERP2= <user>
##$USERP3= <user>
##$USERP4= <user>
##$USERP5= <user>
##$WDW= 1
##$XDIM= 65536
##$YMAX_p= 411725097
##$YMIN_p= -12464948
$$ End of Bruker specific parameters
$$ ---------------------------------
##NTUPLES= NMR SPECTRUM
##VAR_NAME=  FREQUENCY,     SPECTRUM/REAL,   SPECTRUM/IMAG
##SYMBOL=    X,             R,               I
##VAR_TYPE=  INDEPENDENT,   DEPENDENT,       DEPENDENT
##VAR_FORM=  AFFN,          ASDF,            ASDF
##VAR_DIM=   65536,         65536,           65536
##UNITS=     HZ,            ARBITRARY UNITS, ARBITRARY UNITS
##FACTOR=    0.620285442955139, 1,           1
##FIRST=     20137.2065510682, 0,            0
##LAST=      -20513.1999529968, 0,           0
##MIN=       -20513.1999529968, -12464948,   0
##MAX=       20137.2065510682, 411725097,    0
$$ Real data points
##PAGE= N=1
##DATA TABLE= (X++(R..R)), XYDATA
$$ [...]
$$ plain form
39782 -639536 -798444 -1039312 -1268122 -1445549 -1572870 -1627701 -1573625 -1440016 -1332898 -1329741
39772 -1329741 -1395045 -1430981 -1382711 -1259485 -1081873 -861548 -626923 -417821 -241439 -67855
39762 -67855 116186 276314 370058 397036 392810 387315 385956 381317 365439 332069 280652 225451
39750 225451 201288 257296 432778 723694 1072911 1407724 1690718 1922569 2096292 2173904
39740 2173904 2126660 1984998 1824199 1697228 1595705 1481891 1348353 1235832 1193202 1226585
39730 1226585 1292303 1336761 1333880 1280278 1169786 996451 784202 587970 446469 345501
39720 345501 246128 139330 47376 -28271 -130437 -302030 -538924 -808385 -1099029 -1419258
39710 -1419258 -1743349 -1992027 -2091252 -2040614 -1906299 -1753193 -1601900 -1449125 -1306741 -1207162
$$ packed form
39782f39536j58908k40868k28810j77427j27321n4831N4076J33609J07118L157
39772a329741o5304l5936M8270J23226J77612K20325K34625K09102J76382J73584
39762f7855J84041J60128R3744K6978m226n495j359m639j5878l3370n1417n5201
39750B25451k4163N6008J75482K90916L49217L34813K82994K31851J73723P7612
39740B173904m7244j41662j60799j26971j01523j13814j33538j12521m2630L3383
39730A226585O5718M4458k881n3602j10492j73335k12249j96232j41501j00968
39720C45501r9373j06798r1954p5647j02166j71593k36894k69461k90644l20229
39710a419258l24091k48678r9225N0638J34315J53106J51293J52775J42384R9579
$$ plain form
39700 -1207162 -1176971 -1212668 -1279730 -1334873 -1357498 -1364819 -1393070 -1461305 -1553537 -1629615 -1645981
39689 -1645981 -1575930 -1431453 -1267393 -1141897 -1061441 -980960 -868685 -751122 -674058 -632850
39679 -632850 -566471 -418803 -189217 72177 299685 445779 504696 513317 519646 547843 598994
39668 598994 672638 760829 818834 769470 557326 196549 -235789 -643046 -948916 -1118895
39658 -1118895 -1159517 -1092704 -929958 -682780 -394470 -134645 51683 173270 261687 335276
39648 335276 414407 548248 782928 1094561 1381558 1544050 1567652 1522980 1486958 1467271
39638 1467271 1397570 1199520 848999 389575 -102609 -554308 -907244 -1127069 -1217653 -1211021
39628 -1211021 -1125487 -945624 -665540 -346397 -105431 -37261 -151106 -377834 -619241 -792354
$$ packed form
39700a207162L0191l5697o7062n5143k2625p321k8251o8235r2232p6078j6366
39689a645981P0051J44477J64060J25496Q0456Q0481J12275J17563P7064M1208
39679f32850O6379J47668K29586K61394K27508J46094N8917Q621O329K8197N1151
39668E98994P3644Q8191N8005m9364k12144l60777m32338m07257l05870j69979
39658a118895m0622O6813J62746K47178K88310K59825J86328J21587Q8417P3589
39648C35276P9131J33841K34680L11633K86997J62492K3602m4672l6022j9687
39638A467271o9701j98050l50521m59424m92184m51699l52936k19825r0584O632
39628a211021Q5534J79863K80084L19143K40966O8170j13845k26728k41407j73113
$$ plain form
39618 -792354 -856482 -823739 -743158 -662929 -601792 -550931 -493589 -420854 -336579 -248623 -147966
39607 -147966 -1535 211430 445673 595466 583553 444738 299635 239491 252371 267335
39597 267335 248463 224965 242442 316272 439830 611921 832024 1075115 1292248 1442515
39587 1442515 1519482 1550999 1583831 1660911 1788097 1911431 1943255 1829283 1588751 1282603
39577 1282603 952365 602501 231849 -141747 -492468 -803961 -1065803 -1265472 -1397907
39568 -1397907 -1476974 -1521937 -1531329 -1485160 -1383244 -1272718 -1220481 -1253578 -1337051 -1416806 -1473766
39557 -1473766 -1524576 -1578683 -1614463 -1597500 -1503704 -1322595 -1064001 -780090 -564301 -501330
39547 -501330 -612031 -849882 -1136741 -1387460 -1520627 -1490527 -1330507 -1150537 -1072016 -1153256
$$ packed form
39618g92354o4128L2743Q0581Q0229O1137N0861N7342P2735Q4275Q7956J00657
39607a47966J46431K12965K34243J49793j1913j38815j45103o0144J2880J4964
39597B67335j8872k3498J7477P3830J23558J72091K20103K43091K17133J50267
39587A442515P6967L1517L2832P7080J27186J23334L1824j13972k40532l06148
39577A282603l30238l49864l70652l73596l50721l11493k61842j99669j32435
39568a397907p9067m4963r392M6169J01916J10526N2237l3097q3473p9755n6960
39557a473766n0810n4107l5780J6963R3796J81109K58594K83911K15789O2971
39547e01330j10701k37851k86859k50719j33167L0100J60020J79970P8521q1240
$$ plain form
39537 -1153256 -1358721 -1575329 -1661563 -1520491 -1162255 -699258 -268073 50192 246170 353064
39527 353064 425240 527722 705134 940510 1155270 1263534 1229108 1075458 857486 634193
39517 634193 456020 352923 319445 316229 300818 265978 245702 278506 367010 480024 591442
39506 591442 702767 819394 917309 954215 919310 859769 847589 923991 1082103 1294641 1537615
39495 1537615 1777780 1952963 1992428 1871167 1639515 1391396 1203805 1106929 1099693 1174632
39485 1174632 1320260 1507828 1687726 1807217 1840108 1805257 1750691 1707126 1654771 1546798
39475 1546798 1371017 1178518 1042186 992913 1005460 1039927 1081605 1138599 1214960 1296347 1356846
39464 1356846 1370675 1317945 1188614 990803 759608 552830 423610 382359 382605 353018 250720
$$ packed form
39537a153256k05465k16608q6234J41072L58236M62997M31185L18265J95978J06894
39527C53064P2176J02482J77412K35376K14760J08264l4426j53650k17972k23293
39517F34193j78173j03097l3478l216j5411l4840k0276L2804Q8504J13014J11418
39506E91442J11325J16627R7915L6906l4905n9541j2180P6402J58112K12538K42974
39495A537615K40165J75183L9465j21261k31652k48119j87591r6876p236P4939
39485A174632J45628J87568J79898J19491L2891l4851n4566m3565n2355j07973
39475A546798j75781j92499j36332m9273J2547L4467M1678N6994P6361Q1387O0499
39464A356846J3829n2730j29331j97811k31195k06778j29220m1251K46k9587j02298
$$ plain form
39453 250720 82891 -121673 -348620 -592321 -819753 -964004 -974269 -872520 -747470 -684001
39443 -684001 -698768 -742272 -752332 -697516 -578504 -409317 -209970 -8285 172143 339004
39433 339004 541475 836386 1229189 1646494 1975757 2140435 2140415 2027682 1859049 1680441
39423 1680441 1539194 1478252 1499397 1539896 1503494 1325984 1016744 642884 275734 -53287
39413 -53287 -354696 -647158 -926158 -1167131 -1353702 -1493173 -1602360 -1686140 -1733880 -1729960
39403 -1729960 -1663749 -1539319 -1385497 -1248276 -1156347 -1092266 -1011566 -897941 -793335 -769893
39393 -769893 -878454 -1123077 -1465330 -1834563 -2143943 -2327351 -2377732 -2339371 -2249755 -2096370
39383 -2096370 -1845026 -1505439 -1147368 -844428 -617715 -445633 -312559 -224935 -185410 -179971
$$ packed form
39453B50720j67829k04564k26947k43701k27432j44251j0265J01749J25050O3469
39443f84001j4767m3504j0060N4816J19012J69187J99347K01685J80428J66861
39433C39004K02471K94911L92803M17305L29263J64678k0j12733j68633j78608
39423A680441j41247o0942K1145M0499l6402j77510l09240l73860l67150l29021
39413e3287l01409k92462k79000k40973j86571j39471j09187q3780m7740L920
39403a729960O6211J24430J53822J37221R1929O4081Q0700J13625J04606K3442
39393g69893j08561k44623l42253l69233l09380j83408n0381L8361Q9616J53385
39383b096370K51344L39587L58071L02940K26713J72082J33074Q7624L9525N439
$$ plain form
39373 -179971 -202327 -271502 -405200 -580428 -735404 -812741 -797525 -721145 -639526 -602471 -626105
39362 -626105 -685480 -737042 -750327 -716685 -634171 -496386 -297864 -41910 256937 567979
39352 567979 842885 1038531 1155296 1242273 1345521 1449084 1480901 1386062 1190739 986556
39342 986556 848284 765325 652794 429353 85879 -315043 -694445 -1005572 -1242137 -1424825
39332 -1424825 -1589459 -1769778 -1966139 -2123448 -2148626 -1960641 -1535792 -923199 -232005 399481
39322 399481 843626 1021281 928518 646356 319776 93833 33704 94265 171159 180967 95424
39311 95424 -74483 -293989 -507005 -660209 -745938 -805078 -871380 -926881 -929767 -873529 -794913
39300 -794913 -727071 -667396 -594348 -496073 -374232 -234618 -84779 69592 238121 449396
$$ packed form
39373a79971k2356o9175j33698j75228j54976p7337J5216P6380Q1619L7055k3634
39362f26105n9375n1562j3285L3642Q2514J37785J98522K55954K98847L11042
39352E67979K74906J95646J16765Q6977J03248J03563L1817r4839j95323k04183
39342I86556j38272q2959j12531k23441l43474m00922l79402l11127k36565j82688
39332a424825j64634j80319j96361j57309k5178J87985M24849O12593O91194O31486
39322C99481M44145J77655r2763k82162l26580k25943o0129O0561P6894R808q5543
39311I5424j69907k19506k13016j53204q5729n9140o6302n5501k886N6238P8616
39300g94913O7842N9675P3048R8275J21841J39614J49839J54371J68529K11275
$$ plain form
39290 449396 726319 1052619 1367941 1600289 1708076 1699432 1618441 1511490 1398150 1265701
39280 1265701 1087755 849955 563434 258051 -37809 -313194 -570664 -806957 -1002438
39271 -1002438 -1134235 -1196448 -1200178 -1152895 -1042927 -847045 -554466 -189525 183908 488337
39261 488337 680077 778751 844239 920985 1009475 1091019 1166787 1261757 1393215 1540650 1644529
39250 1644529 1637330 1493607 1266292 1068642 1000180 1076614 1228673 1364420 1428119 1408697
39240 1408697 1314370 1154857 945156 715760 512817 382963 346758 375391 393462 319517
39230 319517 124389 -137517 -356767 -441680 -376592 -216712 -31771 140761 292682 415456
39220 415456 492995 525402 545153 595531 689576 792794 847541 814461 692990 508314 286041
$$ packed form
39290D49396K76923L26300L15322K32348J07787q644q0991j06951j13340j32449
39280A265701j77946k37800k86521l05383k95860k75385k57470k36293j95481
39271a002438j31797o2213l730M7283J09968J95882K92579L64941L73433L04429
39261D88337J91740R8674O5488P6746Q8490Q1544P5768R4970J31458J47435J03879
39250A644529p199j43723k27315j97650o8462P6434J52059J35747O3699j9422
39240A408697r4327j59513k09701k29396k02943j29854l6205K8633J8071p3945
39230C19517j95128k61906k19250q4913O5088J59880J84941J72532J51921J22774
39220D15456P7539L2407J9751N0378R4045J03218N4747l3080j21471j84676k22273
$$ plain form
39209 286041 42022 -209201 -444875 -635228 -750477 -766654 -670963 -466603 -173906 169243
39199 169243 504233 759117 881789 877549 804010 719534 645036 582309 549140 569667 635876
39188 635876 709660 774605 865900 1033095 1283457 1574821 1855373 2093919 2271465 2357804
39178 2357804 2308713 2092815 1726170 1280259 849537 505975 280270 170762 148738 155605
39168 155605 123558 21530 -126183 -279186 -428342 -587442 -744476 -840579 -800055 -574047
39158 -574047 -167126 351733 857701 1212745 1326893 1195640 897245 567516 357178 365135
39148 365135 583002 913050 1250824 1536191 1719053 1717537 1468035 1026112 574094 288504
39138 288504 199305 194404 156839 77749 33119 73929 160798 200053 121923 -78587 -349751
$$ packed form
39209B86041k44019k51223k35674j90353j15249j6177R5691K04360K92697L43149
39199A69243L34990K54884J22672m240p3539q4476p4498o2727l3169K0527O6209
39188F35876P3784O4945R1295J67195K50362K91364K80552K38546J77546Q6339
39178B357804m9091k15898l66645m45911m30722l43562k25705j09508k2024O867
39168A55605l2047j02028j47713j53003j49156j59100j57034r6103M0524K26008
39158e74047M06921N18859N05968L55044J14148j31253k98395l29729k10338P957
39148C65135K17867L30048L37774K85367J82862j516k49502m41923m52018k85590
39138B88504q9199m901l7565p9090m4630M0810Q6869L9255p8130k00510k71164
$$ plain form
39127 -349751 -608850 -777310 -829930 -823079 -852607 -965171 -1116457 -1220319 -1222204 -1116528 -919044
39116 -919044 -652358 -348483 -33829 290402 627022 936842 1140122 1180406 1075817 899998
39106 899998 726010 592603 500378 419033 308443 151733 -33179 -219227 -392262 -535358
39096 -535358 -611393 -592200 -504811 -424859 -416430 -488486 -605426 -718757 -785460 -779115 -700180
39085 -700180 -570982 -419167 -277769 -199356 -242933 -427387 -708415 -1015412 -1300935 -1539449
39075 -1539449 -1690160 -1689474 -1491732 -1112635 -633513 -167605 188969 396417 475737 475200 433663
39064 433663 374632 317373 272095 229239 178710 146097 187926 335811 556468 777903 944455
39053 944455 1038456 1069561 1069622 1089379 1166350 1282971 1373836 1385873 1319998 1207186 1063047
$$ packed form
39127c49751k59099j68460n2620O851k9528j12564j51286j03862j885J05676J97484
39116i19044K66686L03875L14654L24231L36620L09820K03280M0284j04589j75819
39106H99998j73988j33407r2225q1345j10590j56710j84912j86048j73035j43096
39096e35358p6035J9193Q7389P9952Q429p2056j16940j13331o6703O345P8935
39085g00180J29198J51815J41398P8413m3577j84454k81028l06997k85523k38514
39075a539449j50711O86J97742L79097M79122M65908L56574K07448P9320n37m1537
39064D33663n9031n7259m5278m2856n0529l2613M1829J47885K20657K21435J66552
39053I44455R4001L1105O1J9757P6971J16621R0865J2037o5875j12812j44139
$$ plain form
39042 1063047 885893 689419 511103 381890 303678 266329 275661 348167 473522 589157
39032 589157 603851 460210 182882 -136585 -408346 -597291 -708147 -733817 -642471 -421686
39022 -421686 -118783 174843 373780 432992 356737 198584 47865 -9039 71172 283566
39012 283566 597098 966112 1328644 1623553 1823926 1939952 1978905 1917436 1729318 1432037
39002 1432037 1090546 779052 548985 421799 387970 410335 449367 494710 558124 628266
38992 628266 651339 576181 411003 215431 36269 -131624 -317840 -529103 -740397 -917684
38982 -917684 -1031304 -1056785 -989998 -869596 -763848 -716534 -711843 -706471 -691828 -707114 -785212
38971 -785212 -895252 -945798 -844702 -562976 -157842 257664 581857 787646 934519 1114190
$$ packed form
39042A063047j77154j96474j78316j29213p8212l7349R332P2506J25355J15635
39032E89157J4694j43641k77328l19467k71761j88945j10856k5670R1346K20785
39022d21686L02903K93626J98937N9212p6255j58153j50719n6904Q0211K12394
39012B83566L13532L69014L62532K94909K00373J16026L8953o1469j88118k97281
39002A432037l41491l11494k30067j27186l3829K2365L9032M5343O3414P0142
38992F28266K3073p5158j65178j95572j79162j67893j86216k11263k11294j77287
38982i17684j13620k5481O6787J20402J05748M7314M691N372J4643j5286p8098
38971g85212j10040n0546J01096K81726M05134M15506L24193K05789J46873J79671
$$ plain form
38961 1114190 1369737 1654688 1868037 1938514 1888175 1818974 1830981 1942973 2082747 2146338
38951 2146338 2065761 1833427 1484201 1069156 645907 282931 55381 14443 146564 369751
38941 369751 588151 756458 886618 1001220 1104142 1200803 1318383 1480835 1673548 1854044
38931 1854044 1992632 2080612 2097976 1999173 1750246 1374677 948666 546159 189713 -144607
38921 -144607 -476229 -779416 -1000742 -1117595 -1167958 -1212143 -1270971 -1314978 -1315633 -1296578 -1327843
38910 -1327843 -1469076 -1713722 -1982209 -2172242 -2225097 -2149290 -1987995 -1780190 -1561383 -1380975
38900 -1380975 -1287607 -1294185 -1378378 -1520976 -1718899 -1947275 -2131855 -2188336 -2091393 -1894459
38890 -1894459 -1685883 -1535634 -1474758 -1502424 -1601420 -1750925 -1925219 -2077805 -2140689 -2066369
$$ packed form
38961A114190K55547K84951K13349P0477n0339o9201J2007J11992J39774O3591
38951B146338q0577k32334l49226m15045m23249l62976k27550m0938J32121K23187
38941C69751K18400J68307J30160J14602J02922R6661J17580J62452J92713J80496
38931A854044J38588Q7980J7364r8803k48927l75569m26011m02507l56446l34320
38921a44607l31622l03187k21326j16853n0363m4185n8828m4007o55J9055l1265
38910a327843j41233k44646k68487j90033n2855P5807J61295K07805K18807J80408
38900a380975R3368o578q4193j42598j97923k28376j84580n6481R6943J96934
38890a894459K08576J50249O0876k7666r8996j49505j74294j52586o2884P4320
$$ plain form
38880 -2066369 -1880795 -1676682 -1534045 -1448313 -1346100 -1166093 -912349 -636855 -396101 -232215
38870 -232215 -169988 -204799 -298109 -404583 -501628 -576840 -598967 -539991 -435688 -383305 -442283
38859 -442283 -554715 -602075 -535766 -414991 -314597 -241383 -167211 -109908 -133054 -264770 -451782
38848 -451782 -610447 -705132 -756335 -777275 -726627 -542432 -221342 151917 465819 668713
38838 668713 787230 868078 921558 924702 858529 726933 551466 368197 228598 181902 238040
38827 238040 344306 406729 350621 178205 -25604 -152415 -150905 -62978 9189 -27401 -198294
38816 -198294 -442557 -644891 -710267 -632411 -493732 -393356 -373858 -409850 -448643 -456041 -444089
38805 -444089 -474337 -623272 -920409 -1315192 -1711364 -2027009 -2212700 -2232787 -2069427 -1757333
$$ packed form
38880b066369J85574K04113J42637Q5732J02213J80007K53744K75494K40754J63886
38870b32215O2227l4811r3310j06474r7045p5212k2127N8976J04303N2383n8978
38859d42283j12432m7360O6309J20775J00394P3214P4172N7303k3146j31716j87012
38848d51782j58665r4685n1203k0940N0648J84195L21090L73259L13902K02894
38838F68713J18517Q0848N3480L144o6173j31596j75467j83269j39599m6696N6138
38827B38040J06266O2423n6108j72416k03809j26811J510Q7927P2167l6590j70893
38816a98294k44263k02334o5376P7856J38679J00376J9498l5992l8793p398J1952
38805d44089l0248j48935k97137l94783l96172l15645j85691k0087J63360L12094
$$ plain form
38795 -1757333 -1387945 -1052848 -781798 -540980 -283214 8736 317918 612260 860023
38786 860023 1033344 1108873 1076572 954432 791386 645758 552585 506670 471355 401046 263545
38775 263545 55002 -197537 -444198 -620796 -658442 -511461 -200629 173025 477689 626742
38765 626742 611549 478986 302224 168766 156449 286094 498066 692049 795620 794764
38755 794764 710679 565868 379988 190711 62585 56847 181794 380808 584517 773336
38745 773336 974073 1196808 1395759 1498687 1458630 1275691 997576 715903 534367 504546
38735 504546 592156 718535 822243 866514 816725 656515 422693 181853 -37646 -259372
38725 -259372 -498680 -727525 -917324 -1079920 -1232719 -1346142 -1363225 -1263785 -1078898 -847093
$$ packed form
38795a757333L69388L35097K71050K40818K57766K91950L09182K94342K47763
38786H60023J73321P5529l2301j22140j63046j45628r3173m5915l5315p0309j37501
38775B63545k08543k52539k46661j76598l7646J46981L10832L73654L04664J49053
38765F26742j5193j32563j76762j33458j2317J29645K11972J93983J03571q56
38755G94764q4085j44811j85880j89277j28126n738J24947J99014K03709J88819
38745G73336K00737K22735J98951J02928m0057j82939k78115k81673j81536k9821
38735E04546Q7610J26379J03708M4271m9789j60210k33822k40840k19499k21726
38725b59372k39308k28845j89799j62596j52799j13423j7083R9440J84887K31805
$$ plain form
38715 -847093 -588915 -330220 -121094 -10345 -5829 -67564 -140048 -196382 -258251 -366923 -523296
38704 -523296 -660761 -689733 -566948 -313295 22866 395992 761631 1076346 1315770 1480108
38694 1480108 1571802 1577103 1475502 1258447 937430 548674 156208 -163097 -348482 -370068
38684 -370068 -229015 29390 302293 468328 473154 370354 264479 225008 262961 361260
38674 361260 493676 624259 721918 779608 800102 766258 647844 436255 150137 -191300
38664 -191300 -572613 -954297 -1268453 -1459854 -1521139 -1482922 -1385483 -1264777 -1144855 -1030062
38654 -1030062 -916065 -814419 -749824 -726536 -717659 -697914 -664545 -610960 -505779 -327552 -108452
38643 -108452 82346 190134 187688 55086 -209958 -555981 -889881 -1146834 -1331217 -1477583
$$ packed form
38715h47093K58178K58695K09126J10749M516o1735p2484n6334o1869j08672j56373
38704e23296j37465k8972J22785K53653L36161L73126L65639L14715K39424J64338
38694A480108R1694N301j01601k17055l21017l88756l92466l19305j85385k1586
38684c70068J41053K58405K72903J66035M826j02800j05875l9471L7953R8299
38674C61260J32416J30583R7659N7690K0494l3844j18414k11589k86118l41437
38664a91300l81313l81684l14156j91401o1285L8217R7439J20706J19922J14793
38654a030062J13997J01646O4595K3288Q877J9745L3369N3585J05181J78227K19100
38643a08452J90798J07788k446j32602k65044l46023l33900k56953j84383j46366
$$ plain form
38633 -1477583 -1594327 -1663967 -1678035 -1642310 -1552860 -1392799 -1158170 -872483 -573681 -301573
38623 -301573 -101048 -17681 -70450 -228299 -422857 -589930 -705050 -791668 -902638 -1082148
38613 -1082148 -1323327 -1553125 -1669174 -1608154 -1388033 -1088319 -792040 -542235 -339905 -170100
38603 -170100 -26969 84618 173878 289011 500498 836039 1225512 1526968 1627610 1527613
38593 1527613 1325877 1127806 970456 829586 679826 530820 406793 313372 245019 217804
38583 217804 265052 385123 512141 563404 513953 409912 317393 282846 338127 501293 741681
38572 741681 962173 1055670 997594 877313 830012 929343 1131846 1313128 1359951 1240712
38562 1240712 1002705 717410 437116 191185 -4356 -147092 -244972 -300355 -304058 -252021
$$ packed form
38633a477583j16744o9640j4068L5725Q9450J60061K34629K85687K98802K72108
38623c01573K00525Q3367n2769j57849j94558j67073j15120q6618j10970j79510
38613a082148k41179k29798j16049O1020K20121K99714K96279K49805K02330J69805
38603a70100J43131J11587Q9260J15133K11487L35541L89473L01456J00642r9997
38593A527613k01736j98071j57350j40870j49760j49006j24027r3421o8353k7215
38583B17804M7248J20071J27018N1263m9451j04041r2519l4547N5281J63166K40388
38572G41681K20492R3497n8076j20281m7301R9331K02503J81282M6823j19239
38562A240712k38007k85295k80294k45931j95541j42736r7880n5383l703N2037
$$ plain form
38552 -252021 -158427 -46547 59286 123946 104834 -10006 -173412 -310171 -374858 -363272
38542 -363272 -277723 -115904 95162 283383 377891 367297 296403 208495 107438 -18851
38532 -18851 -152138 -239864 -246289 -205579 -218759 -395170 -789745 -1374408 -2040362 -2622796 -2957375
38521 -2957375 -2957754 -2660108 -2193651 -1706237 -1306330 -1041038 -894282 -807036 -728801 -664260
38511 -664260 -658755 -732340 -841153 -910774 -894623 -790000 -611163 -368852 -79321 222652
38501 222652 494598 711684 875599 999168 1094365 1183963 1309283 1496052 1705073 1842724
38491 1842724 1840473 1709881 1503696 1245051 925887 560294 195428 -137262 -446588 -744018
38481 -744018 -1010177 -1215054 -1346181 -1397388 -1354416 -1221784 -1052962 -925569 -885671 -930488
$$ packed form
38552b52021R3594J11880J05833O4660j9112j14840j63406j36759o4687J1586
38542c63272Q5549J61819K11066J88221R4508j0594p0894q7908j01057j26289
38532a8851j33287q7726o425M0710j3180j76411l94575n84663o65954n82434l34579
38521b957375l79K97646M66457M87414L99907K65292J46756Q7246P8235O4541
38511f64260N505p3585j08813o9621J6151J04623J78837K42311K89531L01973
38501B22652K71946K17086J63915J23569R5197Q9598J25320J86769K09021J37651
38491A842724k251j30592k06185k58645l19164l65593l64866l32690l09326k97430
38481g44018k66159k04877j31127n1207M2972J32632J68822J27393L9898m4817
$$ plain form
38471 -930488 -1036334 -1179677 -1331453 -1454696 -1519735 -1514625 -1439187 -1298653 -1104568 -870994
38461 -870994 -605824 -315022 -22842 214938 324742 251556 -2861 -365067 -716826 -954755
38451 -954755 -1040375 -1001643 -892379 -751762 -594610 -427837 -268166 -140539 -58442 -12093
38441 -12093 12041 -999 -89837 -262850 -453901 -550035 -473143 -235714 76487 365299 567326
38430 567326 662556 657517 566544 405968 201072 -7643 -173077 -263955 -283497 -264973 -241986
38419 -241986 -217632 -166555 -72832 42227 146559 252554 425291 719616 1115621 1528111
38409 1528111 1874315 2121390 2275470 2345139 2324142 2202963 1994084 1750536 1557167 1489734
38399 1489734 1569575 1751430 1949471 2075174 2068256 1920412 1684001 1447658 1284314 1209755
$$ packed form
38471i30488j05846j43343j51776j23243o5039N110P5438J40534J94085K33574
38461h70994K65170K90802K92180K37780J09804p3186k54417l62206l51759k37929
38451i54755q5620L8732J09264J40617J57152J66773J59671J27627Q2097M6349
38441a2093K4134j3040q8838j73013j91051r6134P6892K37429L12201K88812K02027
38430E67326R5230n039r0973j60576k04896k08715j65434r0878j9542J8524K2987
38419b41986K4354N1077R3723J15059J04332J05995J72737K94325L96005M12490
38409A528111L46204K47075J54080O9669k0997j21179k08879k43548j93369o7433
38399A489734P9841J81855J98041J25703o918j47844k36411k36343j63344p4559
$$ plain form
38389 1209755 1183405 1144746 1055567 923519 795477 724244 733955 815782 953020 1136317 1343890
38378 1343890 1518955 1595252 1560673 1481871 1440036 1434455 1365078 1125279 707742 209250 -260651
38367 -260651 -655866 -979685 -1224613 -1354535 -1344791 -1218488 -1032114 -831253 -624080 -388375
38357 -388375 -94145 274230 697280 1107223 1403937 1509589 1425925 1234901 1031692 856140
38347 856140 693378 529813 387091 299788 283443 339056 472165 684502 950514 1222843
38337 1222843 1467321 1682554 1881803 2065056 2214572 2313424 2364247 2389888 2413771 2437524
38327 2437524 2442535 2418571 2385327 2376516 2403812 2441445 2440273 2350341 2144817 1847545 1535981
38316 1535981 1286997 1103905 915631 664178 375152 120595 -69529 -222780 -356190
$$ packed form
38389A209755k6350l8659q9179j32048j28042p1233R711Q1827J37238J83297K07573
38378A343890J75065P6297l4579p8802m1835n581o9377k39799m17537m98492m69901
38367b60651l95215l23819k44928j29922R744J26303J86374K00861K07173K35705
38357c88375K94230L68375M23050M09943K96714J05652q3664j91024k03209j75552
38347H56140j62762j63565j42722q7303j6345N5613J33109K12337K66012K72329
38337A222843K44478K15233J99249J83253J49516R8852N0823K5641K3883K3753
38327B437524N011k3964l3244q811K7296L7633j172q9932k05524k97272l11564
38316A535981k48984j83092j88274k51453k89026k54557j90124j53251j33410
$$ plain form
38307 -356190 -438000 -438865 -389328 -350957 -342261 -326747 -273372 -198574 -142869 -134292 -185466 -294491
38295 -294491 -420601 -478713 -396373 -181475 84789 320453 491150 597802 654119 686648
38285 686648 722102 744506 678118 440492 16066 -529642 -1098108 -1608162 -2015596 -2312985
38275 -2312985 -2515996 -2635561 -2662552 -2593548 -2470015 -2371367 -2358926 -2433896 -2548801 -2642050
38265 -2642050 -2658391 -2565339 -2379380 -2168743 -1999404 -1865171 -1683873 -1373093 -924095 -400463
38255 -400463 116129 561679 889202 1071273 1117227 1064000 929070 687840 323823 -103634
38245 -103634 -466869 -649285 -604176 -347361 67842 553139 997641 1316225 1487268 1532874
38235 1532874 1476614 1338191 1153383 966705 796929 621776 397295 89957 -289631 -660846
$$ packed form
38307c56190q1810q65M9537L8371Q696J5514N3375P4798N5705Q577n1174j09025
38295b94491j26110n8112Q2340K14898K66264K35664J70697J06652N6317L2529
38285F86648L5454K2404o6388k37626m24426n45708n68466n10054m07434k97389
38275b312985k03011j19565k6991O9004J23533R8648J2441p4970j14905r3249
38265b642050j6341R3052J85959K10637J69339J34233J81298L10780M48998N23632
38255d00463N16592M45550L27523J82071M5954n3227j34930k41230l64017m27457
38245a03634l63235j82416M5109K56815M15203M85297M44502L18584J71043M5606
38235A532874n6260j38423j84808j86678j69776j75153k24481l07338l79588l71215
$$ plain form
38225 -660846 -894884 -901307 -706011 -428230 -179852 -3579 102597 146365 148209 157281 224690
38214 224690 359884 523199 654306 705201 668534 594706 568353 642114 789812 934563
38204 934563 1019792 1045504 1045684 1046214 1040263 990327 857919 646620 415553 236511 134412
38193 134412 76253 13851 -73662 -173149 -254033 -291099 -290648 -301621 -383899 -551156 -750731
38182 -750731 -907380 -980308 -974153 -912886 -825481 -752538 -737936 -793212 -875399 -916845 -884463
38171 -884463 -806092 -735808 -697980 -671424 -626765 -570142 -543273 -582655 -684856 -812461 -927086
38160 -927086 -1009236 -1046271 -1012074 -875915 -644273 -392427 -240199 -280617 -522947 -898186
38150 -898186 -1309917 -1674346 -1922369 -1990036 -1834520 -1472891 -1001756 -563804 -275933 -173077
$$ packed form
38225f60846k34038o423J95296K77781K48378J76273J06176M3768J844R072O7409
38214B24690J35194J63315J31107N0895l6667p3828k6353P3761J47698J44751
38204I34563Q5229K5712J80N30n951m9936j32408k11299k31067j79042j02099
38193A34412n8159o2402q7513r9487q0884l7066M51j0973q2278j67257j99575
38182g50731j56649p2928O155O1267Q7405P2943J4602n5276q2187m1446L2382
38171h84463P8371P0284L7828K6556M4659N6623K6869l9382j02201j27605j14625
38160i27086q2150l7035L4197J36159K31642K51846J52228m0418k42330l75239
38150h98186m11731l64429k48023o7667J55516L61629M71135M37952K87871J02856
$$ plain form
38140 -173077 -209276 -305229 -397141 -457757 -493924 -530873 -584510 -636806 -646818 -599439 -537375
38129 -537375 -528076 -599120 -722226 -861600 -1013540 -1179965 -1315009 -1321415 -1107751 -650159
38119 -650159 -13723 667439 1239855 1597509 1729437 1705804 1612802 1500722 1386295 1281305
38109 1281305 1202080 1158445 1146692 1150203 1138379 1071880 923231 693639 405043 83627 -239305
38098 -239305 -523789 -744168 -918087 -1092040 -1290156 -1491619 -1663886 -1800151 -1911631 -1996195
38088 -1996195 -2032235 -2006238 -1947685 -1943093 -2101955 -2469408 -2951299 -3352398 -3526297 -3490799
38078 -3490799 -3383697 -3318263 -3301260 -3271889 -3178397 -3013148 -2810022 -2624528 -2493183 -2396603
38068 -2396603 -2278288 -2108706 -1911750 -1720451 -1534741 -1342936 -1159484 -1009873 -891838
$$ packed form
38140a73077l6199r5953r1912o0616l6167l6949n3637n2296j0012M7379O2064
38129e37375R299p1044j23106j39374j51940j66425j35044o406K13664M57592
38119f50159O36436O81162N72416L57654J31928k3633r3002j12080j14427j04990
38109A281305p9225m3635j1753L511j1824o6499j48649k29592k88596l21416l22932
38098b39305k84484k20379j73919j73953j98116k01463j72267j36265j11480q4564
38088a996195l6040K5997N8553M592j58862l67453m81891m01099j73899L5498
38078c490799J07102O5434J7003K9371R3492J65249K03126J85494J31345R6580
38068b396603J18315J69582J96956J91299J85710J91805J83452J49611J18035
$$ plain form
38059 -891838 -784983 -692386 -633431 -585227 -466392 -208626 167089 569850 931832 1259801
38049 1259801 1586158 1887039 2073124 2068758 1889405 1631284 1390552 1204626 1067916 980216
38039 980216 959631 1012115 1104660 1175183 1166936 1058459 873612 670123 511895 437907 444701
38028 444701 491825 524431 496879 384670 187293 -68199 -328729 -540147 -684767 -781223
38018 -781223 -828118 -762313 -512886 -108123 304003 569268 648886 614265 546499 474129 395675
38007 395675 317373 254149 218823 223293 270993 336023 366972 327253 225288 101530 2202
37996 2202 -26330 60342 282292 614293 995288 1354037 1626176 1772265 1805098 1791380 1802077
37985 1802077 1858365 1937184 2018127 2097598 2157165 2149350 2032364 1804794 1495459 1135906 760166
$$ packed form
38059h91838J06855R2597N8955M8204J18835K57766L75715M02761L61982L27969
38049A259801L26357L00881J86085m366j79353k58121k40732j85926j36710q7700
38039I80216k0585N2484R2545P0523q247j08477j84847k03489j58228p3988O794
38028D44701M7124L2606k7552j12209j97377k55492k60530k11418j44620r6456
38018g81223m6895O5805K49427M04763M12126K65265P9618l4621o7766p2370p8454
38007C95675p8302o3224l5326M470M7700O5030L0949l9719j01965j23758r9328
37996B202k8532Q6672K21950L32001L80995L58749K72139J46089L2833j3718J0697
37985A802077N6288P8819Q0943P9471N9567p815j16986k27570l09335l59553l75740
$$ plain form
37974 760166 421078 184672 100134 172514 352731 549186 671533 693486 676640 714718
37964 714718 846955 1033415 1211162 1354774 1476158 1587010 1682523 1754305 1797185 1798248
37954 1798248 1734513 1595063 1405904 1229248 1137387 1181933 1372052 1663933 1968216 2185262
37944 2185262 2255993 2187967 2030120 1825453 1598199 1382425 1234875 1193495 1225345 1233115
37934 1233115 1118371 837608 416498 -57562 -454444 -653318 -615797 -412268 -164048 40755
37924 40755 176097 249157 272672 264601 249341 244489 251731 265000 282267 305867 331673 334538
37912 334538 264483 73191 -237277 -593850 -894605 -1074757 -1130094 -1094243 -1018335 -964325
37902 -964325 -978471 -1051585 -1124231 -1147357 -1125730 -1094690 -1078470 -1090808 -1153200 -1276902 -1430700
$$ packed form
37974G60166l39088k36406q4538P2380J80217J96455J22347K1953j6846L8078
37964G14718J32237J86460J77747J43612J21384J10852R5513P1782M2880J063
37954A798248o3735j39450j89159j76656r1861M4546J90119K91881L04283K17046
37944B185262P0731o8026j57847k04667k27254k15774j47550m1380L1850P770
37934A233115j14744k80763m21110m74060l96882j98874L7521K03529K48220K04803
37924D0755J35342P3060K3515q071j5260m852P242J3269J7267K3600K5806K865
37912C34538p0055j91292l10468l56573l00755j80152n5337L5851P5908N4010
37902i64325j4146p3114p2646k3126K1627L1040J6220j2338o2392j23702j53798
$$ plain form
37891 -1430700 -1558237 -1636465 -1700085 -1804910 -1982994 -2231740 -2518846 -2783848 -2956298 -2997000
37881 -2997000 -2919532 -2762331 -2550100 -2297038 -2037316 -1826323 -1702963 -1660666 -1657808 -1645118
37871 -1645118 -1581951 -1447199 -1255367 -1059554 -921746 -870597 -886973 -924880 -939545 -903991
37861 -903991 -820516 -724841 -662039 -639129 -605639 -498663 -310256 -98347 71440 181979
37851 181979 259489 330619 400451 463579 515752 549863 552296 509336 412514 258436 54847
37840 54847 -167278 -356107 -463636 -470735 -391782 -265489 -143857 -72935 -63478 -79436 -68712
37829 -68712 -10366 73046 144555 180221 171198 123605 68731 52095 87887 133251 134181 97951
37817 97951 96379 189117 359950 532520 624604 573661 338683 -79250 -606638 -1106808 -1437554
$$ packed form
37891a430700j27537p8228o3620j04825j78084k48746k87106k65002j72450m0702
37881b997000P7468J57201K12231K53062K59722K10993J23360M2297K858J2690
37871a645118O3167J34752J91832J95813J37808N1149j6376l7907j4665L5554
37861i03991Q3475R5675O2802K2910L3490J06976J88407K11909J69787J10539
37851A81979P7510P1130O9832O3128N2173L4111K433m2960r6822j54078k03589
37840E4847k22125j88829j07529p099P8953J26293J21632P0922R457j5958J0724
37829f8712N8346Q3412P1509L5666r023m7593n4874j6636L5792M5364R30l6230
37817I7951j572R2738J70833J72570R2084n0943k34978m17933n27388n00170l30746
$$ plain form
37806 -1437554 -1512601 -1332102 -984104 -620701 -401073 -417332 -652887 -1008912 -1377333 -1700673
37796 -1700673 -1976457 -2217100 -2416377 -2560010 -2659360 -2752916 -2861993 -2954288 -2964917 -2852712
37786 -2852712 -2631407 -2355738 -2090774 -1889666 -1782073 -1772233 -1844232 -1963326 -2074898 -2124611
37776 -2124611 -2098760 -2034869 -1974345 -1913840 -1823766 -1704650 -1596539 -1535110 -1527389 -1570356 -1658235
37765 -1658235 -1761106 -1830235 -1844508 -1827143 -1799873 -1749640 -1665475 -1580555 -1540019 -1539370 -1529239
37754 -1529239 -1475901 -1387457 -1286768 -1195450 -1149824 -1197798 -1359668 -1606795 -1888263 -2161960
37744 -2161960 -2390281 -2525757 -2525719 -2386006 -2156330 -1920020 -1746154 -1639106 -1527415 -1318799
37734 -1318799 -984406 -593060 -262260 -76002 -39527 -92821 -158784 -189109 -176221 -125536
$$ packed form
37806a437554p5047J80499L47998L63403K19628j6259k35555l56025l68421l23340
37796a700673k75784k40643j99277j43633r9350r3556j09077r2295j0629J12205
37786b852712K21305K75669K64964K01108J07593R840p1999j19094j11572m9713
37776b124611K5851O3891O0524O0505R0074J19116J08111O1429P721m2967q7879
37765a658235j02871o9129j4273J7365K7270N0233Q4165Q4920M0536O49J0131
37754a529239N3338Q8444J00689R1318M5626m7974j61870k47127k81468k73697
37744b161960k28321j35476L8J39713K29676K36310J73866J07048J11691K08616
37734a318799L34393L91346L30800J86258L6475n3294o5963l0325J2888N0685
$$ plain form
37724 -125536 -24218 152028 404820 698889 976992 1168197 1185589 958119 500090 -60440
37714 -60440 -551596 -865490 -997922 -1004804 -948630 -878607 -818472 -745828 -600017 -341114 -9692
37703 -9692 282374 429046 402297 255904 67830 -117627 -296107 -463510 -583885 -605430
37693 -605430 -505065 -308432 -66520 178399 405421 611277 803404 982202 1114108 1134232
37683 1134232 1003530 769102 545899 423102 396460 399054 381673 345150 306697 266494 219938
37672 219938 185440 198881 276840 394621 510561 615379 749882 959168 1223031 1441473
37662 1441473 1500474 1354080 1049271 694658 418729 330512 472994 798105 1204144 1604822
37652 1604822 1949455 2184682 2239058 2073788 1732857 1320309 935077 638388 459991 397667
$$ packed form
37724a25536J01318J76246K52792K94069K78103J91205J7392k27470m58029n60530
37714f0440m91156l13894j32432o882N6174P0023O0135P2644J45811K58903L31422
37703i692K92066J46672k6749j46393j88074j85457j78480j67403j20375k1545
37693f05430J00365J96633K41912K44919K27022K05856J92127J78798J31906K0124
37683A134232j30702k34428k23203j22797k6642K594j7381l6523l8453m0203m6556
37672B19938l4498J3441P7959J17781J15940J04818J34503K09286K63863K18442
37662A441473N9001j46394l04809l54613k75929q8217J42482L25111M06039M00678
37652A604822L44633K35227N4376j65270l40931m12548l85232k96689j78397o2324
$$ plain form
37642 397667 407132 422434 407237 383650 405659 505108 658554 797617 852548 794610 638858
37631 638858 405929 90887 -318831 -797088 -1260169 -1596251 -1718073 -1609730 -1348787 -1080880
37621 -1080880 -940074 -961352 -1061083 -1112583 -1057532 -956892 -932962 -1051021 -1254017 -1421371
37611 -1421371 -1493060 -1523925 -1615322 -1813824 -2084114 -2352525 -2551969 -2647072 -2657317 -2656715 -2716616
37600 -2716616 -2835655 -2943121 -2974161 -2920141 -2800999 -2615113 -2334105 -1934928 -1426784 -856401
37590 -856401 -289703 228939 705871 1169961 1610832 1969349 2200292 2314480 2333217 2227141
37580 2227141 1944882 1502735 1008911 582595 266150 24378 -191587 -396234 -569009
37571 -569009 -676033 -690308 -606509 -444940 -237439 -7616 228800 441511 575212 580474
$$ packed form
37642C97667R465J5302j5197k3587K2009R9449J53446J39063N4931n7938j55752
37631F38858k32929l15042m09718m78257m63081l36082j21822J08343K60943K67907
37621a080880J40806k1278r9731n1500N5051J00640K3930j18059k02996j67354
37611a421371p1689l0865r1397j98502k70290k68411j99444r5103j0245O02n9901
37600b716616j19039j07466l1040N4020J19142J85886K81008L99177N08144N70383
37590h56401N66698N18642M76932M64090M40871L58517K30943J14188J8737j06076
37580B227141k82259m42147m93824m26316l16445k41772k15965k04647j72775
37571e69009j07024j4275Q3799J61569K07501K29823K36416K12711J33701N262
$$ plain form
37561 580474 464956 310299 231034 310693 562886 927892 1292969 1537808 1600935 1521814
37551 1521814 1408516 1349986 1352258 1345387 1234099 949013 485293 -83261 -640074 -1097471
37541 -1097471 -1434173 -1659551 -1761140 -1710522 -1512115 -1219776 -904156 -625469 -437901 -386166
37531 -386166 -471283 -631252 -780058 -870907 -915962 -953017 -1008811 -1092023 -1200245 -1319547 -1423149
37520 -1423149 -1481495 -1475602 -1400341 -1262363 -1083953 -907087 -782478 -745716 -800158 -916663
37510 -916663 -1040992 -1102299 -1031865 -795571 -417618 31842 478909 878723 1211095 1453952
37500 1453952 1572308 1538404 1361316 1094450 814284 591165 472503 477274 590029 755397
37490 755397 888582 910312 791885 579835 375439 273572 302879 416903 540458 619910
$$ packed form
37561E80474j15518j54657p9265P9659K52193L65006L65077K44839O3127p9121
37551A521814j13298n8530K272o871j11288k85086m63720n68554n56813m57397
37541a097471l36702k25378j01589N0618J98407K92339L15620K78687J87568N1735
37531c86166q5117j59969j48806r0849m5055l7055n5794q3212j08222j19302j03602
37520a423149n8346N893P5261J37978J78410J76866J24609L6762n4442j16505
37510i16663j24329o1307P0434K36294L77953M49460M47067L99814L32372K42857
37500A453952J18356l3904j77088k66866k80166k23119j18662M771J12755J65368
37490G55397J33185K1730j18427k12050k04396j01867K9307J14024J23555P9452
$$ plain form
37480 619910 632968 575842 468663 367207 332986 370493 408577 363017 213438 11381 -171122
37469 -171122 -280436 -281047 -152647 92622 399077 688593 899194 1009103 1033779 1005426
37459 1005426 950762 878173 775534 615406 370016 35755 -354764 -756938 -1152965 -1550788
37449 -1550788 -1937622 -2254511 -2436396 -2468555 -2388231 -2241411 -2057474 -1857665 -1663552 -1494878
37439 -1494878 -1372398 -1312101 -1288218 -1204104 -938274 -445017 199180 856789 1423136 1857677
37429 1857677 2154398 2315043 2349379 2277630 2123660 1917174 1709905 1577773 1584925 1732027
37419 1732027 1945835 2134550 2254886 2312891 2304239 2186312 1928933 1570379 1196442 877341
37409 877341 647483 522293 488003 480302 424012 307398 178198 54385 -113112 -357528
$$ packed form
37480F19910J3058n7126j07179j01456l4221L7507L8084m5560j49579k02057j82503
37469a71122j09314o11J28400K45269L06455K89516K10601J09909K4676k8353
37459A005426n4664p2589j02639j60128k45390l34261l90519m02174l96027l97823
37449a550788l86834l16889j81885l2159Q0324J46820J83937J99809J94113J68674
37439a494878J22480O0297K3883Q4114K65830M93257O44197O57609N66347M34541
37429A857677K96721J60645L4336p1749j53970k06486k07269j32132P152J47102
37419A732027K13808J88715J20336N8005q652j17927k57379l58554l73937l19101
37409H77341k29858j25190l4290p701n6290j16614j29200j23813j67497k44416
$$ plain form
37399 -357528 -613091 -757364 -720593 -520816 -209651 171695 581030 958151 1240341 1390591
37389 1390591 1416206 1375526 1360551 1445497 1633210 1847728 1976811 1928267 1671732 1251228
37379 1251228 755976 267014 -166051 -498184 -667888 -629412 -394545 -20152 431248 887482
37369 887482 1236500 1353258 1185477 796977 313196 -161984 -572449 -886917 -1082752 -1147852
37359 -1147852 -1077986 -873968 -559918 -207497 76366 205091 164603 15846 -146390 -234865
37349 -234865 -185524 37772 428231 921736 1409982 1780406 1956296 1923463 1742788 1527919
37339 1527919 1371603 1273861 1162591 999796 841558 766075 765119 750533 668611 570549 556015
37328 556015 668773 854546 996845 985494 783412 460498 158439 -604 16470 161450
$$ packed form
37399c57528k55563j44273L6771J99777L11165L81346M09335L77121K82190J50250
37389A390591K5615m0680j4975Q4946J87713K14518J29083m8544k56535m20504
37379A251228m95252m88962m33065l32133j69704L8476K34867L74393M51400M56234
37369H87482L49018J16758j67781l88500m83781m75180m10465l14468j95835o5100
37359a147852O9866K04018L14050L52421K83863J28725m0488j48757j62236q8475
37349b34865M9341K23296L90459M93505M88246L70424J75890l2833j80675k14869
37339A527919j56316r7742j11270j62795j58238p5483r56j4586q1922r8062j4534
37328E56015J12758J85773J42299j1351k02082l22914l02059j59043J7074J44980
$$ plain form
37318 161450 356673 530108 629935 646256 625349 637372 714087 827782 941688 1071528
37308 1071528 1279219 1599475 1978546 2290188 2412581 2298876 1997687 1627642 1324004
37299 1324004 1171742 1157440 1184350 1148654 1009312 793496 558087 360960 246443 219220
37289 219220 227553 202144 125101 40222 -15835 -68828 -174590 -351714 -571567 -798429 -1001962
37278 -1001962 -1129819 -1107954 -893791 -516422 -49813 441746 919276 1348841 1694418 1932127
37268 1932127 2051934 2043379 1902729 1666915 1420862 1243389 1140903 1048365 904890 727491
37258 727491 609569 645498 845496 1109614 1284503 1261954 1040449 703257 345336 19972
37248 19972 -265156 -527138 -785111 -1034238 -1228517 -1303966 -1234143 -1054357 -820107 -556976
$$ packed form
37318A61450J95223J73435R9827J6321k0907J2023P6715J13695J13906J29840
37308A071528K07691L20256L79071L11642J22393j13705l01189l70045l03638
37299A324004j52262j4302K6910l5696j39342k15816k35409j97127j14517k7223
37289B19220Q333k5409p7043q4879n6057n2993j05762j77124k19853k26862k03533
37278a001962j27857K1865K14163L77369M66609M91559M77530M29565L45577K37709
37268A932127J19807q555j40650k35814k46053j77473j02486r2538j43475j77399
37258G27491j17922L5929J99998K64118J74889k2549k21505l37192l57921l25364
37248A9972k85128k61982k57973k49127j94279p5449O9823J79786K34250K63131
$$ plain form
37238 -556976 -274529 -20485 115490 71233 -127152 -385006 -608187 -744460 -779122 -725181
37228 -725181 -626298 -544597 -518542 -527051 -503528 -392772 -199789 9225 149116 166707 68240
37217 68240 -87242 -218064 -256642 -181819 -36440 88855 113231 26751 -107898 -221478
37207 -221478 -297257 -355563 -398026 -396831 -337561 -241184 -132235 -10676 128205 267600 384206
37196 384206 473486 537831 563300 534282 463981 384534 308401 220173 102613 -51248 -246196
37185 -246196 -474764 -694189 -840276 -877731 -825068 -730610 -644531 -612586 -662628 -777684 -902129
37174 -902129 -994574 -1066438 -1158941 -1294171 -1457223 -1610378 -1708855 -1709437 -1577575 -1293863 -868841
37163 -868841 -371338 65382 302032 280561 48029 -302603 -691640 -1054872 -1332603 -1492472
$$ packed form
37238e56976K82447K54044J35975m4257j98385k57854k23181j36273l4662N3941
37228g25181R8883Q1701K6055q509K3523J10756J92983K09014J39891J7591r8467
37217F8240j55482j30822l8578P4823J45379J25295K4376q6480j34649j13580
37207b21478p5779n8306m2463J195N9270R6377J08949J21559J38881J39395J16606
37196C84206Q9280O4345K5469k9018p0301p9447p6133q8228j17560j53861j94948
37185b46196k28568k19425j46087l7455N2663R4458Q6079L1945n0042j15056j24445
37174i02129r2445p1864r2503j35230j63052j53155r8477n82J31862K83712M25022
37163h68841M97503M36720K36650k1471k32532l50632l89037l63232k77731j59869
$$ plain form
37153 -1492472 -1551221 -1552841 -1535082 -1528801 -1566471 -1660608 -1776345 -1841984 -1785947 -1565187 -1186587
37142 -1186587 -725291 -305550 -31897 67032 25613 -104793 -270831 -412571 -486870 -501579
37132 -501579 -506001 -545243 -636191 -778268 -962657 -1170182 -1380620 -1588195 -1792952 -1974602
37122 -1974602 -2089497 -2100424 -2005788 -1842723 -1668238 -1530668 -1445921 -1397749 -1362109 -1326747
37112 -1326747 -1288835 -1248162 -1208088 -1169279 -1118247 -1042590 -967337 -950656 -1019389 -1121524 -1163918
37101 -1163918 -1091395 -919923 -712122 -539394 -446423 -418645 -387136 -289891 -131165 28203
37091 28203 127464 141229 79909 -19105 -114577 -202655 -323249 -495856 -658733 -708320 -604522
37080 -604522 -413657 -246637 -176183 -208526 -299437 -382674 -406717 -369526 -322063 -334118 -448821
$$ packed form
37153a492472n8749j620J7759O281l7670r4137j15737o5639N6037K20760L78600
37142a186587M61296M19741K73653R8929m1419j30406j66038j41740p4299j4709
37132e01579m422l9242r0948j42077j84389k07525k10438k07575k04757j81650
37122a974602j14895j0927R4636J63065J74485J37570Q4747M8172L5640L5362
37112a326747L7912M0673M0074L8809N1032P5657P5253J6681o8733j02135m2394
37101a163918P2523J71472K07801J72728R2971K7778L1509R7245J58726J59368
37091B8203R9261J3765o1320r9014r5472q8078j20594j72607j62877m9587J03798
37080f04522J90865J67020P0454l2343r0911q3237k4043L7191M7463j2055j14703
$$ plain form
37069 -448821 -651633 -870593 -1019028 -1055945 -1002633 -896713 -749427 -563523 -372637 -235133
37059 -235133 -193393 -251388 -373353 -481903 -477628 -299995 24033 404181 751298 1009548
37049 1009548 1154915 1199717 1191494 1177588 1171418 1168663 1181826 1239702 1376644 1655354 2180888
37038 2180888 3045806 4249595 5674866 7112118 8288329 8934271 8921558 8359446 7517520
37029 7517520 6636748 5823404 5087945 4419504 3817848 3306648 2932020 2713030 2586456
37020 2586456 2433405 2165904 1765691 1258594 699879 173739 -255583 -604569 -936647
37011 -936647 -1262403 -1522062 -1673140 -1741868 -1773880 -1784720 -1774589 -1739675 -1647322 -1452110 -1169224
37000 -1169224 -892462 -707493 -614281 -552862 -470134 -341576 -166329 29516 210081 369319
$$ packed form
37069d48821k02812k18960j48435l6917N3312J05920J47286J85904J90886J37504
37059b35133M1740n7995j21965j08550M275J77633L24028L80148L47117K58250
37049A009548J45367M4802q223j3906o170k755J3163N7876J36942K78710N25534
37038B180888Q64918J203789J425271J437252J176211O45942j2713n62112q41926
37029G517520q80772q13344p35459o68441o01656n11200l74628k18990j26574
37020B586456j53051k67501m00213n07097n58715n26140m29322l48986l32078
37011i36647l25756k59659j51078o8728l2012j0840J0131L4914R2353J95212K82886
37000a169224K76762J84969R3212O1419Q2728J28558J75247J95845J80565J59238
$$ plain form
36990 369319 529074 691144 832349 963563 1150381 1449380 1858738 2352108 2916849 3522133
36980 3522133 4079919 4476310 4631908 4522377 4176383 3681131 3160721 2714184 2382810
36971 2382810 2184744 2146037 2268368 2486235 2684067 2754851 2648407 2395944 2099447 1865357
36961 1865357 1725824 1635352 1540472 1423096 1280545 1112310 945603 840637 853693 1015159
36951 1015159 1335587 1787122 2274037 2670343 2901573 2955518 2821664 2487420 2010853 1531416
36941 1531416 1169685 950347 836086 786805 769550 768609 815848 964813 1210351 1476823
36931 1476823 1700670 1874462 2000145 2066654 2097728 2153512 2248611 2324774 2334663 2294634 2227308
36920 2227308 2117062 1957904 1785062 1625150 1474606 1357996 1342503 1458808 1664686 1908059
$$ packed form
36990C69319J59755J62070J41205J31214J86818K98999M09358M93370N64741O05284
36980C522133N57786L96391J55598j09531l45994m95252n20410m46537l31374
36971B382810j98066l8707J22331K17867J97832P0784j06444k52463k96497k34090
36961A865357j39533r0472r4880j17376j42551j68235j66707j04966J3056J61466
36951A015159L20428M51535M86915L96306K31230N3945j33854l34244m76567m79437
36941A531416l61731k19338j14261m9281j7255r41M7239J48965K45538K66472
36931A476823K23847J73792J25683O6509L1074N5784R5099P6163R889m0029o7326
36920B227308j10246j59158j72842j59912j50544j16610j5493J16305K05878K43373
$$ plain form
36910 1908059 2156614 2352320 2436405 2459379 2569881 2840460 3185430 3489060 3715767 3852304
36900 3852304 3868524 3818944 3875970 4164851 4642419 5207026 5827605 6485595 7104368 7645889
36890 7645889 8187466 8800456 9437974 10034878 10621556 11241750 11864685 12489055 13230029
36881 13230029 14189342 15342243 16661909 18239427 20169123 22451080 25132117 28388349
36873 28388349 32315345 36790692 41711660 47223458 53575549 60971605 69755073 80504955
36865 80504955 93723796 109714012 129048610 152857490 182323688 218204326 260847910
36858 260847910 309187732 357924025 396171310 411725097 399077531 363533225 317037771
36851 317037771 270249548 228431200 192841007 163421065 139645561 120444249 104701056
$$ packed form
36910A908059K48555J95706Q4085K2974J10502K70579L44970L03630K26707J36537
36900C852304J6220m9580N7026K88881M77568N64607O20579O57990O18773N41521
36890G645889N41577O12990O37518N96904N86678O20194O22935O24370P40974
36881A3230029R59313J152901J319666J577518J929696K281957K681037L256232
36873B8388349L926996M475347M920968N511798O352091P396056Q783468J0749882
36865H0504955J3218841J5990216J9334598K3808880K9466198L5880638M2643584
36858B60847910M8339822M8736293L8247285J5553787j2647566l5544306m6495454
36851C17037771m6788223m1818348l5590193k9419942k3775504j9201312j5743193
$$ plain form
36844 104701056 91780220 81262820 72536538 64993044 58357403 52539088 47378659 42760422
36836 42760422 38746641 35364903 32425390 29731455 27312813 25285455 23632459 22278291
36828 22278291 21228113 20460565 19795094 19022531 18087420 17033539 15879841 14673812 13565079
36819 13565079 12688232 12031794 11513148 11097228 10746268 10348365 9816958 9199449 8588660
36810 8588660 7990036 7367861 6751505 6190271 5656498 5093620 4517697 3980575 3472592
36801 3472592 2952118 2443599 2027364 1753475 1627190 1648532 1802768 2035140 2283804 2508940
36791 2508940 2657615 2660931 2524663 2369021 2310735 2347159 2416097 2516024 2685587 2898767
36781 2898767 3063958 3115207 3044304 2865496 2614627 2368838 2203035 2124536 2085021 2036051
$$ packed form
36844A04701056j2920836j0517400q726282p543494o635641n818315n160429m618237
36836D2760422m013781l381738k939513k693935k418642k027358j652996j354168
36828B2278291j050178p67548o65471p72563r35111j053881j153698j206029j108733
36819A3565079q76847o56438n18646m15920l50960l97903n31407o17509o10789
36810H588660n98624o22175o16356n61234n33773n62878n75923n37122n07983
36801C472592n20474n08519m16235k73889j26285K1342J54236K32372K48664K25136
36791B508940J48675L316j36268j55642n8286L6424O8938R9927J69563K13180
36781B898767J65191N1249p0903j78808k50869k45789j65803p8499l9515m8970
$$ plain form
36771 2036051 1936085 1741796 1457446 1177325 1021147 1030842 1167670 1386953 1662567 1952214
36761 1952214 2195232 2349894 2403235 2357375 2238136 2095658 1957419 1802974 1628788 1512674
36751 1512674 1554147 1755532 2011628 2214868 2326338 2348575 2283872 2136369 1917989 1633419
36741 1633419 1281738 885552 501482 187552 -40704 -224168 -424220 -649887 -815314
36732 -815314 -800759 -576305 -243065 63914 285709 437304 539523 596856 621464 636474
36722 636474 657807 690458 725414 725618 648807 514585 418970 445548 581810 747915 873960
36711 873960 917323 851905 700814 550115 462565 389170 227669 -35630 -298575 -454700
36701 -454700 -476739 -390780 -231121 -38007 150707 328528 505417 652154 700610 618716
$$ packed form
36771B036051r9966j94289k84350k80121j56178R695J36828K19283K75614K89647
36761A952214K43018J54662N3341m5860j19239j42478j38239j54445j74186j16114
36751A512674M1473K01385K56096K03240J11470K2237o4703j47503k18380k84570
36741A633419l51681l96186l84070l13930k28256j83464k00052k25667j65427
36732h15314J4555K24454L33240L06979K21795J51595J02219N7333K4608J5010
36722F36474K1333L2651L4956K04p6811j34222r5615K6578J36262J66105J26045
36711H73960M3363o5418j51091j50699q7550p3395j61501k63299k62945j56125
36701d54700k2039Q5959J59659J93114J88714J77821J76889J46737M8456q1894
$$ plain form
36691 618716 453276 283274 159882 98557 83344 49081 -107251 -453852 -958638 -1502437
36681 -1502437 -1945253 -2181992 -2173041 -1958716 -1643488 -1345470 -1145401 -1065844 -1077400 -1124019
36671 -1124019 -1163598 -1194079 -1231747 -1269048 -1275918 -1243761 -1199532 -1161349 -1101705 -978605 -797643
36660 -797643 -623651 -523267 -499038 -482575 -393592 -206838 35461 264604 424902 483526
36650 483526 437342 327722 223808 164728 129807 85133 43904 56558 153629 322016 522573
36639 522573 701601 799068 784722 686422 554566 407127 248386 136226 174504 410352
36629 410352 768075 1110000 1348296 1487701 1585499 1692011 1813364 1907818 1922147 1847727
36619 1847727 1744474 1707585 1809761 2063623 2420336 2800222 3134539 3380810 3504400 3478577
$$ packed form
36691F18716j65440j70002j23392o1325j5213l4263j56332l46601n04786n43799
36681a502437m42816k36739Q951K14325L15228K98018K00069P9557j1556m6619
36671a124019l9579l0481l7668l7301o870L2157M4229L8183N9644J23100J80962
36660g97643J73992J00384K4229J6463Q8983J86754K42299K29143J60298N8624
36650D83526m6184j09620j03914n9080l4921m4674m1229J2654R7071J68387K00557
36639E22573J79028R7467j4346r8300j31856j47439j58741j12160L8278K35848
36629D10352L57723L41925K38296J39405R7798J06512J21353R4454J4329p4420
36619A847727j03253l6889J02176K53862L56713L79886L34317K46271J23590k5823
$$ plain form
36609 3478577 3332251 3171633 3098946 3103779 3080123 2963395 2805372 2690359 2620780 2526701
36599 2526701 2364088 2161217 1976023 1841607 1752965 1681369 1599741 1512633 1462512 1490946
36589 1490946 1590281 1701914 1763690 1760878 1745026 1809298 2023468 2366089 2720173 2950748
36579 2950748 2991862 2862526 2621106 2326853 2036865 1810562 1698077 1718800 1845936 2015207
36569 2015207 2168531 2301324 2452400 2636129 2807186 2917262 2987363 3084123 3225998 3352481
36559 3352481 3398730 3366875 3299133 3202729 3033413 2751113 2370839 1955186 1568876 1244445
36549 1244445 985287 795714 700617 724333 848465 1006684 1135363 1222302 1292169 1350405
36539 1350405 1361054 1283910 1119811 913865 725566 601111 558868 581821 624106 642202
$$ packed form
36609C478577j46326j60618p2687M833k3656j16728j58023j15013o9579r4079
36599B526701j62613k02871j85194j34416q8642p1596q1628q7108n0121K8434
36589A490946R9335J11633O1776k812j5852O4272K14170L42621L54084K30575
36579B950748M1114j29336k41420k94253k89988k26303j12485K0723J27136J69271
36569B015207J53324J32793J51076J83729J71057J10076P0101R6760J41875J26483
36559C352481M6249l1855o7742r6404j69316k82300l80274m15653l86310l24431
36549A244445k59158j89573r5097K3716J24132J58219J28679Q6939O9867N8236
36539A350405J0649p7144j64099k05946j88299j24455m2243K2953M2285J8096
$$ plain form
36529 642202 633992 647839 745725 951024 1231475 1534398 1834094 2135802 2434716 2689154
36519 2689154 2847108 2886704 2812396 2623962 2322091 1946787 1572598 1242932 933078 605323
36509 605323 284599 48539 -53698 -50304 -20396 -39912 -143060 -304257 -453291 -530408
36499 -530408 -528418 -464405 -325220 -82128 238886 546484 763074 883628 941373 952953
36489 952953 924332 879030 845966 839502 879800 1006931 1232378 1485664 1645491 1624976 1411889
36478 1411889 1053164 643352 311705 157047 169085 239418 262939 213351 129237 67365
36468 67365 77783 182090 346479 493118 556418 520079 402356 236430 75101 -21161
36458 -21161 -30367 10155 44263 42541 1412 -67446 -119132 -76741 104513 377504 636064
$$ packed form
36529F42202q210J3847R7886K05299K80451L02923K99696L01708K98914K54438
36519B689154J57954L9596p4308j88434l01871l75304l74189l29666l09854l27755
36509F05323l20724k36060j02237L394K9908j9516j03148j61197j49034p7117
36499e30408J990O4013J39185K43092L21014L07598K16590J20554N7745J1580
36489I52953k8621m5302l3064o464M0298J27131K25447K53286J59827k0515k13087
36478A411889l58725m09812l31647j54658J2038P0333K3521m9588q4114o1872
36468F7365J0418J04307J64389J46639O3300l6339j17723j65926j61329r6262
36458b1161r206M0522L4108j722m1129o8858n1686M2391J81254K72991K58560
$$ plain form
36447 636064 803051 863134 825307 697925 505695 289364 67781 -171621 -422551 -624475
36437 -624475 -708133 -666159 -550935 -407360 -236848 -30691 192167 398425 570860 703326
36427 703326 778181 773531 688245 537732 332122 91461 -116781 -203124 -153018 -73414 -101622
36416 -101622 -268537 -472965 -579062 -513437 -287185 24493 315324 506901 603539 669798
36406 669798 742967 794150 785333 726457 649808 560758 450568 336881 253671 213983 217585
36395 217585 282435 426781 623085 810029 954047 1062715 1133989 1135989 1055159 928556
36385 928556 804527 698862 611504 555565 535282 514121 441381 305423 136757 -27785
36375 -27785 -151587 -181338 -72239 154030 407752 608369 747868 868292 999676 1138304
$$ packed form
36447F36064J66987O0083l7827j27382j92230k16331k21583k39402k50930k01924
36437f24475q3658M1974J15224J43575J70512K06157K22858K06258J72435J32466
36427G03326P4855m650q5286j50513k05610k40661k08242q6343N0106P9604k8208
36416a01622j66915k04428j06097O5625K26252L11678K90831J91577R6638O6259
36406F69798P3169N1183q817n8876p6649q9050j10190j13687q3210l9688L602
36395B17585O4850J44346J96304J86944J44018J08668P1274K000q0830j26603
36385I28556j24029j05665q7358n5939k0283k1161p2740j35958j68666j64542
36375b7785j23802k9751J09099K26269K53722K00617J39499J20424J31384J38628
$$ plain form
36365 1138304 1267084 1371717 1443365 1487392 1529226 1594401 1679244 1751608 1781038 1758022 1683826
36354 1683826 1555781 1371965 1146139 911690 710382 576657 526017 548346 606279 645640
36344 645640 624481 544413 445560 355438 249495 86882 -111738 -251665 -248745 -109962 84728
36333 84728 257215 363868 380966 307392 184736 75805 10346 -22909 -27371 22392 138367
36322 138367 289104 434780 566625 688426 785451 844397 886500 944555 1014124 1060647 1072836
36311 1072836 1076216 1087586 1083864 1029292 917991 782073 671446 630244 676434 791992 935826
36300 935826 1066470 1147831 1145366 1042723 868642 687232 545859 437091 317158 155291
36290 155291 -38847 -228074 -379073 -479307 -525164 -505634 -421137 -324689 -311231 -428418
$$ packed form
36365A138304J28780J04633P1648M4027M1834O5175Q4843P2364K9430k3016p4196
36354A683826j28045j83816k25826k34449k01308j33725n0640K2329N7933L9361
36344F45640k1159q0068r8853r0122j05943j62613j98620j39927K920J38783J94690
36333H4728J72487J06653J7098p3574j22656j08931o5459l3255m462M9763J15975
36322A38367J50737J45676J31845J21801R7025N8946M2103N8055O9569M6523J2189
36311A072836L380J1370l722n4572j11301j35918j10627m1202M6190J15558J43834
36300I35826J30644Q1361k465j02643j74081j81410j41373j08768j19933j61867
36290A55291j94138j89227j50999j00234m5857J9530Q4497R6448J3458j17187
$$ plain form
36280 -428418 -605975 -709980 -672194 -539657 -399413 -294719 -226937 -195450 -199424 -221018 -239654
36269 -239654 -254043 -267662 -264594 -224456 -153317 -78159 -19991 4801 -30991 -143962 -299185
36258 -299185 -419733 -449796 -394030 -291536 -170886 -38158 109874 274787 449000 608534
36248 608534 717251 742522 666027 490203 252944 32464 -90385 -90804 -13598 71639 111293
36237 111293 66950 -87105 -339012 -632205 -909650 -1152314 -1352827 -1474762 -1480241 -1391657
36227 -1391657 -1281006 -1188943 -1093280 -971456 -851221 -766816 -695751 -581162 -401649 -177378
36217 -177378 83636 392184 715005 949740 1001433 871240 643203 393270 138818 -126706
36207 -126706 -385977 -606071 -777308 -915467 -1021788 -1063222 -1012317 -901617 -817388 -828626
$$ packed form
36280d28418j77557j04005L7786J32537J40244J04694O7782L1487l974k1594j8636
36269b39654j4389j3619L068M0138P1139P5158N8168K4792l5792j12971j55223
36258b99185j20548l0063N5766J02494J20650J32728J48032J64913J74213J59534
36248F08534J08717K5271p6495j75824k37259k20480j22849m19P7206Q5237L9654
36237A11293m4343j54055k51907k93193k77445k42664k00513j21935n479Q8584
36227a391657J10651R2063R5663J21824J20235Q4405P1065J14589J79513K24271
36217a77378K61014L08548L22821K34735N1693j30193k28037k49933k54452k65524
36207a26706k59271k20094j71237j38159j06321m1434N0905J10700Q4229j1238
$$ plain form
36197 -828626 -928805 -1050454 -1123564 -1111533 -1010261 -842420 -656441 -509122 -433564 -422987
36187 -422987 -439384 -428117 -338091 -162297 28296 114136 14050 -255863 -607490 -944907
36177 -944907 -1197345 -1319451 -1295397 -1146602 -919998 -665151 -422611 -216470 -39713 143189
36167 143189 356637 576023 742098 808771 764332 617830 393277 140238 -77311 -220842
36157 -220842 -297872 -335394 -342722 -308958 -230084 -130627 -62198 -82963 -226264 -470378 -729886
36146 -729886 -886455 -855441 -650752 -387948 -198630 -119401 -68335 61274 296470 583312
36136 583312 863838 1115362 1313267 1393945 1282902 956031 467289 -76109 -567790 -954916
36126 -954916 -1254595 -1512012 -1733950 -1870869 -1871362 -1744582 -1557552 -1374951 -1211569 -1043184
$$ packed form
36197h28626j00179j21649p3110J2031J01272J67841J85979J47319P5558J0577
36187d22987j6397J1267R0026J75794J90593Q5840j00086k69913l51627l37417
36177i44907k52438j22106K4054J48795K26604K54847K42540K06141J76757J82902
36167A43189K13448K19386J66075O6673m4439j46502k24553k53039k17549j43531
36157b20842p7030l7522p328L3764P8874R9457O8429k0765j43301k44114k59508
36146g29886j56569L1014K04689K62804J89318P9229N1066J29609K35196K86842
36136E83312K80526K51524J97905Q0678j11043l26871m88742n43398m91681l87126
36126i54916k99679k57417k21938j36919m93J26780J87030J82601J63382J68385
$$ plain form
36116 -1043184 -854591 -670107 -536315 -478434 -477442 -486761 -462133 -377182 -230627 -54107 99313
36105 99313 194946 241518 260331 235306 116673 -122104 -448832 -798062 -1117838 -1391652
36095 -1391652 -1635380 -1879009 -2131275 -2350232 -2464641 -2439516 -2311247 -2144459 -1960778 -1724943
36085 -1724943 -1403709 -1031125 -708838 -534648 -524230 -603545 -679007 -707491 -697025 -662984
36075 -662984 -608688 -537675 -452813 -339957 -177818 29831 252829 468746 673381 848568
36065 848568 944062 909244 735146 465002 180932 -24038 -96622 -63450 -208 49452 102421
36054 102421 180890 267225 331983 368225 368236 301576 158594 -7241 -126547 -192402 -248706
36043 -248706 -306116 -314432 -226247 -54829 137671 279778 314600 222854 47203 -120946 -197594
$$ packed form
36116a043184J88593J84484J33792N7881R92r319K4628Q4951J46555J76520J53420
36105I9313R5633M6572J8813k5025j18633k38777l26728l49230l19776k73814
36095a391652k43728k43629k52266k18957j14409K5125J28269J66788J83681K35835
36085a724943L21234L72584L22287J74190J0418p9315p5462k8484J0466L4041
36075f62984N4296P1013Q4862J12856J62139K07649K22998K15917K04635J75187
36065H48568R5494l4818j74098k70144k84070k04970p2584L3172O3242M9660N2969
36054A02421P8469Q6335O4758L6242J1o6660j42982j65835j19306o5855n6304
36043b48706n7410q316Q8185J71418J92500J42107L4822r1746j75651j68149p6648
$$ plain form
36032 -197594 -154584 -28404 97022 129444 33327 -129090 -248196 -272445 -243437 -221711 -214895
36021 -214895 -204001 -208508 -279590 -431410 -613337 -758436 -837553 -857612 -827330 -743558 -607672
36010 -607672 -442678 -287891 -173515 -94428 -6484 143683 372536 634908 844564 923457
36000 923457 838479 604355 269157 -95643 -406276 -593743 -632945 -546183 -386631 -230894
35990 -230894 -174374 -292116 -576770 -928064 -1225653 -1410421 -1489557 -1486071 -1411021 -1270630
35980 -1270630 -1061399 -754758 -324765 187760 662012 974629 1085582 1036399 881232 649092
35970 649092 373095 122125 -27944 -57366 -24314 -19511 -103608 -282200 -516525 -740056
35960 -740056 -882379 -915681 -890872 -904122 -1008633 -1169863 -1314714 -1400382 -1416014 -1347982 -1192704
$$ packed form
36032a97594M3010J26180J25426L2422r6117j62417j19106k4249K9008K1726O816
36021b14895J0894m507p1082j51820j81927j45099p9117k0059L0282Q3772J35886
36010f07672J64994J54787J14376P9087Q7944J50167K28853K62372K09656P8893
36000I23457q4978k34124l35198l64800l10633j87467l9202Q6762J59552J55737
35990b30894N6520j17742k84654l51294k97589j84768p9136L486P5050J40391
35980a270630K09231L06641M29993N12525M74252L12617J10953m9183j55167k32140
35970F49092k75997k50970j50069k9422L3052M803q4097j78592k34325k23531
35960g40056j42323l3302K4809j3250j04511j61230j44851q5668j5632O8032J55278
$$ plain form
35949 -1192704 -1002356 -869823 -843327 -879082 -899798 -884973 -883634 -946915 -1064870 -1163650 -1150904
35938 -1150904 -973580 -657946 -304787 -32282 96649 103343 56029 5550 -44551 -113552
35928 -113552 -204088 -297042 -378595 -453942 -529763 -602778 -681928 -808480 -1030299 -1357342 -1759811
35917 -1759811 -2204600 -2666167 -3097525 -3424655 -3597132 -3632245 -3587914 -3503276 -3392248 -3286878
35907 -3286878 -3240755 -3260440 -3257669 -3115215 -2813076 -2464706 -2211022 -2093896 -2051194 -2017484
35897 -2017484 -1993315 -2011594 -2068795 -2112150 -2084785 -1972387 -1816251 -1688088 -1635915 -1639944 -1631173
35886 -1631173 -1562562 -1447886 -1321569 -1184622 -1015854 -822579 -652107 -558048 -576168 -721052
35876 -721052 -972439 -1262659 -1506893 -1657824 -1720268 -1720733 -1687987 -1657201 -1655218 -1670694 -1668212
$$ packed form
35949a192704J90348J32533K6496l5755k0716J4825J339o3281j17955r8780J2746
35938a150904J77324L15634L53159K72505J28931O694m7314n0479n0101o9001
35928a13552r0536r2954q1553p5347p5821p3015p9150j26552k21819l27043m02469
35917a759811m44789m61567m31358l27130j72477l5113M4331Q4638J11028J05370
35907c286878M6123j9685K771J42454L02139L48370K53684J17126M2702L3710
35897b017484K4169j8279n7201m3355K7365J12398J56136J28163N2173m029Q771
35886a631173O8611J14676J26317J36947J68768J93275J70472R4059j8120j44884
35876g21052k51387k90220k44234j50931o2444m65L2746L0786J983j5476K482
$$ plain form
35865 -1668212 -1645071 -1646962 -1710881 -1816278 -1910913 -1962538 -1962370 -1897072 -1748957 -1522523 -1252695
35854 -1252695 -989378 -784995 -684280 -698972 -783509 -846352 -798023 -603947 -311842 -32874
35844 -32874 128471 153958 125271 150598 278121 477537 681385 824154 857949 766032 572455
35833 572455 322505 43949 -265541 -610999 -972531 -1312716 -1602811 -1828043 -1965181 -1970062
35823 -1970062 -1809746 -1517678 -1205164 -999016 -962792 -1080101 -1296269 -1548428 -1761160 -1858297
35813 -1858297 -1811895 -1669200 -1512133 -1395023 -1325803 -1283221 -1229514 -1124384 -960464 -786312
35803 -786312 -672506 -652473 -708220 -802582 -899398 -958132 -946849 -878693 -815400 -816849 -895528
35792 -895528 -1026009 -1178378 -1323046 -1415969 -1408302 -1281810 -1068105 -830512 -630442 -504393
$$ packed form
35865a668212K3141j891o3919j05397r4635n1625J68O5298J48115K26434K69828
35854a252695K63317K04383J00715j4692q4537o2843M8329J94076K92105K78968
35844c2874J61345K5487k8687K5327J27523J99416K03848J42769L3795r1917j93577
35833E72455k49950k78556l09490l45458l61532l40185k90095k25232j37138m881
35823a970062J60316K92068L12514K06148L6224j17309k16168k52159k12732r7137
35813a858297M6402J42695J57067J17110O9220M2582N3707J05130J63920J74152
35803g86312J13806K0033n5747r4362r6816n8734J1283O8156O3293j449p8679
35792h95528j30481j52369j44668r2923P667J26492K13705K37593K00070J26049
$$ plain form
35782 -504393 -454199 -445260 -417286 -311781 -104926 174268 451280 635731 665305 549698
35772 549698 383535 296463 357895 517893 652032 672037 587381 463389 344824 237039
35762 237039 141669 76975 58626 83344 141504 228350 327153 392399 374160 270804 151605
35751 151605 115650 219302 436193 681015 870370 970558 1007469 1047553 1166246 1413970
35741 1413970 1794153 2269513 2789504 3307179 3769068 4103628 4243478 4174640 3962411 3714155
35731 3714155 3500886 3310674 3085025 2801732 2510365 2281579 2139205 2059053 2019000 2020034
35721 2020034 2059782 2117945 2180342 2254054 2345208 2442719 2539835 2651182 2784992 2908592 2960332
35710 2960332 2888870 2670142 2304410 1820445 1271879 704854 135232 -422042 -914859 -1281461
$$ packed form
35782e04393N0194Q939K7974J05505K06855K79194K77012J84451K9574j15607
35772E49698j66163q7072O1432J59998J34139K0005q4656j23992j18565j07785
35762B37039r5370o4694j8349K4718N8160Q6846R8803O5246j8239j03356j19199
35751A51605l5955J03652K16891K44822J89355J00188L6911M0084J18693K47724
35741A413970L80183M75360N19991N17675M61889L34560J39850o8838k12229k48256
35731C714155k13269j90212k25649k83293k91367k28786j42374q0152m0053J034
35721B020034L9748N8163O2397P3712R1154R7511R7116J11347J33810J23600N1740
35710B960332p1462k18728l65732m83965n48566n67025n69622n57274m92817l66602
$$ plain form
35700 -1281461 -1519822 -1699064 -1889051 -2097106 -2281209 -2403410 -2456081 -2452037 -2407964 -2335352
35690 -2335352 -2239460 -2127379 -2014122 -1910800 -1806984 -1676116 -1498617 -1268076 -977455 -619062
35680 -619062 -204750 228569 640293 1001770 1289762 1484456 1584235 1606384 1560193 1432456
35670 1432456 1216915 954861 734671 647111 735294 973566 1287293 1599488 1861921 2039912
35660 2039912 2083972 1948672 1646586 1257108 867910 526859 256969 78812 -16045 -87835
35650 -87835 -196385 -323920 -382771 -305823 -105221 160355 447201 742510 1039037 1309653
35640 1309653 1501890 1559012 1464420 1271638 1075510 943360 875971 825851 734396 560581
35630 560581 313191 72935 -45119 18292 214240 427343 555439 550169 422943 248618
$$ packed form
35700a281461k38361j79242j89987k08055j84103j22201n2671M044M4073P2612
35690b335352R5892J12081J13257J03322J03816J30868J77499K30541K90621L58393
35680f19062M14312M33319M11724L61477K87992J94694R9779K2149m6191j27737
35670A432456k15541k62054k20190q7560Q8183K38272L13727L12195K62433J77991
35660B039912M4060j35300l02086l89478l89198l41051k69890j78157r4857p1790
35650h7835j08550j27535n8851P6948K00602K65576K86846K95309K96527K70616
35640A309653J92237N7122r4592j92782j96128j32150o7389n0120r1455j73815
35630E60581k47390k40256j18054O3411J95948K13103J28096n270j27226j74325
$$ plain form
35620 248618 140908 173349 312649 452796 516492 501160 431383 305638 105660 -170720
35610 -170720 -508610 -889138 -1281307 -1633883 -1898689 -2057986 -2113699 -2059321 -1885737 -1613690
35600 -1613690 -1296726 -982441 -685524 -410178 -189027 -83332 -139040 -345009 -636591 -941311
35590 -941311 -1222272 -1478421 -1707964 -1882322 -1962682 -1936845 -1830470 -1681451 -1509118 -1309368
35580 -1309368 -1074609 -815411 -564788 -364633 -248844 -233725 -308066 -416460 -460063 -346584
35570 -346584 -65371 291330 597649 786651 873464 904365 903098 859036 742806 531330
35560 531330 240252 -60022 -279285 -372586 -363695 -301020 -205358 -68122 117564 342342
35550 342342 589292 841597 1083557 1302455 1484573 1603041 1620704 1520849 1333780 1122623
$$ packed form
35620B48618j07710L2441J39300J40147O3696j5332o9777j25745j99978k76380
35610a70720l37890l80528l92169l52576k64806j59297n5713N4378J73584K72047
35600a613690L16964L14285K96917K75346K21151J05695n5708k05969k91582l04720
35590i41311k80961k56149k29543j74358q0360K5837J06375J49019J72333J99750
35580a309368K34759K59198K50623K00155J15789J5119p4341j08394m3603J13479
35570c46584K81213L56701L06319J89002Q6813L0901j267m4062j16230k11476
35560E31330k91078l00274k19263r3301Q891O2675R5662J37236J85686K24778
35550C42342K46950K52305K41960K18898J82118J18468J7663r9855j87069k11157
$$ plain form
35540 1122623 941965 810126 706561 582262 386445 112611 -172983 -365527 -400001 -299991
35530 -299991 -155800 -63536 -77085 -192684 -362330 -528917 -663745 -776725 -892848 -1023721
35520 -1023721 -1160729 -1282171 -1354260 -1330182 -1168660 -871972 -508357 -183002 32671 154236
35510 154236 266176 446218 705294 995897 1265227 1491720 1680448 1840951 1971464 2051606
35500 2051606 2045792 1926649 1707790 1451140 1231904 1091289 1022479 997366 996926 1010470 1013965
35489 1013965 969295 860069 722532 620773 581060 560551 491175 347588 162839 -12060
35479 -12060 -144804 -221449 -234661 -187141 -96921 14824 141354 289785 462414 638381
35469 638381 769177 792632 664610 394052 55032 -238649 -383481 -333912 -124366 149233
$$ packed form
35540A122623j80658j31839j03565j24299j95817k73834k85594j92544l4474J00010
35530b99991J44191R2264j3549j15599j69646j66587j34828j12980j16123j30873
35520a023721j37008j21442p2089K4078J61522K96688L63615L25355K15673J21565
35510A54236J11940J80042K59076K90603K69330K26493J88728J60503J30513Q0142
35500B051606n814j19143k18859k56650k19236j40615o8810k5113m40J3544L495
35489A013965m4670j09226j37537j01759l9713k0509o9376j43587j84749j74899
35479a2060j32744p6645j3212M7520R0220J11745J26530J48431J72629J75967
35469F38381J30796K3455j28022k70558l39020k93681j44832M9569K09546K73599
$$ plain form
35459 149233 384673 528896 586643 579093 505646 353010 127805 -141649 -435032 -746359
35449 -746359 -1046284 -1258761 -1308452 -1197866 -1016122 -858581 -750442 -658856 -559788 -466132
35439 -466132 -396337 -345714 -297437 -240782 -169173 -81596 -766 31041 -270 -45747 -30080
35428 -30080 78752 254566 460339 680290 896161 1057249 1097017 977137 709442 343689
35418 343689 -59684 -457321 -838918 -1213830 -1573810 -1872937 -2054333 -2098138 -2040422 -1948594
35408 -1948594 -1881947 -1866829 -1892136 -1918590 -1896609 -1788282 -1586710 -1324200 -1061536 -860126
35398 -860126 -755184 -751009 -837817 -1006843 -1245181 -1516436 -1749891 -1857792 -1780381 -1529092
35388 -1529092 -1186156 -853304 -596708 -437274 -373897 -390664 -443567 -473457 -457933 -442747
$$ packed form
35459A49233K35440J44223N7747p550p3447j52636k25205k69454k93383l11327
35449g46359k99925k12477m9691J10586J81744J57541J08139R1586R9068R3656
35439d66132O9795N0623M8277N6655P1609Q7577Q0830L1807l1311m5477J5667
35428c0080J08832J75814K05773K19951K15871J61088L9768j19880k67695l65753
35418C43689m03373l97637l81597l74912l59980k99127j81396m3805N7716R1828
35408a948594O6647J5118k5307k6454K1981J08327K01572K62510K62664K01410
35398h60126J04942M175q6808j69026k38338k71255k33455j07901P7411K51289
35388a529092L42936L32852K56596J59434O3377j6767n2903k9890J5524J5186
$$ plain form
35378 -442747 -501126 -656401 -849280 -979947 -982194 -869874 -724143 -628614 -600826 -585707 -525757
35367 -525757 -436188 -400882 -497410 -738652 -1081711 -1465989 -1829590 -2112809 -2278353 -2332468
35357 -2332468 -2310077 -2235653 -2109871 -1932866 -1720273 -1487142 -1234056 -968180 -729904 -577310
35347 -577310 -541841 -613442 -768260 -987416 -1234641 -1433955 -1499191 -1395608 -1165553 -892041
35337 -892041 -642464 -441819 -280420 -132039 33295 242110 512098 845018 1217343 1577933
35327 1577933 1866211 2046771 2131461 2162803 2170462 2144950 2056411 1894096 1678399 1437055
35317 1437055 1186441 944171 741767 601707 506104 410255 289752 157000 34074 -61223
35307 -61223 -95418 -24384 147822 332929 418111 364140 226575 87832 -9909 -77361 -161290
$$ packed form
35378d42747n8379j55275j92879j30667k247J12320J45731R5529K7788J5119N9950
35367e25757Q9569L5306r6528k41242l43059l84278l63601k83219j65544n4115
35357b332468K2391P4424J25782J77005K12593K33131K53086K65876K38276J52594
35347e77310L5469p1601j54818k19156k47225j99314o5236J03583K30055K73512
35337h92041K49577K00645J61399J48381J65334K08815K69988L32920L72325L60590
35327A577933K88278J80560Q4690L1342P659k5512q8539j62315k15697k41344
35317A437055k50614k42270k02404j40060r5603r5849j20503j32752j22926r5297
35307f1223l4195P1034J72206J85107Q5182n3971j37565j38743r7741o7452q3929
$$ plain form
35296 -161290 -318117 -568888 -863379 -1107943 -1239708 -1258283 -1185021 -1023499 -777545 -483412
35286 -483412 -199000 29888 181005 250719 254910 222047 170521 105842 52179 64286 181396
35275 181396 378030 580485 722033 765043 690407 504139 254882 15442 -158806 -237476
35265 -237476 -195590 -28581 203770 386112 429156 334311 170831 8833 -115848 -198926
35255 -198926 -259559 -328163 -421073 -525028 -610678 -649717 -610258 -454241 -164720 224401 639464
35244 639464 1007418 1280485 1436763 1480662 1444160 1370273 1287564 1204288 1121862 1042452 966586
35233 966586 895690 835371 785814 735076 677711 634516 630934 653642 652489 596372 509888 443349
35221 443349 420782 426234 422426 368603 241183 64895 -82838 -124395 -44899 103935 250244
$$ packed form
35296a61290j56827k50771k94491k44564j31765j8575P3262J61522K45954K94133
35286d83412K84412K28888J51117O9714M191l2863n1526o4679n3663J2107J17110
35275A81396J96634K02455J41548M3010p4636j86268k49257k39440j74248p8670
35265b37476M1886J67009K32351J82342M3044r4845j63480j61998j24681q3078
35255a98926o0633o8604r2910j03955q5650l9039L9459J56017K89521L89121M15063
35244F39464L67954K73067J56278M3899l6502p3887q2709q3276q2426p9410p5866
35233I66586p0896o0319m9557n0738n7365m3195l582K2708j153n6117q6484o6539
35221D43349k2567N452l808n3823j27420j76288j47733m1557P9496J48834J46309
$$ plain form
35210 250244 333724 308813 162431 -52884 -230903 -287201 -226554 -132411 -95933 -150171 -248431
35199 -248431 -295311 -222557 -61569 63216 32844 -166731 -437601 -641609 -671782 -488713
35189 -488713 -135079 281061 653237 948892 1206040 1455582 1667300 1781131 1768281 1641770
35179 1641770 1425297 1144182 847181 604881 461112 388344 304608 139107 -120261 -437292
35169 -437292 -768412 -1082629 -1349476 -1528065 -1581831 -1504736 -1334457 -1148038 -1042772 -1097689
35159 -1097689 -1327537 -1669615 -2025183 -2316959 -2507570 -2579186 -2519617 -2333806 -2055978 -1742437
35149 -1742437 -1452933 -1231140 -1089050 -1008952 -968620 -960511 -975746 -978637 -920482 -781226 -578708
35138 -578708 -334917 -56013 246860 542188 803120 1035421 1264133 1498850 1720910 1894736
$$ packed form
35210B50244Q3480k4911j46382k15315j78019n6298O0647R4143L6478n4238r8260
35199b48431m6880P2754J60988J24785l0372j99575k70870k04008l0173J83069
35189d88713L53634M16140L72176K95655K57148K49542K11718J13831j2850j26511
35179A641770k16473k81115k97001k42300j43769p2768q3736j65501k59368l17031
35169d37292l31120l14217k66847j78589n3766P7095J70279J86419J05266n4917
35159a097689k29848l42078l55568k91776j90611p1616N9569J85811K77828L13541
35149a742437K89504K21793J42090Q0098M0332Q109j5235k891N8155J39256K02518
35138e78708K43791K78904L02873K95328K60932K32301K28712K34717K22060J73826
$$ plain form
35128 1894736 1984260 1973392 1883156 1755107 1603522 1398469 1116544 799407 538870 401471
35118 401471 377492 397116 381752 286740 116957 -89704 -298094 -493567 -664015 -781060
35108 -781060 -815128 -760167 -629563 -441013 -225936 -39438 73035 121640 160066 225576
35098 225576 313432 406004 488982 526775 459585 255073 -55278 -414575 -796158 -1191052
35088 -1191052 -1552395 -1791146 -1838749 -1697040 -1423476 -1087909 -752060 -469940 -282601 -205163
35078 -205163 -222319 -298608 -398042 -504075 -625714 -778896 -956543 -1119711 -1222857 -1247077
35068 -1247077 -1207120 -1130086 -1031421 -906685 -737011 -503724 -213207 79785 281233 312630
35058 312630 172021 -60345 -283477 -446456 -565387 -682606 -813607 -923695 -946627 -832383
$$ packed form
35128A894736Q9524j0868r0236j28049j51585k05053k81925l17137k60537j37399
35118D01471k3979J9624j5364r5012j69783k06661k08390j95473j70448j17045
35108g81060l4068N4961J30604J88550K15077J86498J12473M8605L8426O5510
35098B25576Q7856R2572Q2978L7793o7190k04512l10351l59297l81583l94894
35088a191052l61343k38751m7603J41709K73564L35567L35849K82120J87339P7438
35078b05163j7156p6289r9434j06033j21639j53182j77647j63168j03146k4220
35068a247077L9957P7034R8665J24736J69674K33287K90517K92992K01448L1397
35058C12630j40609k32366k23132j62979j18931j17219j31001j10088k2932J14244
$$ plain form
35048 -832383 -591054 -294433 -28844 159448 278962 364745 440216 497236 504160 439986 330722
35037 330722 245533 242349 316238 407815 455937 432955 343718 219609 116289 89000 152562
35026 152562 276579 427008 595710 778550 944584 1050314 1078175 1041868 955822 817222
35016 817222 622764 393512 179516 42270 25470 130436 319752 553648 821459 1126050
35006 1126050 1436100 1669405 1741321 1638449 1445202 1292851 1272719 1389713 1593285 1842228
34996 1842228 2125664 2423572 2673432 2801238 2784196 2667953 2523640 2403468 2337220 2346744
34986 2346744 2443041 2613627 2825903 3041216 3214484 3282193 3172400 2850409 2363590 1835568
34976 1835568 1407345 1174337 1159811 1315109 1524110 1630341 1515805 1190122 791216 469887
$$ packed form
35048h32383K41329K96621K65589J88292J19514Q5783P5471N7020O924o4174j09264
35037C30722q5189l184P3889R1577M8122k2982q9237j24109j03320k7289O3562
35026A52562J24017J50429J68702J82840J66034J05730K7861l6307q6046j38600
35016H17222j94458k29252k13996j37246j6800J04966J89316K33896K67811L04591
35006A126050L10050K33305P1916j02872j93247j52351k0132J16994K03572K48943
34996A842228K83436K97908K49860J27806j7042j16243j44313j20172o6248R524
34986B346744R6297J70586K12276K15313J73268O7709j09793l21991m86819n28022
34976A835568m28223k33008j4526J55298K09001J06231j14536l25683l98906l21329
$$ plain form
34966 469887 267302 112173 -74577 -295998 -494620 -618445 -653469 -607970 -489533 -304067
34956 -304067 -73720 146605 281827 288826 206772 139255 167108 281232 408899 492498 523523
34945 523523 511798 458278 371996 287711 239755 224653 209601 175414 130853 82131 12394
34934 12394 -90070 -195248 -247314 -221825 -152742 -96610 -81025 -93103 -101363 -72086 23469
34923 23469 189043 383779 544583 644403 718974 822935 966580 1108371 1203710 1246144
34913 1246144 1263148 1288461 1342842 1426119 1512826 1555685 1503027 1324874 1034982 693439 378640
34902 378640 142216 -12955 -110665 -168263 -194341 -202244 -195159 -133830 53391 410340 912322
34891 912322 1488236 2058272 2534532 2816032 2832622 2607195 2252144 1888342 1568782 1275276
$$ packed form
34966D69887k02585j55129j86750k21421j98622j23825l5024M5499J18437J85466
34956c04067K30347K20325J35222O999q2054o7517K7853J14124J27667Q3599L1025
34945E23523j1725n3520q6282q4285m7956j5102j5052l4187m4561m8722o9737
34934A2394j02464j05178n2066K5489O9083N6132J5585j2078q260K9277R5555
34923B3469J65574J94736J60804R9820P4571J03961J43645J41791R5339M2434
34913A246144J7004K5313N4381Q3277Q6707M2859n2658j78153k89892l41543l14799
34902C78640k36424j55171r7710n7598k6078p903P085O1329J87221L56949N01982
34891I12322N75914N70036M76260K81500J6590k25427l55051l63802l19560k93506
$$ plain form
34881 1275276 971277 652032 355953 135457 11051 -50119 -108081 -205756 -354965 -552869
34871 -552869 -788835 -1033708 -1246193 -1403482 -1513821 -1590126 -1624405 -1598682 -1508404 -1362687
34861 -1362687 -1175110 -973402 -809373 -732897 -748620 -813456 -885343 -964779 -1079544 -1234017
34851 -1234017 -1381764 -1446557 -1366501 -1125626 -763214 -369423 -64976 48028 -49604 -269474
34841 -269474 -469629 -546567 -477398 -283929 16806 411158 857030 1283141 1627046 1863247
34831 1863247 1994355 2030928 1989012 1897801 1795453 1711904 1656080 1619818 1594105 1582351 1598880
34820 1598880 1655958 1752675 1871291 1976496 2019288 1954347 1764500 1469045 1109540 735810
34810 735810 406017 180564 92838 121900 202752 266198 269164 201161 84120 -29307 -76295
$$ packed form
34881A275276l03999l19245k96079k20496j24406o1170n7962r7675j49209j97904
34871e52869k35966k44873k12485j57289j10339p6305l4279K5723R0278J45717
34861a362687J87577K01708J64029P6476j5723o4836p1887p9436j14765j54473
34851a234017j47747o4793Q0056K40875L62412L93791L04447J13004r7632k19870
34841b69474k00155p6938O9169J93469L00735L94352M45872M26111L43905K36201
34831A863247J31108L6573m1916r1211j02348q3549n5824l6262k5713j1754J6529
34820A598880N7078R6717J18616J05205M2792o4941j89847k95455l59505l73730
34810G35810l29793k25453q7726K9062Q0852O3446K966o8003j17041j13427m6988
$$ plain form
34799 -76295 -22846 112128 273249 409005 498040 544212 555128 529947 468250 387573 325022
34788 325022 313974 356401 419618 460936 454422 394539 280424 108339 -111401 -334651 -498117
34777 -498117 -566335 -558246 -517377 -462572 -380966 -261074 -110755 56673 228647 376722 454934
34766 454934 428349 290376 47622 -287305 -674922 -1050446 -1374301 -1661037 -1926339 -2121790
34756 -2121790 -2164148 -2029977 -1786583 -1524209 -1288168 -1082673 -904246 -749537 -612983 -498454
34746 -498454 -420019 -375243 -329297 -239201 -85012 129695 389622 661489 886404 1001026
34736 1001026 975750 835396 649683 498342 422216 395520 358286 283370 194402 108425 -14377
34725 -14377 -238634 -582525 -998839 -1414875 -1767752 -2013625 -2140791 -2182799 -2191619 -2183382 -2127077
$$ packed form
34799g6295N3449J34974J61121J35756Q9035M6172J0916k5181o1697q0677o2551
34788C25022j1048M2427O3217M1318o514n9883j14115j72085k19740k23250j63466
34777d98117o8218Q089M0869N4805Q1606J19892J50319J67428J71974J48075P8212
34766D54934k6585j37973k42754l34927l87617l75524l23855k86736k65302j95451
34756b121790m2358J34171K43394K62374K36041K05495J78427J54709J36554J14529
34746d98454P8435M4776M5946R0096J54189K14707K59927K71867K24915J14622
34736A001026k5276j40354j85713j51341p6126k6696l7234p4916q8968q5977j22802
34725a4377k24257l43891m16314m16036l52877k45873j27166m2008q820Q237N6305
$$ plain form
34714 -2127077 -1996058 -1810778 -1614679 -1425677 -1239090 -1076846 -1006590 -1093137 -1333315 -1644931
34704 -1644931 -1916486 -2064337 -2054387 -1895517 -1631167 -1330306 -1062736 -866680 -738353 -650756
34694 -650756 -574797 -485150 -366311 -229173 -114004 -61150 -78852 -148133 -252241 -385036
34684 -385036 -532720 -667863 -768000 -822571 -810880 -691985 -440830 -92133 270986 576977
34674 576977 804760 967089 1077640 1144349 1176908 1182143 1159864 1119476 1093188 1110553 1157101
34663 1157101 1175588 1114509 965844 758388 535207 341617 208547 128047 58648 -28966
34653 -28966 -122450 -194659 -239383 -257868 -227779 -119829 58670 268774 490496 737441 1013043
34642 1013043 1283840 1516398 1719198 1922223 2122157 2268741 2309130 2238608 2106930 1976329
$$ packed form
34714b127077J31019J85280J96099J89002J86587J62244P0256q6547k40178l11616
34704a644931k71555j47851R950J58870K64350L00861K67570J96056J28327Q7597
34694f50756P5959Q9647J18839J37138J15169N2854j7702o9281j04108j32795
34684c85036j47684j35143j00137n4571J1691J18895K51155L48697L63119L05991
34674E76977K27783J62329J10551O6709L2559N235k2279m0388k6288J7365M6548
34663A157101J8487o1079j48665k07456k23181j93590j33070q0500o9399q7614
34653b8966r3484p2209m4724j8485L0089J07950J78499K10104K21722K46945K75602
34642A013043K70797K32558K02800K03025J99934J46584M0389p0522j31678j30601
$$ plain form
34632 1976329 1870636 1766486 1637528 1498705 1394450 1350574 1356892 1393944 1453800 1532744
34622 1532744 1626901 1738835 1862472 1955067 1956431 1855701 1714895 1603893 1529031 1442337
34612 1442337 1298023 1078812 796296 505250 301954 260615 361875 508864 613740 645287
34602 645287 604435 503347 385702 326082 370593 487759 600887 661147 669640 635617 540281
34591 540281 354033 81452 -218307 -455242 -554662 -490895 -289985 -8632 291143 558318
34581 558318 757001 862377 860714 763248 620074 505427 475783 543226 690613 898437
34571 898437 1143781 1384012 1563836 1642972 1607394 1456972 1198673 855051 464060 61874
34561 61874 -324680 -661251 -892416 -964094 -870274 -677027 -492784 -404302 -431627 -535766
$$ packed form
34632A976329j05693j04150j28958j38823j04255m3876O318L7052N9856P8944
34622A532744R4157J11934J23637R2595J364j00730j40806j11002p4862q6694
34612A442337j44314k19211k82516k91046k03296m1339J01260J46989J04876L1547
34602F45287m0852j01088j17645n9620M4511J17166J13128O0260Q493l4023r5336
34591E40281j86248k72581k99759k36935r9420O3767K00910K81353K99775K67175
34581E58318J98683J05376j663r7466j43174j14647k9644O7443J47387K07824
34571H98437K45344K40231J79824P9136l5578j50422k58299l43622l90991m02186
34561F1874l86554l36571k31165p1678R3820J93247J84243Q8482k7325j04139
$$ plain form
34551 -535766 -658059 -745752 -754754 -658929 -472350 -248804 -44088 115182 217991 240380
34541 240380 153159 -41673 -295854 -538698 -713168 -800367 -825974 -843348 -900121 -1016661
34531 -1016661 -1188222 -1383956 -1532992 -1541757 -1365745 -1066084 -769897 -569590 -473696 -444700
34521 -444700 -452047 -483096 -531954 -593122 -650040 -663080 -591437 -442460 -284088 -191141 -183290
34510 -183290 -219973 -242733 -213385 -125100 4527 147549 277817 374780 427825 448438 468233
34499 468233 505415 539596 544348 539305 572885 643882 677577 602890 424888 196330 -50884
34488 -50884 -304817 -525190 -652968 -680334 -672135 -695337 -748109 -776499 -743176 -656524 -539428
34477 -539428 -395284 -216994 -21385 137871 196523 116799 -100643 -427177 -807764 -1150962
$$ packed form
34551e35766j22293q7693r002R5825J86579K23546K04716J59270J02809K2389
34541B40380q7221j94832k54181k42844j74470q7199k5607j7374n6773j16540
34531a016661j71561j95734j49036q765J76012K99661K96187K00307R5894K8996
34521d44700p347l1049m8858o1168n6918j3040P1643J48977J58372R2947P851
34510a83290l6683k2760K9348Q8285J29627J43022J30268R6963N3045K0613J9795
34499D68233L7182L4181M752n043L3580P0997L3695p4687j78002k28558k47214
34488e0884k53933k20373j27778k7366Q199k3202n2772k8390L3323Q6652J17096
34477e39428J44144J78290J95609J59256N8652p9724k17442l26534l80587l43198
$$ plain form
34467 -1150962 -1346684 -1326735 -1113582 -796357 -456454 -125849 185941 447809 608982 644452
34457 644452 589830 524836 514593 557512 587987 534872 380144 161776 -69796 -281439 -445112
34446 -445112 -522095 -485694 -361468 -229628 -178901 -258913 -469864 -775298 -1107926 -1375286
34436 -1375286 -1492497 -1432805 -1246325 -1021582 -827535 -691230 -617355 -610466 -673690 -797116
34426 -797116 -957135 -1125152 -1272992 -1375629 -1421457 -1426939 -1435662 -1491032 -1604024 -1750634 -1900034
34415 -1900034 -2031838 -2116415 -2095886 -1917527 -1595365 -1215661 -862964 -551339 -241667 87001
34405 87001 403301 652937 802668 859630 866578 875392 903707 914742 858570 737672 613544
34394 613544 541029 511668 470857 377443 235242 75530 -78470 -229976 -395903 -575930
$$ packed form
34467a150962j95722J9949K13153L17225L39903L30605L11790K61868J61173L5470
34457F44452n4622o4994j0243M2919L0475n3115j54728k18368k31572k11643j63673
34446d45112p6983L6401J24226J31840N0727q0012k10951l05434l32628k67360
34436a375286j17211N9692J86480K24743J94047J36305P3875O889o3224j23426
34426g97116j60019j68017j47840j02637m5828n482q723n5370j12992j46610j49400
34415a900034j31804q4577K0529J78359L22162L79704L52697L11625L09672L28668
34405H7001L16300K49636J49731N6962O948Q814K8315J1035n6172j20898j24128
34394F13544p2515k9361m0811r3414j42201j59712j54000j51506j65927j80027
$$ plain form
34384 -575930 -739594 -853720 -920198 -974930 -1050745 -1152393 -1260677 -1337824 -1329098 -1193036 -956216
34373 -956216 -729514 -650101 -797316 -1151027 -1608138 -2035301 -2333285 -2476515 -2492440 -2405417
34363 -2405417 -2218546 -1949723 -1650409 -1366265 -1103846 -863270 -680901 -599335 -601994 -619419
34353 -619419 -611098 -611502 -680359 -828104 -1004663 -1144256 -1203364 -1165879 -1033433 -816576 -528801
34342 -528801 -187313 178213 521115 790048 951595 1002285 956863 823835 597358 281871
34332 281871 -75106 -387974 -584622 -656586 -658000 -658197 -691985 -740869 -752906 -691842 -582391
34321 -582391 -504162 -527509 -654406 -829054 -997564 -1137057 -1227219 -1225076 -1098367 -882774
34311 -882774 -681805 -591018 -619377 -686402 -692170 -589388 -403812 -209799 -90765 -97034 -213922
$$ packed form
34384e75930j63664j14126o6478n4732p5815j01648j08284p7147Q726J36062K36820
34373i56216K26702P9413j47215l53711m57111m27163k97984j43230j5925Q7023
34363b405417J86871K68823K99314K84144K62419K40576J82369Q1566k659j7425
34353f19419Q321m04o8857j47745j76559j39593n9108L7485J32446K16857K87775
34342e28801L41488L65526L42902K68933J61547N0690m5422j33028k26477l15487
34332B81871l56977l12868j96648p1964j414j97l3788m8884j2037O1064J09451
34321e82391P8229k3347j26897j74648j68510j39493r0162K143J26709K15593
34311h82774K00969R0787k8359o7025n768J02782J85576J94013J19034o269j16888
$$ plain form
34300 -213922 -372116 -507815 -615813 -732547 -870761 -990467 -1040139 -1013478 -960358 -950420
34290 -950420 -1022143 -1148536 -1249163 -1254126 -1163561 -1032710 -902933 -773731 -644069 -542896
34280 -542896 -496350 -491762 -499654 -509107 -512697 -475548 -355471 -149849 100839 345197 531216
34269 531216 602627 530604 354877 159396 -3130 -139004 -266114 -376114 -459951 -538695
34259 -538695 -636979 -733911 -761804 -656102 -405170 -63959 272106 519466 652046 702870
34249 702870 724941 756358 816213 911022 1029808 1139317 1195925 1166153 1039482 828112 552980
34238 552980 222951 -168615 -616443 -1078179 -1495180 -1840914 -2131274 -2380166 -2561132 -2625595
34228 -2625595 -2550669 -2358988 -2098490 -1814737 -1542729 -1315467 -1168419 -1124276 -1169538 -1255555
$$ packed form
34300b13922j58194j35699j07998j16734j38214j19706m9672K6661N3120R938
34290i50420p1723j26393j00627m963R0565J30851J29777J29202J29662J01173
34280e42896M6546M588p892r453l590L7149J20077K05622K50688K44358J86019
34269E31216P1411p2023j75727j95481j62526j35874j27110j10000q3837p8744
34259e38695r8284r6932k7893J05702K50932L41211L36065K47360J32580N0824
34249G02870K2071L1417N9855R4809J18786J09509N6608k9772j26671k11370k75132
34238E52980l30029l91566m47828m61736m17001l45734k90360k48892j80966o4463
34228b625595P4926J91681K60498K83753K72008K27262J47048M4143m5262q6017
$$ plain form
34218 -1255555 -1332743 -1380162 -1397360 -1381914 -1330932 -1250899 -1138386 -954833 -654335 -251563
34208 -251563 157502 458817 597197 588798 479866 313435 130285 -17900 -73573 -7154
34198 -7154 143287 275033 284863 139495 -116786 -406086 -645452 -748079 -647082 -345943
34188 -345943 69517 482468 800122 968440 975473 862071 698609 518281 284157 -57024
34178 -57024 -499162 -967661 -1365466 -1611841 -1667538 -1565140 -1408404 -1304259 -1286426 -1319988
34168 -1319988 -1368829 -1428633 -1499235 -1562316 -1598260 -1600721 -1564537 -1479719 -1345858 -1172640 -957888
34157 -957888 -687916 -375787 -83249 113550 173630 98380 -94134 -379858 -715432 -1032049
34147 -1032049 -1253496 -1326279 -1246084 -1069484 -897291 -826472 -894983 -1056835 -1205966 -1235636
$$ packed form
34218a255555p7188m7419j7198J5446N0982Q0033J12513J83553L00498M02772
34208b51563M09065L01315J38380q399j08932j66431j83150j48185n5673O6419
34198g154J50441J31746R830j45368k56281k89300k39366j02627J00997L01139
34188c45943M15460M12951L17654J68318P033j13402j63462j80328k34124l41181
34178e7024m42138m68499l97805k46375n5697J02398J56736J04145J7833l3562
34168a319988m8841n9804p0602o3081l5944k461L6184Q4818J33861J73218K14752
34157i57888K69972L12129K92538J96799O0080p5250j92514k85724l35574l16617
34147a032049k21447p2783Q0195J76600J72193P0819o8511j61852j49131k9670
$$ plain form
34137 -1235636 -1096557 -813939 -452394 -65145 321240 680927 968488 1138928 1184179 1140804
34127 1140804 1064752 1006261 1001037 1061244 1159472 1232306 1222734 1128579 1001595 893067 806079
34116 806079 704303 556048 358172 125820 -121295 -358587 -556476 -687424 -726926 -650115
34106 -650115 -443910 -128225 249312 645740 1031980 1360097 1548373 1534172 1341367 1070436
34096 1070436 816896 617117 473569 401136 422871 529530 667666 776552 831187 845943
34086 845943 839939 804782 711623 550574 355356 182207 72480 50385 151747 425155
34076 425155 880941 1442971 1967203 2314546 2409889 2249936 1881212 1378835 828751 307041
34066 307041 -135852 -476571 -711336 -847315 -889424 -824036 -621481 -272857 168248 593161
$$ packed form
34137a235636J39079K82618L61545L87249L86385L59687K87561J70440M5251m3375
34127A140804p6052n8491n224O0207R8228P2834r572r4155j26984j08528q6988
34116H06079j01776j48255j97876k32352k47115k37292j97889j30948l9502P6811
34106f50115K06205L15685L77537L96428L86240L28117J88276j4201j92805k70931
34096A070436k53540j99779j43548p2433K1735J06659J38136J08886N4635J4756
34086H45943o004l5157r3159j61049j95218j73149j09727k2095J01362K73408
34076D25155M55786N62030N24232L47343R5343j59953l68724n02377n50084n21710
34066C07041m42893l40719k34765j35979m2109O5388K02555L48624M41105M24913
$$ plain form
34056 593161 902473 1064620 1106664 1055431 904240 640918 293714 -62642 -342460 -486255
34046 -486255 -477099 -343555 -151892 24324 149785 247337 363480 511367 657117 766371
34036 766371 849636 943706 1053671 1137352 1154579 1109139 1023521 890698 684273 418829 172503
34025 172503 33316 30871 122442 228989 279497 245804 160491 95858 104124 171307 233210
34014 233210 230635 141278 -30319 -271173 -563914 -888894 -1232140 -1582607 -1912311 -2165795
34004 -2165795 -2284903 -2252694 -2109400 -1917078 -1707323 -1471353 -1204536 -947249 -765035 -693051
33994 -693051 -721260 -836816 -1052487 -1369389 -1725233 -2011439 -2153070 -2161994 -2107493 -2044632
33984 -2044632 -1976535 -1876856 -1734042 -1563898 -1378547 -1156126 -862057 -508586 -177529 36766
$$ packed form
34056E93161L09312J62147M2044n1233j51191k63322l47204l56356k79818j43795
34046d86255R156J33544J91663J76216J25461R7552J16143J47887J45750J09254
34036G66371Q3265R4070J09965Q3681J7227m5440q5618j32823k06425k65444k46326
34025A72503j39187k445R1571J06547N0508l3693q5313o4633Q266O7183O1903
34014B33210k575q9357j71597k40854k92741l24980l43246l50467l29704k53484
34004b165795j19108L2209J43294J92322K09755K35970K66817K57287J82214P1984
33994f93051k8209j15556k15671l16902l55844k86206j41631q924N4501O2861
33984b044632O8097R9679J42814J70144J85351K22421K94069L53471L31057K14295
$$ plain form
33974 36766 109672 103185 101631 136228 164863 108611 -92744 -438674 -858820 -1245766 -1514139
33963 -1514139 -1645358 -1684433 -1695476 -1716752 -1750214 -1781426 -1796821 -1780528 -1709986 -1571057 -1375147
33952 -1375147 -1148126 -902037 -629031 -321615 15042 367149 705480 971188 1097863
33943 1097863 1068146 933871 766906 609427 488120 447166 524664 699236 893279 1036113
33933 1036113 1106311 1118455 1100677 1093513 1142816 1270972 1455410 1633480 1721334 1645698 1395038
33922 1395038 1050566 740502 544203 448234 395977 357028 338926 354884 399298 443966 448167
33911 448167 387300 281785 180280 101659 12381 -121457 -277374 -394128 -434432 -408120
33901 -408120 -341814 -248915 -126644 35425 238974 450910 602791 644912 603943 562054
$$ packed form
33974C6766P2906o487j554L4597K8635n6252k01355l45930m20146l86946k68373
33963a514139j31219l9075j1043k1276l3462l1212j5395J6293P0542J38929J95910
33952a375147K27021K46089K73006L07416L36657L52107L38331K65708J26675
33943A097863k9717j34275j66965j57479j21307m0954P7498J74572J94043J42834
33933A036113P0198J2144j7778p164M9303J28156J84438J78070Q7854p5636k50660
33922A395038l44472l10064j96299r5969n2257l8949j8102J5958M4414M4668M201
33911D48167o0867j05515j01505p8621q9278j33838j55917j16754m0304K6312
33901d08120O6306R2899J22271J62069K03549K11936J51881M2121m0969m1889
$$ [...]
##END NTUPLES=NMR SPECTRUM
##END=
