##TITLE=31Pdec_AP-13_HCl
 D2O
  24 sc
 2.11.2023
##JCAMPDX= 6.0         $$ Bruker NMR JCAMP-DX V2.0
##DATA TYPE= NMR SPECTRUM
##DATA CLASS= NTUPLES
##ORIGIN= UXNMR, Bruker Analytische Messtechnik GmbH
##OWNER= root
$$ XWIN-NMR		Version 3.5
$$ Thu Nov  2 17:41:21 2023 Russian Standard Time (UT+4h)  she@DPX200
##.OBSERVE FREQUENCY= 81.013821
##.OBSERVE NUCLEUS= ^31P
##.ACQUISITION MODE= SIMULTANEOUS
##.ACQUISITION SCHEME= undefined
##.AVERAGES= 24
##.DIGITISER RES= 16
##SPECTROMETER/DATA SYSTEM= spect
##.PULSE SEQUENCE= zgpg30
##.SOLVENT NAME= CD2Cl2
##.SHIFT REFERENCE= (INTERNAL, CD2Cl2, 0, 248.564)
##AUDIT TRAIL= $$ (NUMBER, WHEN, WHO, WHERE, WHAT)
$$ ##TITLE= Audit trail, XWIN-NMR		Version 3.5
$$ ##JCAMPDX= 5.01
$$ ##ORIGIN= Bruker BioSpin GmbH
$$ ##OWNER= she
$$ F:/spectra/data/she/nmr/P31/1/pdata/1/auditp.txt
$$ ##AUDIT TRAIL=  $$ (NUMBER, WHEN, WHO, WHERE, WHAT)
(   1,<2023-11-02 17:39:37.17 +0400>,<she>,<DPX200>,
      <created by zg, POWCHK disabled, PULCHK disabled
       configuration hash MD5:
       00 E9 B6 7A A2 85 ED C7 34 08 36 98 17 FE 4E 26
       data hash MD5: 32K
       E6 E3 D2 28 E9 37 9C 5C F7 A8 73 86 A4 65 27 9D>)
(   2,<2023-11-02 17:39:46.28 +0400>,<she>,<DPX200>,
      <Start of raw data processing
       efp BC_mod = 2 LB = 5 FT_mod = 6 PKNL = 1 PHC0 = -10913.75 PHC1 = 676.2902 SI = 64K 
       data hash MD5: 64K
       88 D7 A2 EC 42 AE 72 CE C6 C4 22 67 99 FF C9 7A>)
(   3,<2023-11-02 17:40:11.81 +0400>,<she>,<DPX200>,
      <pk PHC0 = 47.8386 PHC1 = 0 
       data hash MD5: 64K
       35 CD 0E 4F 77 58 EC 18 40 AC 42 90 0B AD FC E8>)
(   4,<2023-11-02 17:40:35.07 +0400>,<she>,<DPX200>,
      <pk PHC0 = 3.200001 PHC1 = 0 
       data hash MD5: 64K
       E6 8B 0A 1F 04 FD 4E FE 4C E1 F6 80 2D EC A6 B5>)
(   5,<2023-11-02 17:40:39.57 +0400>,<she>,<DPX200>,
      <abs ABSG = 5 
       data hash MD5: 64K
       8C 25 F0 C9 A4 DE FD C5 7D 8A 21 58 F3 07 5B 45>)
$$ ##END=
$$ 
$$ hash MD5
$$ 87 E6 D9 94 97 F3 EE E9 E0 F5 75 67 F0 A1 DE 19
##$RELAX= 
##$RELAX= 
##$RELAX= 
##$RELAX= 
##$RELAX= 
##$RELAX= 
##$RELAX= 
##$RELAX= 
##$RELAX= 
$$ Bruker specific parameters
$$ --------------------------
##$DU= <F:/spectra>
##$EXPNO= 1
##$NAME= <P31>
##$PROCNO= 1
##$TYPE= <nmr>
##$USER= <she>
##$AMP= (0..31)
100 100 100 100 100 100 100 100 100 100 100 100 100 100 100 100 100 100 
100 100 100 100 100 100 100 100 100 100 100 100 100 100 
##$AQSEQ= 0
##$AQ_mod= 1
##$AUNM= <au_zg>
##$AUTOPOS= <>
##$BF1= 81.014009
##$BF2= 200.13
##$BF3= 200.13
##$BF4= 200.13
##$BF5= 200.13
##$BF6= 200.13
##$BF7= 200.13
##$BF8= 200.13
##$BYTORDA= 1
##$CFDGTYP= 0
##$CFRGTYP= 5
##$CHEMSTR= <none>
##$CNST= (0..31)
1 1 145 1 1 1 1 1 1 1 1 1 1 1 1 1 1 1 1 1 1 1 1 1 1 1 1 1 1 1 1 1 
##$CPDPRG= <waltz16>
##$CPDPRG1= <>
##$CPDPRG2= <waltz16>
##$CPDPRG3= <>
##$CPDPRG4= <mlev>
##$CPDPRG5= <mlev>
##$CPDPRG6= <mlev>
##$CPDPRG7= <mlev>
##$CPDPRG8= <mlev>
##$CPDPRGB= <>
##$CPDPRGT= <>
##$D= (0..31)
$$ [...]
##$SUBNAM3= <"">
##$SUBNAM4= <"">
##$SUBNAM5= <"">
##$SUBNAM6= <"">
##$SUBNAM7= <"">
##$SUBNAM8= <"">
##$SUBNAM9= <"">
##$SW= 501.771253377433
##$SWIBOX= (0..15)
0 1 3 0 0 0 0 0 0 0 0 0 0 0 0 0 
##$SW_h= 40650.406504065
##$TD= 32768
##$TD0= 1
##$TE= 0
##$TE2= 300
##$TE3= 300
##$TEG= 300
##$TL= (0..7)
0 120 53 12 22 120 120 120 
##$TP= (0..7)
150 150 150 150 150 150 150 150 
##$TP07= 0
##$TPNAME0= <>
##$TPNAME1= <>
##$TPNAME2= <>
##$TPNAME3= <>
##$TPNAME4= <>
##$TPNAME5= <>
##$TPNAME6= <>
##$TPNAME7= <>
##$TPOAL= (0..7)
0.5 0.5 0.5 0.5 0.5 0.5 0.5 0.5 
##$TPOFFS= (0..7)
0 0 0 0 0 0 0 0 
##$TUNHIN= 0
##$TUNHOUT= 0
##$TUNXOUT= 0
##$USERA1= <user>
##$USERA2= <user>
##$USERA3= <user>
##$USERA4= <user>
##$USERA5= <user>
##$V9= 5
##$VALIST= <valist>
##$VCLIST= <CCCCCCCCCCCCCCC>
##$VD= 0
##$VDLIST= <DDDDDDDDDDDDDDD>
##$VPLIST= <PPPPPPPPPPPPPPP>
##$VTLIST= <TTTTTTTTTTTTTTT>
##$WBST= 1024
##$WBSW= 4
##$XGAIN= (0..3)
0 0 0 0 
##$XL= 0
##$YL= 0
##$YMAX_a= 639
##$YMIN_a= -225
##$ZGOPTNS= <>
##$ZL1= 120
##$ZL2= 120
##$ZL3= 120
##$ZL4= 120
##$ABSF1= 248.5645
##$ABSF2= -253.2056
##$ABSG= 5
##$ABSL= 3
##$ALPHA= 0
##$AQORDER= 0
##$ASSFAC= 0
##$ASSFACI= 0
##$ASSFACX= 0
##$ASSWID= 0
##$AUNMP= <proc_1d>
##$AZFE= 0.1
##$AZFW= 0.5
##$BCFW= 0
##$BC_mod= 2
##$BYTORDP= 0
##$COROFFS= 0
##$CY= -3
##$DATMOD= 1
##$DC= 0
##$DFILT= <>
##$DTYPP= 0
##$F1P= 0
##$F2P= 0
##$FCOR= 1
##$FTSIZE= 65536
##$FT_mod= 6
##$GAMMA= 0
##$GB= 0
##$INTBC= 1
##$INTSCL= 6.047779e-11
##$ISEN= 30
##$LB= 5
##$LEV0= 0
##$LPBIN= 0
##$MAXI= 10000
##$MC2= 0
##$MEAN= 0
##$ME_mod= 0
##$MI= 50
##$NCOEF= 0
##$NC_proc= -10
##$NLEV= 6
##$NOISF1= 182.463
##$NOISF2= 159.3651
##$NSP= 0
##$NTH_PI= 0
##$NZP= 0
##$OFFSET= 248.5645
##$PC= 4
##$PHC0= -10862.71
##$PHC1= 676.2902
##$PH_mod= 1
##$PKNL= yes
##$PPARMOD= 0
##$PSCAL= 0
##$PSIGN= 0
##$REVERSE= no
##$SF= 81.0140089999694
##$SI= 65536
##$SIGF1= 159.3651
##$SIGF2= -187.1042
##$SINO= 113.3802
##$SIOLD= 16384
##$SREGLST= <1H.CDCl3>
##$SSB= 0
##$STSI= 65536
##$STSR= 0
##$SW_p= 40650.406504065
##$SYMM= 0
##$S_DEV= 0
##$TDeff= 32768
##$TDoff= 0
##$TI= <>
##$TILT= no
##$TM1= 0
##$TM2= 0
##$TOPLEV= 0
##$USERP1= <user>
##$USERP2= <user>
##$USERP3= <user>
##$USERP4= <user>
##$USERP5= <user>
##$WDW= 1
##$XDIM= 65536
##$YMAX_p= 322952117
##$YMIN_p= -12691887
$$ End of Bruker specific parameters
$$ ---------------------------------
##NTUPLES= NMR SPECTRUM
##VAR_NAME=  FREQUENCY,     SPECTRUM/REAL,   SPECTRUM/IMAG
##SYMBOL=    X,             R,               I
##VAR_TYPE=  INDEPENDENT,   DEPENDENT,       DEPENDENT
##VAR_FORM=  AFFN,          ASDF,            ASDF
##VAR_DIM=   65536,         65536,           65536
##UNITS=     HZ,            ARBITRARY UNITS, ARBITRARY UNITS
##FACTOR=    0.620285442955139, 1,           1
##FIRST=     20137.2065510682, 0,            0
##LAST=      -20513.1999529968, 0,           0
##MIN=       -20513.1999529968, -12691887,   0
##MAX=       20137.2065510682, 322952117,    0
$$ Real data points
##PAGE= N=1
##DATA TABLE= (X++(R..R)), XYDATA
$$ [...]
$$ plain form
39870 -194849 -233155 -314573 -459805 -648814 -828689 -946914 -973538 -905456 -768335 -613948
39860 -613948 -497293 -443224 -436039 -442534 -439057 -414345 -357204 -254892 -104903 79226 276529
39849 276529 467917 635015 757719 823110 837838 824278 799758 762884 703848 624046 538926
39838 538926 463050 401022 356627 343522 376930 451930 534085 576897 552802 470731 366294
39827 366294 276365 221626 206643 226437 269118 319932 371264 425131 478525 513561 519906 529200
39815 529200 606738 791037 1045169 1277752 1409517 1415993 1320340 1166089 996698 840890
39805 840890 703696 573815 442717 314990 205696 138502 142835 233607 383707 526844
39795 526844 599049 577144 478998 340983 202890 99156 43505 19939 -183 -27885 -45331
$$ packed form
39870a94849l8306q1418j45232j89009j79875j18225k6624O8082J37121J54387
39860f13948J16655N4069P185o495L477K4712N7141J02312J49989J84129J97303
39849B76529J91388J67098J22704O5391J4728j3560k4520l6874n9036p9802q5120
39838E38926p5876o2028m4395j3105L3408P5000Q2155M2812k4095q2071j04437
39827C66294q9929n4739j4983J9794M2681N0814N1332N3867N3394L5036O345R294
39815E29200P7538J84299K54132K32583J31765O476r5653j54251j69391j55808
39805H40890j37194j29881j31098j27727j09294o7194M333R0772J50100J43137
39795E26844P2205k1905r8146j38015j38093j03734n5651k3566k0122k7702j7446
$$ plain form
39784 -45331 -22913 51594 149339 198637 121522 -105655 -424109 -735158 -972236 -1125968 -1209918
39773 -1209918 -1228200 -1187220 -1121565 -1086260 -1117666 -1204783 -1299009 -1353048 -1355307 -1328143 -1291726
39762 -1291726 -1235869 -1136434 -994599 -844505 -720978 -636509 -595396 -609199 -677634 -762463 -803141
39751 -803141 -766176 -672759 -577129 -523101 -518222 -539261 -559092 -573004 -600942 -662431 -751479 -839022
39739 -839022 -895938 -909186 -882705 -834917 -794674 -785618 -804687 -817712 -780179 -664753 -476357
39728 -476357 -252770 -53401 65405 81337 21436 -54037 -89360 -65006 -1723 62691 102859
39717 102859 116734 113038 95605 65458 35319 32959 82921 182175 293461 364757 361292 285241
39705 285241 168399 47624 -54569 -135729 -212661 -314031 -458046 -627934 -778358 -876044
$$ packed form
39784d5331K2418P4507R7745M9298p7115k27177l18454l11049k37078j53732q3950
39773a209918j8282M0980O5655L5305l1406q7117r4226n4039k259K7164L6417
39762a291726N5857R9435J41835J50094J23527Q4469M1113j3803o8435q4829m0678
39751h03141L6965R3417R5630N4028M879k1039j9831j3912k7938o1489q9048q7543
39739h39022n6916j3248K6481M7788M0243R056j9069j3025L7533J15426J88396
39728d76357K23587J99369J18806J5932n9901p5473l5323K4354O3283O4414M0168
39717A02859J3875l696j7433l0147l0139k360M9962R9254J11286P1296l465p6051
39705B85241j16842j20775j02193q1160p6932j01370j44015j69888j50424r7686
$$ plain form
39695 -876044 -928466 -965346 -1002561 -1038461 -1076924 -1130606 -1195508 -1236794 -1208182 -1082195 -867601
39684 -867601 -613430 -393834 -263139 -209170 -161698 -59372 98464 271341 430913 575783
39674 575783 701607 778540 764660 636147 408779 139274 -101357 -273253 -390748 -493086
39664 -493086 -595165 -676899 -713464 -696296 -625773 -509054 -376306 -277028 -238188 -233888 -214601
39653 -214601 -164169 -115164 -112064 -172822 -281968 -401567 -484880 -498208 -444884 -364764 -303963
39642 -303963 -286723 -313026 -366337 -412408 -403229 -303799 -120532 105017 332107 543857 736753
39631 736753 901508 1023106 1092891 1110163 1072414 973486 817743 634047 468267 354230
39621 354230 287795 229684 135562 -14196 -207620 -413155 -594960 -726048 -798309 -820050
$$ packed form
39695h76044n2422l6880l7215l5900l8463n3682o4902m1286K8612J25987K14594
39684h67601K54171K19596J30695N3969M7472J02326J57836J72877J59572J44870
39674E75783J25824P6933j3880j28513k27368k69505k40631j71896j17495j02338
39664d93086j02079q1734l6565J7168P0523J16719J32748R9278L8840M300J9287
39653b14601N0432M9005L100o0758j09146j19599q3313j3328N3324Q0120O0801
39642c03963J7240k6303n3311m6071R179R9430J83267K25549K27090K11750J92896
39631G36753J64755J21598O9785J7272l7749r8928j55743j83696j65780j14037
39621C54230o6435n8111r4122j49758j93424k05535j81805j31088p2261k1741
$$ plain form
39611 -820050 -798364 -727320 -601844 -440469 -282813 -162527 -90638 -63136 -69493 -89634 -100289
39600 -100289 -99031 -113324 -170489 -260463 -339253 -369693 -353288 -325833 -329732 -387132 -489612 -610729
39588 -610729 -728807 -831276 -894203 -872839 -731306 -480982 -177129 121681 381020 585684
39578 585684 731342 829952 908741 991745 1086755 1192549 1306393 1415565 1491806 1509468 1471148
39567 1471148 1409454 1361758 1343193 1340083 1326182 1286816 1227879 1158903 1070080 935221 741452
39556 741452 509328 276718 64256 -138176 -349047 -561083 -733440 -821586 -811783 -718158
39546 -718158 -551111 -311782 -28481 226722 389568 467330 525800 614827 731630 853004
39536 853004 964725 1046274 1063178 1003919 905171 813670 734396 637465 504094 343778 176797
$$ packed form
39611h20050K1686P1044J25476J61375J57656J20286P1889K7502o357k0141j0655
39600a00289J258j4293n7165q9974p8790l0440J6405K7455l899n7400j02480j21117
39588f10729j18078j02469o2927K1364J41533K50324L03853K98810K59339K04664
39578E85684J45658R8610P8789Q3004R5010J05794J13844J09172P6241J7662l8320
39567A471148o1694m7696j8565l110j3901l9366n8937o8976q8823j34859j93769
39556G41452k32124k32610k12462k02432k10871k12036j72357q8146R803R3625
39546g18158J67047K39329K83301K55203J62846P7762N8470Q9027J16803J21374
39536H53004J11721Q1549J6904n9259r8748r1501p9274r6931j33371j60316j66981
$$ plain form
39525 176797 22878 -101662 -200496 -305847 -444858 -597342 -709657 -753156 -749810 -737820
39515 -737820 -729786 -707600 -643506 -527047 -389104 -297744 -306119 -396235 -489902 -519469 -474020
39504 -474020 -381830 -279404 -207526 -204046 -270343 -356660 -405252 -406891 -402980 -439184 -530593 -665407
39492 -665407 -824472 -991821 -1150574 -1269475 -1299297 -1200600 -985789 -722347 -482041 -293278
39482 -293278 -148947 -42604 24181 61056 90065 124644 165156 219697 313224 465448 665712
39471 665712 875250 1050021 1158772 1185039 1120138 960994 719991 434927 159145 -62322
39461 -62322 -199443 -222760 -108972 116623 357987 502145 504312 407242 281929 173624
39451 173624 104070 87086 115126 149434 151319 118558 74596 32000 -12022 -50875 -66096 -54318
$$ packed form
39525A76797j53919j24540r8834j05351j39011j52484j12315m3499L346J1990
39515g37820Q034K2186O4094J16459J37943R1360q375r0116r3667k9567M5449
39504d74020R2190J02426P1878L480o6297q6317m8592j639L911l6204r1409j34814
39492f65407j59065j67349j58753j18901k9822R8697K14811K63442K40306J88763
39482b93278J44331J06343O6785L6875K9009L4579M0512N4541R3527J52224K00264
39471F65712K09538J74771J08751K6267o4901j59144k41003k85064k75782k21467
39461f2322j37121k3317J13788K25595K41364J44158K167r7070j25313j08305
39451A73624o9554j6984K8040L4308J885l2761m3962m2596m4022l8853j5221J1778
$$ plain form
39439 -54318 -37886 -42539 -77029 -134518 -195268 -225329 -196700 -122119 -51547 -17722 1652 53399
39427 53399 156843 301159 476625 677090 878479 1050796 1197285 1348270 1498936 1577621
39417 1577621 1498374 1234442 830023 361753 -90495 -456521 -699721 -836455 -913564 -962041
39407 -962041 -982728 -971478 -939073 -905126 -887773 -899577 -937331 -973417 -971548 -913908 -802721
39396 -802721 -641401 -436094 -217078 -33444 85999 153005 196130 234736 282088 348713
39386 348713 423720 470043 461881 422351 409457 468721 605811 789527 963098 1062408 1046665
39375 1046665 917567 706358 453606 208599 24147 -79371 -140311 -219087 -331414 -434901
39365 -434901 -478026 -439437 -322809 -149391 28431 136370 134046 58174 -8548 -11385 42066
$$ packed form
39439e4318J6432m653l4490n7489o0750l0061K8629P4581P0572L3825J9374N1747
39427E3399J03444J44316J75466K00465K01389J72317J46489J50985J50666P8685
39417A577621p9247k63932m04419m68270m52248l66026k43200j36734p7109m8477
39407i62041k0687J1250L2405L3947J7353j1804l7754l6086J869N7640J11187
39396h02721J61320K05307K19016J83634J19443O7006M3125L8606M7352O6625
39386C48713P5007M6323q162l9530j2894N9264J37090J83716J73571R9310j5743
39375A046665j29098k11209k52752k45007j84452j03518o0940p8776j12327j03487
39365d34901m3125L8589J16628J73418J77822J07939k324p5872o6722k837N3451
$$ plain form
39354 42066 111508 169037 214221 261224 320154 383549 421837 394199 274217 72108 -170199
39343 -170199 -411809 -640008 -857581 -1043488 -1140977 -1098261 -918259 -661190 -405155 -213531
39333 -213531 -127330 -159888 -287056 -456944 -623823 -772125 -906012 -1022658 -1100110 -1108320
39323 -1108320 -1033683 -899323 -757286 -648070 -567544 -485059 -391261 -309614 -259999 -236654 -235681
39312 -235681 -281921 -403058 -583739 -765208 -888475 -924589 -870384 -738484 -558556 -372964
39302 -372964 -218484 -112044 -53338 -35516 -53247 -105166 -186834 -276550 -334118 -327203 -263605
39291 -263605 -192258 -169640 -224505 -345654 -489937 -601700 -639529 -597118 -501353 -391751 -303699
39280 -303699 -264250 -288213 -368577 -473441 -558041 -584102 -536494 -433443 -323289 -259947 -268057
$$ packed form
39354D2066O9442N7529M5184M7003N8930O3395L8288k7638j19982k02109k42307
39343a70199k41610k28199k17573j85907r7489M2716J80002K57069K56035J91624
39333b13531Q6201l2558j27168j69888j66879j48302j33887j16646p7452q210
39323a108320P4637J34360J42037J09216Q0526Q2485R3798Q1647M9615K3345R73
39312b35681m6240j21137j80681j81469j23267l6114N4205J31900J79928J85592
39302c72964J54480J06440N8706J7822j7731n1919q1668q9716n7568O915O3598
39291b63605P1347K2618n4865j21149j44283j11763l7829M2411R5765J09602Q8052
39280c03699L9449k3963q0364j04864q4600k6061M7608J03051J10154O3342q110
$$ plain form
39269 -268057 -326642 -386637 -405133 -366968 -282601 -174817 -71462 -6044 -10524 -90717 -205580
39258 -205580 -286406 -294485 -262516 -271445 -382747 -591561 -835924 -1040836 -1159414 -1191217 -1173374
39247 -1173374 -1151708 -1154772 -1191264 -1262672 -1367256 -1492760 -1614894 -1704293 -1729783 -1662059 -1492647
39236 -1492647 -1254840 -1013525 -826832 -722652 -706577 -767156 -860159 -910763 -864207 -739269
39226 -739269 -615379 -561384 -584778 -647969 -715905 -777290 -829638 -860366 -848177 -778099 -649547
39215 -649547 -469223 -241201 30609 331929 636811 917415 1148505 1304432 1369289 1363196
39205 1363196 1348058 1385758 1482656 1581032 1607095 1524804 1350200 1129390 908890 717939
39195 717939 567916 463146 407773 399220 419795 441959 439972 392157 282320 118625 -46133
$$ packed form
39269b68057n8585n9995j8496L8165Q4367J07784J03355O5418m480q0193j14863
39258b05580q0826q079L1969q929j11302k08814k44363k04912j18578l1803J7843
39247a173374K1666l064l6492p1408j04584j25504j22134q9399k5490O7724J69412
39236a492647K37807K41315J86693J04180J6075o0579r3003n0604M6556J24938
39226g39269J23890N3995k3394o3191o7936o1385n2348l0728J2189P0078J28552
39215f49547J80324K28022K71810L01320L04882K80604K31090J55927O4857o093
39205A363196j5138L7700R6898R8376K6063q2291j74604k20810k20500j90951
39195G17939j50023j04770n5373q553K0575K2164j987m7815j09837j63695j64758
$$ plain form
39184 -46133 -132262 -88589 67808 267458 438881 547111 600628 632019 662904 676570 630816
39173 630816 507782 345041 204418 112022 41791 -40515 -129739 -184709 -173390 -108307 -37931
39162 -37931 -6428 -24304 -78614 -163252 -281627 -411792 -486437 -433641 -243836 15170 252134
39151 252134 411001 480238 471546 409118 327074 252545 187733 121932 61182 28586 28810 30043
39139 30043 -165 -45972 -48386 35052 185942 345456 468524 547448 589758 592863 551295
39128 551295 481871 428650 436105 515036 632899 738460 801070 828864 846569 855939 825531
39117 825531 724925 564166 392444 259970 186826 164980 179020 220279 286128 370109 452736
39106 452736 504884 506889 465493 407176 354332 311996 273402 224303 137658 -18494 -246732
$$ packed form
39184d6133q6129M3673J56397J99650J71423J08230N3517L1391L0885J3666m5754
39173F30816j23034j62741j40623r2396p0231q2306q9224n4970J1319O5083P0376
39162c7931L1503j7876n4310q4638j18375j30165p4645N2796J89805K59006K36964
39151B52134J58867O9237q692o2428q2044p4529o4812o5801o0750l2596K24J233
39139C0043l0208m5807k414Q3438J50890J59514J23068P8924M2310L105m1568
39128E51295o9424n3221P455P8931J17863J05561O2610K7794J7705R370l0408
39117H25531j00606j60759j71722j32474p3144k1846J4040M1259O5849Q3981Q2627
39106D52736N2148K005m1396n8317n2844m2336l8594m9099q6645j56152k28238
$$ plain form
39095 -246732 -492299 -665744 -708337 -639364 -538576 -482272 -493503 -545183 -599767 -640733 -671940
39084 -671940 -698422 -712923 -696279 -628067 -503762 -346253 -191225 -50949 98972 280186
39074 280186 462014 571626 559848 442431 273372 100073 -42008 -115792 -99462 -19938
39064 -19938 53689 63489 7937 -60999 -75619 5984 174430 374625 544104 652928 708619
39053 708619 733864 754667 804618 915708 1091729 1299657 1494279 1644966 1739302 1778342
39043 1778342 1778938 1768028 1759799 1741281 1687483 1585999 1444043 1284756 1148004 1082588 1115690
39032 1115690 1224417 1345617 1417253 1411197 1335770 1217534 1077862 918436 730941 524812
39022 524812 336790 203052 129686 103719 124949 205700 338171 483393 603722 696224
$$ packed form
39095b46732k45567j73445m2593O8973J00788N6304j1231n1680n4584m0966l1207
39084f71940k6482j4501J6644O8212J24305J57509J55028J40276J49921J81214
39074B80186J81828J09612j1778j17417j69059j73299j42081p3784J6330P9524
39064a9938P3627R800n5552o8936j4620Q1603J68446K00195J69479J08824N5691
39053G08619K5245K0803M9951J11090J76021K07928J94622J50687R4336L9040
39043A778342N96j0910q229j8518n3798j01484j41956j59287j36752o5416L3102
39032A115690J08727J21200P1636o056p5427j18236j39672j59426j87495k06129
39022E24812j88022j33738p3366k5967K1230Q0751J32471J45222J20329R2502
$$ plain form
39012 696224 786599 897930 1028794 1150275 1216642 1188600 1057248 843805 574022 261439
39002 261439 -79600 -416802 -709876 -935454 -1092878 -1186993 -1214780 -1171621 -1065619 -921640
38992 -921640 -769427 -625434 -486453 -343429 -198767 -64253 53621 153497 225524 257709
38982 257709 266271 303339 415314 596944 797244 963981 1071891 1119831 1122820 1105602 1084793
38971 1084793 1055076 1008101 963605 960465 1010419 1078158 1115683 1103039 1051645 988338 945990
38960 945990 944862 958725 913453 750102 494584 249365 113180 116595 227001 392457 572503
38949 572503 742080 881587 967058 972024 883177 713192 495979 274574 95272 -3453
38939 -3453 -15774 22763 69752 117653 184454 267476 333100 358836 360319 361896 360214 335786
$$ packed form
39012F96224R0375J11331J30864J21481O6367k8042j31352k13443k69783l12583
39002B61439l41039l37202k93074k25578j57424r4115k7787M3159J06002J43979
38992i21640J52213J43993J38981J43024J44662J34514J17874R9876P2027L2185
38982B57709Q562L7068J11975J81630K00300J66737J07910M7940K989j7218k0809
38971A084793k9717m6975m4496l140M9954O7739L7525j2644n1394o3307m2348
38960I45990j128J3863m5272j63351k55518k45219j36185L415J10406J65456J80046
38949E72503J69577J39507Q5471M966q8847j69985k17213k21405j79302r8725
38939c453j2321L8537M6989M7901O6801Q3022O5624K5736J483J577j682k4428
$$ plain form
38927 335786 286646 230160 180330 144358 138422 185711 291781 430570 558113 638603 665668
38916 665668 669307 696915 773624 878869 965986 998971 965158 867848 726669 577475 447634
38905 447634 331265 211770 111192 88400 171042 307479 407718 426314 391513 360134
38895 360134 360330 377859 384088 369630 350102 337530 310259 225897 72382 -105060 -240111
38884 -240111 -301239 -300953 -262582 -202840 -146408 -127092 -151739 -172728 -119893 30820 225795
38873 225795 374677 420854 371562 266421 129031 -43122 -247652 -452764 -613620 -707523
38863 -707523 -742298 -730069 -663113 -523083 -312934 -75389 124805 243526 289006 314120
38853 314120 377092 507514 700478 925423 1131982 1263489 1290697 1237580 1157570 1074462
$$ packed form
38927C35786m9140n6486m9830l5972n936M7289J06070J38789J27543Q0490K7065
38916F65668L639K7608P6709J05245Q7117L2985l3813r7310j41179j49194j29841
38905D47634j16369j19495j00578k2792Q2642J36437J00239J8596l4801l1379
38895C60134J96J7529O229j4458j9528j2572k7271q4362j53515j77442j35051
38884b40111o1128K86L8371N9742N6432J9316k4647k0989N2835J50713J94975
38873B25795J48882M6177m9292j05141j37390j72153k04530k05112j60856r3903
38863g07523l4775J2229O6956J40030K10149K37545K00194J18721M5480K5114
38853C14120O2972J30422J92964K24945K06559J31507K7208n3117q0010q3108
$$ plain form
38843 1074462 955633 750048 442022 59628 -354188 -757655 -1104706 -1354511 -1502077
38834 -1502077 -1583419 -1630915 -1628496 -1528100 -1311417 -1021737 -732014 -494763 -328989 -240727
38824 -240727 -237924 -324794 -491316 -709454 -935209 -1120270 -1236033 -1291035 -1317602 -1337582 -1345317
38813 -1345317 -1322814 -1260554 -1158431 -1015729 -830254 -606026 -357538 -108853 110113 274092
38803 274092 376311 427922 437171 391894 269014 61139 -207305 -483945 -704396 -816192
38793 -816192 -805836 -709171 -589166 -496623 -445414 -413441 -358910 -244647 -64669 146070 332355
38782 332355 448952 468248 369925 144775 -184100 -554722 -887205 -1107205 -1157291 -1015214
38772 -1015214 -723486 -390224 -132940 -6729 13034 -17144 -64172 -130318 -228784 -359811
$$ packed form
38843A074462j18829k05585l08026l82394m13816m03467l47051k49805j47566
38834a502077q1342m7496K419J00396K16683K89680K89723K37251J65774Q8262
38824b40727K803q6870j66522k18138k25755j85061j15763n5002k6567j9980p735
38813a345317K2503O2260J02123J42702J85475K24228K48488K48685K18966J63979
38803B74092J02219N1611R249m5277j22880k07875k68444k76640k20451j11796
38793h16192J0356R6665J20005R2543N1209L1973N4531J14263J79978K10739J86285
38782C32355J16597J9296r8323k25150l28875l70622l32483k20000n0086J42077
38772a015214K91728L33262K57284J26211J9763l0178m7028o6146r8466j31027
$$ plain form
38762 -359811 -505444 -634919 -709865 -690728 -552301 -307422 -20556 211481 310191 261011
38752 261011 114178 -58354 -207089 -313273 -369879 -371818 -328300 -270904 -233757 -225005 -226825
38741 -226825 -222932 -213013 -195686 -152545 -64249 63276 202724 333269 451679 556836 638429
38730 638429 685826 697213 675310 624093 555217 488998 443739 431298 463776 547602 659192
38719 659192 739840 735526 644091 513523 393991 298821 209376 107360 725 -75211 -81602
38708 -81602 -7696 119270 258439 388414 514417 649798 800083 963203 1134715 1307708
38698 1307708 1468919 1594115 1647614 1596344 1436371 1206284 969717 786413 699159 730201
38688 730201 868365 1061068 1237633 1347691 1373763 1318885 1205212 1081601 999899 967081
$$ packed form
38762c59811j45633j29475p4946J9137J38427K44879K86866K32037R8710m9180
38752B61011j46833j72532j48735j06184n6606j939M3518N7396L7147Q752j820
38741b26825L893R919J7327M3141Q8296J27525J39448J30545J18410J05157Q1593
38730F38429M7397J1387k1903n1217o8876o6219m5259j2441L2478Q3826J11590
38719F59192Q0648m314r1435j30568j19532r5170q9445j02016j06635p5936o391
38708h1602P3906J26966J39169J29975J26003J35381J50285J63120J71512J72993
38698A307708J61211J25196N3499n1270j59973k30087k36567j83304q7254L1042
38688G30201J38164J92703J76565J10058K6072n4878j13673j23611q1702l2818
$$ plain form
38678 967081 941038 891230 846000 857169 929428 1011430 1054754 1057432 1045734 1036223 1027146 1009127
38666 1009127 965361 867884 694186 457856 219095 56165 16441 85945 202289 298366
38656 298366 336258 305269 202572 33067 -169308 -336289 -402062 -358291 -276120 -267925 -411966
38645 -411966 -696531 -1028577 -1298791 -1445740 -1469025 -1398473 -1264679 -1095004 -920137 -772969
38635 -772969 -681488 -660267 -698180 -750829 -756875 -674262 -501695 -266050 -1075 253515 447276
38624 447276 539474 532284 470829 400679 330323 239268 113297 -38507 -195247 -337986 -451379
38613 -451379 -526805 -573671 -617606 -670926 -703694 -658032 -500387 -255858 10725 236564 377953
38602 377953 405647 313593 137984 -54431 -212647 -328031 -408450 -443128 -412985 -327919 -230285
$$ packed form
38678I67081k6043m9808m5230J1169P2259Q2002M3324K678j1698r511r077j8019
38666A009127m3766r7477j73698k36330k38761j62930l9724O9504J16344R6077
38656B98366L7892l0989j02697j69505k02375j66981o5773M3771Q2171Q195j44041
38645d11966k84565l32046k70214j46949k3285P0552J33794J69675J74867J47168
38635g72969R1481K1221l7913n2649o046Q2613J72567K35645K64975K54590J93761
38624D47276R2198p190o1455p0150p0356r1055j25971j51804j56740j42739j13393
38613d51379p5426m6866m3935n3320l2768M5662J57645K44529K66583K25839J41389
38602C77953K7694r2054j75609j92415j58216j15384q0419l4678L0143Q5066R7634
$$ plain form
38591 -230285 -156113 -106686 -62635 -14313 25781 28606 -38752 -191691 -404037 -607028 -723621
38580 -723621 -713480 -593769 -424549 -269828 -156938 -65508 38170 153944 242866 268677
38570 268677 229420 145676 40499 -53432 -87192 -25357 119471 301043 484549 657677
38560 657677 803293 894843 933247 965886 1046934 1184191 1335759 1451492 1507016 1503776 1448683
38549 1448683 1335511 1144761 868097 536104 212158 -49074 -231969 -347282 -404339 -407468
38539 -407468 -366828 -291608 -173200 7458 249443 516856 756982 927207 1004625 981395
38529 981395 861769 665773 431199 202383 6315 -159661 -304116 -403363 -407257 -300646
38519 -300646 -146899 -45789 -45648 -109639 -161862 -145389 -41067 131589 309402 404674 364453
$$ packed form
38591b30285P4172M9427M4051M8322M0094K825o7358j52939k12346k02991j16593
38580g23621J0141J19711J69220J54721J12890R1430J03678J15774Q8922K5811
38570B68677l9257q3744j05177r3931l3760O1835J44828J81572J83506J73128
38560F57677J45616R1550L8404L2639Q1048J37257J51568J15733N5524l240n5093
38549A448683j13172j90750k76664l31993l23946k61232j82895j15313n7057l129
38539d07468M0640P5220J18408J80658K41985K67413K40126J70225P7418k3230
38529I81395j19626j95996k34574k28816j96068j65976j44455r9247l894J06611
38519c00646J53747J01110J41o3991n2223J6473J04322J72656J77813R5272m0221
$$ plain form
38508 364453 217790 54774 -39173 -24464 96118 289120 492115 630480 659911 596666
38498 596666 497067 404807 322617 233800 139148 61435 18087 7310 30525 113574 282277
38487 282277 514601 737176 882420 940467 945927 925483 876193 792338 694754 625004 616576
38476 616576 673601 768557 855839 896382 880912 832842 787769 770781 790530 843029 909149
38465 909149 951791 933951 855113 768168 746869 827273 980802 1144112 1269260 1343513 1372107
38454 1372107 1356230 1289907 1171573 1016337 857539 728807 634201 538772 400550 213127
38444 213127 7901 -181619 -339197 -446630 -469287 -382116 -204194 7185 195121 330115
38434 330115 410689 454371 485310 516106 540199 548612 546300 537524 502201 410316 265134 114339
$$ packed form
38508C64453j46663j63016r3947J4709J20582J93002K02995J38365K9431o3245
38498E96666r9599r2260q2190q8817r4652p7713m3348j0777K3215Q3049J68703
38487B82277K32324K22575J45244N8047N460k0444m9290q3855r7584o9750q428
38476F16576N7025R4956Q7282M0543j5470m8070m5073j6988J9749N2499O6120
38465I09149M2642j7840p8838q6945k1299Q0404J53529J63310J25148P4253K8594
38454A372107j5877o6323j18334j55236j58798j28732r4606r5429j38222j87423
38444B13127k05226j89520j57578j07433k2657Q7171J77922K11379J87936J34994
38434C30115Q0574M3682L0939L0796K4093Q413k312q776l5323r1885j45182j50795
$$ plain form
38422 114339 9441 -34080 -32197 -6521 23133 34277 12010 -32631 -62897 -36325 75560
38411 75560 274390 524095 751727 875623 850108 691668 465059 242680 69172 -45647
38401 -45647 -107588 -117774 -74777 7245 94075 153495 181828 208245 276614 421105 645901
38390 645901 915969 1168930 1345669 1417199 1390047 1297259 1187321 1107768 1082556 1103090 1147756
38379 1147756 1209976 1304097 1448733 1648815 1884342 2105102 2244939 2262410 2173964 2037638
38369 2037638 1901525 1774472 1640145 1479671 1277963 1029912 752932 478733 220981
38360 220981 -33731 -288933 -509874 -655851 -731359 -778889 -824791 -860847 -881740 -906965 -946121
38349 -946121 -964718 -909780 -762603 -551738 -325616 -130081 1367 67185 112314 198504
$$ packed form
38422A14339j04898m3521J883K5676K9654J1144k2267m4641l0266K6572J11885
38411G5560J98830K49705K27632J23896k5515j58440k26609k22379j73508j14819
38401d5647o1941j0186M2997Q2022Q6830N9420K8333K6417O8369J44491K24796
38390F45901K70068K52961J76739P1530k7152r2788j09938p9553k5212K0534M4666
38379A147756O2220R4121J44636K00082K35527K20760J39837J7471q8446j36326
38369B037638j36113j27053j34327j60474k01708k48051k76980k74199k57752
38360B20981k54712k55202k20941j45977p5508m7530m5902l6056k0893k5225l9156
38349i46121j8597N4938J47177K10865K26122J95535J31448O5818M5129Q6190
$$ plain form
38339 198504 346299 516063 650194 719843 725372 671685 563723 421798 285894 200337
38329 200337 193756 264509 378777 492712 588595 684073 796081 904540 968683 975590 952996
38318 952996 931253 911347 878276 828842 773158 723080 698197 734726 862028 1061137 1261471
38307 1261471 1390774 1422993 1371722 1249743 1054911 797464 522803 292127 143833 82631
38297 82631 100464 190282 332553 482386 587273 619770 586174 505089 387939 243352 90625
38286 90625 -41840 -132414 -176776 -182707 -158673 -110919 -50085 6809 48674 84240 136098 217735
38274 217735 321868 432925 541314 639978 719476 780009 839599 911947 978580 1001830 967338
38263 967338 895732 808867 705551 579820 441342 299442 142535 -44046 -247600 -436717
$$ packed form
38339A98504J47795J69764J34131O9649N529n3687j07962j41925j35904q5557
38329B00337o581P0753J14268J13935R5883R5478J12008J08459O4143O907k2594
38318I52996k1743j9906l3071m9434n5684n0078k4883L6529J27302J99109K00334
38307A261471J29303L2219n1271j21979j94832k57447k74661k30676j48294o1202
38297H2631J7833Q9818J42271J49833J04887L2497l3596q1085j17150j44587j52727
38286I0625j32465r0574m4362n931K4034M7754O0834N6894M1865L5566N1858Q1637
38274B17735J04133J11057J08389R8664P9498O0533N9590P2348O6633K3250l4492
38263I67338p1606q6865j03316j25731j38478j41900j56907j86581k03554j89117
$$ plain form
38253 -436717 -596722 -736237 -859128 -950142 -992138 -980520 -916470 -803860 -661119 -519635
38243 -519635 -397476 -286486 -180471 -109176 -126903 -262895 -488524 -733144 -928389 -1042054
38233 -1042054 -1081389 -1072010 -1034675 -978872 -910653 -836460 -757475 -669226 -574408 -493427 -456614
38222 -456614 -484849 -576137 -704533 -828929 -908611 -916933 -841947 -680241 -444316 -181355 30460
38211 30460 124447 90637 -22472 -145748 -226118 -242099 -207534 -164845 -157711 -197322 -257325
38200 -257325 -303034 -318020 -301260 -252725 -174109 -77851 16227 92887 143867 163016 150670
38189 150670 123843 111600 134826 195064 283440 389140 491010 551188 536170 450729 341989
38178 341989 262570 233455 246556 294667 385203 523362 693107 862157 1001027 1091036 1117547
$$ packed form
38253d36717j60005j39515j22891r1014m1996J1618O4050J12610J42741J41484
38243e19635J22159J10990J06015P1295j7727j35992k25629k44620j95245j13665
38233a042054l9335R379L7335N5803O8219P4193P8985Q8249R4818Q0981L6813
38222d56614k8235r1288j28396j24396p9682q322P4986J61706K35925K62961K11815
38211C0460R3987l3810j13109j23276q0370j5981L4565M2689P134l9611o0003
38200b57325m5709j4986J6760M8535P8616R6258R4078P6660N0980J9149j2346
38189A50670k6827j2243K3226O0238Q8376J05700J01870O0178j5018q5441j08740
38178C41989p9419k9115J3101M8111R0536J38159J69745J69050J38870R0009K6511
$$ plain form
38167 1117547 1066032 932794 741725 548006 417230 389568 458083 583901 735121 909191
38157 909191 1118268 1360465 1609420 1824639 1965711 2005522 1943960 1808778 1633095 1432198
38147 1432198 1209947 979612 756134 525361 249995 -70083 -357237 -505666 -477444 -334017
38137 -334017 -170056 -32459 91384 227404 377822 524113 647155 736659 786896 790579
38127 790579 741304 644528 523248 405726 307376 233635 201596 242593 369324 548000 719172
38116 719172 846185 932504 993967 1028304 1013118 920481 732936 464785 177498 -43403
38106 -43403 -146787 -148823 -98561 -19660 99680 268048 466095 664599 848004 1009337
38096 1009337 1134152 1202011 1197922 1112792 939364 683214 381476 99104 -108073 -234870
$$ packed form
38167A117547n1515j33238j91069j93719j30776k7662O8515J25818J51220J74070
38157I09191K09077K42197K48955K15219J41072L9811o1562j35182j75683k00897
38147A432198k22251k30335k23478k30773k75366l20078k87154j48429K8222J43427
38137c34017J63961J37597J23843J36020J50418J46291J23042Q9504N0237L683
38127G90579m9275r6776j21280j17522r8350p3741l2039M0997J26731J78676J71172
38116G19172J27013Q6319O1463L4337j5186r2637j87545k68151k87287k20901
38106d3403j03384k036N0262P8901J19340J68368J98047J98504J83405J61333
38096A009337J24815O7859m089q5130j73428k56150l01738k82372k07177j26797
$$ plain form
38086 -234870 -330962 -455602 -619671 -772365 -849337 -830901 -745972 -625168 -469078 -268907
38076 -268907 -40765 176802 351518 468076 516300 490860 410817 324639 279495 283038 299867
38065 299867 287665 238101 184689 171013 210238 276812 337924 387714 446656 533196 643981
38054 643981 757897 848184 889651 865335 774911 637371 485031 351675 253390 169016 47977
38043 47977 -142853 -378939 -601960 -785307 -952345 -1118664 -1242307 -1261267 -1174433 -1059545
38033 -1059545 -1007102 -1052956 -1175547 -1334221 -1493966 -1626172 -1709489 -1739279 -1730163 -1700814 -1652556
38022 -1652556 -1564730 -1416109 -1213050 -994846 -813609 -714842 -730236 -863176 -1063883 -1235055
38012 -1235055 -1291201 -1218137 -1062886 -871296 -656015 -421181 -185404 36406 253823 483729
$$ packed form
38086b34870r6092j24640j64069j52694p6972J8436Q4929J20804J56090K00171
38076b68907K28142K17567J74716J16558M8224k5440q0043q6178m5144L543J6829
38065B99867j2202m9564n3412j3676L9225O6574O1112M9790N8942Q6540J10785
38054F43981J13916R0287M1467k4316r0424j37540j52340j33356r8285q4374j21039
38043D7977j90830k36086k23021j83347j67038j66319j23643j8960Q6834J14888
38033a059545N2443m5854j22591j58674j59745j32206q3317k9790R116K9349M8258
38022a652556Q7826J48621K03059K18204J81237R8767j5394j32940k00707j71172
38012a235055n6146P3064J55251J91590K15281K34834K35777K21810K17417K29906
$$ plain form
38002 483729 721522 941121 1110727 1194791 1157246 991189 747000 511166 349244 275239
37992 275239 271099 317914 402474 507401 609381 692581 767038 872688 1051543 1301545 1562761
37981 1562761 1764719 1888526 1971674 2055356 2144439 2220207 2270254 2291794 2277874 2216299 2100304
37970 2100304 1933332 1728142 1507255 1296613 1107481 926196 730971 521745 331750
37961 331750 210519 193652 278679 421424 559771 651472 693686 706770 703152 675055 607811
37950 607811 497831 356260 197702 27210 -158546 -353391 -528901 -651140 -713894 -744628
37940 -744628 -769004 -777220 -736702 -635646 -505128 -399036 -356696 -377269 -416493 -408909 -309959
37929 -309959 -129553 75281 244254 352443 411536 441325 441161 384338 241375 17883 -226042
$$ packed form
38002D83729K37793K19599J69606Q4064l7545j66057k44189k35834j61922p4005
37992B75239m140M6815Q4560J04927J01980Q3200P4457J05650J78855K50002K61216
37981A562761K01958J23807Q3148Q3682Q9083P5768N0047K1540j3920o1575j15995
37970B100304j66972k05190k20887k10642j89132j81285j95225k09226j89995
37961C31750j21231j6867Q5027J42745J38347R1701M2214J3084l618k8097o7244
37950F07811j09980j41571j58558j70492j85756j94845j75510j22239o2754l0734
37940g44628k4376q216M0518J01056J30518J06092M2340k0573l9224P584R8950
37929c09959J80406K04834J68973J08189N9093K9789j64n6823j42963k23492k43925
$$ plain form
37918 -226042 -400699 -440947 -342390 -150773 76219 295899 481785 614678 680978 677864
37908 677864 614259 503695 357915 189297 15565 -145491 -286792 -409373 -505077 -551712
37898 -551712 -537808 -490438 -466445 -511137 -629639 -797363 -988000 -1186251 -1382110 -1563106
37888 -1563106 -1711961 -1807887 -1834202 -1792599 -1709026 -1615860 -1523102 -1413222 -1272223 -1122889
37878 -1122889 -1015235 -977246 -981563 -971137 -916717 -838156 -765510 -690840 -571268 -378034 -132158
37867 -132158 110246 298099 404925 418934 334649 168093 -25724 -171260 -225664 -215502
37857 -215502 -214180 -281401 -424347 -605975 -773403 -878903 -896598 -837628 -744846 -661412 -604542
37846 -604542 -570708 -553929 -547827 -539327 -517382 -487512 -466339 -462716 -473570 -494278 -519893 -538172
$$ packed form
37918b26042j74657m0248R8557J91617K26992K19680J85886J32893O6300l114
37908F77864o3605j10564j45780j68618j73732j61056j41301j22581r5704m6635
37898e51712J3904M7370K3993m4692j18502j67724j90637j98251j95859j80996
37888a563106j48855r5926k6315M1603Q3573R3166R2758J09880J40999J49334
37878a122889J07654L7989m317J0426N4420P8561P2646P4670J19572J93234K45876
37867a32158K42404J87853J06826J4009q4285j66556j93817j45536n4404J0162
37857b15502J322o7221j42946j81628j67428j05500j7695N8970R2782Q3434N6870
37846f04542L3834J6779O102Q500K1945K9870K1173L623j0854k0708k5615j8279
$$ plain form
37834 -538172 -536838 -520030 -504038 -493831 -478166 -454059 -442484 -468589 -532499 -607382 -662620 -687114
37822 -687114 -700422 -747768 -872584 -1077444 -1309649 -1492956 -1577978 -1563624 -1476142 -1335994
37812 -1335994 -1149326 -930097 -721260 -576787 -510653 -473063 -397584 -274700 -162898 -123646
37802 -123646 -164002 -251273 -360152 -480056 -585499 -629486 -578042 -440785 -261431 -84903
37792 -84903 63999 180145 268425 338646 406509 488659 582130 646550 624712 499198 324962
37781 324962 189869 140441 155757 190868 227082 273423 337937 417397 509663 615301 718426
37770 718426 775755 736259 575959 317962 28225 -204589 -299597 -219886 4472 289296
37760 289296 540592 697465 748335 723167 672144 633634 605100 546201 419420 228200 14818
$$ packed form
37834e38172J334J6808J5992J0207J5665K4107J1575k6105o3910p4883n5238k4494
37822f87114j3308m7346j24816k04860k32205j83307q5022J4354Q7482J40148
37812a335994J86668K19229K08837J44473O6134L7590P5479J22884J11802L9252
37802a23646m0356q7271j08879j19904j05443m3987N1444J37257J79354J76528
37792h4903J48902J16146Q8280P0221O7863Q2150R3471O4420k1838j25514j74236
37781C24962j35093m9428J5316L5111L6214M6341O4514P9460R2266J05638J03125
37770G18426N7329l9496j60300k57997k89737k32814r5008P9711K24358K84824
37760B89296K51296J56873N0870k5168n1023l8510k8534n8899j26781j91220k13382
$$ plain form
37749 14818 -167813 -274796 -277892 -182412 -36835 94558 177064 216563 230377 225334 204976
37738 204976 177178 147291 120864 119625 175030 293938 446378 598633 741741 873432 970151
37727 970151 999997 956484 861275 736796 588458 408786 190178 -55663 -279101 -406882
37717 -406882 -393679 -253596 -30995 240965 531125 780224 921470 937073 868955 769888
37707 769888 667114 574101 504538 457036 406430 328822 225782 114834 9864 -77355 -128040
37696 -128040 -122903 -53922 75136 249195 434012 578323 639287 609100 515214 398557 292269
37685 292269 212707 163942 151884 192695 300740 468018 661083 835779 948728 965330
37675 965330 880214 735304 598936 513935 471448 435919 380266 291836 164210 1474 -175657
$$ packed form
37749A4818j82631j06983l096R5480J45577J31393Q2506L9499J3814n043k0358
37738B04976k7798k9887k6427j239N5405J18908J52440J52255J43108J31691R6719
37727I70151K9846m3513r5209j24479j48338j79672k18608k45841k23438j27781
37717d06882J3203J40083K22601K71960K90160K49099J41246J5603o8118r9067
37707G69888j02774r3013o9563m7502n0606p7608j03040j10948j04970q7219n0685
37696a28040N137O8981J29058J74059J84817J44311O0964l0187r3886j16657j06288
37685B92269p9562m8765j2058M0811J08045J67278J93065J74696J12949J6602
37675I65330q5116j44910j36368q5001m2487l5529n5653q8430j27626j62736j77131
$$ plain form
37664 -175657 -340379 -473891 -563765 -595098 -548996 -403947 -139947 238017 665498 1022964
37654 1022964 1203524 1188772 1055790 912112 826912 811923 843789 891445 929515 941744 923040
37643 923040 880269 825873 765731 694494 605179 499504 385077 268227 155627 55724 -30200
37632 -30200 -109405 -176797 -202984 -166823 -100294 -78014 -152549 -310340 -489985 -626278 -678771
37621 -678771 -646751 -570570 -499379 -442975 -367477 -246180 -99855 18275 57731 -13235 -194985
37610 -194985 -438327 -660882 -805894 -873529 -882907 -830610 -712795 -564432 -438801 -355913
37600 -355913 -300808 -263576 -248226 -246551 -237032 -211707 -174898 -113688 -2299 153405 301679
37589 301679 389110 403581 368387 314911 270356 252677 262765 290253 331794 391744 463564
$$ packed form
37664a75657j64722j33512q9874l1333M6102J45049K64000L77964M27481L57466
37654A022964J80560j4752j32982j43678q5200j4989L1866M7656L8070J2229j8704
37643I23040m2771n4396o0142p1237q9315j05675j14427j16850j12600r9903q5924
37632c0200p9205o7392k6187L6161O6529K2280p4535j57791j79645j36293n2493
37621f78771L2020P6181P1191N6404P5498J21297J46325J18130L9456p0966j81750
37610a94985k43342k22555j45012o7635r378N2297J17815J48363J25631Q2888
37600c55913N5105L7232J5350J675R519K5325L6809O1210J11389J55704J48274
37589C01679Q7431J4471l5194n3476m4555j7679J0088K7488M1541N9950P1820
$$ plain form
37578 463564 528783 580552 631820 693351 759083 818587 865416 884617 852167 763182 648888
37567 648888 550849 484423 434456 375495 287075 161554 10339 -144015 -290388 -435482
37557 -435482 -579930 -698746 -757123 -739534 -656553 -534335 -407723 -309831 -247005 -184048 -69754
37546 -69754 116392 345319 562964 728952 836431 903206 945028 956251 919593 834086 724093
37535 724093 617450 524704 445469 384436 352446 360929 423895 553475 737439 926595 1061942
37524 1061942 1119223 1122112 1115376 1130869 1169373 1198509 1169586 1053413 866640 656641 460068
37513 460068 283811 122638 -21959 -147066 -257398 -353592 -415115 -409403 -325338 -194652
37503 -194652 -74497 -4451 22815 50806 119735 234898 366870 474704 529251 526151 488808
$$ packed form
37578D63564O5219N1769N1268O1531O5732N9504M6829J9201l2450q8985j14294
37567F48888r8039o6426m9967n8961q8420j25521j51215j54354j46373j45094
37557d35482j44448j18816n8377J7589Q2981J22218J26612R7892O2826O2957J14294
37546f9754J86146K28927K17645J65988J07479O6775M1822J1223l6658q5507j09993
37535G24093j06643r2746p9235o1033l1990Q483O2966J29580J83964J89156J35347
37524A061942N7281K889o736J5493L8504K9136k8923j16173j86773k09999j96573
37513D60068j76257j61173j44597j25107j10332r6194o1523N712Q4065J30686
37503a94652J20155P0046K7266K7991O8929J15163J31972J07834N4547l100l7343
$$ plain form
37492 488808 457397 462197 498440 528568 514764 453181 378632 336472 347225 394368 444605 480316
37480 480316 513284 570436 672693 828825 1038097 1281693 1507090 1636425 1612920 1450857
37470 1450857 1235648 1063523 972474 927543 869343 774067 669739 603224 597318 635923 682285
37459 682285 707551 704532 680280 642032 593067 537072 478555 419052 359531 304403 250534 169856
37447 169856 20807 -206999 -466240 -682917 -809164 -835762 -766388 -606290 -378238 -125038
37437 -125038 117041 336559 534201 708062 859901 998637 1121798 1204264 1222420 1184225
37427 1184225 1119939 1044966 945496 802504 620401 430479 273067 176400 145366 167246
37417 167246 228740 323942 443378 563303 657350 721271 782806 886673 1066061 1314566
$$ packed form
37492D88808l1411M800L6243L0128j3804o1583p4549m2160J0753M7143N0237L5711
37480D80316L2968N7152J02257J56132K09272K43596K25397J29335k3505j62063
37470A450857k15209j72125r1049m4931n8200r5276j04328o6515n906L8605M6362
37459F82285K5266l019k4252l8248m8965n5995n8517n9503n9521n5128n3869q0678
37447A69856j49049k27806k59241k16677j26247k6598O9374J60098K28052K53200
37437a25038K42079K19518J97642J73861J51839J38736J23161Q2466J8156l8195
37427A184225o4286p4973r9470j42992j82103j89922j57412r6667l1034K1880
37417A67246O1494R5202J19436J19925R4047O3921O1535J03867J79388K48505
$$ plain form
37407 1314566 1574347 1759457 1809243 1728123 1574034 1413171 1288228 1213932 1179201 1151186
37397 1151186 1096611 1010167 914470 830698 765287 733147 773326 915610 1131527 1336945 1451884
37386 1451884 1453987 1377129 1270912 1162570 1041656 870672 619721 302813 -23432 -304617
37376 -304617 -526492 -700439 -822648 -868226 -825047 -710576 -544275 -320128 -25330 316603
37366 316603 632835 833268 858809 715694 477941 248202 96293 27902 12516 31166
37356 31166 87038 182647 310203 465673 653572 871491 1100511 1312217 1473503 1547081
37346 1547081 1508767 1374131 1195385 1023780 884945 793794 773811 844297 994411 1181383
37336 1181383 1353713 1476772 1548648 1598101 1656234 1722762 1770110 1784825 1786894 1795500 1793144
$$ packed form
37407A314566K59781J85110M9786q1120j54089j60863j24943p4296l4731k8015
37397A151186n4575q6444r5697q3772o5411l2140M0179J42284K15917K05418J14939
37386A451884K103p6858j06217j08342j20914j70984k50951l16908l26245k81185
37376c04617k21875j73947j22209m5578M3179J14471J66301K24147K94798L41933
37366C16603L16232K00433K5541j43115k37753k29739j51909o8391j5386J8650
37356C1166N5872R5609J27556J55470J87899K17919K29020K11706J61286P3578
37346A547081l8314j34636j78746j71605j38835r1151j9983P0486J50114J86972
37336A181383J72330J23059P1876M9453N8133O6528M7348J4715K069Q606k356
$$ plain form
37325 1793144 1744781 1643613 1517589 1396006 1290059 1203630 1140503 1095376 1054406 1011568
37315 1011568 971944 932908 874190 776140 642501 500389 383830 321070 329720 413893 563433
37304 563433 756823 965462 1159521 1317120 1430881 1504714 1546482 1565952 1572652 1565039 1524051
37293 1524051 1431525 1301104 1180472 1110632 1082921 1044107 948444 804246 669113 602139
37283 602139 623004 713283 843956 988303 1110385 1159902 1095715 917492 671564 427287
37273 427287 245612 155105 139631 145209 109554 -2967 -186051 -400486 -592251 -708975
37263 -708975 -715102 -604019 -400903 -155961 67653 211493 244952 181370 69123 -42723
37253 -42723 -138126 -235230 -351003 -466042 -533010 -523776 -457713 -373647 -285068 -182572 -75360
$$ packed form
37325A793144m8363j01168j26024j21583j05947q6429o3127m5127m0970m2838
37315A011568l9624l9036n8718r8050j33639j42112j16559o2760Q650Q4173J49540
37304E63433J93390K08639J94059J57599J13761P3833M1768J9470O700p613m0988
37293A524051r2526j30421j20632o9840k7711l8814r5663j44198j35133o6974
37283F02139K0865R0279J30673J44347J22082M9517o4187j78223k45928k44277
37273D27287j81675r0507j5474N578l5655j12521j83084k14435j91765j16724
37263g08975o127J11083K03116K44942K23614J43840L3459o3582j12247j11846
37253d2723r5403r7104j15773j15039o6968R234O6063Q4066Q8579J02496J07212
$$ plain form
37242 -75360 -1629 14874 -70 3814 52229 137270 247378 384726 549036 716042 840041
37231 840041 880999 835870 746164 666507 619377 584993 534969 461430 367709 250103 107481
37220 107481 -40434 -162267 -238339 -261773 -224038 -118253 42163 219790 367678 442913
37210 442913 420963 319444 205681 159298 218831 370112 578500 813291 1041885 1223044
37200 1223044 1319025 1310989 1207446 1052584 922972 891205 978086 1147479 1351123 1566420
37190 1566420 1786444 1989295 2132314 2174949 2102987 1934144 1702629 1437419 1160981 913716
37180 913716 763572 764191 898299 1081135 1227903 1305331 1316760 1264836 1151845 1005058 875538
37169 875538 803442 790244 806186 822822 842259 897773 1019487 1191892 1346229 1399764 1307238
$$ packed form
37242g5360P3731J6503j4944L884M8415Q5041J10108J37348J64310J67006J23999
37231H40041M0958m5129q9706p9657m7130l4384n0024p3539r3721j17606j42622
37220A07481j47915j21833p6072k3434L7735J05785J60416J77627J47888P5235
37210D42913k1950j01519j13763m6383N9533J51281K08388K34791K28594J81159
37200A223044R5981q036j03543j54862j29612l1767Q6881J69393K03644K15297
37190A566420K20024K02851J43019M2635p1962j68843k31515k65210k76438k47265
37180I13716j50144O19J34108J82836J46768P7428J1429n1924j12991j46787j29520
37169H75538p2096j3198J5942J6636J9437N5514J21714J72405J54337N3535r2526
$$ plain form
37158 1307238 1083896 792161 508146 286525 141445 54650 -60 -39807 -69864 -84413
37148 -84413 -70720 -25315 30475 61505 50072 10095 -29653 -47382 -37680 -19536 -40570 -149811
37136 -149811 -344499 -551992 -684630 -715137 -689476 -669925 -678974 -696828 -693989 -652648 -563437
37125 -563437 -418299 -216450 24338 269081 482777 648832 775562 891416 1031435 1211871
37115 1211871 1402337 1525990 1504027 1311587 993151 629464 297223 53365 -67086 -61446
37105 -61446 28553 128406 173173 152445 116628 133056 231764 393861 584282 779474 962653
37094 962653 1116223 1236225 1339143 1432125 1482684 1439431 1284229 1051447 800473 583790
37084 583790 433638 355007 328105 334930 384811 496120 651320 789529 850348 813927 701334
$$ packed form
37158A307238k23342k91735k84015k21621j45080q6795n4710l9747l0057j4549
37148h4413J3693M5405N5790L1030j1433l9977l9748j7729R702J8144k1034j09241
37136a49811j94688k07493j32638l0507K5661J9551r049j7854K839M1341Q9211
37125e63437J45138K01849K40788K44743K13696J66055J26730J15854J40019J80436
37115A211871J90466J23653k1963j92440l18436l63687l32241k43858j20451N640
37105f1446Q9999R9853M4767k0728l5817J6428R8708J62097J90421J95192J83179
37094I62653J53570J20002J02918R2982N0559m3253j55202k32782k50974k16683
37084E83790j50152p8631k6902O825M9881J11309J55200J38209O0819l6421j12593
$$ plain form
37073 701334 556246 427359 344349 300871 276512 278158 337721 462475 611701 734009 804860
37062 804860 813601 741027 579944 367619 170922 38041 -21822 -17216 47135 165319 311773
37051 311773 432623 461749 362100 162316 -56013 -219906 -314000 -368398 -410791 -440293 -438615
37040 -438615 -391515 -298227 -168231 -13838 150726 300737 400031 423641 382663 314283 244929
37029 244929 174251 94376 7728 -78411 -158405 -222036 -255295 -253936 -225765 -179573 -130099 -115672
37017 -115672 -183637 -340593 -530900 -678044 -738286 -710357 -614428 -477378 -323896 -163901
37007 -163901 7883 196314 400647 622905 856314 1058491 1166467 1159896 1090306 1028576
36997 1028576 1000559 990702 984838 980899 972220 950798 923083 901382 885002 867660 855147 856327
$$ packed form
37073G01334j45088j28887q3010m3478k4359J646N9563J24754J49226J22308P0851
37062H04860Q741p2574j61083k12325j96697j32881n9863M606O4351J18184J46454
37051C11773J20850K9126r9649j99784k18329j63893r4094n4398m2393k9502J678
37040d38615M7100R3288J29996J54393J64564J50011R9294K3610m0978o8380o9354
37029B44929p0678p9875q6648q6139p9994o3631l3259J359K8171M6192M9474J4427
37017a15672o7965j56956j90307j47144o0242K7929R5929J37050J53482J59995
37007a63901J71784J88431K04333K22258K33409K02177J07976o571o9590o1730
36997A028576k8017r857n864l939q679k1422k7715k1701j6380j7342j2513J180
$$ plain form
36985 856327 863065 856285 824854 764202 669040 547829 433845 358028 314438 270585 206011
36974 206011 123667 32313 -60385 -141827 -201576 -241257 -260317 -237797 -148309 6212 197435
36963 197435 398852 595549 770721 904238 988308 1031893 1048940 1050463 1041883 1016187 955487
36952 955487 850843 714070 560952 394812 219510 54519 -80509 -183704 -254506 -272617
36942 -272617 -218739 -110339 7569 108126 203704 324421 488577 687452 885720 1046366
36932 1046366 1171834 1313679 1527056 1820350 2152465 2457824 2663817 2718948 2640285 2517757
36922 2517757 2438816 2416777 2414315 2413859 2426327 2445562 2440714 2396588 2328477 2256881 2197762 2175143
36910 2175143 2208871 2283981 2355746 2384187 2342294 2203851 1963873 1674764 1427848 1287445
$$ packed form
36985H56327O738o780l1431o0652r5162j21211j13984p5817m3590m3853o4574
36974B06011q2344r1354r2698q1442n9749l9681j9060K2520Q9488J54521J91223
36963A97435K01417J96697J75172J33517Q4070M3585J7047J523q580k5696o0700
36952I55487j04644j36773j53118j66140j75302j64991j35028j03195p0802j8111
36942b72617N3878J08400J17908J00557R5578J20717J64156J98875J98268J60646
36932A046366J25468J41845K13377K93294L32115L05359K05993N5131p8663j22528
36922B517757p8941k2039k462m56J2468J9235m848m4126o8111p1596n9119k2619
36910B175143L3728P5110P1765K8441m1893j38443k39978k89109k46916j40403
$$ plain form
36900 1287445 1259748 1319374 1436592 1581213 1732988 1893260 2062374 2210136 2300599 2345196
36890 2345196 2396903 2486999 2597343 2696798 2770360 2804470 2778204 2688814 2569316 2470195 2433082
36879 2433082 2477565 2594773 2757444 2954493 3207383 3531541 3894115 4236003 4523140 4748917
36869 4748917 4905614 4994490 5053367 5130470 5232366 5332965 5427845 5543237 5699385 5904168
36859 5904168 6174791 6523843 6928905 7354920 7799289 8277552 8779278 9281763 9790975
36850 9790975 10319465 10839821 11315175 11766389 12260817 12852423 13581847 14502968 15640973
36841 15640973 16950676 18388618 19998311 21849344 23935984 26238504 28850298 31926545
36833 31926545 35530408 39654246 44374419 49856222 56232921 63636126 72337918 82716526
$$ packed form
36900A287445k7697N9626J17218J44621J51775J60272J69114J47762R0463M4597
36890B345196N1707R0096J10344R9455P3562L4110k6266q9390j19498r9121l7113
36879B433082M4483J17208J62671J97049K52890L24158L62574L41888K87137K25777
36869D748917J56697Q8876N8877P7103J01896J00599R4880J15392J56148K04783
36859E904168K70623L49052M05062M26015M44369M78263N01726N02485N09212
36850I790975N28490N20356M75354M51214M94428N91606P29424R21121J138005
36841A5640973J309703J437942J609693J851033K086640K302520K611794L076247
36833C1926545L603863M123838M720173N481803O376699P403205Q701792J0378608
$$ plain form
36825 82716526 95123921 109983791 127979316 149889317 176204094 206959675 241385337
36818 241385337 276624379 306516115 322952117 320281695 299249709 266508787 230186725
36811 230186725 195840249 165737016 140331530 119432926 102455631 88597546 77189632
36804 77189632 67762220 59853783 53023244 47046243 41890443 37487887 33679761 30354950
36796 30354950 27476530 24973474 22745394 20773709 19103587 17711419 16493450 15378010
36788 15378010 14346138 13350561 12324613 11282107 10316644 9489432 8791166 8209096 7742430
36779 7742430 7341148 6913756 6423470 5921669 5474749 5109586 4831643 4634711 4480301
36770 4480301 4317517 4133072 3942163 3736503 3492290 3225351 2983544 2783841 2609454
$$ packed form
36825H2716526J2407395J4859870J7995525K1910001K6314777L0755581L4425662
36818B41385337L5239042K9891736J6436002k670422k1031986l2740922l6322062
36811B30186725l4346476l0103233k5405486k0898604j6977295j3858085j1407914
36804G7189632r427412p908437o830539n977001n155800m402556l808126l324811
36796C0354950k878420k503056k228080j971685j670122j392168j217969j115440
36788A5378010j031872r95577j025948j042506r65463q27212o98266n82070m66666
36779G742430m01282m27392m90286n01801m46920l65163k77943j96932j54410
36770D480301j62784j84445j90909k05660k44213k66939k41807j99703j74387
$$ plain form
36761 2609454 2467670 2391425 2376346 2372838 2353681 2338737 2339951 2333070 2302901 2271766 2262325 2269619
36749 2269619 2285743 2313292 2337341 2323829 2268842 2215783 2199021 2198040 2171113 2111401 2045955 1994125
36737 1994125 1943567 1854045 1676381 1390020 1040093 723602 521044 441868 433915 429448 381119
36726 381119 279091 152699 49296 1514 14208 76023 171172 284172 408528 548943
36716 548943 701769 840079 936938 997930 1048442 1092590 1111584 1105989 1113267 1170953 1276321
36705 1276321 1388749 1460714 1466898 1419595 1359323 1317863 1289700 1250365 1196457 1149602 1124054
36694 1124054 1108692 1078591 1007611 877367 698835 522168 398162 328278 277646 237118
36684 237118 240110 308037 407659 478270 480450 405968 265168 89321 -66479 -148566 -141255
$$ packed form
36761B609454j41784p6245j5079l508j9157j4944J214o881l0169l1135r441P294
36749B269619J6124K7549K4049j3512n4987n3059j6762r81k6927n9712o5446n1830
36737A994125n0558q9522j77664k86361l49927l16491k02558p9176p953m467m8329
36726C81119j02028j26392j03403m7782J2694O1815R5149J13000J24356J40415
36716E48943J52826J38310R6859O0992N0512M4148J8994n595P278N7686J05368
36705A276321J12428P1965O184m7303o0272m1460k8163l9335n3908m6855k5548
36694A124054j5362l0101p0980j30244j78532j76667j24006o9884n0632m0528
36684B37118K992O7927R9622P0611K180p4482j40800j75847j55800q2087P311
$$ plain form
36673 -141255 -78641 -24687 -35250 -116768 -208314 -214083 -69568 214224 558757 859085 1031301
36662 1031301 1051069 959669 823582 685181 558853 462405 424317 456891 546719 679187
36652 679187 850144 1044047 1223892 1359542 1450112 1501780 1496609 1404183 1223992 1006137
36642 1006137 827825 745981 761457 826212 894498 967252 1073968 1212853 1330732 1371121
36632 1371121 1325345 1225313 1100257 953332 770689 543157 288148 57934 -87757 -132873
36622 -132873 -124348 -130447 -182376 -259130 -318521 -335266 -318701 -302477 -308619 -313336 -257278 -99580
36610 -99580 144381 424310 700794 957624 1180633 1345852 1431123 1427466 1336824 1167902
36600 1167902 937850 672244 398171 135163 -108850 -330991 -518488 -643739 -686239 -662607
$$ packed form
36673a41255O2614N3954j0563q1518r1546n769J44515K83792L44533L00328J72216
36662A031301J9768r1400j36087j38401j26328r6448l8088L2574Q9828J32468
36652F79187J70957J93903J79845J35650R0570N1668n171r2426j80191k17855
36642A006137j78312q1844J5476O4755O8286P2754J06716J38885J17879M0389
36632A371121m5776j00032j25056j46925j82643k27532k55009k30214j45691m5116
36622a32873Q525o099n1929p6754n9391j6745J6565J6224o142m717N6058J57698
36610i9580K43961K79929K76484K56830K23009J65219Q5271l657r0642j68922
36600A167902k30052k65606k74073k63008k44013k22141j87497j25251m2500K3632
$$ plain form
36590 -662607 -622414 -604673 -604659 -589753 -538709 -455942 -357749 -262835 -195484 -179038 -214283 -269684
36578 -269684 -300746 -278125 -195082 -55674 131119 341716 532394 656330 691008 649375
36568 649375 570287 505130 505262 599570 770811 960906 1107898 1174314 1142295 1003950 775543
36557 775543 511165 282135 141959 116425 210036 397222 614459 791960 903881 973806
36547 973806 1031226 1082179 1123887 1162915 1207500 1261024 1334792 1448004 1596646 1734271 1803821
36536 1803821 1786652 1708842 1604402 1487273 1360835 1241662 1162323 1147867 1192141 1261304
36526 1261304 1318938 1338546 1291112 1142362 885184 566595 256028 -16195 -266901 -502246
36516 -502246 -676847 -726509 -628096 -415005 -146461 125633 371785 585495 768241 905869
$$ packed form
36590f62607M0193J7741J4J4906N1044Q2767R8193R4914O7351J6446l5245n5401
36578b69684l1062K2621Q3043J39408J86793K10597J90678J23936L4678m1633
36568F49375p9088o5157J32R4308J71241J90095J46992O6416l2019j38345k28407
36557G75543k64378k29030j40176k5534R3611J87186K17237J77501J11921O9925
36547I73806N7420N0953M1708L9028M4585N3524P3768J13212J48642J37625O9550
36536A803821j7169p7810j04440j17129j26438j19173p9339j4456M4274O9163
36526A261304N7634J9608m7434j48750k57178l18589l10567k72223k50706k35345
36516e02246j74601m9662R8413K13091K68544K72094K46152K13710J82746J37628
$$ plain form
36506 905869 964077 914773 763949 550216 321288 113259 -57778 -191457 -287124 -332969
36496 -332969 -320717 -269320 -215808 -174694 -121280 -27474 94278 193277 223816 183988 118192
36485 118192 79519 76385 55644 -45562 -228393 -428810 -586047 -691573 -765425 -814975 -837113
36474 -837113 -838717 -830324 -812271 -785664 -762432 -744947 -711602 -645846 -564647 -490170 -404658 -267202
36462 -267202 -74562 124794 281703 384752 439894 435708 344908 150885 -134503 -470571
36452 -470571 -801426 -1079581 -1280301 -1389726 -1388801 -1268434 -1061594 -841299 -676330 -593574
36442 -593574 -580275 -606559 -641514 -663523 -668334 -664729 -658571 -643118 -602687 -521088 -393436 -241430
36430 -241430 -111420 -40347 -23221 -28845 -46547 -98290 -201811 -343699 -499556 -661194 -826079
$$ packed form
36506I05869N8208m9304j50824k13733k28928k08029j71037j33679r5667m5845
36496c32969J2252N1397N3512M1114N3414R3806J21752R8999L0539l9828o5796
36485A18192l8673l134k0741j01206j82831k00417j57237j05526p3852m9550k2138
36474h37113j604Q393J8053K6607K3232J7485L3345O5756Q1199P4477Q5512J37456
36462b67202J92640J99356J56909J03049N5142m186r0800j94023k85388l36068
36452d70571l30855k78155k00720j09425R25J20367K06840K20295J64969Q2756
36442e93574J3299k6284l4955k2009m811L605O158J5453M0431Q1599J27652J52006
36430b41430J30010P1073J7126n624j7702n1743j03521j41888j55857j61638j64885
$$ plain form
36419 -826079 -971962 -1063679 -1085685 -1055454 -1004042 -952858 -910322 -881402 -872419 -884801 -905076
36408 -905076 -904429 -854145 -744866 -590073 -412288 -230002 -56667 95335 213623 285915
36398 285915 301486 258505 171105 62557 -51562 -167866 -280461 -370320 -418246 -426100 -416309
36387 -416309 -406715 -389644 -340138 -244748 -118318 9976 123348 224107 316558 395868 460579
36376 460579 525904 610231 708214 786069 804033 737969 585052 365273 122308 -93691 -262001
36365 -262001 -408848 -575652 -764254 -921772 -989028 -963791 -910805 -909751 -998297 -1160432 -1348425
36354 -1348425 -1499379 -1543717 -1430328 -1160206 -787950 -385611 -14379 271580 423429 424738
36344 424738 311478 144303 -38529 -229925 -424622 -600678 -730433 -795440 -790621 -727401
$$ packed form
36419h26079j45883r1717k2006L0231N1412N1184M2536K8920Q983j2382k0275
36408i05076O47N0284J09279J54793J77785J82286J73335J52002J18288P2292
36398B85915J5571m2981q7400j08548j14119j16304j12595q9859m7926p854R791
36387d16309R594J7071M9506R5390J26430J28294J13372J00759R2451P9310O4711
36376D60579O5325Q4327R7983P7855J7964o6064j52917k19779k42965k15999j68310
36365b62001j46847j66804j88602j57518o7256K5237N2986J054q8546j62135j87993
36354a348425j50954m4338J13389K70122L72256M02339L71232K85959J51849J309
36344D24738j13260j67175j82832j91396j94697j76056j29755o5007M819O3220
$$ plain form
36334 -727401 -633524 -536623 -445629 -357998 -282859 -241858 -245115 -279953 -325315 -361730 -362109 -290938
36322 -290938 -129323 102384 356004 590150 794345 986013 1186050 1390079 1560448 1653001
36312 1653001 1655099 1592382 1498193 1385760 1253853 1109422 974398 870659 802381 754286
36302 754286 708829 665928 639676 629779 603743 520034 367284 170019 -40677 -246921 -435687
36291 -435687 -590542 -700672 -766851 -792705 -781132 -743477 -697265 -645779 -572908 -470124 -358884
36280 -358884 -273564 -228062 -208987 -193677 -160930 -88110 44000 231957 435002 584611 621306
36269 621306 540985 411681 330083 345811 430469 527132 619712 738646 904565 1088642 1237240
36258 1237240 1322421 1355032 1353813 1318566 1242155 1139707 1048821 994613 965438 934642 900219
$$ packed form
36334g27401R3877R6901R0994Q7631P5139M1001l257l4838m5362l6415l79P1171
36322b90938J61615K31707K53620K34146K04195J91668K00037K04029J70369R2553
36312A653001K098o2717r4189j12433j31907j44431j35024j03739o8278m8095
36302G54286m5457m2901k6252r897k6036q3709j52750j97265k10696k06244j88766
36291d35687j54855j10130o6179k5854J1573L7655M6212N1486P2871J02784J11240
36280c58884Q5320M5502J9075J5310L2747P2820J32110J87957K03045J49609L6695
36269F21306q0321j29304q1598J5728Q4658R6663R2580J18934J65919J84077J48598
36258A237240Q5181L2611j219l5247p6411j02448r0886n4208k9175l0796l4423
$$ plain form
36247 900219 887935 914616 961200 984820 946665 828670 643300 439873 287107 228549 252479
36236 252479 313451 382748 471915 608247 791141 970150 1065259 1018592 837962 593348
36226 593348 370939 229473 187700 230404 318075 408772 488712 576647 686837 793913 848329
36215 848329 826327 754503 681654 628097 561617 426312 205119 -45358 -235568 -322802 -336404
36204 -336404 -320707 -279604 -198183 -97664 -32996 -34691 -76781 -106367 -88482 -23266 59118
36193 59118 113329 104414 29299 -88925 -222340 -344752 -430323 -471041 -493650 -532496 -580484
36182 -580484 -592932 -550928 -497504 -495464 -568127 -697108 -856529 -1021329 -1151444 -1199682 -1146453
36171 -1146453 -1015700 -851732 -685368 -520483 -345469 -157888 18002 142094 191513 176831
$$ packed form
36247I00219j2284K6681M6584K3620l8155j17995j85370k03427j52766n8558K3930
36236B52479O0972O9297Q9167J36332J82894J79009R5109m6667j80630k44614
36226E93348k22409j41466m1773M2704Q7671R0697P9940Q7935J10190J07076N4416
36215H48329k2002p1824p2849n3557o6480j35305k21193k50477j90210q7234j3602
36204c36404J5697M1103Q1421J00519O4668j695m2090k9586J7885O5216Q2384
36193E9118N4211q915p5115j18224j33415j22412q5571m0718k2609l8846m7988
36182e80484j2448M2004N3424K040p2663j28981j59421j64800j30115m8238N3229
36171a146453J30753J63968J66364J64885J75014J87581J75890J24092M9419j4682
$$ plain form
36161 176831 119701 24657 -113816 -282501 -445221 -571303 -659199 -730052 -804862 -887815 -963635
36150 -963635 -1009444 -1015225 -993647 -965435 -937314 -900496 -846239 -770184 -661707 -506783 -314740
36139 -314740 -134399 -25139 -1975 -13082 19065 128738 279646 407865 486590 539660
36129 539660 594626 641735 651886 622340 582330 551182 507337 406866 223900 -31528 -323107
36118 -323107 -602618 -819419 -931943 -922461 -805241 -619500 -408463 -197116 12817 224015
36108 224015 419533 560420 607812 547732 401656 221885 71521 -9467 -29150 -28323 -33133
36097 -33133 -28470 14846 93577 165515 191010 172830 149960 154111 175741 174186 119466 18340
36085 18340 -103598 -233856 -368472 -476283 -494709 -384482 -182049 22471 162225 238681
$$ packed form
36161A76831n7130r5044j38473j68685j62720j26082q7896p0853p4810q2953p5820
36150i63635m5809n781K1578K8212K8121L6818N4257P6055J08477J54924J92043
36139c14740J80341J09260K3164j1107L2147J09673J50908J28219P8725N3070
36129E39660N4966M7109J0151k9546m0010l1148m3845j00471j82966k55428k91579
36118c23107k79511k16801j12524R482J17220J85741K11037K11347K09933K11198
36108B24015J95518J40887M7392o0080j46076j79771j50364q0988j9683Q27m810
36097c3133M663M3316P8731P1938K5495j8180k2870M151K1630j555n4720j01126
36085A8340j21938j30258j34616j07811j8426J10227K02433K04520J39754P6456
$$ plain form
36075 238681 294607 360073 429327 476049 482064 459031 448777 494810 603704 734123 825916
36064 825916 839200 770508 644938 500227 371425 281271 242113 262699 344529 471690 615250
36053 615250 751339 865199 936249 938323 869668 771155 695272 658612 638897 616859 604203
36042 604203 624855 679898 738663 759759 716887 608558 449355 257751 57807 -111113
36032 -111113 -204694 -209540 -163753 -126877 -127449 -147054 -151150 -123889 -77095 -39970 -37282 -59428
36020 -59428 -53628 33542 196504 370180 496460 572653 624395 655086 646216 592548 507457
36009 507457 397511 260198 111230 -11123 -81576 -113042 -137470 -176142 -238481 -331891 -451086
35998 -451086 -564609 -635460 -660700 -675991 -714418 -772962 -827524 -867073 -894291 -895990 -835865
$$ packed form
36075B38681N5926O5466O9254M6722O015k3033j0254M6033J08894J30419R1793
36064H25916J3284o8692j25570j44711j28802r0154l9158K0586Q1830J27161J43560
36053F15250J36089J13860P1050K074o8655r8513p5883l6660j9715k2038j2656
36042F04203K0652N5043N8765K1096m2872j08329j59203j91604j99944j68920
36032a11113r3581m846M5787L6876n72j9605m096K7261M6794L7125K688k2146
36020e9428N800Q7170J62962J73676J26280P6193N1742L0691q870n3668q5091
36009E07457j09946j37313j48968j22353p0453l1466k4428l8672o2339r3410j19195
35998d51086j13523p0851k5240j5291l8427n8544n4562l9549k7218j699O0125
$$ plain form
35987 -835865 -691113 -489127 -295300 -163011 -98236 -66786 -27623 35920 103849 135957 112578
35976 112578 65302 58769 133894 270984 409211 493915 503664 449928 371324 325314 362293
35965 362293 490122 663608 815298 900539 915715 877793 791922 643761 425438 164697
35955 164697 -80147 -258659 -359992 -407121 -426047 -423580 -388971 -310676 -192911 -59636 57683
35944 57683 135827 162874 135114 68274 13912 43350 196489 451547 755410 1073553 1394461
35933 1394461 1695036 1928656 2055380 2070432 1999199 1877792 1741710 1614855 1494260 1350943
35923 1350943 1156434 909669 638843 383585 173423 8808 -143307 -321888 -527212
35914 -527212 -709780 -813901 -829006 -792451 -751101 -731493 -738662 -762966 -781538 -765030 -693426
$$ packed form
35987h35865J44752K01986J93827J32289O4775L1450L9163O3543O7929L2108k3379
35976A12578m7276o533P5125J37090J38227Q4704R749n3736p8604m6010L6979
35965C62293J27829J73486J51690Q5241J5176l7922q5871j48161k18323k60741
35955A64697k44844j78512j01333m7129j8926K467L4609P8295J17765J33275J17319
35944E7683P8144K7047k7760o6840n4362K9438J53139K55058L03863L18143L20908
35933A394461L00575K33620J26724J5052p1233j21407j36082j26855j20595j43317
35923A350943j94509k46765k70826k55258k10162j64615j52115j78581k05324
35914e27212j82568j04121j5105L6555M1350J9608p169k4304j8572J6508P1604
$$ plain form
35903 -693426 -566264 -399211 -215479 -37856 121570 268263 415779 565216 698147 793341
35893 793341 846276 867605 864887 830717 749319 613396 435517 243782 63148 -102770 -271000
35882 -271000 -457469 -653616 -821382 -907049 -862747 -670634 -365663 -38401 200706 279727
35872 279727 199467 18071 -188234 -350983 -422325 -393781 -307214 -224401 -168136 -100307 29027
35861 29027 213769 382014 452055 392963 238279 55763 -94433 -186221 -227214 -238514 -237114
35850 -237114 -235208 -244421 -269357 -300652 -325537 -344851 -370008 -403474 -432838 -445857 -441040 -420012
35838 -420012 -379533 -317755 -243359 -174476 -130452 -120528 -129898 -119362 -58314 30614 71323 -6996
35826 -6996 -212169 -493859 -796024 -1093944 -1387207 -1672961 -1930090 -2122835 -2219492 -2214393
$$ packed form
35903f93426J27162J67053J83732J77623J59426J46693J47516J49437J32931R5194
35893G93341N2935K1329k718l4170q1398j35923j77879j91735j80634j65918j68230
35882b71000j86469j96147j67766q5667M4302J92113L04971L27262K39107P9021
35872B79727q0260j81396k06305j62749p1342K8544Q6567Q2813N6265O7829J29334
35861B9027J84742J68245P0041n9092j54684j82516j50196r1788m0993j1300J400
35850b37114J906r213k4936l1295k4885j9314k5157l3466k9364j3019M817K1028
35838d20012M0479O1778P4396O8883M4024R924r370J0536O1048Q8928M0709p8319
35826f996k05173k81690l02165k97920k93263k85754k57129j92745r6657N099
$$ plain form
35816 -2214393 -2133501 -2014909 -1882842 -1740052 -1578936 -1394246 -1190100 -984677 -810668 -706889
35806 -706889 -704689 -813585 -1005575 -1208187 -1328654 -1308268 -1163832 -975061 -829361 -771270
35796 -771270 -786885 -822501 -824407 -777065 -708632 -657200 -634767 -625571 -607190 -562483 -483449 -383652
35784 -383652 -302440 -275480 -298872 -339748 -382341 -440003 -513992 -565836 -551796 -472336 -366754
35773 -366754 -264264 -159219 -34160 110156 254381 380268 483394 570229 648923 724619
35763 724619 801712 885544 976127 1060071 1113655 1114986 1050674 915958 720330 493989 275352
35752 275352 85982 -72281 -192263 -251600 -242566 -198865 -171510 -180782 -210450 -250171 -323420
35741 -323420 -461881 -660540 -867451 -1016333 -1068953 -1034796 -958273 -886218 -841487 -820419 -807430
$$ packed form
35816b214393Q0892J18592J32067J42790J61116J84690K04146K05423J74009J03779
35806g06889K200j08896j91990k02612j20467K0386J44436J88771J45700N8091
35796g71270j5615l5616j906M7342O8433N1432K2433R196J8381M4707P9034R9797
35784c83652Q1212K6960k3392m0876m2593n7662p3989n1844J4040P9460J05582
35773c66754J02490J05045J25059J44316J44225J25887J03126Q6835P8694P5696
35763G24619P7093Q3832R0583Q3944N3584J331o4312j34716j95628k26341k18637
35752B75352j89370j58263j19982n9337R034M3701K7355r272k9668l9721p3249
35741c23420j38461j98659k06911j48882n2620L4157P6523P2055M4731K1068J2989
$$ plain form
35730 -807430 -788340 -756180 -713475 -669032 -627512 -584706 -540002 -511610 -530330 -614673 -753733
35719 -753733 -911335 -1043358 -1119647 -1142994 -1147012 -1163664 -1189330 -1189631 -1137262 -1036633 -913922
35708 -913922 -797535 -710563 -664891 -650159 -637330 -606735 -572917 -575408 -641567 -753537 -846004
35697 -846004 -843795 -720399 -526049 -346105 -225169 -141240 -54355 41046 123740 183394 225030
35686 225030 243964 222093 153834 60963 -22507 -72240 -82783 -66351 -42068 -17873 13631
35675 13631 53206 79295 73569 58371 84816 175180 291215 365760 354011 251869 83671
35664 83671 -113163 -298934 -439467 -506536 -477775 -350163 -152727 72276 305348 548738
35654 548738 783489 951276 997511 917775 744579 505280 219887 -67817 -289611 -394614
$$ packed form
35730h07430J9090L2160M2705M4443M1520M2806M4704K8392j8720q4343j39060
35719g53733j57602j32023p6289k3347m018j6652k5666l01N2369J00629J22711
35708i13922J16387Q6972M5672J4732J2829L0595L3818k491o6159j11970r2467
35697h46004K209J23396J94350J79944J20936Q3929Q6885R5401Q2694N9654M1636
35686B25030J8934k1871o8259r2871q3470m9733j0543J6432K4283K4195L1504
35675A3631L9575K6089n726j5198K6445R0364J16035P4545j1749j02142j68198
35664H3671j96834j85771j40533o7069K8761J27612J97436K25003K33072K43390
35654E48738K34751J67787M6235p9736j73196k39299k85393k87704k21794j05003
$$ plain form
35644 -394614 -379017 -272460 -110569 74806 253475 395922 472829 460233 359803 216249
35634 216249 98361 50086 62531 95373 116762 118819 106447 84128 52509 9125 -50967
35623 -50967 -132450 -233008 -335320 -408112 -426740 -401386 -377617 -395747 -449493 -492874 -484437
35612 -484437 -414762 -297768 -156104 -19047 84671 145120 175815 196697 221594 259712 306488
35601 306488 324075 256508 89477 -115334 -268166 -330045 -328180 -302603 -263877 -204419 -124716
35590 -124716 -35244 51283 115513 129199 72099 -48867 -202422 -352826 -475470 -557675 -587056
35579 -587056 -537956 -376830 -96975 247206 553828 733782 759457 660273 488557 296669
35569 296669 125463 -13787 -149515 -324210 -547562 -778402 -957066 -1054490 -1089789 -1102218
$$ packed form
35644c94614J5597J06557J61891J85375J78669J42447P6907j2596j00430j43554
35634B16249j17888m8275J2445L2842K1389K057j2372k2319l1619m3384o0092
35623e0967q1483j00558j02312p2792j8628K5354K3769j8130n3746m3381Q437
35612d84437O9675J16994J41664J37057J03718O0449L0695K0882K4897L8118M6776
35601C06488J7587o7567j67031k04811j52832o1879J865K5577L8726N9458P9703
35590a24716Q9472Q6527O4230J3686n7100j20966j53555j50404j22644q2205k9381
35579e87056M9100J61126K79855L44181L06622J79954K5675r9184j71716j91888
35569B96669j71206j39250j35728j74695k23352k30840j78664r7424l5299j2429
$$ plain form
35559 -1102218 -1106571 -1078664 -990601 -857392 -730955 -636586 -530512 -344070 -70137 212326
35549 212326 402857 455826 397189 293101 214581 209035 276795 373474 448381 482965 491042
35538 491042 495669 519453 584689 697985 831714 937149 980470 956162 870234 732982 574761
35527 574761 446979 389133 401364 458419 540185 637310 738173 828509 901960 958044 991378
35516 991378 994114 965230 902371 786271 594494 340843 85114 -115484 -262441 -408744
35506 -408744 -591919 -785351 -924714 -975389 -958195 -904546 -802319 -606116 -302002 54646
35496 54646 374894 600501 726104 772688 760805 711909 659969 649344 717405 872000 1076656
35485 1076656 1260814 1358420 1344953 1238390 1071492 872502 665141 466143 275087 79136
$$ packed form
35559a102218m353K7907Q8063J33209J26437R4369J06074J86442K73933K82463
35549B12326J90531N2969n8637j04088p8520n546O7760R6679P4907L4584Q077
35538D91042M627K3784O5236J13296J33729J05435M3321k4308q5928j37252j58221
35527E74761j27782n7846J2231N7055Q1766R7125J00863R0336P3451N6084L3334
35516I91378K736k8884o2859j16100j91777k53651k55729k00598j46957j46303
35506d08744j83175j93432j39363n0675J7194N3649J02227J96203L04114L56648
35496E4646L20248K25607J25603M6584j1883m8896n1940j0625O8061J54595K04656
35485A076656J84158R7606j3467j06563j66898j98990k07361j98998j91056j95951
$$ plain form
35475 79136 -124702 -321314 -495026 -640462 -745795 -780181 -717665 -570879 -386653 -209739
35465 -209739 -63532 37301 77704 57829 5292 -45599 -88028 -145340 -233500 -324720 -354903
35454 -354903 -269751 -64131 218605 514942 764417 919409 956728 890353 762497 610244
35444 610244 442992 257384 67475 -89485 -174790 -169682 -82209 54448 193331 300290
35434 300290 376936 448035 519096 554359 507035 369281 184427 11555 -111765 -169958 -149669
35423 -149669 -42415 126557 289543 379253 385592 360042 362367 415574 515636 662976 861431
35412 861431 1092107 1310929 1478104 1578779 1614274 1588767 1510510 1392720 1245168 1076117
35402 1076117 910181 788694 733503 714998 673687 575599 434439 279986 123868 -32035
$$ packed form
35475G9136k03838j96612j73712j45436j05333l4386O2516J46786J84226J76914
35465b09739J46207J00833M0403j9875n2537n0891m2429n7312q8160r1220l0183
35454c54903Q5152K05620K82736K96337K49475J54992L7319o6375j27856j52253
35444F10244j67252j85608j89909j56960q5305N108Q7473J36657J38883J06959
35434C00290P6646P1099P1061L5263m7324j37754j84854j72872j23320n8193K0289
35423a49669J07254J68972J62986Q9710O339k5550K325N3207J00062J47340J98455
35412H61431K30676K18822J67175J00675L5495k5507p8257j17790j47552j69051
35402A076117j65936j21487n5191j8505m1311r8088j41160j54453j56118j55903
$$ plain form
35392 -32035 -166868 -241394 -231576 -151777 -40524 68526 154987 199984 183768 103363 -16274
35381 -16274 -141839 -262622 -390441 -523631 -622327 -635443 -556355 -444934 -388563 -439176 -581149
35370 -581149 -746833 -856347 -854038 -730253 -524899 -309687 -154071 -93656 -120971 -201141
35360 -201141 -295734 -375983 -422254 -421712 -372979 -289796 -189888 -74524 75145 272193 495236
35349 495236 695349 835437 916388 961723 987237 995759 993781 996002 1009518 1023888 1021076 987510
35337 987510 914315 798289 653619 517473 432316 418867 466501 544926 621339 674089 702206
35326 702206 724648 765463 838638 948582 1098394 1285122 1483143 1640407 1700227 1631220
35316 1631220 1441020 1168716 867665 589901 374805 239486 171083 129097 66396 -39026
$$ packed form
35392c2035j34833p4526R818P9799J11253J09050Q6461M4997j6216q0405j19637
35381a6274j25565j20783j27819j33190r8696j3116P9088J11421N6371n0613j41973
35370e81149j65684j09514K309J23785K05354K15212J55616O0415k7315q0170
35360b01141r4593q0249m6271N42M8733Q3183R9908J15364J49669J97048K23043
35349D95236K00113J40088Q0951M5335K5514Q522j978K221J3516J4370k812l3566
35337I87510p3195j16026j44670j36146q5157j3449M7634P8425P6413N2750K8117
35326G02206K2442M0815P3175J09944J49812J86728J98021J57264N9820o9007
35316A631220j90200k72304l01051k77764k15096j35319o8403m1986o2701j05422
$$ plain form
35306 -39026 -166575 -266621 -293715 -233505 -108836 33177 143776 190988 161502 51925
35296 51925 -129626 -348654 -544513 -663645 -696516 -675034 -634431 -586009 -527721 -471625 -454073
35285 -454073 -517864 -679649 -907598 -1133101 -1294075 -1371147 -1381773 -1348984 -1290332 -1233528 -1217930
35274 -1217930 -1260900 -1324924 -1329972 -1206742 -947044 -614467 -308718 -106908 -24299 -24525 -62199
35263 -62199 -109594 -147632 -150339 -92876 27043 182059 328889 430343 473926 477444 475223
35252 475223 495760 552135 646481 768482 885495 948227 918960 794268 602404 390522
35242 390522 214554 118528 105154 135473 171711 212704 275191 354053 424262 477117 529175
35231 529175 589903 639523 647652 601657 510389 391763 265525 152874 78097 70801 157174
$$ packed form
35306c9026j27549j00046k7094O0210J24669J42013J10599M7212k9486j09577
35296E1925j81551k19028j95859j19132l2871K1482M0603M8422N8288N6096J7552
35285d54073o3791j61785k27949k25503j60974p7072j0626L2789N8652N6804J5598
35274a217930m2970o4024n048J23230K59698L32577L05749K01810Q2609k26l7674
35263f2199m7395l8038k707N7463J19919J55016J46830J01454M3583L518k221
35252D75223K0537N6375R4346J22001J17013O2732k9267j24692j91864k11882
35242C90522j75968r6026j3374L0319L6238M0993O2487P8862P0209N2855N2058
35231E29175O0728M9620Q129m5995r1268j18626j26238j12651p4777p296Q6373
$$ plain form
35220 157174 332379 542319 713535 812925 868473 924539 987722 1024399 1001057 917155 805134
35209 805134 705017 630927 555978 439285 275049 104830 -26127 -109884 -159021 -163622 -90714
35198 -90714 72885 296297 526825 722480 861653 940872 975854 993813 1008825 1003171 939640
35187 939640 796110 591103 379143 218759 136483 116898 127012 146110 167039 175875 146730
35176 146730 63039 -62595 -192562 -283805 -308589 -272974 -220276 -200243 -221012 -238618 -205464
35165 -205464 -124789 -49879 -38794 -121623 -299395 -546129 -802286 -985778 -1032294 -932958 -735533
35154 -735533 -515048 -341237 -256652 -266651 -345028 -453753 -560262 -638175 -660778 -607520 -484285
35143 -484285 -333524 -213690 -158308 -152102 -152255 -137711 -134047 -184311 -299547 -447348 -586398
$$ packed form
35220A57174J75205K09940J71216R9390N5548N6066O3183L6677k3342q3902j12021
35209H05134j00117p4090p4949j16693j64236j70219j30957q3757m9137m601P2908
35198i0714J63599K23412K30528J95655J39173P9219L4982J7959J5012n654o3531
35187I39640j43530k05007k11960j60384q2276j9585J0114J9098K0929Q836k9145
35176A46730q3691j25634j29967r1243k4784L5615N2698K0033k0769j7606L3154
35165b05464Q0675P4910J1085q2829j77772k46734k56157j83492m6516R9336J97425
35154g35533K20485J73811Q4585r999p8377j08725j06509p7913k2603N3258J23235
35143d84285J50761J19834N5382O206j53J4544L664n0264j15236j47801j39050
$$ plain form
35132 -586398 -696367 -766846 -772670 -681929 -492560 -249267 -15265 173278 326792 483490
35122 483490 673392 893035 1105592 1263258 1334865 1318740 1233512 1099408 931595 753198
35112 753198 608518 548361 589384 689754 777579 809610 796350 765953 712602 592355 372046
35101 372046 78334 -202894 -378313 -409118 -333583 -230372 -155149 -110617 -73701 -38349 -20588
35090 -20588 -28926 -47490 -53719 -42904 -29226 -28090 -40835 -50433 -28286 46033 160289 265453
35078 265453 307983 277435 225176 232841 356878 597568 912846 1250417 1561255 1794307
35068 1794307 1902347 1867662 1717995 1509506 1293539 1095649 912162 721033 511916 318435
35058 318435 204500 195261 229976 212113 111289 -4251 -38499 50567 239392 472902 688430
$$ packed form
35132e86398j09969p0479n824R0741J89369K43293K34002J88543J53514J56698
35122D83490J89902K19643K12557J57666P1607j6125q5228j34104j67813j78397
35112G53198j44680o0157M1023J00370Q7825L2031j3260l0397n3351j20247k20309
35101C72046k93712k81228j75419l0805P5535J03211P5223M4532L6916L5352J7761
35090b0588q338j8564o229J0815J3678J136j2745r598K2147P4319J14256J05164
35078B65453M2530l0548n2259P665J24037K40690L15278L37571L10838K33052
35068A794307J08040l4685j49667k08489k15967j97890j83487j91129k09117j93481
35058C18435j13935r239L4715j7863j00824j15540l4248Q9066J88825K33510K15528
$$ plain form
35047 688430 831949 886680 887436 890380 929457 1009490 1126697 1273316 1426110 1552467 1633610
35036 1633610 1671591 1674096 1642864 1574193 1458913 1286307 1065059 841625 682162 629161
35026 629161 679412 796370 925901 1002030 965121 796755 535233 248656 -8247 -215040
35016 -215040 -376839 -502931 -592287 -640469 -662467 -697307 -771368 -856686 -883453 -801623 -620456
35005 -620456 -387229 -146562 69601 231485 316272 327287 299272 278354 289178 311049 288606
34994 288606 183305 21150 -124424 -204750 -237268 -266448 -300314 -301294 -228059 -70351 146386
34983 146386 371223 549341 654932 704813 730510 745920 755154 772301 798192 781512 644833
34972 644833 368513 24792 -287733 -521490 -675536 -743548 -706264 -572039 -390500 -214596
$$ packed form
35047F88430J43519N4731P56K944L9077Q0033J17207J46619J52794J26357Q1143
35036A633610L7981K505l1232o8671j15280j72606k21248k23434j59463n3001
35026F29161N0251J16958J29531P6129l6909j68366k61522k86577k56903k06793
35016b15040j61799j26092q9356m8182k1998l4840p4061q5318k6767Q1830J81167
35005f20456K33227K40667K16163J61884Q4787J1015k8015k0918J0824K1871k2443
34994B88606j05301j62155j45574q0326l2518k9180l3866r80P3235J57708K16737
34983A46386K24837J78118J05591M9881K5697J5410R234J7147K5891j6680j36679
34972F44833k76320l43721l12525k33757j54046o8012L7284J34225J81539J75904
$$ plain form
34962 -214596 -68995 34657 72250 20619 -104321 -239790 -320047 -333413 -336027 -405503 -575834
34951 -575834 -814472 -1058941 -1268340 -1436672 -1567274 -1649512 -1662291 -1590947 -1438975 -1232635
34941 -1232635 -1016377 -829883 -676508 -518845 -319063 -87879 112658 219075 218248 152354
34931 152354 80071 35189 14582 -4774 -39499 -82116 -100272 -53575 78818 277447 489233
34920 489233 662413 778839 849858 884307 875268 826848 779641 785350 850159 917582 916811 822011
34908 822011 662780 492514 358663 289496 284487 311864 329323 315949 282101 251146 239710
34897 239710 251612 274898 279775 232092 118621 -43895 -223520 -385330 -490157 -506224 -442313
34886 -442313 -358080 -317956 -333040 -362520 -369768 -357508 -344273 -328526 -291571 -221602 -113695
$$ packed form
34962b14596J45601J03652L7593n1631j24940j35469q0257j3366k614o9476j70331
34951e75834k38638k44469k09399j68332j30602q2238j2779P1344J51972K06340
34941a232635K16258J86494J53375J57663J99782K31184K00537J06417q27o5894
34931A52354p2283m4882k0607j9356l4725m2617j8156M6697J32393J98629K11786
34920D89233J73180J16426P1019L4449r039m8420m7207N709O4809O7423p71r4800
34908H22011j59231j70266j33851o9167n009K7377J7459j3374l3848l0955j1436
34897B39710J1902K3286M877m7683j13471j62516j79625j61810j04827j6067O3911
34886d42313Q4233M0124j5084k9480p248J2260J3235J5747L6955O9969J07907
$$ plain form
34875 -113695 48513 284451 576901 855623 1042402 1117016 1129958 1148714 1201699 1277025
34865 1277025 1357276 1434031 1491927 1502757 1448071 1336528 1187816 1007540 789086 533028
34855 533028 250684 -47438 -349673 -626649 -831767 -928822 -916388 -824253 -695321 -573972
34845 -573972 -496278 -471955 -473250 -453472 -384794 -276491 -154323 -27054 120116 299682 497312
34834 497312 678495 814994 896040 914483 855801 712661 507765 293383 127310 52266
34824 52266 90710 240546 464076 688991 839474 882593 850436 813418 822780 871050 905712
34813 905712 880742 794781 684955 594587 548847 547252 566256 575145 564017 556098 581881 642889
34801 642889 712835 771594 819434 853391 849321 781735 651540 483278 306205 152706 64385
$$ packed form
34875a13695J62208K35938K92450K78722J86779P4614J2942J8756N2985P5326
34865A277025Q0251P6755N7896J0830n4686j11543j48712j80276k18454k56058
34855E33028k82344k98122l02235k76976k05118r7055J2434R2135J28932J21349
34845e73972P7694K4323j295J9778O8678J08303J22168J27269J47170J79566J97630
34834D97312J81183J36499Q1046J8443n8682j43140k04896k14382j66073p5044
34824E2266L8444J49836K23530K24915J50483M3119l2157l7018R362M8270L4662
34813I05712k4970q5961j09826r0368m5740j595J9004Q889j1128p919K5783O1008
34801F42889O9946N8759M7840L3957m070o7586j30195j68262j77073j53499q8321
$$ plain form
34790 64385 73505 169358 295214 388226 420722 403259 357159 291219 202178 92301 -15627
34779 -15627 -82722 -77696 861 124667 255297 361486 423354 432949 399463 349711 311465
34768 311465 288728 257057 192945 111294 66083 105275 226919 385749 538194 669695 781553
34757 781553 870471 929424 954294 938814 876980 786946 721661 731186 810788 900887 939618 902373
34745 902373 793862 628393 431347 240103 80750 -51675 -174282 -280324 -335302 -308519
34735 -308519 -198063 -27015 170368 354649 486012 533867 481660 323867 68823 -248034
34725 -248034 -559595 -788011 -880303 -834038 -699718 -558923 -483172 -492472 -545408 -574043 -534240
34714 -534240 -427367 -283335 -132445 9158 139242 260513 366499 435643 449246 418411
$$ packed form
34790F4385R120R5853J25856R3012L2496j7463m6100o5940q9041j09877j07928
34779a5627o7095N026P8557J23806J30630J06189O1868R595l3486m9752l8246
34768C11465k2737l1671o4112q1651m5211L9192J21644J58830J52445J31501J11858
34757G81553Q8918N8953K4870j5480o1834r0034o5285R525P9602R0099L8731l7245
34745I02373j08511j65469j97046j91244j59353j32425j22607j06042n4978K6783
34735c08519J10456J71048J97383J84281J31363M7855n2207j57793k55044l16857
34725b48034l11561k28416r2292M6265J34320J40795P5751r300n2936k8635L9803
34714e34240J06873J44032J50890J41603J30084J21271J05986O9144J3603l0835
$$ plain form
34704 418411 379361 350779 307103 212214 75151 -49036 -117892 -141617 -155082 -168785 -167480
34693 -167480 -148897 -141453 -180124 -278524 -426961 -602677 -773623 -903700 -969277 -973176 -939369
34682 -939369 -895125 -858351 -834230 -815425 -785853 -729586 -638192 -511095 -355923 -194415 -61253
34671 -61253 18166 55327 95543 177259 295920 416096 518402 622951 759836 924165
34661 924165 1070746 1151664 1150823 1083847 977382 853752 724254 585093 422943 235234
34651 235234 46896 -98889 -169092 -159435 -89410 13519 124495 223785 295582 327418 313371
34640 313371 258639 177242 82916 -14269 -101937 -166277 -207110 -244744 -300693 -376891 -466460
34629 -466460 -578183 -727678 -898905 -1035220 -1084670 -1046411 -962531 -874184 -799317 -745527 -724514
$$ packed form
34704D18411l9050k8582m3676r4889j37063j24187o8856k3725j3465j3703J305
34693a67480J8583P444l8671r8400j48437j75716j70946j30077o5577l899L3807
34682i39369M4244L6774K4121J8805K9572N6267R1394J27097J55172J61508J33162
34671f1253P9419L7161M0216Q1716J18661J20176J02306J04549J36885J64329
34661I24165J46581Q0918q41o6976j06465j23630j29498j39161j62150j87709
34651B35234j88338j45785p0203R657P0025J02929J10976R9290P1797L1836j4047
34640C13371n4732q1397r4326r7185q7668o4340m0833l7634n5949p6198q9569
34629d66460j11723j49495j71227j36315m9450L8259Q3880Q8347P4867N3790K1013
$$ plain form
34618 -724514 -747828 -817404 -924040 -1048776 -1163031 -1234343 -1240460 -1182127 -1083098 -974310 -870849
34607 -870849 -761511 -625743 -463582 -303103 -174993 -87516 -32474 -5963 -9511 -33134 -50973
34596 -50973 -38760 8172 72120 122800 136905 122113 120325 169501 254632 309507 279509 178984
34584 178984 80771 55879 130065 287696 495718 714872 898670 999569 989397 880251
34574 880251 724887 588796 511719 490533 497420 511784 531607 556325 567137 532205 432515
34563 432515 278095 95865 -93380 -277780 -436315 -532861 -540779 -469157 -352763 -215538
34553 -215538 -54174 140300 356076 562671 732316 851277 913746 912102 834339 671803
34543 671803 436826 176352 -44129 -187879 -281405 -390696 -554787 -743407 -879850 -900531
$$ packed form
34618g24514k3314o9576j06636j24736j14255p1312o117N8333R9029J08788J03461
34607h70849J09338J35768J62161J60479J28110Q7477N5042K6511l548k3623j7839
34596e0973J2213M6932O3948N0680J4105j4792j788M9176Q5131N4875k9998j00525
34584A78984r8213k4892P4186J57631K08022K19154J83798J00899j0172j09146
34574H80251j55364j36091p7077k1186O887J4364J9823K4718J0812l4932r9690
34563D32515j54420j82230j89245j84400j58535r6546p918P1622J16394J37225
34553b15538J61364J94474K15776K06595J69645J18961O2469j644p7763j62536
34543F71803k34977k60474k20481j43750r3526j09291j64091j88620j36443k0681
$$ plain form
34533 -900531 -793517 -592914 -350976 -117335 66949 170189 174656 84224 -72180 -247375
34523 -247375 -392450 -475359 -490324 -451207 -374291 -267213 -135730 1006 108730 157498
34513 157498 144023 94030 42749 11191 -4430 -24809 -67331 -128459 -184354 -210128 -198423
34502 -198423 -159011 -103306 -31972 65485 202679 381981 576628 726834 769867 690251 540183
34491 540183 399307 308319 243868 156815 26521 -124998 -260403 -354304 -395988 -382657 -322384
34480 -322384 -238713 -159329 -94295 -28366 61528 179466 298715 375719 380953 322812 241145
34469 241145 171904 116925 52082 -36415 -132088 -206028 -243660 -244601 -203958 -111319 25703 168093
34457 168093 267643 302409 284534 236608 173308 112409 91263 151019 295679 475790 624028
$$ packed form
34533i00531J07014K00603K41938K33641J84284J03240M467r0432j56404j75195
34523b47375j45075q2909j4965L9117P6916J07078J31483J36736J07724M8768
34513A57498j3475m9993n1281l1558j5621k0379m2522o1128n5895k5774J1705
34502a98423L9412N5705P1334R7457J37194J79302J94647J50206M3033p9616j50068
34491E40183j40876r0988o4451q7053j30294j51519j35405r3901m1684J3331O0273
34480c22384Q3671P9384O5034O5929Q9894J17938J19249P7004N234n8141q1667
34469B41145o9241n4979o4843q8497r5673p3940l7632r41M0643R2639J37022J42390
34457A68093R9550L4766j7875m7926o3300o0899k1146N9756J44660J80111J48238
$$ plain form
34446 624028 707613 744311 775607 833435 924251 1024183 1083322 1052399 923673 745525 588987
34435 588987 499092 476833 493746 510796 492624 426564 336171 266024 247167 283050 367453
34424 367453 498082 659708 805428 876537 848563 750856 637902 546271 478338 414903 333633
34413 333633 222107 88887 -31954 -95798 -77875 7701 119235 215477 272146 278588 229650
34402 229650 126395 -15520 -159099 -252110 -254265 -172879 -68694 -8723 -4220 -3047 50091
34391 50091 152358 245360 268670 203673 76601 -65089 -181594 -261341 -319727 -376400 -437984
34380 -437984 -505797 -586660 -678540 -750648 -758536 -683909 -546682 -377285 -195500 -22168 110951
34369 110951 184347 218126 259959 343269 462163 583182 675002 731550 775480 838246 930260
$$ packed form
34446F24028Q3585L6698L1296N7828R0816R9932N9139l0923j28726j78148j56538
34435E88987q9895k2259J6913J7050j8172o6060r0393p0147j8857L5883Q4403
34424C67453J30629J61626J45720P1109k7974r7707j12954r1631o7933o3435q1270
34413C33633j11526j33220j20841o3844J7923Q5576J11534R6242N6669O442m8938
34402B29650j03255j41915j43579r3011k155Q1386J04185N9971M503J173N3138
34391E0091J02267R3002K3310o4997j27072j41690j16505p9747n8386n6673o1584
34380d37984o7813q0863r1880p2108p888P4627J37227J69397J81785J73332J33119
34369A10951P3396L3779M1833Q3310J18894J21019R1820N6548M3930O2766R2014
$$ plain form
34358 930260 1029953 1103435 1130334 1107968 1039574 929866 791491 647484 523357 436012 387277
34347 387277 366787 363992 376056 397589 405857 371410 288517 180515 66499 -61425 -212973
34336 -212973 -365881 -478703 -529979 -521926 -449664 -297609 -79395 139358 279741 310790
34326 310790 267454 214073 194301 206913 217520 189678 105449 -39378 -245325 -499930 -764499
34315 -764499 -989353 -1145203 -1224922 -1216453 -1101715 -897075 -672764 -505353 -414477 -362098
34305 -362098 -307633 -245767 -194291 -167550 -169651 -200208 -256485 -332550 -417031 -487363 -511311 -468674
34293 -468674 -376336 -282234 -226724 -211202 -204715 -176610 -124451 -78689 -80569 -144445 -235952 -294288
34281 -294288 -282025 -209620 -111372 -10257 84282 155054 174225 128708 40729 -44182 -91165
$$ packed form
34358I30260R9693P3482K6899k2366o8394j09708j38375j44007j24127q7345m8735
34347C87277k0490k795J2064K1533Q268l4447q2893j08002j14016j27924j51548
34336b12973j52908j12822n1276Q053P2262J52055K18214K18753J40383L1049
34326C10790m3336n3381j9772J2612J0607k7842q4229j44827k05947k54605k64569
34315g64499k24854j55850p9719Q469J14738K04640K24311J67411R0876N2379
34305c62098N4465O1866N1476K6741k101l0557n6277p6065q4481p0332k3948M2637
34293d68674R2338R4102N5510J5522O487K8105N2159M5762j880o3876r1507n8336
34281b94288J2263P2405R8248J01115R4539P0772J9171m5517q7979q4911m6983
$$ plain form
34270 -91165 -101589 -111332 -164069 -277694 -429061 -570972 -667130 -713083 -728735 -740050 -771166
34259 -771166 -841054 -947380 -1048246 -1076761 -993343 -825740 -648015 -519341 -450988 -428105
34249 -428105 -441159 -482714 -528905 -547557 -524768 -466576 -372928 -229771 -38307 160869 308117
34238 308117 365784 331393 220841 58157 -118651 -264457 -356677 -413178 -470484 -547031 -634851
34227 -634851 -720416 -797414 -855668 -872004 -824760 -714404 -562581 -393816 -224459 -64074
34217 -64074 84766 228530 372359 503565 596771 642887 662149 675797 672559 622942 532053
34206 532053 463930 498973 663520 900311 1105692 1201615 1187791 1134705 1119642 1156608 1184505
34195 1184505 1126780 963632 746983 552797 425885 363397 333101 298958 240246 161964
$$ packed form
34270i1165j0424r743n2737j13625j51367j41911r6158m5953j5652j1315l1116
34259g71166o9888j06326j00866k8515Q3418J67603J77725J28674O8353K2883
34249d28105j3054m1555m6191j8652K2789N8192R3648J43157J91464J99176J47248
34238C08117N7667l4391j10552j62684j76808j45806r2220n6501n7306p6547q7820
34227f34851q5565p6998n8254j6336M7244J10356J51823J68765J69357J60385
34217f4074J48840J43764J43829J31206R3206M6116J9262J3648l238m9617r0889
34206E32053o8123L5043J64547K36791K05381R5923j3824n3086j5063L6966K7897
34195A184505n7725j63148k16649j94186j26912o2488l0296l4143n8712p8282
$$ plain form
34185 161964 89606 46307 31932 28004 22324 19960 24874 18445 -30910 -132561 -253719 -341278
34173 -341278 -367339 -356709 -371140 -460287 -616452 -771560 -843585 -794767 -651597 -476381 -326814
34162 -326814 -237663 -220514 -264365 -341364 -427676 -521496 -629614 -731582 -766362 -664957 -400924
34151 -400924 -15345 397630 730016 904472 905688 781211 609085 454456 343952 267481
34141 267481 196840 106748 -10693 -142766 -263834 -347989 -380898 -368579 -339632 -334741 -384352
34130 -384352 -488671 -616786 -727666 -797202 -829070 -840162 -835511 -799963 -716261 -588496 -444198
34119 -444198 -314883 -216396 -142834 -73005 12245 107013 173789 172834 105294 19539 -32447 -40798
34107 -40798 -38016 -65084 -146582 -288828 -483538 -709017 -937448 -1145303 -1312403 -1413099
$$ packed form
34185A61964p2358m3299j4375l928n680k364M914o429m9355j01651j21158q7559
34173c41278k6061J0630j4431q9147j56165j55108p2025M8818J43170J75216J49567
34162c26814Q9151J7149m3851p6999q6312r3820j08118j01968l4780J01405K64033
34151d00924L85579M12975L32386J74456J216j24477j72126j54629j10504p6471
34141B67481p0641r0092j17441j32073j21068q4155l2909J2319K8947M891m9611
34130c84352j04319j28115j10880o9536l1868j1092M651L5548Q3702J27765J44298
34119d44198J29315R8487P3562O9829Q5250R4768O6776r55o7540q5755n1986q351
34107d0798K782k7068q1498j42246j94710k25479k28431k07855j67100j00696
$$ plain form
34097 -1413099 -1420717 -1328568 -1163391 -974110 -808024 -694720 -641140 -632475 -640283 -639209 -621023
34086 -621023 -592406 -559720 -518665 -458853 -374301 -265125 -129804 38602 244066 476118
34076 476118 709465 914791 1069024 1159270 1184110 1153551 1085189 1000821 928385 898700 923486
34065 923486 971595 981591 912802 782355 645580 546166 494504 485487 515267 571400 618885
34054 618885 613414 537917 428303 357797 382083 488540 602607 652682 626358 557064 466515
34043 466515 341253 166294 -41629 -248026 -433520 -596063 -728341 -813215 -845493 -843772
34033 -843772 -829519 -798143 -720968 -580762 -401598 -236264 -122461 -58285 -24500 -19566 -57430
34022 -57430 -134731 -220932 -289793 -346856 -413638 -493334 -565217 -609089 -624084 -625481 -633018 -660392
$$ packed form
34097a413099p618R2149J65177J89281J66086J13304N3580Q665p808J074J8186
34086f21023K8617L2686M1055N9812Q4552J09176J35321J68406K05464K32052
34076D76118K33347K05326J54233R0246K4840l0559o8362q4368p2436k9685K4786
34065I23486M8109R996o8789j30447j36775r9414n1662r017K9780N6133M7485
34054F18885n471p5497j09614p0506K4286J06457J14067N0075k6324o9294r0549
34043D66515j25262j74959k07923k06397j85494j62543j32278q4874l2278J721
34033h43772J4253L1376P7175J40206J79164J65334J13803O4176L3785M934l7864
34022e7430p7301q6201o8861n7063o6782p9696p1883m3872j4995j397p537k7374
$$ plain form
34010 -660392 -704345 -741623 -746305 -715137 -670377 -634710 -609790 -584768 -560212 -552854 -572814 -601318
33998 -601318 -597475 -528227 -390462 -209433 -28702 93897 99245 -34615 -255751 -454236
33988 -454236 -532863 -469098 -312859 -135468 15685 130138 224295 319269 413790 472909 452035
33977 452035 340522 181754 47757 -8669 16658 88682 168088 239977 314417 407320 526534
33966 526534 671217 831360 983316 1095652 1148101 1143248 1100564 1047899 1016561 1022408 1036564
33955 1036564 989293 825289 555223 243022 -48671 -285884 -450705 -534486 -551902 -539250
33945 -539250 -522286 -491258 -412995 -263531 -54068 159805 296098 295417 163434 -42698 -266960
33934 -266960 -474734 -625268 -663971 -569063 -386185 -188688 -12106 151507 308541 445407
$$ packed form
34010f60392m3953l7278m682L1168M4760L5667K4920K5022K4556P358j9960k8504
33998f01318L843O9248J37765J81029J80731J22599N348j33860k21136j98485
33988d54236p8627O3765J56239J77391J51153J14453R4157R4974R4521N9119k0874
33977D52035j11513j58768j33997n6426K5327P2024P9406P1889P4440R2903J19214
33966E26534J44683J60143J51956J12336N2449m853m2684n2665l1338N847J4156
33955A036564m7271j64004k70066l12201k91693k37213j64821q3781j7416J2652
33945e39250J6964L1028P8263J49464K09463K13873J36293o81j31983k06132k24262
33934b66960k07774j50534l8703R4908J82878J97497J76582J63613J57034J36866
$$ plain form
33924 445407 553098 637137 691641 687649 606372 474554 353425 295660 316151 393130 486800
33913 486800 563200 613083 651446 696663 749943 792061 791439 714188 540663 287724 14446
33902 14446 -205746 -327089 -350271 -307541 -236551 -163740 -97719 -29414 55178 151275 222925
33891 222925 221737 122733 -59088 -284979 -516585 -722645 -876340 -963464 -994939 -1000025 -1001203
33880 -1001203 -998694 -978189 -925822 -835930 -716099 -589954 -485577 -414062 -365684 -329594 -302806
33869 -302806 -268590 -181420 629 263797 532934 722855 789264 736561 600569 435331
33859 435331 297068 213756 165402 107067 18306 -74252 -125740 -120149 -86180 -68891 -87126
33848 -87126 -115443 -103918 -17363 137776 317811 469822 557676 567387 498867 366313 211239
$$ packed form
33924D45407J07691Q4039N4504l992q1277j31818j21129n7765K0491P6979R3670
33913D86800P6400M9883L8363M5217N3280M2118o22p7251j73525k52939k73278
33902A4446k20192j21343k3182M2730P0990P2811O6021O8305Q4592R6097P1650
33891B22925j188r9004j81821k25891k31606k06060j53695q7124l1475n086j178
33880a001203K509K0505N2367Q9892J19831J26145J04377P1515M8378L6090K6788
33869c02806L4216Q7170J82049K63168K69137J89921O6409n2703j35992j65238
33859D35331j38263q3312m8354n8335q8761r2558n1488N591L3969J7289j8235
33848h7126k8317J1525Q6555J55139J80035J52011Q7854R711o8520j32554j55074
$$ plain form
33837 211239 101544 95248 194857 345251 486021 604494 733523 902190 1094276 1249306
33827 1249306 1295606 1187659 928625 568514 180096 -169773 -435473 -595327 -652173 -631186
33817 -631186 -569629 -505667 -474944 -504635 -592906 -691970 -727105 -648025 -467838 -255508 -92447
33806 -92447 -27149 -53092 -119921 -171105 -180194 -156273 -119976 -78328 -17314 88904 253976
33795 253976 447955 593283 618885 533626 430829 402267 455274 527436 569257 587456 611385
33784 611385 647720 681013 697378 687745 638774 542301 413945 286507 180404 89440 -3885
33773 -3885 -112361 -247937 -425406 -644288 -868876 -1040232 -1112987 -1076936 -949084 -761660
33763 -761660 -562325 -407287 -333358 -335382 -380687 -448142 -550476 -721266 -981371 -1306990
$$ packed form
33837B11239j09695o296R9609J50394J40770J18473J29029J68667J92086J55030
33827A249306M6300j07947k59034l60111l88418l49869k65700j59854n6846K0987
33817f31186O1557O3962L0723k9691q8271r9064l5135P9080J80187K12330J63061
33806i2447O5298k5943o6829n1184r089K3921L6297M1648O1014J06218J65072
33795B53976J93979J45328K5602q5259j02797k8562N3007P2162M1821J8199K3929
33784F11385L6335L3293J6365r633m8971r6473j28356j27438j06103r0964r3325
33773c885j08476j35576j77469k18882k24588j71356p2755L6051J27852J87424
33763g61660J99335J55038P3929k024m5305o7455j02334j70790k60105l25619
$$ plain form
33753 -1306990 -1620217 -1821431 -1852841 -1737072 -1546665 -1339092 -1133056 -938871 -780446 -672491
33743 -672491 -596614 -522897 -449413 -403576 -406600 -449795 -504109 -539594 -534136 -476518 -371673 -244335
33731 -244335 -135300 -86873 -118462 -210261 -321462 -433973 -567130 -732907 -883303 -924798
33721 -924798 -793085 -504752 -137497 221907 506155 672597 713393 665847 594285 545945
$$ packed form
33753a306990l13227k01214l1410J15769J90407K07573K06036J94185J58425J07955
33743f72491P5877P3717P3484M5837l024m3195n4314l5485N458N7618J04845J27338
33731b44335J09035M8427l1589r1799j11201j12511j33157j65777j50396m1495
33721i24798J31713K88333L67255L59404K84248J66442M0796m7546p1562m8340
$$ [...]
##END NTUPLES=NMR SPECTRUM
##END=
