##TITLE=31Pdec_AEDM2907
 CDCl3, 24 sc
 29.7.2019
##JCAMPDX= 6.0         $$ Bruker NMR JCAMP-DX V2.0
##DATA TYPE= NMR SPECTRUM
##DATA CLASS= NTUPLES
##ORIGIN= UXNMR, Bruker Analytische Messtechnik GmbH
##OWNER= root
$$ XWIN-NMR		Version 3.5
$$ Mon Jul 29 16:00:39 2019 Russian Standard Time (UT+4h)  she@DPX200
##.OBSERVE FREQUENCY= 81.013821
##.OBSERVE NUCLEUS= ^31P
##.ACQUISITION MODE= SIMULTANEOUS
##.ACQUISITION SCHEME= undefined
##.AVERAGES= 24
##.DIGITISER RES= 17
##SPECTROMETER/DATA SYSTEM= spect
##.PULSE SEQUENCE= zgpg30
##.SOLVENT NAME= CDCl3
##.SHIFT REFERENCE= (INTERNAL, CDCl3, 0, 182.463)
##AUDIT TRAIL= $$ (NUMBER, WHEN, WHO, WHERE, WHAT)
$$ ##TITLE= Audit trail, XWIN-NMR		Version 3.5
$$ ##JCAMPDX= 5.01
$$ ##ORIGIN= Bruker BioSpin GmbH
$$ ##OWNER= she
$$ F:/spectra/data/she/nmr/P31/1/pdata/1/auditp.txt
$$ ##AUDIT TRAIL=  $$ (NUMBER, WHEN, WHO, WHERE, WHAT)
(   1,<2019-07-29 15:59:53.28 +0400>,<she>,<DPX200>,
      <created by zg, POWCHK disabled, PULCHK disabled
       configuration hash MD5:
       00 E9 B6 7A A2 85 ED C7 34 08 36 98 17 FE 4E 26
       data hash MD5: 32K
       2D 6C EE 47 45 79 96 E4 AA B4 D6 31 6D BA AF 0E>)
(   2,<2019-07-29 15:59:55.81 +0400>,<she>,<DPX200>,
      <Start of raw data processing
       efp BC_mod = 2 LB = 1 FT_mod = 6 PKNL = 1 PHC0 = -405.0331 PHC1 = 130.4 SI = 64K 
       data hash MD5: 64K
       EA 1A B4 3B 66 69 51 F7 2B 34 00 DD D7 7D 43 2A>)
(   3,<2019-07-29 16:00:08.21 +0400>,<she>,<DPX200>,
      <pk PHC0 = -1.863973 PHC1 = 0 
       data hash MD5: 64K
       2F 72 7C D1 0E 3C C0 16 0B 44 C1 BB 5A 4D 74 BC>)
$$ ##END=
$$ 
$$ hash MD5
$$ 69 53 1F D8 3D 1D AA 1B FB 33 A6 3A E4 63 75 20
##$RELAX= 
##$RELAX= 
##$RELAX= 
##$RELAX= 
##$RELAX= 
##$RELAX= 
##$RELAX= 
##$RELAX= 
$$ Bruker specific parameters
$$ --------------------------
##$DU= <F:/spectra>
##$EXPNO= 1
##$NAME= <P31>
##$PROCNO= 1
##$TYPE= <nmr>
##$USER= <she>
##$AMP= (0..31)
100 100 100 100 100 100 100 100 100 100 100 100 100 100 100 100 100 100 
100 100 100 100 100 100 100 100 100 100 100 100 100 100 
##$AQSEQ= 0
##$AQ_mod= 1
##$AUNM= <au_zg>
##$AUTOPOS= <>
##$BF1= 81.014009
##$BF2= 200.13
##$BF3= 200.13
##$BF4= 200.13
##$BF5= 200.13
##$BF6= 200.13
##$BF7= 200.13
##$BF8= 200.13
##$BYTORDA= 1
##$CFDGTYP= 0
##$CFRGTYP= 5
##$CHEMSTR= <none>
##$CNST= (0..31)
1 1 145 1 1 1 1 1 1 1 1 1 1 1 1 1 1 1 1 1 1 1 1 1 1 1 1 1 1 1 1 1 
##$CPDPRG= <waltz16>
##$CPDPRG1= <>
##$CPDPRG2= <waltz16>
##$CPDPRG3= <>
##$CPDPRG4= <mlev>
##$CPDPRG5= <mlev>
##$CPDPRG6= <mlev>
##$CPDPRG7= <mlev>
##$CPDPRG8= <mlev>
##$CPDPRGB= <>
##$CPDPRGT= <>
##$D= (0..31)
0 1 0 0 0 0 0 0 0 0 0 0.03 2e-05 3e-06 0 0 0 0 0 0 0 0 0 0 0 0 0 0 0 0 
0 0 
##$DATE= 1564401592
##$DBL= (0..7)
120 120 120 11 120 120 24 19 
##$DBP= (0..7)
150 150 150 150 150 150 150 150 
##$DBP07= 0
##$DBPNAM0= <>
##$DBPNAM1= <>
##$DBPNAM2= <>
##$DBPNAM3= <>
##$DBPNAM4= <>
##$DBPNAM5= <>
##$DBPNAM6= <>
##$DBPNAM7= <>
##$DBPOAL= (0..7)
0.5 0.5 0.5 0.5 0.5 0.5 0.5 0.5 
##$DBPOFFS= (0..7)
0 0 0 0 0 0 0 0 
$$ [...]
##$SUBNAM2= <"">
##$SUBNAM3= <"">
##$SUBNAM4= <"">
##$SUBNAM5= <"">
##$SUBNAM6= <"">
##$SUBNAM7= <"">
##$SUBNAM8= <"">
##$SUBNAM9= <"">
##$SW= 369.568048894756
##$SWIBOX= (0..15)
0 1 3 0 0 0 0 0 0 0 0 0 0 0 0 0 
##$SW_h= 29940.119760479
##$TD= 32768
##$TD0= 1
##$TE= 0
##$TE2= 300
##$TE3= 300
##$TEG= 300
##$TL= (0..7)
0 120 53 12 22 120 120 120 
##$TP= (0..7)
150 150 150 150 150 150 150 150 
##$TP07= 0
##$TPNAME0= <>
##$TPNAME1= <>
##$TPNAME2= <>
##$TPNAME3= <>
##$TPNAME4= <>
##$TPNAME5= <>
##$TPNAME6= <>
##$TPNAME7= <>
##$TPOAL= (0..7)
0.5 0.5 0.5 0.5 0.5 0.5 0.5 0.5 
##$TPOFFS= (0..7)
0 0 0 0 0 0 0 0 
##$TUNHIN= 0
##$TUNHOUT= 0
##$TUNXOUT= 0
##$USERA1= <user>
##$USERA2= <user>
##$USERA3= <user>
##$USERA4= <user>
##$USERA5= <user>
##$V9= 5
##$VALIST= <valist>
##$VCLIST= <CCCCCCCCCCCCCCC>
##$VD= 0
##$VDLIST= <DDDDDDDDDDDDDDD>
##$VPLIST= <PPPPPPPPPPPPPPP>
##$VTLIST= <TTTTTTTTTTTTTTT>
##$WBST= 1024
##$WBSW= 4
##$XGAIN= (0..3)
0 0 0 0 
##$XL= 0
##$YL= 0
##$YMAX_a= 78505
##$YMIN_a= -80404
##$ZGOPTNS= <>
##$ZL1= 120
##$ZL2= 120
##$ZL3= 120
##$ZL4= 120
##$ABSF1= 0
##$ABSF2= 0
##$ABSG= 0
##$ABSL= 0
##$ALPHA= 0
##$AQORDER= 0
##$ASSFAC= 0
##$ASSFACI= 0
##$ASSFACX= 0
##$ASSWID= 0
##$AUNMP= <proc_1d>
##$AZFE= 0.1
##$AZFW= 0.5
##$BCFW= 0
##$BC_mod= 2
##$BYTORDP= 0
##$COROFFS= 0
##$CY= -3
##$DATMOD= 1
##$DC= 0
##$DFILT= <>
##$DTYPP= 0
##$F1P= 0
##$F2P= 0
##$FCOR= 1
##$FTSIZE= 65536
##$FT_mod= 6
##$GAMMA= 0
##$GB= 0
##$INTBC= 1
##$INTSCL= 5.30512e-09
##$ISEN= 30
##$LB= 1
##$LEV0= 0
##$LPBIN= 0
##$MAXI= 10000
##$MC2= 0
##$MEAN= 0
##$ME_mod= 0
##$MI= 50
##$NCOEF= 0
##$NC_proc= -3
##$NLEV= 6
##$NOISF1= 182.463
##$NOISF2= 159.3651
##$NSP= 0
##$NTH_PI= 0
##$NZP= 0
##$OFFSET= 182.463
##$PC= 4
##$PHC0= -406.8971
##$PHC1= 130.4
##$PH_mod= 1
##$PKNL= yes
##$PPARMOD= 0
##$PSCAL= 0
##$PSIGN= 0
##$REVERSE= no
##$SF= 81.0140089999434
##$SI= 65536
##$SIGF1= 159.3651
##$SIGF2= -187.1042
##$SINO= 113.3802
##$SIOLD= 16384
##$SREGLST= <1H.CDCl3>
##$SSB= 0
##$STSI= 65536
##$STSR= 0
##$SW_p= 29940.119760479
##$SYMM= 0
##$S_DEV= 0
##$TDeff= 32768
##$TDoff= 0
##$TI= <>
##$TILT= no
##$TM1= 0
##$TM2= 0
##$TOPLEV= 0
##$USERP1= <user>
##$USERP2= <user>
##$USERP3= <user>
##$USERP4= <user>
##$USERP5= <user>
##$WDW= 1
##$XDIM= 65536
##$YMAX_p= 507178179
##$YMIN_p= -3827565
$$ End of Bruker specific parameters
$$ ---------------------------------
##NTUPLES= NMR SPECTRUM
##VAR_NAME=  FREQUENCY,     SPECTRUM/REAL,   SPECTRUM/IMAG
##SYMBOL=    X,             R,               I
##VAR_TYPE=  INDEPENDENT,   DEPENDENT,       DEPENDENT
##VAR_FORM=  AFFN,          ASDF,            ASDF
##VAR_DIM=   65536,         65536,           65536
##UNITS=     HZ,            ARBITRARY UNITS, ARBITRARY UNITS
##FACTOR=    0.456856943014862, 1,           1
##FIRST=     14782.0589164792, 0,            0
##LAST=      -15158.0608439998, 0,           0
##MIN=       -15158.0608439998, -3827565,    0
##MAX=       14782.0589164792, 507178179,    0
$$ Real data points
##PAGE= N=1
##DATA TABLE= (X++(R..R)), XYDATA
$$ [...]
41516A6493r3757J49391K19661R6954k6857o5128q9444j46974j96997j98144j32921
41505d67723K1427K30163L41888K23734l8971j94071j09692P2852J17970l1578
41495A65999k14781k52940j29971K9414J06489P4296k9140j41352j79893q1484
41485f53363J14734K73845L04810K45712J64736N2596j04637k24186k23704j70143
41475b19600j89376k52697k08026k6015J41078J74450J20226P0461M7976M6920
41465b94603N6273J4229j15559k01452o2691K20718L29853J35252j09302j36137
41455a63419j6353L4122P70p890k3160j31898k32754j50876N6010J60572J04233
41444c70643L1690J2198k5096q2184o8970m175M922O23J27699L12248K85960K5953
$$ y = [16493, -77264, 72127, 291788, 388742, 361885, 296757, 207313, 60339, -136658, -334802, -467723, -446296, -216133, 125755, 349489, 310518, 116447, 6755, 79607, 197577, 165999, -48782, -301722, -431693, -402279, -295790, -221494, -250634, -391986, -571879, -653363, -538629, -264784, 40026, 285738, 450474, 503070, 398433, 174247, -49457, -219600, -408976, -661673, -869699, -895714, -754636, -580186, -459960, -389499, -341523, -294603, -238330, -224101, -339660, -541112, -603803, -383085, -53232, 82020, -27282, -163419, -179772, -145650, -144880, -152770, -175930, -307828, -540582, -691458, -635448, -474876, -370643, -338953, -326755, -351851, -434035, -503005, -507180, -502258, -501635, -373936, -61688, 224272, 250225]
41432B50225j30456K7763K52936K04457p2359k71706k63367j55521m3156N7856
41422a43328R6642L0259n8808o5649k6954j9392J3188J31869K00092O2696j35045
41411H5570j01003J34990K18463K719k23424j80565P696P8407O0800J61284L40691
41400E85628L15955p361l51535m01318j68001P4911J25363K6598n5236m3672j1083
41389I0249m4964j07657q6875K9118J20202J10057P1952Q5112Q1999l8825k09534
41378A00834k53308j35057m756L0097L2823Q3884J28765P4320n0480j33834j31214
41367b57926q4994k9006L7703R7922J17902J02810Q7906P2222J6366q5993j79516
41356a04604k01364j37637k7726O5861J03553J01388R2734N2156p1462k08948
$$ y = [250225, 119769, 147532, 400468, 604925, 532566, 260860, -2507, -158028, -201184, -143328, -46686, -16427, -75235, -140884, -167838, -187230, -174042, -42173, 157919, 220615, 85570, -15433, 119557, 338020, 340739, 117315, -63250, -55554, 22853, 83653, 244937, 585628, 901583, 894222, 542687, 141369, -26632, 48279, 173642, 200240, 145004, 101332, 90249, 45285, -62372, -149247, -120129, 73, 110130, 182082, 267194, 349193, 310368, 100834, -152474, -287531, -292287, -262190, -229367, -145483, -16718, 57602, 7122, -126712, -257926, -342920, -371926, -334223, -236301, -118399, -15589, 72317, 144539, 160905, 74912, -104604, -305968, -443605, -471331, -405470, -301917, -200529, -107795, -55639, -127101, -336049]
41346c36049j67553J08398L56398K59361j18038l53446j88143J53556K78908J12706
41336A06098q9951j18468o974J10465J65120J40253L0782j11942j72257p8813
41326b5687R8245J92708R3279j33231k71220j66741O8626J51095k0675k12725
41316b26326j65612N4424J83490J49295R9056P4140n5940k73885l19768p6179
41306e57305J90525J89407J6745m3913J6981j4943j40244j10060J28280K78575
41296d5952J30533j17873j73818q3223r8157k28147k10245O8922L66855L92933
41286A828J61198p8445j58715j18855n8596j70P6350J44288J43605O8212p679
41275A73021j0149M5537P3089K1879o3966j09197r8435o4000p120R4619J86895
$$ y = [-336049, -503602, -395204, -38806, 220555, 102517, -250929, -439072, -285516, -6608, 106098, 16147, -102321, -109295, 1170, 166290, 306543, 337325, 225383, 53126, -25687, 72558, 265266, 358545, 225314, -45906, -212647, -144021, 7074, -13601, -226326, -391938, -337514, -154024, -4729, 94327, 168467, 112527, -161358, -481126, -557305, -366780, -177373, -160628, -204541, -187560, -202503, -342747, -452807, -324527, -45952, 84581, -33292, -207110, -290333, -388490, -616637, -826882, -757960, -391105, 1828, 163026, 84581, -74134, -192989, -251585, -251755, -175405, -31117, 112488, 180700, 173021, 162872, 208409, 281498, 303377, 239411, 130214, 31779, -32221, -39341, 55278, 242173]
41264B42173J38172p7699k57217j59042J68407L88915K81770K2395o9709K6803
41254G04968L8097j72152l90022l57769j18653Q5758J40682J13647O3086k0491
41244H7151j00166r4898k0286J5537j4862k4397J6056J6134o4020j21209o9484
41233c74444K9203Q4458J07312J18805N7936q0389j33085K5295K43095K54790
41223C32976M3016j59335k07398j73803j33232m7062P7107J25592P1860L6569
41213c3710N5300l779j55013j59489J07817L55834K39681j00428k04660L6761
41203A38314K35955R4920j91847k81287j60274n8089o1031o0453j298L7602mo6182
41191c73674q9412l7487Q3166K06994K22837R8915l6362k9648J01965J92541J29126
$$ y = [242173, 380345, 302646, 45429, -113613, 54794, 443709, 725479, 747874, 678165, 704968, 743065, 570913, 180891, -176878, -295531, -209773, -69091, 44556, 107642, 87151, -13015, -107913, -128199, -112662, -127524, -151921, -135865, -119731, -183751, -304960, -374444, -345241, -260783, -153471, -34666, 23270, -57119, -190204, -164909, 78186, 332976, 375992, 216657, 9259, -164544, -297776, -344838, -267731, -142139, -70279, -33710, 21590, 17811, -137202, -296691, -188874, 166960, 406641, 306213, 101553, 138314, 374269, 469189, 277342, -3945, -164219, -222308, -283339, -343792, -345090, -307488, -307492, -373674, -463086, -500573, -417407, -210413, 12424, 111339, 74977, 45329, 147294, 339835, 468961]
41180D68961l6726j65728j66737p2882j2292o9922j71848j77007q0525l346L0036
41169d58016J19259K34686J68955j11312k97605j51711J13793J53941K2851L3628
41159a71531J94111J94115m6903k28565j51161J6019P3945P1282R2135P1200j0311
41148A04336k2983N0720L3051j07999j41042J1987P8166r4189k13417k6370K06522
41137a21218J28912j02244j03924N8916K6965j64508j36310J25468K03472l0848
41127a15319j95911o1333R6503L8761j7763J54433L34422K14515p6453j90001
41117A81854q8038l697k4937m3286j8344j1301k1604j1798j8375n8596m1900N3345
41105a06677P0455o0494j31770J9334J81289P3240j69889j81975M9250J74817
$$ y = [468961, 432235, 266507, 99770, 26888, 14596, -55326, -227174, -404181, -484706, -488052, -458016, -338757, -104071, 64884, -46428, -344033, -495744, -381951, -228010, -205159, -171531, 22580, 216695, 169792, -58773, -209934, -193915, -119970, -48688, 43447, 114647, 104336, 81353, 132073, 165124, 57125, -83917, -71930, 6236, -87953, -301370, -327740, -121218, 7694, -94550, -198474, -139558, -112593, -277101, -413411, -287943, -84471, -115319, -311230, -372563, -276060, -237299, -255062, -100629, 233793, 448308, 371855, 181854, 93816, 90119, 65182, 21896, 3552, -7749, -29353, -41151, -59526, -118122, -160022, -106677, -36222, -96716, -228486, -209152, -27863, 45377, -124512, -306487, -257237, -82420]
41095h2420N6556m9773L3047J12033k2529k31232k31308k26K19570K27904M3062
41084G4684j64154k19682q2307J13552J97939J56255J05606R7333O5283k3552
41074C20957j04436j33667j45111j47512q7714L1200J05444O6368k5278p4167
41064a93916o8305n8666p6875j02185p5729M2893J95903K53378J78700R0645P3978
41053B59821L8522r4830j92199r8555O7639O8750o4222q8831K7878O8074l2403
41042d0356q2139j7135l2754j91558k45490n2145J50096J27330J7412L2980P3532
41031b60227l5573j55767o3207J19663J19312k20L3748J77095J29514r8143j50752
41020a84557O4158J92484J7108j83875r6180J47810K19549P7620p5625j37045
$$ y = [-82420, -25864, -75637, -42590, 69443, 46914, -184318, -415626, -415852, -196282, 31622, 74684, -89470, -309152, -391459, -277907, -79968, 76287, 181893, 279226, 344509, 320957, 216521, 82854, -62257, -209769, -297483, -266283, -160839, -94471, -119749, -193916, -262221, -320887, -397762, -499947, -575676, -532783, -336880, -83502, 95198, 185843, 259821, 298343, 203513, 11314, -87241, -19602, 49148, -15074, -103905, -76027, -7953, -40356, -122495, -139630, -172384, -363942, -609432, -661577, -511481, -384151, -366739, -333759, -260227, -295800, -451567, -514774, -395111, -275799, -276019, -242271, -65176, 64338, -33805, -184557, -120399, 72085, 89193, -94682, -190862, -43052, 176497, 254117, 178492, 41447]
41010D1447j41123q7224L4677J33745J23495N8199K0821j4626p2244o9192J9439
40999D7414M8171n8516j18907K4790K00282J59863K888R825J44010J00918j56537
40988D04201l08455j92491k6502J2399N8803K07934K42491j975k75247k50351
40978a29193k4251O6153j7675l0518Q6308J31334L3523m7079n7390j44020l09982
40967d42790l07795l5170K44454K70898J41907R1015J17835P6816k5541p2106
40957E9523o6463r0037j08093l5772O9743R1070O1103Q5230J21669O2949k8983
40946B21939k1929M615j29396l24600k67479O2032K84826J64765n1522m0335J20689
40935B3605J44311P469o6703L364P3210M2856l0511r1092j48085j61799n2239
$$ y = [41447, -99676, -186900, -152223, -18478, 105017, 163216, 184037, 169411, 97167, 27975, 47414, 95585, 37069, -81838, -57048, 143234, 303097, 305985, 315810, 459820, 560738, 404201, 95746, -96745, -123247, -110848, -52045, 155889, 398380, 396405, 121158, -129193, -153444, -87291, -104966, -135484, -49176, 82158, 115681, 68602, 11212, -132808, -442790, -750585, -785755, -541301, -270403, -128496, -37481, 80354, 157170, 131629, 59523, -6940, -96977, -205070, -240842, -171099, -80029, -18926, 66304, 187973, 250922, 221939, 200010, 204625, 75229, -249371, -516850, -454818, -169992, -5227, -56749, -97084, 23605, 167916, 175385, 108682, 112046, 185256, 228112, 197601, 106509, -41576, -203375, -255614]
40924b55614J32944K11140Q8196j16138k16749j58846l0086N6874O3521M8718
40914a76040J00328K13300K61766J43442p6076k23008j98296n3189Q0782Q5069
40904A58078o9929k69024l19063j52959P0515J46900O1119l8476m6995J7514R6960
40893c45360J41607J02422j2089q5916r662J60492K52042J76210m260j80107k70913
40882g5534k24924o1050R3679J13086K0163n3391k9796P8559K40456L88193L77672
40871H67113J27654k11073l79819l09934j55594m1210N0530J26377J12110m34
40861A85720r4599r3516n5937m8011m5099j7160J0433K9405N8693N2714m9753
40850f7110j54442p8843J43993K36752O5883j43797j37527J0268O0751j5878o1221
$$ y = [-255614, -122670, 88470, 176666, 60528, -156221, -315067, -345153, -288279, -224758, -176040, -75712, 137588, 399354, 542796, 466720, 243712, 45416, -7773, 73009, 158078, 88149, -180875, -499938, -652897, -582382, -435482, -374363, -412839, -459834, -442320, -345360, -203753, -101331, -113420, -199336, -208998, -48506, 203536, 379746, 375486, 195379, -75534, -300458, -361508, -267829, -154743, -134580, -187971, -217767, -139208, 101248, 489441, 867113, 994767, 783694, 403875, 93941, -61653, -102863, -52333, 74044, 186154, 185720, 91121, -2395, -58332, -106343, -151442, -168602, -158169, -128764, -70071, -17357, -67110, -221552, -300395, -156402, 80350, 146233, 2436, -135091, -124823, -64072, -79950, -141171]
40839a41171k6576j0446l4984o508Q8977J33744N8591o2555j31424j27296o6413
40828c26061L5261J23638J16557J301j20185j18703L0761J98597J96753j7999
40818A19920k39489k06936O6709K76990K02542k3464j17933j5841J00048O5496
40808B28042j04506k78305l16226j58229R1506K12875J04676p8693j23474k2389
40798d44723P3124R6173J10513J49148J53214P1534p8802k30664k72645j12261
40788d85389J61658K80170J11101j16827r6479J25452K26221Q0570r8560j16373
40778G1544m3563k4548n0850m7204k8759m7074p9878p1729j3365P5777J69581
40767i0068K07767J33917j3029j31557j88634k19806k10797j11145L3815J10122
$$ y = [-141171, -167747, -178193, -213177, -219685, -130708, 3036, 61627, -928, -132352, -259648, -326061, -290800, -167162, -50605, -49304, -169489, -288192, -257431, -58834, 137919, 119920, -119569, -326505, -259796, 17194, 219736, 196272, 78339, 62498, 162546, 228042, 123536, -154769, -470995, -629224, -537718, -324843, -220167, -298860, -422334, -444723, -371599, -275426, -164913, -15765, 137449, 208983, 130181, -100483, -373128, -485389, -323731, -43561, 67540, -49287, -145766, -20314, 205907, 286477, 187917, 71544, 27981, 3433, -47417, -94621, -123380, -170454, -250332, -322061, -335426, -259649, -90068, 117699, 251616, 238587, 107030, -81604, -301410, -512207, -623352, -589537, -479415]
40757d79415J05917J08326J25326Q0167m096q657N7956M8505n3795p4882N2347
40746d2301J51895Q7782l0572p0393q9556j48784j17011J01186L05310K32541
40736C80097m5457k16479j60334m0399P326K6103N7656L6054o5230j47881j32616
40725c01160p2058n0051n5162j9016O9919J39212J07851j7418j25077j15227l1248
40714d69435j021m2743m8765O967Q765o8965n2415J53230L37552K50775j4282
40703E9663j42670l8690R1928Q0167j8972r5043j26712j12993l7770M8199N8842
40692b34051J9069L7303J13970J31238N5105j1709n945K8297P4623J70007K50593
40681F28500J60177j04286l20517l12001j54936k5914K3302M0650M1726R538n0116
$$ y = [-479415, -373498, -265172, -139846, -59679, -63775, -72432, -14476, 34029, -19766, -94648, -42301, 109594, 197376, 166804, 96411, 6855, -141929, -258940, -157754, 147556, 380097, 334640, 118161, -42173, -82572, -75246, -49143, 8513, 44567, -20663, -168544, -301160, -373218, -423269, -478431, -497447, -427528, -288316, -180465, -197883, -322960, -438187, -469435, -470456, -513199, -561964, -554997, -546232, -615197, -667612, -514382, -176830, 73945, 59663, -83007, -121697, -29769, 50398, 31426, -63617, -190329, -303322, -341092, -292893, -234051, -214982, -177679, -63709, 67529, 122634, 110925, 104980, 133277, 207900, 377907, 628500, 788677, 684391, 363874, 51873, -103063, -128977, -105675, -65025, -23299, -13761, -63877]
40670f3877j19573j63280r6203J18060L23073K92484M2628j61064j71512j23039
40660a22303j34729r9647N5298J32181n6702l26869l27697l6030K22060K17817
40650d76621N1409o6294n3675M7205J46414J50878O6182M2323J76990L11577K09014
40639F05402q2071k54726j60342J6792O4712J4626l742K148m9198j30298j41991
40628a18688p8200k6690k8500l1638J7209R4259J21791N7196l9414n6277J7258
40617g1694M6971n5864j66437j06040P4977J54356O9458j7817j8632m1819j29162
40606b61703j13466Q9476K63463J94995K6048L5276J82330J76598l8835j89448
40596C64734j03637M1279K5260r1361j11557r882P1923M6389m5282j26771j44907
$$ y = [-63877, -183450, -346730, -442933, -324873, -1800, 290684, 333312, 172248, 736, -122303, -257032, -356679, -301381, -169200, -225902, -552771, -880468, -916498, -694438, -476621, -425212, -491506, -545181, -497976, -351562, -200684, -134502, -92179, 84811, 396388, 605402, 523331, 268605, 108263, 125055, 189767, 204393, 200651, 202799, 153601, 23303, -118688, -196888, -223578, -252078, -283716, -266507, -172248, -50457, 6739, -32675, -88952, -71694, -24723, -80587, -247024, -353064, -278087, -123731, -54273, -72090, -90722, -132541, -261703, -375169, -285693, -22230, 172765, 198813, 234089, 416419, 593017, 554182, 364734, 261097, 302376, 327636, 236275, 124718, 114836, 186759, 233148, 187866, 61095, -83812]
40585h3812p4721M6737J23216R8604K0001l7055n2603l7205M276L9982K0952k9358
40573C9014k5188L0889K1167q6344j40662l4201R5871O3063o2819n5016J02641
40562e1585J75196L5619j43393j46306n352Q2061K5104q3960j13941l5002O0173
40551b01386M3333j03281k27951j68984L1327J75633J75420J25726R1245r50j65339
40540b25207k37298j08674N6377M0014q9851q4862Q1900J66070L6216j22612r1845
40529e79772P2449J54937Q6355j7777n9189n0521k2737L1973R7814J09333L8656
40518a38479m2066l5622O3375J63968J80727J05550j6152j31970j85782j27627
40508a64078K2100J45049J32397J6975o8615o1892j4316L7422J24698K24976K13041
$$ y = [-83812, -158533, -111796, 11420, 110024, 130025, 92970, 40367, 3162, 7438, 47420, 68372, 39014, 13826, 44715, 65882, -20462, -161124, -195325, -99454, -36391, -99210, -154226, -51585, 123611, 159230, 15837, -130469, -135821, -53760, -28656, -112616, -226557, -261559, -201386, -158053, -261334, -489285, -658269, -626942, -451309, -275889, -150163, -58918, -59868, -225207, -462505, -571179, -514802, -474788, -564639, -649501, -567601, -401531, -365315, -487927, -579772, -507323, -352386, -266031, -283808, -342997, -393518, -416255, -384282, -286468, -177135, -138479, -180545, -216167, -152792, 11176, 191903, 297453, 281301, 149331, -36451, -164078, -141978, 3071, 135468, 152443, 83828, 21936, 7620, 45042, 169740, 394716, 607757]
40497F07757L4002j69661k22425j38275n8319l0682L369M7393L7997r778k733
40486I8645O4797R0277M0044P422M7692Q7777O0724P659k2473n7695j08865j03231
40474B12773r262O7022J9075r7477j45355r4252k6813J736Q530J2191R708J6810
40462b5314N6384J04974J05362L7172n3797r1591l2552P4355R6957l8306k07684
40451B5960j97179J0564J71276Q2450j50743k65725j80901m7326J406Q459Q0491
40440d61268K12339K75139J57741q8509k56594j86487L3652J52155O3956p4155
40430a72031q8902j5462K1028J2695J2345j4256r8491j20261L7483K32971J98500
40419E619o1232k30046r9556J69332K94508K15057O9665l8618j17755j86641k12586
$$ y = [607757, 641759, 472098, 249673, 111398, 53079, 22397, 25766, 73159, 111156, 101378, 98645, 163442, 253719, 293763, 301185, 348877, 436654, 497378, 505037, 482564, 424869, 316004, 212773, 203511, 270533, 289608, 192131, 46776, -47476, -74289, -72553, -64023, -51832, -42124, -25314, 31070, 136044, 241406, 278578, 224781, 133190, 100638, 174993, 271950, 233644, 25960, -171219, -160655, 10621, 93071, -57672, -323397, -504298, -551624, -550218, -541759, -461268, -248929, 26210, 183951, 95442, -161152, -347639, -313987, -161832, -97876, -172031, -260933, -276395, -255367, -242672, -230327, -244583, -343074, -463335, -425852, -192881, 5619, -55613, -285659, -385215, -215883, 78625, 293682, 363347, 324729, 206974, 20333, -192253]
40408a92253j48634L64J39517J41229L220r8402k6193R7929N9089r0589p5836
40397a90559J49754K63174L8705k75300k85796r802J80936J06088k6188k507Q4708
40386C3213M4122q4123r8995L4315J18299J3648j41848j05035J35553L15665K20154
40375D84968m3973j86141r0472P9553J24156K8153r6279j69442j70980r3910L2566
40364a01801J19219R9622J7644k5966K420M1073J2720r2168j92971j80797m3313
40353c44318R0945J05462O2506R5142J55499O0982j73053k77517j26407L7465
40343c13294k9262j76766j09247J18765J87735L6689o0307K2370O1926r2007k16270
40332e69668o3243K20316K95342J14878o2698p8425l1388l2055l2607K6087P5840
$$ y = [-192253, -340887, -340523, -201006, -59777, -56557, -154959, -181152, -83223, -24134, -114723, -190559, -40805, 222369, 261074, -14226, -300022, -309824, -128888, -22800, -48988, -51495, 33213, 77335, -6788, -105783, -71468, 46831, 60479, -81369, -186404, -50851, 264814, 484968, 440995, 254854, 164382, 243935, 368091, 396244, 299965, 130523, -40457, -134367, -101801, 17418, 117040, 134684, 108718, 111138, 152211, 164931, 72763, -120208, -301005, -344318, -253373, -147911, -85405, 9737, 165236, 226218, 53165, -224352, -350759, -313294, -342556, -519322, -628569, -509804, -322069, -285380, -345687, -323317, -261391, -353398, -569668, -632911, -412595, -117253, -2375, -65073, -143498, -174886, -206941, -239548, -213461, -137621]
40321a37621M0388j4816K7022J37082J48808j1900j82400j32689J27902L15214
40311C16990K09488n5721j73645p8864Q730l9747p9604R582P8023l6537j83099
40300b4404j03710J31559J99447J6124j51415j18623k9156m5101o7987L4981J47556
40289a0729R3375m1948m1034P9777R9503m2520j62121j29029k4761M4342Q6369
40278d8776J07488M4960r2495j81662j75865j76615k11690j28315J28377L03418
40268d31175J40633j93660k70794K2403L30298L23184J09384R206R7658J80197
40258C17334J38114O8760N9553K0842j39602k97857k41268O589J61912M9544j47278
40247c357j44001L5597J08373k9756j52186o9558P5485N6790o1599m2196J23336
$$ y = [-137621, -97233, -112049, -85027, 52055, 200863, 188963, 6563, -126126, 1776, 316990, 526478, 470757, 297112, 218248, 226978, 187231, 107627, 117209, 195232, 158695, -24404, -128114, 3445, 202892, 219016, 67601, -51022, -80178, -125279, -193266, -158285, -10729, 82646, 40698, -336, 79441, 178944, 136424, -25697, -154726, -179487, -135145, -48776, 58712, 103672, 11177, -170485, -346350, -522965, -734655, -862970, -734593, -431175, -290542, -484202, -754996, -732593, -402295, -79111, 30273, 39479, 137137, 317334, 455448, 524208, 583761, 604603, 465001, 167144, -74124, -67535, 94377, 143921, -3357, -147358, -111761, -3388, -33144, -185330, -254888, -179403, -122613, -184212, -226408, -103072]
40236a03072J98050Q5363k9213N304P4230J3498j18380j50166o5549J1005L2595
40225d6335O6284J25998J21327Q984j13350j25565l9544K5169n07n7239n6606
40214i1384j6846l4119j15989j36028k0230J03970O5937q5066j25635K9732K14842
40203b10816K48012J38456j350j07743j48092q5749K9233M9165p2433j72277r4886
40192d28480P4867J40102P2580K725j5162m8934j11790j08341J1433J67821K54252
40181A1073K37587J45491L1216n3654j15858k11024l05627k37229M9494L13032
40171a35499K68038n744j44393r926J36804O3980q4276n1516J11277J32191o4188
40160B16748k61899k69570j38057k1495L3215Q3528J58009J99161J28321m8015
$$ y = [-103072, 94978, 180341, 151128, 156432, 230662, 244160, 125780, -24386, -89935, -78930, -46335, 19949, 145947, 267274, 276258, 162908, 37343, -2201, 22968, 22461, -34778, -91384, -108230, -142349, -258338, -394366, -414596, -310626, -244689, -329755, -455390, -425658, -210816, 37196, 175652, 174302, 66559, -81533, -167282, -138049, -88884, -161317, -333594, -428480, -353613, -213511, -140931, -138206, -153368, -202302, -314092, -422433, -411000, -243179, 11073, 248660, 394151, 425367, 371713, 255855, 44831, -260796, -498025, -448531, -135499, 132539, 126795, -17598, -27524, 109280, 173260, 88984, 37468, 148745, 280936, 216748, -45151, -314721, -452778, -474273, -441058, -357530, -199521, -360, 127961, 79946]
40150G9946j97520j67660K9566J86054J22548q5354j93702r1777Q3300J53503
40140h1096J17374R2696J14531R4489k5442j65722j94372p9489P9226J55443J09043
40129B16681M564o3646o7517o8431j27564k00193j71728k0235J24276J41670Q1245
40118a50878O8656J03607P9076j5259o2048j5808K0471j8385m2696K9403J22096
40107A18235J26715O3426K210o3824j37028j26807J376J02039N3046k8302K0748
40096A31834J11662O1559m6861J1662J56880N9140k90793m59146j94201J72615
40086b85649K12867P420o1499P0650J16659m6930j90600j05650J08964K30241
40076E6473J89253O5302o2529j59303k04544j87209j02008M9030K04134K31845
$$ y = [79946, -117574, -285234, -255668, -69614, 52934, -32420, -226122, -317899, -234599, -81096, 36278, 128974, 243505, 337994, 312552, 146830, -47542, -127031, -47805, 107638, 216681, 221245, 157599, 90082, 21651, -105913, -306106, -477834, -498069, -373793, -232123, -150878, -82222, 21385, 100461, 85202, 23154, 7346, 27817, 9432, -33264, -3861, 118235, 244950, 308376, 310586, 246762, 109734, -17073, -15697, 86342, 139388, 111086, 131834, 243496, 305055, 258194, 269856, 426736, 485876, 195083, -264063, -458264, -285649, -72782, -65362, -126861, -56211, 60448, 13518, -177082, -282732, -173768, 56473, 245726, 311028, 248499, 89196, -115348, -302557, -404565, -355535, -151401, 80444]
40066H0444P6768j03703q0571J42307K91629J60813j17022k35008r8289P8412
40056A95780P0749p1814j29152l6250L2686o4207k12010j92879J3743K14896K49916
40045G1458J24887o8507k23752k23697l7448J72537J98201N7425m7429m5182n3973
40034g5480r6675l0930J37173J59361n4581k12571o1501K00090K25711M6797m3326
40023A94068O796n800j12508j19201J0966P8927R831l9209r679n0317j78200j61822
40011c76148P4095K27626N2836k22942k08352P9168K56986J30123q5519j10779
40001a82906N6761K19761K35715J06813q1654k20643k21049p9325R2963J52014
39991G8450O9434k2503J1743J10928P2849j39169k70276r3355K34046L31912R8567
$$ y = [80444, 157212, 53509, -27062, 115245, 406874, 567687, 450665, 215657, 117368, 195780, 266529, 194715, 65563, 29313, 61999, -2208, -214218, -407097, -393354, -178458, 71458, 196345, 127838, -95914, -319611, -357059, -184522, 13679, 71104, 23675, -21507, -75480, -172155, -203085, -65912, 93449, 38868, -173703, -235204, -35114, 190597, 237394, 194068, 200864, 195064, 82556, -36645, -25679, 53248, 63079, 23870, 14191, -36126, -214326, -376148, -302053, -74427, -21591, -244533, -452885, -373717, -116731, 13392, -72127, -182906, -126145, 93616, 329331, 436144, 354490, 133847, -87202, -166527, -73564, 78450, 147884, 125381, 137124, 248052, 320901, 181732, -88544, -181899, 52147, 384059, 482626]
39980D82626j63646j65585K8358J69433J56640O2936m3219j44986k04545j74207
39970C805p1192K5264L9385n0418j71122j68959L5580K93041L48292J53011p3762
39959C62925j38197p7674j6803J4276K2149k5196r2458m9900J07071J67371O308
39948B79872j72306j14636Q4660J23203m2393j60127j05870m2065q1126p5397
39938c06185R4636K44941J30324j57075k72338q0212J75284K12250N6317o0294
39928C7648l6601J0604k4725p4939k8179Q0120J08774M283j40666k07608j52573
39917d23862k664J59544K15143J08566n8364j13866j0815J33591J83022R0654
39907B80949j02899k72201k49699j2477K05785J66292l6990j07047L334M8748
$$ y = [482626, 318980, 153395, 181753, 351186, 507826, 570762, 527543, 382557, 178012, 3805, -67387, -42123, -2738, -53156, -224278, -393237, -357657, -64616, 283676, 436687, 362925, 224728, 147054, 130251, 144527, 166676, 141480, 49022, -878, 106193, 273564, 279872, 107566, -7070, 77590, 200793, 158400, -1727, -107597, -149662, -230788, -306185, -211549, 33392, 163716, 6641, -265697, -345909, -170625, 41625, 97942, 37648, 1047, 11651, -13074, -88013, -116192, -36072, 72702, 76985, -63681, -271289, -423862, -426526, -266982, -51839, 56727, -1637, -115503, -126318, 7273, 190295, 280949, 178050, -94151, -343850, -356327, -150542, 15750, -21240, -128287, -124953, -76205]
39897g6205o0357r9622M7234J46922K0361j19468k7163J41933J08742l3085R44
39886E0236J57310J37413n1703r8642M4550N1956k07855m07982k60274N7544J96878
39875c30569J05105k4191o9609m2088K7184Q7464P2766K0352N2222J58471J74980
39864B32087N8542l1557l0250r1844k64660l09627p0124K14508K34802N4269n8162
39853f2016n8263o9785n3486R9020K37343J10566j77112k58463o7632Q0268L4993
39842a84567K2634J68541K19085r390k49098j73859P9734J40329j8752r7641J8973
39831h4011J31741J04388M5489N4366N7215j1963q2357r0284p5599o0557j678
39820a3250P2900N7620k7321j9714J06926J56327K5665j03521o0402L5076M721
$$ y = [-76205, -136562, -236184, -188950, -42028, -21667, -141135, -168298, -26365, 82377, 49292, 50236, 207546, 344959, 293256, 194614, 239164, 291120, 83265, -324717, -584991, -527447, -330569, -225464, -249655, -319264, -361352, -334168, -246704, -173938, -153586, -101364, 57107, 232087, 290629, 259072, 228822, 136978, -127682, -437309, -507433, -292925, -58123, -3854, -62016, -120279, -190064, -243550, -144530, 92813, 203379, 26267, -232196, -299828, -219560, -184567, -161933, 6608, 225693, 216303, -32795, -206654, -126920, 13409, -5343, -102984, -84011, 47730, 152118, 197607, 251973, 309188, 297225, 214868, 124584, 48985, -11572, -13250, 59650, 117270, 89949, 70235, 177161, 333488, 359153, 255632, 195230, 230306, 235027]
39809B35027o5928j2519N6855p1178k86376k62475J5357K03952J41916O2917J37523
39798A55071J64974n1147l19376l37496j38499K9162J00723J75596K20298J07354
39788A06660r5966j64482m0841J09692J66086J55493R9809j5768j10137o1147
39778A49399P7205J11447q077j30613j53805j28589q6354K3826J68286K05860
39768B28585J07320R871j8065p1480j86900k29692j15575L8718J05429J14249
39758a7540J13634M8940p6410j00232N5398J91840Q7799j66431k92788k02809
39748c58599n1507L0688O0508P2970N1671J2127K0211Q9664J43924J05129j9444
39737A57342j36108j38584k5343O2801J0381q0847j8619J51904J63501n3947k18620
$$ y = [235027, 169099, 156580, 213435, 142257, -144119, -406594, -391237, -187285, -45369, 17548, 155071, 320045, 268898, -50478, -387974, -526473, -497311, -396588, -220992, -694, 106660, 10694, -153788, -194629, -84937, 81149, 236642, 336451, 320683, 210546, 149399, 226604, 338051, 329974, 199361, 45556, -83033, -169387, -145561, 22725, 228585, 335905, 345776, 327711, 256231, 69331, -160361, -275936, -237218, -131789, -17540, 96094, 145034, 68624, -31608, 23790, 215630, 303429, 136998, -155790, -358599, -410106, -379418, -318910, -245940, -194269, -182142, -161931, -72267, 71657, 176786, 157342, 21234, -117350, -142693, -79892, -69511, -150358, -168977, -17073, 146428, 92481, -126139]
39726a26139j20204M5310L874j42328j01128J10028K07725J29531J07880K25933
39716C40482K53245M6033j80819j57985P0155K57214K79056J77979O283j93080
39706H98563l12972k55435p7841M2980Q198j04070j48955q3315j236o820p9194
39695a20097j07130n1577O908J1450J6972O6601R1635M4337K0979J02065J68422
39684B50565P0671q7774o9465J14742J88648J3815k20679k87221j91894o0967
39674b79559N4175J35038J20936J7538m0086L6259J46310J48726N2771m6071j20441
39663B25596j78633j70471o5491L9914L4324k8165O058J52636K35540R7181k02820
39652A45669m21949l55726m7730K17651J94293m0703j71847m4246J49006J56766
$$ y = [-126139, -246343, -201033, -197159, -339487, -440615, -330587, -122862, 6669, 114549, 340482, 593727, 639760, 458941, 300956, 371111, 628325, 907381, 1085360, 1091643, 898563, 585591, 330156, 252315, 295295, 303493, 199423, 50468, -32847, -34083, -40903, -120097, -227227, -278804, -271896, -260446, -243474, -176873, -85238, -40901, -19922, 82143, 250565, 321236, 233462, 163997, 278739, 467387, 481202, 260523, -26698, -218592, -279559, -225384, -90346, 30590, 48128, 8042, 44301, 190611, 339337, 392108, 346037, 225596, 46963, -123508, -188999, -149085, -114761, -142926, -136868, 15768, 251308, 348489, 145669, -276280, -632006, -679736, -462085, -267792, -308495, -480342, -524588, -375582, -218816]
39642b18816J1412o6702j1450L6457k093k2630N8387J36567P2325q1581j40389
39631b28513n0513L6693j2248j24779j42079n3347J6986K9169P5724J76063J96910
39620g9934P9233j7657L9876J11267j211j85006j47540J06052K29927M4299j96570
39609a7264j87532P121J05011J0640j29814j72028r4418N2954J74453J63715K8144
39598e9018q7571r0515n1080l5845K4836J63891K27641R6900o7232l6056J12486
39587A98437R9853j00244j98859l3962J81529J75333j4558j41734r9583m858J5304
39576G6658k2171k8359J9540N9740M2169j712j1704M438j2999o4866q0776m3009
39564f3051k9552q2437j28475r9876l6061J5643Q9266J83492J79235K6220r8068
$$ y = [-218816, -207404, -274106, -285556, -249099, -251192, -273822, -215435, -78868, -6543, -88124, -228513, -279026, -242333, -254581, -379360, -521439, -574786, -557800, -528631, -452907, -276844, -79934, -701, -18358, 21518, 132785, 131574, -53432, -200972, -94920, 135007, 179306, -17264, -204796, -197675, -92664, -82024, -211838, -383866, -478284, -425330, -250877, -87162, -59018, -146589, -237104, -288184, -324029, -299193, -135302, 92339, 189239, 122007, 85951, 198437, 298290, 198046, -813, -34775, 146754, 322087, 307529, 165795, 66212, 61354, 76658, 54487, 26128, 45668, 105408, 147577, 145865, 134161, 138599, 125600, 60734, -20042, -63051, -92603, -175040, -303515, -403391, -439452, -423809, -334543, -151051, 28184, 54404, -43664]
39553d3664j0402J74990J88921J5646q7650J245R3260R348j39544j43306j4498
39542D4346N2366k7886j34293j26185j5897P7103R0083Q2997J28252J75731J05708
39531D52325p5023j96100j41824J660J05037J74996K37720J80546p1029l09148
39521C59160k50595K9665J60087J1951j19862K784J81280R7023j92523l41070
39511f2100k05000M766N6566k4384p2211l4376o657n4197q5578M0738K93924M38448
39499B89939K97228r824k03271j89067j23441j32431j36895k4980J41494K01388
39489A10140J00478o1739j50143j13270j9869J3185l3060m3743M8716J24484N1734
39478B6913p7736q4021o653k2589q9468R990K31073K34656p6483l39081k55614
$$ y = [-43664, -54066, 120924, 309845, 325491, 237841, 239086, 332346, 341694, 202150, 58844, 44346, 96712, 68826, -65467, -191652, -207549, -130446, -40363, 42634, 170886, 346617, 452325, 377302, 181202, 39378, 41038, 146075, 321071, 558791, 739337, 668308, 359160, 108565, 138230, 298317, 310268, 190406, 193190, 374470, 471493, 278970, -62100, -267100, -262334, -205768, -230152, -302363, -336739, -343396, -397593, -483171, -442433, -148509, 289939, 587167, 577343, 374072, 185005, 61564, -70867, -207762, -232742, -91248, 110140, 210618, 148879, -1264, -114534, -134403, -121218, -154278, -198021, -149305, -24821, 26913, -50823, -134844, -141497, -164086, -253554, -243564, -12491, 222165, 145682, -193399, -449013]
39467d49013j9091N1705O180O2106J58598R6827l7498K603J69128J80042K196
39456B23783j02390k1306P1641O2936M5264N1918l1815j94592k32129p2072R5480
39445a03282J23720R3285Q3814K8465p1315n5847R9946J60066p326j75982j03852
39434G1692Q2194J07390j5718n9760K7633R6388Q8169Q0050O4542m8518k02029
39423B92033k06837k8931J42744J63354Q6292M659q0433j63475j68474p1644K9940
39412g72N1088J7050k8250r2075j39746o3739J40439K73840J54295j20188k72258
39401h0316j90093l4908R330l7479l8855L6024P6256m091j39658j78869m8181
39390f30840J68719L11577K92908J59736J4181r2791j59155j58718n1942J10369
$$ y = [-449013, -468104, -416399, -410219, -348113, -189515, -92688, -130186, -127583, 41545, 221587, 223783, 121393, 100087, 171728, 234664, 279928, 331846, 300031, 105439, -126690, -198762, -103282, 20438, 113723, 197537, 226002, 154687, 98840, 198786, 358852, 351526, 175544, 71692, 153886, 261276, 245558, 185798, 213431, 309819, 397988, 478038, 542580, 494062, 292033, 85196, 56265, 199009, 362363, 448655, 453314, 372881, 209406, 40932, -30712, -772, 50316, 67366, 39116, -52959, -192705, -256444, -116005, 157835, 312130, 191942, -80316, -270409, -305317, -295987, -333466, -372321, -336297, -260041, -264132, -403790, -582659, -630840, -462121, -150544, 142364, 302100, 316281, 223490, 64335, -94383, -146325, -35956]
39380c5956J78780P3823q5138j07999K8566J60842J50476K4093j05951j60027
39370A21509j11732L49N0042o3276k30391k08211L5027K14551J10992r8863r7652
39359b77655J05336K16378J10204l1087m0833K6989O7858P4554M6925l9771j14603
39348A44295o9098J2382p0343k52559k03066J49021M02511K37788j02370j91672
39338E6889l6472N6443L9807J16305K57862J98302o6045j99043n4674R6180J9560
39327D85114j45632j95079j86949k25751j94115J2816J98354J28279n7001k5333
39317b05297K19077L21474J09837j56383j71822Q554J00141j1900j66647j77089
39307a30055n5620M0964K8581r759L5877J27435J29979K1367o9661o7746o0607
$$ y = [-35956, 142824, 216647, 131509, 23510, 52076, 212918, 363394, 387487, 281536, 121509, 9777, 10126, 60168, -3108, -233499, -441710, -406683, -192132, -81140, -180003, -277655, -172319, 44059, 154263, 123176, 82343, 109332, 177190, 251744, 298669, 258898, 144295, 75197, 87579, 17236, -235323, -438389, -289368, 113143, 350931, 248561, 56889, 20417, 76860, 116667, 232972, 490834, 689136, 623091, 424048, 369374, 465554, 485114, 339482, 144403, -42546, -268297, -462412, -449596, -251242, -122963, -179964, -205297, 13780, 335254, 445091, 288708, 116886, 125440, 225581, 213681, 47034, -130055, -185675, -144711, -116130, -125889, -90012, 37423, 167402, 188769, 119108, 51362, -9245]
39296i245j22522j53894k9423J79205K76837J95456L9510p7079j06160k1684J42909
39285C13910K34821J25544q0248j43534k1045P4196o029j35026j18575K7821J31799
39274D03634J00273j3577j14997j39554p1657K4834M2482l5733r9788p4065k8617
39263f765m1311n0289K2767R0377J8832j18509j15794L3640J04287M285m9970
39252a08450J26015L50370K97513l8587l30506l41711j53349M5286J76423K15345
39242B38349J17047o4582j37899j3813J27325P8593p8315j02392K2056O8996n4309
39231B01056j61763r7776K5997L6356l4862n5030k8565m4793p3136k092J49310
39220h5298K26085J43345k4280j46290j28046N3906K83205L25868P9509k35538
$$ y = [-9245, -131767, -285661, -315084, -135879, 140958, 336414, 375924, 298845, 192685, 171001, 313910, 548731, 674275, 594027, 450493, 429448, 503644, 497615, 362589, 244014, 271835, 403634, 503907, 490330, 375333, 235779, 164122, 188956, 231438, 195705, 95917, 21852, -6765, -48076, -98365, -75598, 14779, 33611, -84898, -200692, -167052, -62765, -58480, -108450, 17565, 367935, 665448, 626861, 296355, -45356, -198705, -153419, 23004, 238349, 355396, 290814, 152915, 139102, 266427, 345020, 266705, 164313, 186369, 255365, 201056, 39293, -58483, -32486, 3870, -30992, -86022, -114587, -159380, -232516, -234608, -85298, 140787, 284132, 259852, 113562, -14484, 39422, 322627, 648495, 728004, 492466]
39210D92466l04550j12613P4288R9876O1771M7343j6972j61575k53920k17144
39200b91030j65346j69975q8230J82152M43313M22889J52942r6693j83622j73846
39190C2554j21690n494J28659J72285J22371P3850M3629k9442j17531j22075o2600
39179A14516n4663q5991k3331J22037J60339L0894p6135j9999P1157K8312q9650
39168A77486j31896j15507j50206k03233j44521K3795J66479K17681K21352J88141
39158B49571P6461p4643j43960r4768k5331j6540k9277N491P6319J15723Q1925
39147B20971j0417r9891j11378k2787J01788J81565J97379J55441K8899j69147
39137D72423k97049k09500J8341J30880P423j82952k14680q4386M5798R4799J15222
$$ y = [492466, 187916, 75303, 149591, 249467, 311238, 358581, 341609, 180034, -73886, -291030, -456376, -626351, -714581, -532429, -89116, 333773, 486715, 390022, 206400, 32554, -89136, -94630, 34029, 206314, 328685, 402535, 446164, 416722, 299191, 177116, 114516, 59853, -26138, -49469, 72568, 232907, 263801, 187666, 167667, 238824, 267136, 177486, 45590, -69917, -220123, -423356, -567877, -544082, -377603, -159922, 61430, 249571, 326032, 251389, 107429, 12661, -12670, -29210, -58487, -52996, 23323, 139046, 220971, 210554, 110663, -715, -23502, 78286, 259851, 457230, 612671, 641570, 472423, 175374, -34126, -15785, 115095, 122518, -60434, -275114, -359500, -313702, -218903, -103681]
39126a03681J38698J15388K6942n9125r4117j12412j32964q6466O6879K11374
39116b9484J90580K9055q8859p7557n1781j10608j56619n3974J27619J86815P1028
39105C6215p5292j37989j48536j44948q0399N5413J58520J51143R7853Q8877J02721
39094A03578Q2943N5583N1185p52j48896k54971j35207J37117K55723P2891j79039
39083D0155j72742Q9671K77286J55946j15020k00830l8246R3908r572j70157j01715
39072a51316J19690J35349j40393l44610j79728J55093K65493J03305n9333p2871
39062a69321l3885j3649M5745J36333J33062N542j08731j05115k9277M3558Q8854
39051f884O6343n1853j51556o2863J65692K66424J08961j14056j53390k375J65745
$$ y = [-103681, 35017, 150405, 177347, 118222, 24105, -88307, -221271, -307737, -240858, -29484, 161096, 190151, 101292, 23735, -28046, -138654, -295273, -349247, -221628, -34813, 36215, -39077, -177066, -325602, -470550, -550949, -495536, -337016, -185873, -88020, 857, 103578, 186521, 242104, 293289, 292537, 143641, -111330, -246537, -109420, 146303, 219194, 40155, -132587, -42916, 234370, 390316, 275296, 74466, 36220, 130128, 120556, -49601, -151316, -31626, 103723, -36670, -381280, -561008, -405915, -140422, -37117, -96450, -169321, -203206, -216855, -171110, -34777, 98285, 103827, -4904, -110019, -139296, -95738, -6884, 59459, 7606, -143950, -206813, -41121, 225303, 334264, 220208, 66818, 64443, 230188]
39040B30188K15595J11812r1998k29407j33198J20873K29776M7682j87842j66372
39030A47109P5095K14384O2708k30730l72011k25025O0432J86758K9666j85676
39020b37290j53018Q5424J90466M3055p0229P4066K67204K07233k4533j25337
39010B57041m9405n181p0283j22428j06867q0973j8986J46262L00086K45661L2365
38999E27292r1842o8404p6014j57014j18436R3020K25895J00825r9851j11740
38989B23731L9910J42473J14884L7582j8556k7202L2395J07970O4741j23899k74436
38978C19593k17932l6715O0251J7459n0044n0817J1677J11436K09603K22302R7336
38967F94149q9935k04085j93903j07972j1213M7753L8595r674j7095L8652Q0725
$$ y = [230188, 445783, 557595, 465597, 236190, 102992, 223865, 453641, 501323, 313481, 147109, 222204, 436588, 499296, 268566, -103445, -328470, -268038, -81280, -51614, -237290, -390308, -304884, -114418, -71363, -141592, -67526, 199678, 406911, 382378, 257041, 207636, 202455, 132172, 9744, -97123, -178096, -197082, -50820, 249266, 494927, 527292, 435450, 367046, 291032, 134018, 15582, 108602, 334497, 435322, 335471, 223731, 263641, 406114, 520998, 558580, 540024, 512822, 545217, 653187, 717928, 594029, 319593, 101661, 64946, 125197, 142656, 92612, 41795, 53472, 164908, 374511, 596813, 694149, 604214, 400129, 206226, 98254, 87041, 134794, 173389, 163715, 146620, 185272, 265997]
38956B65997N2916K972j2608j0743M373R3583K41138K76454Q5871j83325k93729
38945E22899k30390j69477j78848j49714l3734N2712L1052N708R6437K29871K24960
38934D01476M8804j23101j21369J0778P8842j2025j36353j21523J5527J02650
38924A43706O5642J5841M8394Q8010K5755r6466j53047j13985m4121J9876Q0071
38913G9676J10595Q8416N1219K6402m2574j83527k69650j58643O9311J76491Q2571
38902C0287l8766k1117P2599O8312o7234j83232j31228N7613J96751J51072M33
38891A35490o2676M353M6716l2321j17114q5473j4913j6056n26J52609K98013
38880C08102J78232j48145l27757k01005R134P1549L5380K4939J0696m1748k0945
$$ y = [265997, 318913, 321885, 309277, 298534, 302907, 396490, 637628, 914082, 999953, 816628, 522899, 292509, 123032, -55816, -205530, -239264, -186552, -155500, -149792, -53355, 176516, 401476, 450280, 327179, 205810, 216588, 295430, 283405, 147052, 25529, 41056, 143706, 209348, 225189, 273583, 361593, 387348, 290882, 137835, 23850, -20271, -395, 79676, 190271, 278687, 329906, 356308, 313734, 130207, -139443, -298086, -228775, -52284, 30287, -8479, -29596, 43003, 111315, 44081, -139151, -270379, -212766, -16015, 135057, 135490, 72814, 77167, 123883, 91562, -25552, -111025, -125938, -141994, -142520, 10089, 308102, 486334, 338189, 10432, -190573, -181439, -109890, -74510, -49571, -38875, -80623, -101568]
38869a01568J24099K09027P0294j44036j70442j2575J04316Q9753O3173J00301
38859C32342J24868P1473j6565p7598r1128m7324K6930L8638n0663j22379o4994
38848A23600K1702k4254j27796p1830J15229J50806n2173k12197j07448P6558
38838a07803N1181j17051j30269O3044K04943J30090k7701q0247k5158L7800N9973
38827E8802K2888q9085j92737j17706J54516L71582K89096J855j72532j08910
38817B17769J0849J3570l0651J9505J26857J42125L1939j01331j76210j74620
38807G9802o9877J29481K68225J51836j71961l80749k29290J52734M10549L50437
38797F91187Q9405j26990j59544n1615M7630L4581m1114m9343K5691M9195n3424
$$ y = [-101568, 22531, 231558, 301852, 157816, -12626, -25201, 79115, 168868, 232041, 332342, 457210, 528683, 512118, 434520, 343392, 296068, 322998, 361636, 310973, 188594, 123600, 145302, 121048, -6748, -78578, 36651, 187457, 135284, -76913, -184361, -107803, -56622, -173673, -303942, -240898, -35955, 94135, 66434, -13813, -38971, -1171, 58802, 81690, -7395, -200132, -317838, -163322, 208260, 497356, 499211, 326679, 217769, 228618, 242188, 211537, 231042, 357899, 500024, 531963, 430632, 254422, 79802, 9925, 139406, 407631, 559467, 387506, 6757, -222533, -69799, 340750, 691187, 780592, 653602, 494058, 442443, 490073, 524654, 483540, 434197, 459888, 509083, 455659]
38786D55659j59289j27565j6097K9585K2101P6316J56271J12487j4982J4029K58789
38775H07304M51543L93251K80930M05258O66751O73391K72057k79119o70788q22954
38765B177624p63587m92880j07862J40931J10280l0105k5967J06717J30758n1657
38755A194252k67609l13702j78082J3653J50937J85930J30547O7620Q7403J54669
38745A225618J14445r5334l02544k79002m1521J35412M4117j98777k91070j07647
38735B03697J60665K47205J09476p5576j61084j62048j36298o6083O5752J79000
38725C64706J87057J27439Q8301N4078l8309j22872o1847R9334J21959r3792l22529
38714D03525k86785r085K39053K62722R6309j01477j79892p6528J12638J86872
$$ y = [455659, 296370, 168805, 152708, 182293, 204394, 280710, 436981, 549468, 534486, 548515, 807304, 1258847, 1652098, 1933028, 2338286, 3005037, 3678428, 3950485, 3671366, 3000578, 2177624, 1414037, 921157, 813295, 954226, 1064506, 1034401, 1008434, 1115151, 1245909, 1194252, 926643, 612941, 434859, 448512, 599449, 785379, 915926, 983546, 1070949, 1225618, 1340063, 1244729, 942185, 663183, 621662, 757074, 801191, 602414, 311344, 203697, 364362, 611567, 721043, 645467, 484383, 322335, 186037, 119954, 185706, 364706, 551763, 679202, 767503, 821581, 783272, 660400, 598553, 697887, 819846, 726054, 403525, 116740, 107655, 346708, 609430, 705739, 604262, 424370, 347842, 460480, 647352]
38704F47352P2319o2510m2241N3754L9137m8280k848J75221K29785M1547j74579
38693I28657j91726q1466l7210o1508l2250M0021M2548j0636P812J03286J23171
38682H30699j2228j86766k42974j56909k0371P4259J02859J14948J70428K29886
38672I03831J55783r5357l37429l37410j09158J07830J50642O9568l2466j20010
38662C55824j47760n0046J04678J18029n8466j97856j02770R3835J18784m2630
38652A91622j48834o1861J05054J98187J80526N6070j57164l18962k35562N6448
38642a34476K50048J42672r9599j92975r8565L8828J62017K75559K62163J9617
38632F25289k54638k28968P1098K41011O7470j75779j68355p77N2805n107L1171
$$ y = [647352, 719671, 657161, 614920, 668674, 707811, 659531, 656683, 831904, 1061689, 1103236, 928657, 736931, 655465, 618255, 556747, 524497, 564518, 607066, 596430, 604242, 707528, 830699, 818471, 631705, 388731, 231822, 211451, 285710, 388569, 503517, 673945, 903831, 1059614, 964257, 626828, 289418, 180260, 288090, 438732, 508300, 475834, 355824, 208064, 158018, 262696, 380725, 322259, 124403, 21633, 115468, 234252, 191622, 42788, -19073, 85981, 284168, 464694, 520764, 363600, 44638, -190924, -134476, 115572, 258244, 158645, -34330, -132895, -94067, 67950, 343509, 605672, 625289, 370651, 141683, 212781, 453792, 521262, 345483, 177128, 176351, 229156, 224049, 255220]
38621B55220J75165K45430J92823J30779P2246o2191j78254p2101J87558K62744
38611A209419M1398j75605j39798j4188m6866j47141p9568J04194J55531N5633
38601I63009L0622J59254K56545J88064N5900l123j2392n9898j44662j96927j65168
38590A071224m8530Q5802J31069P5802O2028J83872K98606K25760P8887J45048
38580B309568M23624N62554L39685m6949k93293l51854l20664k09404m3498p044
38570B362725k04427m02409k98325J8881J62199j2971k41334k57730j10952K2827
38560A038484J10909K08957K97716L20292K82149K06121P6401q6812j91042j92678
38550B070497j60539j44879r7017p253J1396r3296j70987p7917P1402N6717j08553
$$ y = [255220, 430385, 675815, 868638, 999417, 1071663, 1009472, 831218, 759117, 946675, 1209419, 1250817, 1075212, 935414, 921226, 874360, 727219, 647651, 751845, 907376, 963009, 993631, 1152885, 1409430, 1597494, 1653394, 1650271, 1637879, 1577981, 1433319, 1236392, 1071224, 1022694, 1108496, 1239565, 1315367, 1377395, 1561267, 1859873, 2085633, 2164520, 2309568, 2733192, 3295746, 3635431, 3588482, 3295189, 2943335, 2622671, 2413267, 2369769, 2362725, 2158298, 1755889, 1457564, 1476445, 1638644, 1625673, 1384339, 1126609, 1015657, 1038484, 1149393, 1358350, 1656066, 1976358, 2258507, 2464628, 2541029, 2454217, 2263175, 2070497, 1909958, 1765079, 1668062, 1660809, 1672205, 1578909, 1407922, 1330005, 1401407, 1458124, 1349571]
38539A349571k01207j23274J418O5561R2827Q4815j8351j56073j48458J7597J13906
38528A078332R320j23841r4949K2968Q8514J56150K90826L12109N2036k62195
38518A529270k54856K7875J79217N6182o7068k5977q111j17768j28494P8669K15289
38507A484228N0855j50533m4437K11131K25352K9087k2352J14129J41598J1072
38497B050130J3868K00785K14958r9737l70344k53079M7284J44168O1654Q6494
38487B096181K31331K48943R6822J0383R9557J84896J06554m4836j02886n5897
38477B871048k520M792j5208l0601j7460L3292J01714J64537K28420K89864K86003
38466C913881J62976j2804r7035l9461N9876R7347J01842J64372K69834K88460
$$ y = [1349571, 1148364, 1025090, 1026508, 1092069, 1184896, 1269711, 1251360, 1095287, 946829, 964426, 1078332, 1087652, 963811, 868862, 891830, 980344, 1136494, 1427320, 1739429, 1791465, 1529270, 1274414, 1302289, 1481506, 1537688, 1470620, 1444643, 1436532, 1318764, 1190270, 1268939, 1484228, 1535083, 1384550, 1340113, 1551244, 1776596, 1805683, 1783331, 1897460, 2039058, 2050130, 2063998, 2264783, 2479741, 2380004, 2009660, 1756581, 1803865, 1948033, 2009687, 2096181, 2327512, 2576455, 2673277, 2683660, 2783217, 2968113, 3074667, 3029831, 2926945, 2871048, 2868528, 2873320, 2858112, 2827511, 2810051, 2843343, 2945057, 3109594, 3338014, 3627878, 3913881, 4076857, 4064053, 3967018, 3927557, 3987433, 4084780, 4186622, 4350994, 4620828, 4909288]
38456D909288J64726L9908R0930K69728L36932J97791N4090J05659K45434K47923
38446F662409J55076K04936M05389M87429L49143K47296L99942O54922P49375
38437A0315917O92733O75595P60505Q79325J002500J106105J105831J031915J123637
38428A8694063J516207J979547K230614K357377K628389L034336L408086L895439
38420C9744058M837171O187472P550776Q897369J0743189J3428730J6721095K0439417
38412A28549277K5017619L1040804L8572835M7192762N5844502O1606495N9200540
38405D47024834M3867172J6286173j5720782m1640103n5136711n6928227n1894944
38398B85857412m4547446l7174977l0661384k5396773k1262283j7706059j4408593
$$ y = [4909288, 5074014, 5113922, 5204852, 5474580, 5811512, 6009303, 6063393, 6169052, 6414486, 6662409, 6817485, 7022421, 7427810, 7915239, 8264382, 8511678, 8911620, 9566542, 10315917, 11008650, 11684245, 12444750, 13324075, 14326575, 15432680, 16538511, 17570426, 18694063, 20210270, 22189817, 24420431, 26777808, 29406197, 32440533, 35848619, 39744058, 44581229, 50768701, 58319477, 67216846, 77960035, 91388765, 108109860, 128549277, 153566896, 184607700, 223180535, 270373297, 326217799, 387824294, 447024834, 490892006, 507178179, 491457397, 449817294, 394680583, 337752356, 285857412, 241309966, 204134989, 173473605, 148076832, 126814549, 109108490, 94699897]
38391I4699897j1619618r627875q225112o982768n812864m916675m314101l768936
38383C9431948l157131k614867k277700k094483j951391j798150j602768j343338
38375B2592120j093889r74987r78600r74986r12209q53169p92872o27506l70040
38366A5013862k13859k78884m41629n18168m80172l90796k68008j32520o8328
38357A2221498j09589j70767j94287k39554l07075k35420M1158K70745J66107
38348A1442816j58132k91287p2944K09427K28370J2594j67155j47523J8368J97030
38338A1271564K95139K92089K40136K07661J84357R6255n3501j44148j00116r490
38328A2279946R433j8593q608q227j32408l07739k84623O501K86424K71425N9832
$$ y = [94699897, 83080279, 73452404, 65227292, 58244524, 52431660, 47514985, 43200884, 39431948, 36274817, 33659950, 31382250, 29287767, 27336376, 25538226, 23935458, 22592120, 21498231, 20523244, 19544644, 18569658, 17657449, 16804280, 16011408, 15383902, 15013862, 14800003, 14521119, 14079490, 13561322, 13081150, 12690354, 12422346, 12289826, 12221498, 12111909, 11941142, 11746855, 11507301, 11200226, 10964806, 11005964, 11276709, 11442816, 11284684, 10993397, 10920453, 11129880, 11358250, 11370844, 11203689, 11056166, 11074534, 11271564, 11566703, 11858792, 12098928, 12306589, 12490946, 12587201, 12533700, 12389552, 12289436, 12279946, 12289379, 12270786, 12262178, 12253951, 12121543, 11813804, 11529181, 11535682, 11822106, 12093531, 12153363]
38317A2153363k6460R3108J99649J69112J38960J96040J83962J3374p6112J52765
38307A3197761M93632N16189J75931j26251j22449L629j6792j41412j75707j14553
38297A3689978r4553j27028j04205k6352l0146j80359l72114m73068m70731m40328
38287A1371094m25395m05807l79386m17613n66142o96811n89002k42787J5143
38278G663294j00910m45537o16021m67446k30815j31152j39318j49579j62743
38269E219773j99198k23774k41737k98846l38513k53624j08530p0921r5683K5483
38259C414430K45493K53936O484j35166Q196J11961j03059l90176l99061k23311
38249B789727j26161n0210J53609L18240K71364K61728N65123J014618J530350
$$ y = [12153363, 12126903, 12220011, 12419660, 12588772, 12727732, 12923772, 13107734, 13121108, 13044996, 13197761, 13691393, 14207582, 14383513, 14257262, 14134813, 14138442, 14121650, 13980238, 13804531, 13689978, 13595425, 13468397, 13364192, 13337840, 13307694, 13127335, 12755221, 12282153, 11811422, 11371094, 10945699, 10539892, 10160506, 9742893, 9176751, 8479940, 7890938, 7648151, 7663294, 7562384, 7116847, 6500826, 6033380, 5802565, 5671413, 5532095, 5382516, 5219773, 5020575, 4796801, 4555064, 4256218, 3917705, 3664081, 3555551, 3484630, 3388947, 3414430, 3659923, 3913859, 3920343, 3785177, 3793373, 3905334, 3802275, 3412099, 3013038, 2789727, 2663566, 2613356, 2766965, 3085205, 3356569, 3618297, 4183420, 5198038, 6728388]
38240F728388K637755M462571N503489L799919l37138l980860m688363l062737
38232A1063024j472115j069677j161220r70974o79424o34371o34600m22543j96442
38223C821658k03710k84802j92066k0130J6694k3664M4610J86080K32665K04117
38213C781452K76301M88142P09279Q87410J128016J483826J806196J878174J620745
38204A4059541J111889M62278k48713r28175j442275j679391j625603j370917
38196H338634j067247q61247p85283p03186m75964k14461k00507m59271o20367
38187B951101m12101r3057p2384k55867k07640Q7100J48297j97679m79776l19523
38177A148471k4088l9299k08375r0853K47712L40369R6448q9902j5699O6483l9979
$$ y = [6728388, 9366143, 13828714, 19332203, 23132122, 22794984, 18814124, 14125761, 11063024, 9590909, 8521232, 7360012, 6389038, 5709614, 5075243, 4440643, 4018100, 3821658, 3617948, 3333146, 3141080, 3120950, 3137644, 3113980, 3158590, 3344670, 3577335, 3781452, 4057753, 4545895, 5255174, 6142584, 7270600, 8754426, 10560622, 12438796, 14059541, 15171430, 15633708, 15384995, 14456820, 13014545, 11335154, 9709551, 8338634, 7271387, 6410140, 5624857, 4921671, 4445707, 4231246, 4030739, 3571468, 2951101, 2539000, 2445943, 2373559, 2117692, 1910052, 1997152, 2145449, 1947770, 1467994, 1148471, 1124383, 1085084, 876709, 785856, 1033568, 1373937, 1470385, 1380483, 1364784, 1431267, 1391288]
38166A391288j58616j01483L1848J04469J68086K55211K57030K13574M04728Q63494
38156C429629J075934N57534m09644j017558q97785m82426l24117m05133l49867
38147A176567q4355O5087r6922l28766l14134j04879K0778O808L9931J54763J40785
38136F75663o7593k11903j05552N0710K716j23698m7367J56705J52276r2292k20872
38125A68793l6580K11502K23252M9707o7913m4080M2931J24275J53282O9494r9107
38114G95556j96130j28638j0711L415n3110k5214J21301K36967J64813p5386k78022
38103E54841k36380K1218K21754J66702N606L3971K53030L51523J60737j06416
38093A426586j74986o0100M6100O6931M3299k9273j69394k79742k28081m9327
$$ y = [1391288, 1232672, 1131189, 1163037, 1267506, 1435592, 1690803, 1947833, 2161407, 2566135, 3429629, 4505563, 5063097, 4653453, 3635895, 2738110, 2255684, 1931567, 1526434, 1176567, 1092212, 1157299, 1060377, 731611, 417477, 312598, 333376, 340184, 380115, 534878, 675663, 608070, 396167, 290615, 341325, 344041, 220343, 172976, 329681, 481957, 389665, 168793, 132213, 343715, 566967, 616674, 548761, 504681, 547612, 671887, 825169, 894663, 795556, 599426, 470788, 460077, 463492, 410382, 385168, 506469, 743436, 908249, 832863, 554841, 318461, 339679, 561433, 728135, 733741, 767712, 1020742, 1372265, 1533002, 1426586, 1251600, 1191500, 1237600, 1304531, 1347830, 1318557, 1149163, 869421, 641340, 592013]
38083E92013O5357k836j61406k12607o9868J31264J56658n2385k76206k76278
38073a06294r6052M1982P6291J24211J83850J00340j11968k05179q1565L5087
38063c9297j8889o7883P2862K42319K01676N3400N4382J51775P4710j73225k86344
38052B65486j43261J7287j0249j17694j19368l5750R707J2887N7253J52674K18514
38041C07486J80647L4109j44310k35986j93221r6914l3185L2236J45614K05644
38031B02120R1194q9135r2992R0023J88913L9572j78835k09916n7215Q1033Q7457
38020A52219q166j43491k54170k45915q1445J19088J83116R6359J3397M5112J26090
38009B194J33507O3027R081J604l6813j38557j87935o5851J50312K56698J88048
$$ y = [592013, 657370, 654534, 493128, 280521, 210653, 341917, 498575, 446190, 169984, -106294, -202346, -160364, -84073, 40138, 223988, 324328, 212360, 7181, -74384, -39297, -58186, -126069, -53207, 189112, 390788, 444188, 498570, 650345, 725055, 551830, 265486, 122225, 139512, 129263, 11569, -107799, -143549, -133842, -120955, -63702, 88972, 307486, 488133, 522242, 377932, 141946, -51275, -148189, -181374, -149138, -3524, 202120, 293314, 204179, 111187, 201210, 390123, 429695, 250860, 40944, -16271, 64762, 152219, 144053, 562, -253608, -499523, -580968, -461880, -278764, -182405, -169008, -123896, 2194, 135701, 198728, 207809, 209413, 172600, 34043, -153892, -219743, -69431, 187267, 375315]
37998C75315P5303J3557o5006k04496k72267j39192R6900K28361K03866J23559
37988D35900L7631p6511j75897j68110o3314L1261N8479L1252m9981j54281j50425
37977b43996L9177K55911K76220J35202N7071Q3802M1638r4934j05512R9074K73578
37966H17231J83962n6142j79726j26067k1479N1393P2643n343j72260k75823k06067
37955H2322q0794o7989j12372m9268P6491N6958j14453j81274p406J94429J61686
37944d1670m1544j30417j3005R7039O518j82165k25016o6293J27981K26735K54338
37933A2501K32274R3381j36113k43788j05116P7285L7334j40073j43440O2892
37923b52863J80197O3581o3875j5925N5871j8082p8522R4887L53626L46217L3874
$$ y = [375315, 450618, 464175, 399169, 194673, -77594, -216786, -119886, 108475, 312341, 435900, 473531, 397020, 221123, 53013, -10301, 20960, 79439, 110691, 60710, -93571, -243996, -204819, 51092, 327312, 462514, 519585, 603387, 645025, 550091, 444579, 543653, 817231, 1001193, 945051, 765325, 639258, 617779, 669172, 741815, 736472, 564212, 288389, 82322, 1528, -66461, -178833, -228101, -151610, -94652, -209105, -390379, -397785, -203356, -41670, -83214, -213631, -226636, -129597, -123079, -305244, -530260, -596553, -468572, -241837, 12501, 244775, 338156, 202043, -41745, -146861, -69576, -32242, -172315, -315755, -252863, -72666, -9085, -72960, -88885, -33014, -51096, -129618, -34731, 318895, 665112, 698986]
37912F98986k56976k81869j28484p830o769q0709j29048n3516J34322K74860K43991
37901D06958J20381L2284o8400k70724m23921k78637Q7101K82644J32009q2818
37891f3123m5614J62217K44657J27372j4279o2946p4586j13855j52422j46863
37881a39442j00926l9109K797k3246j08686j44703l8667J41599K32377J76416
37871d1590O9261N379j7246j7073L4460J30345J67422O4091j02550j70640r0707
37860C1152L6460J13266J37357J21018L3421j04391j60591m1615J48090K12138
37850E26305J07833k5949p3929n2423p070N5194R1277K1141j21478j64967l0575
37839C25359J18920Q5808q9184j99996j67178j02219r2187p4539K7719J58842
$$ y = [698986, 442010, 160141, 31657, 23827, 17058, -63651, -192699, -246215, -111893, 162967, 406958, 527339, 559623, 491223, 220499, -203422, -482059, -394958, -112314, 19695, -63123, -108737, 53480, 298137, 425509, 411230, 348284, 273698, 159843, 7421, -139442, -240368, -279477, -276680, -299926, -408612, -553315, -591982, -450383, -218006, -41590, 27671, 33050, 15804, -1269, 33191, 163536, 330958, 395049, 292499, 121859, 31152, 67612, 180878, 318235, 439253, 472674, 368283, 207692, 166077, 314167, 526305, 634138, 608189, 534260, 481837, 474767, 529961, 621238, 642379, 520901, 355934, 325359, 444279, 530087, 440903, 240907, 73729, -28490, -120677, -195216, -167497, -8655]
37829h655J96994J21232M4545P5188J75857J95294N5915j29467j87445j03454
37819D36004j8079j0404q992M8451R7779O1176l4054j24164j87688j83312m1825
37808C4892J78935K70123J37355l7188n0788K7775M799j15001j70908j31146j00454
37797D8394r0952k6365M5875m727j25810j03962R5812K41007J63288j9253j04197
37786A19110n5201M7532J51982K20212J90370N8830p4775j09167l2311R3973J60571
37775G71126O2171j46548k00355P7298M56973N22523K11408j24893k30367k13875
37765A185461k22662j73567N274J43854Q1056o1462r0675n1716r2195j71781j48659
37754D02928l5547N2765R4306R8204j2861k29084l08234p7369K38639K87994R8421
$$ y = [-8655, 188339, 309571, 354116, 429304, 605161, 800455, 856370, 726903, 539458, 436004, 417925, 407521, 398529, 446980, 544759, 605935, 571881, 447717, 260029, 76717, 34892, 213827, 483950, 621305, 584117, 533329, 561104, 565903, 450902, 279994, 148848, 48394, -42558, -68923, -23048, -27775, -153585, -257547, -161735, 79272, 242560, 223307, 119110, 63909, 111441, 263423, 483635, 674005, 732835, 658060, 548893, 516582, 610555, 771126, 833297, 686749, 486394, 563692, 1020665, 1543188, 1754596, 1629703, 1399336, 1185461, 962799, 789232, 794506, 938360, 1019416, 957954, 867279, 815563, 723368, 551587, 402928, 367381, 420146, 514452, 612656, 599795, 370711, 62477, -14892, 223747, 511741, 610162]
37743F10162q943N6058Q1531M539L9589K54054L69841J74336j40248k56183j50955
37732A033781l7962l8250j06985j82536k31751k12077j28074o8826p7875n6610
37722a07165Q6855K59344K80308J18301q1943j79873j50137m7120M0152K2964
37712B41686r3299j64069o1541J25003J63665j2181j87602j36877P8457J99059
37702A52301J11535l7385q4738o2967q2626j19652o2929P8935J74330J67551J32276
37691C66631J06912L3288q6092j28189m5715J3609q4528k35282k22796j2419K15944
37680g8637K85010J64411n2079k11576j98444o0905K2693j5710l9000M1231P4900
37669f8106p1224k16480r8878J79402K55901N1101j15534j9496J62857J71426
$$ y = [610162, 601219, 657277, 738808, 743347, 782936, 1036990, 1406831, 1581167, 1440919, 1184736, 1033781, 995819, 957569, 850584, 668048, 436297, 224220, 96146, 27320, -50555, -107165, -20310, 239034, 519342, 637643, 555700, 375827, 225690, 178570, 218722, 241686, 148387, -15682, -77223, 47780, 211445, 199264, 11662, -125215, -46758, 152301, 263836, 226451, 141713, 78746, -3880, -123532, -186461, -107526, 66804, 234355, 366631, 473543, 506831, 420739, 292550, 246835, 260444, 175916, -59366, -282162, -294581, -78637, 206373, 370784, 318705, 107129, -91315, -152220, -129527, -145237, -184237, -143006, -68106, -139330, -355810, -454688, -275286, -19385, 31716, -83818, -103314, 59543, 230969]
37659B30969K4866r8809j32297r5431K0728J69267J98099N8241p6618o7636l8531
37648A92848j44004k53293j28890J53347K48429K1611k64375l08629j18339R6289
37638e05006K06183K15676J45009J3026r3566o0859J05427K37554J69817n8440
37628C74821k17318j44832M9019J18063L309j04322n9238L2264J3962m6936J5992
37617C4784J39119P5710j84175k88659J3223M48597N03308Q5635l40919l55719
37607A30904r1522K3849j18984k23588q8271J03781J16509L2182N7864J27866
37597G0590J1276k34801k62904L3574K97248J99528q4705j48405N9573K12765
37587A53739J14603p0297j30877r3474p5651n8689K3940R1378m332k35188l88315
$$ y = [230969, 255835, 157026, 24729, -70702, -49974, 119293, 317392, 375633, 299015, 231379, 192848, 48844, -204449, -333339, -179992, 68437, 90048, -174327, -482956, -601295, -505006, -298823, -83147, 61862, 74888, -18678, -79537, 25890, 263444, 433261, 374821, 157503, 12671, 61690, 179753, 183062, 78740, 19502, 51766, 65728, 18792, 34784, 173903, 249613, 65438, -223221, -209998, 238599, 741907, 827542, 486623, 130904, 39382, 63231, -55753, -279341, -367612, -263831, -147322, -115140, -57276, 70590, 81866, -152935, -415839, -382265, -85017, 114511, 29806, -118599, -59026, 153739, 268342, 198045, 67168, -26306, -101957, -160646, -136706, -45328, -49660, -284848, -673163]
37576f73163l17599r5406J14236K37614K94668L00090K48658J69256J08007N5856
37566D42217l3031j37002j62083q2277p065l6837j11088r5962J3487R1278P5533
37555d2830M6313P6185J12011P3484r312m2884j3554J326m1860q9059p3236j8165
37543b1581j1357p6334j20298n0741Q3167J37646O4866l1895o3317p0666j10822
37532b71332j30717o4345L0899O1059M6192M8551K8442o2133j15594p640J45418
37521b91200J11006q1065j46967J7221J75305J22183l4054r7849o9670l9532P005
37510c27617R4640J33746P0454J6498N7427Q1077j8230j17824o4322M3154J1556
37499a9441j06566r4739O2657J59363J02433K5849L7351O1143J780q6638p5346
$$ y = [-673163, -990762, -1086168, -971932, -734318, -439650, -139560, 109098, 278354, 386361, 442217, 409186, 272184, 110101, 27824, 20759, -16078, -127166, -223128, -209641, -118363, -42830, 3483, 79668, 191679, 265163, 255851, 212967, 199413, 200739, 158879, 69820, -3416, -21581, -32938, -109272, -229570, -280311, -197144, -59498, 5368, -26527, -89844, -160510, -271332, -402049, -466394, -435495, -374436, -328244, -279693, -251251, -313384, -428978, -436618, -291200, -180194, -261259, -408226, -391005, -215700, -93517, -127571, -225420, -295090, -334622, -327617, -232977, -99231, -28777, -12279, 45148, 126225, 107995, -9829, -74151, -30997, -19441, -126007, -220746, -158089, 1274, 103707, 129556, 166907, 228050, 229830, 143192, 67846]
37488F7846O8377K25226K20102R957k13086k11364k5714N6446p1867j67019l9836
37477h0932J18745O2148q2952l3104J66671K30683J06147k958k5835p3833j30011
37466B54769o1447N7925J0605j55181j61933M429L9726j51001k80385j73942l8647
37455f55082m9358m8694J07146K50886K14644J28334J37898J16992n3412j93266
37445d3912j22722m049n4271j39837j3840K24177K76839J31727L9475R0789J38444
37434E22820Q5001l0328j67955k69096k05575J0096J13547l9961j77482j4974
37424a73907K37659K00170j9915q552K05496J68831j92535l85114j34234J87660
37414H5559J82070m255n5892k6993j17347k24784j28799R1255J95505J78754J81526
$$ y = [67846, 136223, 361449, 581551, 591508, 378422, 167058, 141344, 197790, 125923, -41096, -80932, 37813, 99961, 17009, -16095, 150576, 381259, 487406, 484448, 458613, 384780, 254769, 193322, 251247, 261852, 106671, -55262, -50833, -11107, -162108, -442493, -616435, -655082, -704440, -753134, -645988, -395102, -180458, -52124, 85774, 202766, 149354, -43912, -166634, -170683, -224954, -364791, -378631, -154454, 122385, 254112, 293587, 384376, 522820, 607821, 577493, 409538, 140442, -65133, -55037, 58510, 18549, -158933, -173907, 63752, 263922, 244007, 235455, 440951, 609782, 417247, 32133, -102101, 85559, 267629, 263374, 207482, 180489, 63142, -161642, -290441, -199186, -3681, 175073, 356599]
37403C56599J52340m2391k70624k61220m4915O8079l3840j13832K3029K46845
37393H0070L08693J46499j02546k66509k58796j33610m4368o5725q7714N776J19767
37382b98463P9886o3654p9408Q6547K14508J36413m0735j32538j24169r4560l7734
37371c53907Q3196J90072J56178o131j43667j50092p5093l7473p9645j23668o4506
37360f04736Q9461J98336J61030O3494N7539J19683Q4579o5606j39189m9284J1326
37349g3367j21783k73621j71143J07347K12937M1191j24488m8556J42998K07685
37339a00800J18356j0283j35461k37075k11182k6475J28488P5532o4973m7414
37329e11287J09355J66248O6123Q460R4412J73329J20221J4284n7514j30432j79486
$$ y = [356599, 508939, 466548, 195924, -65296, -110211, -42132, -75972, -189804, -166775, 80070, 388763, 535262, 432716, 166207, -92589, -226199, -270567, -336292, -424006, -418230, -298463, -218577, -282231, -361639, -275092, -60584, 75829, 35094, -97444, -221613, -316173, -353907, -270711, -80639, 75539, 69408, -74259, -224351, -299444, -336917, -416562, -540230, -604736, -515275, -316939, -155909, -92415, -34876, 84807, 169386, 103780, -35409, -84693, -73367, -195150, -468771, -639914, -532567, -319630, -278439, -402927, -451483, -308485, -100800, 17556, 7273, -128188, -365263, -576445, -602920, -474432, -398900, -463873, -511287, -401932, -235684, -169561, -161101, -66689, 106640, 226861, 241145, 183631, 53199, -126287]
37318a26287o6371J67479K14955o1710l43290k83886l1392K3766j22284j12793
37308g41813J55786L66964L03088J47165J12733J03836l8493k11915k26934j19634
37298a49217m3843M558J06184J75350O9769j14629j29328M7399J66556Q1173o8255
37287A45717j11229p3677l9389J6348J02624Q9456r4530k57529j68403O8587J13264
37276b08761j15302k94797j57561J26954K14400P6866j1213Q2148J75705R0820
37266b0741q3001j50558q5057o293J8049J9597L3125O0655R5739J04949L2617
37255A9081j02888j79490j21897j5722K1782Q200J6347J0764p4645j50750o0095
37244f29313J53506K56928J48013j3934o0058k6220k6172o2179p7946p9097p6851
$$ y = [-126287, -192658, -25179, 189776, 128066, -215224, -499110, -530502, -506736, -629020, -741813, -586027, -219063, 84025, 231190, 343923, 447759, 409266, 197351, -29583, -149217, -193060, -188502, -82318, 93032, 162801, 48172, -81156, -33757, 132799, 213972, 145717, 34488, -39189, -78578, -62230, 40394, 129850, 35320, -222209, -390612, -322025, -208761, -324063, -618860, -776421, -649467, -435067, -358201, -369414, -287266, -111561, -20741, -103742, -254300, -339357, -345650, -327601, -308004, -274879, -214224, -118485, -13536, 19081, -83807, -263297, -385194, -400916, -379134, -370934, -354587, -343823, -418468, -569218, -629313, -475807, -218879, -70866, -84800, -144858, -171078, -197250, -259429, -337375, -416472, -493323]
37233d93323j2632J29597K19895J35221m1692j21649o8511q328J24L1730J05267
37222a24301J01210l9754j70124j18801N8261J52792R3223J0609J1200L7730J5595
37211B7640m110M3603R1235M5506l3623k3841L3432j4623j57895k03876p5180
37200b71732P1413R6691N4061J7019n7437j53216r9561J49638L35103K35660K6007
37189D03646P180J20580O9859j57518k69532j64768o7666j04602j10010J8296
37179b54535J05158J6585r4994o5296R367j0076l2143Q3231K38936K37598Q6735
37168C20566m5061q1604o3004q584O6394P6808k6156j41897j48321o8639P51L1810
37156h6937L0464j8603o8227j4915J00377P5132j33119k69711j46953O1430J10347
$$ y = [-493323, -505955, -376358, -156463, -21242, -62934, -184583, -253094, -261422, -261298, -229568, -124301, -23091, -62845, -232969, -351770, -293509, -140717, -47494, -36885, -25685, 12045, 27640, 23530, 67133, 158368, 203874, 170251, 146410, 179842, 165219, 7324, -196552, -271732, -200319, -103628, -49567, -32548, -89985, -243201, -342762, -193124, 141979, 377639, 403646, 410826, 531406, 601265, 443747, 174215, 9447, -58219, -162821, -272831, -254535, -149377, -132792, -227786, -293082, -283715, -293791, -325934, -242703, -3767, 233831, 320566, 275505, 193901, 130897, 122313, 188707, 265515, 239359, 97462, -50859, -119498, -118747, -86937, -56473, -75076, -143303, -158218, -57841, 17291, -115828, -385539, -532492, -471062, -360715]
37145c60715O2757J10545K00004J50729J1809k9251M944m7248j44200j05047L7805
37134a07868Q6710L8120M6789O5043r6280l36875l09116K7680K87647K22312M0116
37123c5722M764O2606O7663N9909Q8578L2977j56162k72037j52018M4760R6228
37112a58454N3125O5921O7815p8513k54851k12132M1780K40813K19297O1366p6015
37101b9848j02690M482J66979K08891N5772j20318j11973L1609J00063M7403J5956
37090B66326O0623O4181m1879j50083j31731k056J13309J00708n4046k25459k25894
37079b26001j8503J87374J69361j8251j25516n1778N2684M3603k3983k8034K1114
37068a7930J7066o5436j24472o6047O3146J13370J1860j28534j38324j4143Q1103
$$ y = [-360715, -297958, -187413, 12591, 163320, 175129, 145878, 150822, 103574, -40626, -145673, -107868, -21158, 16962, 63751, 128794, 32514, -304361, -613477, -585797, -298150, -75838, -35722, -30958, 31648, 99311, 159220, 247798, 280775, 124613, -147424, -299442, -254682, -158454, -105329, -39408, 28407, -50106, -304957, -517089, -475309, -234496, -15199, 46167, -29848, -132538, -128056, 38923, 247814, 303586, 183268, 71295, 102904, 202967, 250370, 266326, 326949, 391130, 349251, 199168, 67437, 65381, 178690, 279398, 225352, -107, -226001, -244504, -57130, 112231, 93980, -31536, -83314, -30630, 12973, -11010, -39044, -17930, -864, -66300, -190772, -256819, -193673, -80303, -68443, -196977, -335301, -349444, -268341]
37057b68341N4730o35J5307M8980J5521k8765J9585J16189J19696M310j12849
37046a6272j38385q0589J7962J13201J42640Q0484r204o4967j26559k29009k61017
37035e71715r4031J70418K67434J16210o1913m1017J23733J99312Q0267j04427
37025H4271j63149n6567P3052P8764j2076n3778j2505k0537j41584k25583j32358
37014e82050K5047N0704j3530K7137J61977J71690K777j30413r7271m0852q5856
37003e10640j05616L0467J89186J89963J24944J89146L00982K05332p0657j87963
36993C55144N942K34704J94473l4122j72634j66309j69741k08157j33691P0105
36983b4286J95377J12572l5182p0905n2585j27880k35263j69362Q1498K68182
$$ y = [-268341, -213611, -214246, -198939, -149959, -134438, -163203, -143618, -27429, 92267, 96577, -16272, -154657, -235246, -217284, -104083, 38557, 119041, 109837, 44870, -81689, -310698, -571715, -665746, -495328, -227894, -111684, -173597, -214614, -90881, 108431, 188698, 84271, -78878, -135445, -62393, 16371, 4295, -49483, -61988, -82525, -224109, -449692, -582050, -557003, -506299, -519829, -492692, -330715, -159025, -156248, -286661, -383932, -424784, -510640, -616256, -585789, -396603, -206640, -81696, 107450, 408432, 613764, 543107, 355144, 361086, 595790, 790263, 756141, 583507, 417198, 247457, 39300, -94391, -24286, 171091, 283663, 248481, 177576, 124991, -2889, -238152, -407514, -326016, -57834]
36973e7834J94653n0959k34509k26024n9124J45512K45106J54496n9362k16110
36963a64155k04589p7154N4179J30574J29940M4508o8741j04648l3660O5710J27869
36952a00167J54885J30035J7655j04389p8327Q3759J56826K6576j21700r6716
36942F8437q154o0478j75093r1209K01309L92377K52752q6007l11501k69195p8834
36931a65596J8622p8170k05578j39671O6593J23426m7281j42256O5683L39239
36921a64989L22486Q3017l2283M8040Q8290K792m9771k9361q6853k21429k25570
36910b65631n3406Q9477J06895J26947J68783O1208j70566k11691N0379K85187
36900A87582K06693j2134p4916k1003m6133j09878n4682O0385O5245j1430k9454
$$ y = [-57834, 136819, 85860, -148649, -374673, -433797, -288285, -43179, 111317, 51955, -164155, -368744, -445898, -391719, -261145, -131205, -86697, -155438, -260086, -293746, -228036, -100167, 54718, 184753, 202408, 98019, 19692, 103451, 260277, 286853, 165153, 68437, 60283, -195, -175288, -266497, -65188, 327189, 579941, 493934, 182433, -86762, -165596, -146974, -225144, -430722, -570393, -503800, -380374, -427655, -569911, -504228, -164989, 157497, 240514, 208231, 256271, 344561, 347353, 297582, 268221, 181368, -40061, -265631, -319037, -229560, -122665, 4282, 173065, 234273, 63707, -147984, -97605, 187582, 394275, 382141, 307225, 286222, 240089, 130211, 75529, 135914, 201159, 189729, 160275]
36889A60275k1754j10593k28543j93373m897J65331K25499J99720Q4506j21618
36879A54553l01128l19143j96194l9542J08237K18565K08537Q2240k804K9785
36869e6894M8872o925L8992K53334L36629N1650l12772l10972j5205J18480l9074
36858A06115j75186j01231K4523O9705R1921P0698j08696l22296k68868L0766
36848e82549K00649R5310l679P0785Q6516r7233j98006M087K32706J53987o4194
36837a01621n5338J26470J45331j7013o6274O3593J18820n118j01719m3649J0776
36826G4258o6463j36699m6650R5430Q7265n4339j28264l7635J02431J37338N1773
36815G8445m4796n2252L4932J49583K09109J43642o6566l21234m23948k82975
$$ y = [160275, 138521, 27928, -200615, -393988, -398885, -233554, -8055, 191665, 276171, 154553, -146575, -465718, -661912, -701454, -593217, -374652, -166115, -83875, -86679, -56894, -8022, -14947, 24045, 277379, 614008, 665658, 352886, 41914, 26709, 145189, 106115, -69071, -170302, -145779, -76074, 15847, 86545, -22151, -344447, -613315, -582549, -381900, -286590, -290269, -219484, -132968, -230201, -428207, -424120, -191414, -37427, -101621, -156959, -30489, 114842, 97829, 31555, 95148, 213968, 208850, 107131, 63482, 74258, 7795, -128904, -175554, -80124, 7141, -47198, -175462, -213097, -110666, 26672, 78445, 33649, -18603, 16329, 165912, 375021, 518663, 452097, 130863, -293085, -576060]
36805e76060o2559n218j07813j28639N7340K84202L43251K32894O1006j29266
36795c0862k92923k98233r8132J15071J20514k4941p0630P6129K53962K88132
36785C8087J71327J505j25268j46636o8457J8556L3835M156m652n695m4140q2725
36773b10107n3121J4166L6217K7268O8631J40316J23142j0849j32500j21544j0181
36762a28562P9228Q0331L7383M3920J29658K03298J56643L6472Q490R8167J07862
36751H52890q9348l10984l01587j05284J7166j9214o1752l4425m4414j23346j22043
36740c42341K0476J23268L4360j18337j23633m590N1596r16k8012M2067J16525
36729b29537J05263N2610M4769P5423P1169Q636n2276m9753k202J0603n0109j17199
$$ y = [-576060, -638619, -643837, -751650, -880289, -822949, -538747, -195496, 37398, 98404, -30862, -323785, -622018, -720150, -605079, -484565, -509506, -580136, -504007, -250045, 38087, 209414, 210919, 85651, -60985, -129442, -110886, -77051, -72895, -77547, -83242, -127382, -210107, -263228, -249062, -212845, -185577, -116946, 23370, 146512, 135663, 3163, -118381, -128562, -49334, 30997, 68380, 112300, 241958, 445256, 601899, 638371, 646861, 745028, 852890, 763542, 452558, 150971, 45687, 62853, 43639, -18113, -52538, -96952, -220298, -342341, -321865, -198597, -164237, -282574, -406207, -410797, -359201, -360117, -388129, -346062, -229537, -124274, -71664, -26895, 48528, 119697, 128333, 76057, 26304, 24102, 34705, -15404, -132603]
36717a32603q2830O8358K18241K25420O7925j34660k38594k06869j14855l6311
36707c66778K8301Q1488O1144n3442j19135J7912K40852K46736p540j80083l5949
36696h6494J67818P0122j98006j87344J59570L96742K44520l4580j07719n4931
36686C69698j05474j85025q4224J02023R1326r9318j57826R914J19752k6787k13781
36675a79722j38137J36879K83311J63833l2064q9104j7940M3479M6568N0622Q1270
36664C48995P8390L758p3524n8301L3285Q2924J5854j21708k37544k78609k22679
36653d29159o8773J10075J80434R8157p518O857R5503R3828k3659r7020l1797
36642g3072M3147k5561j58636j45204K5749J16918j1740j72770j15002R0390J43124
$$ y = [-132603, -215433, -147075, 71166, 296586, 364511, 229851, -8743, -215612, -330467, -366778, -338477, -256989, -195845, -249287, -368422, -350510, -109658, 137078, 129538, -50545, -86494, 81324, 151446, -46560, -233904, -74334, 322408, 566928, 532348, 424629, 369698, 264224, 79199, -5025, 96998, 188324, 89006, -68820, -58906, 60846, 34059, -179722, -317859, -180980, 102331, 266164, 234100, 144996, 127056, 170535, 217103, 267725, 348995, 427385, 431143, 357619, 299318, 332603, 415527, 431381, 309673, 72129, -206480, -429159, -497932, -387857, -207423, -109266, -116784, -109927, -14424, 79404, 55745, -41275, -73072, -29925, -55486, -214122, -359326, -333577, -216659, -228399, -401169, -516171, -425781, -282657]
36631b82657k7594j46499j8334J68088J46597m859j4770J19557J33792n2844k06987
36620a86510j69104p2934m9499M802J71444K70422J29446r8018j60348j03965
36610b64264j39014k20966j14538J57859K88605J55222o521K486P4043N3217m758
36599a8629j6149o3358j91203k14876J2154K86513K85366K3063j86602j78093
36589b61814q0703k1625N0391J76199K43667J50754l2739j64647j85203j07003
36579b32723L4403J51628J41917K8841l9077l885R921q7229j75223j09329L3507
36568b47249P8040M5560J03847K36439K05506p6975l50443l26492o7502J28242
36558b71027J33910R4450J41023K01036J55775M1997j5257L683K586o4967j20035
$$ y = [-282657, -310251, -456750, -475084, -306996, -160399, -165258, -180028, -60471, 73321, 20477, -186510, -355614, -428548, -478047, -473245, -301801, -31379, 98067, 49, -160299, -264264, -403278, -624244, -738782, -580923, -292318, -137096, -143617, -141131, -67088, -13871, -18629, -34778, -98136, -289339, -504215, -492061, -205548, 79818, 102881, -83721, -261814, -342517, -364142, -313751, -137552, 106115, 256869, 224130, 59483, -125720, -232723, -198320, -46692, 95225, 124066, 84989, 81104, 91025, 3796, -171427, -280756, -247249, -169209, -123649, -19802, 216637, 422143, 345168, -5275, -331767, -399269, -271027, -137117, -42667, 98356, 299392, 455167, 497164, 481907, 485590, 488176, 423209, 303174]
36547C03174p9992P847J5130r5889k08442j93388p8621p426k8162j9720J13907
36536b71582K60487K31234L8885j04598q6871l5946q6590j53087p8185Q7633J39658
36525e8962K8408o4442L150J36445J51858J5078j50352k18687j56678k6264M8187
36514b92259j5961j30794j00409J08974K64315J59690p1728j21525N3088J67983
36504B1374L5877j59332j42310N3299J49221K1448j52641j61503k5814P2282M2355
36493b45744k1458Q051J10600J40799L4175p7102l5973Q7288N7781j70489l25090
36482d37162j65885J57703K83125J06839j20883j64154n9576L6351O6157M8580
36472b48905q573o6762m7792L7194O4408m898l2406P5506J82893J10698r4318
$$ y = [303174, 223182, 231029, 246159, 150270, -58172, -251560, -330181, -337607, -365769, -385489, -271582, -11095, 220139, 259024, 154426, 67555, 31609, -54981, -208068, -286253, -198620, -58962, -30554, -94996, -91846, 44599, 196457, 211535, 61183, -157504, -314182, -340446, -292259, -308220, -439014, -539423, -430449, -166134, -6444, -78172, -199697, -146609, 21374, 57251, -102081, -244391, -191092, -41871, -20423, -173064, -334567, -360381, -288099, -245744, -267202, -259151, -148551, -7752, 26423, -50679, -86652, 636, 58417, -112072, -437162, -603047, -445344, -162219, -55380, -176263, -340417, -399993, -363642, -297485, -248905, -257478, -324240, -372032, -334838, -270430, -275328, -307734, -232228, -49335, 61363, -32955]
36461c2955k33942k14368p4224J39896L37423L24434K3629l00038k97208o321
36451c33674K01267J58123P6183J19023J36496m468j30316n4727P6903L3755q3940
36440A94625n364K31517L01760Q0810j98644l09597k69640j57824L0240K29711
36430A27594K52706M7421j72501k16027j70846k02208k46724j24135J34169K97177
36420b73374K56076J36245P1624M2860q776n0813k4887M5903Q7191O1373j4036
36409C29386q9054j00613k4962P0589Q7390K0590m3937o6878r5007j35994j10292
36398a58782K475Q0639K9764n7545m2475L3013K0026q0030j15171l6887L7202
36387b87771M8898Q8852J83322J91904M9840o7582j179J18560O7861j09962j84220
$$ y = [-32955, -266897, -481265, -555489, -415593, -78170, 246264, 269893, -30145, -327353, -333674, -132407, 25716, 101899, 220922, 357418, 352950, 222634, 167907, 244810, 278565, 194625, 189261, 420778, 722538, 803348, 604704, 295107, 25467, -132357, -102117, 127594, 380300, 427721, 255220, 39193, -131653, -333861, -580585, -704720, -570551, -273374, -17298, 118947, 190571, 233431, 224655, 173842, 148955, 194858, 282049, 343422, 329386, 240332, 139719, 114757, 185346, 272736, 293326, 249389, 182511, 87504, -48490, -158782, -156307, -75668, -45904, -103449, -145924, -112911, -92885, -172915, -288086, -324973, -287771, -238873, -150021, 33301, 225205, 275045, 207463, 206284, 324844, 392705, 282743, 98523]
36376I8523j11757o4507r3243m3742J35282K63244K16214J17487J03312J01144
36366G21957N951r9728r3407l6794m6259n7287N0583J72054P5825k20710m13988
36355E8197l03495l0837J41720J39423P3463M3005L9851L991q8875j82505j77147
36344b83209m0164J37624K34896K13885R9615p9726k46741k56311o4675J38166
36334a46640J29362l9312j09332J3661J48017J28357J6821n4522q0373j10410
36324a04371j13453l6433Q4334J66958J74878J06420k0793j25541j11042j5390
36314E567R482o1732n8934J00802K20306Q8196j77746k66871j02356Q5212J10672
36303d7402N1213N3793J06021J09015N7873J9636p433q3362j83233j81938l2279
$$ y = [98523, -13234, -77741, -170984, -214726, -79444, 183800, 400014, 517501, 620813, 721957, 727908, 628180, 534773, 497979, 451720, 394433, 445016, 617070, 692895, 472185, 58197, -245298, -276135, -134415, 5008, 78471, 121476, 161327, 165318, 76443, -106062, -283209, -323373, -185749, 49147, 263032, 362647, 282921, 36180, -220131, -284806, -146640, -17278, -56590, -165922, -152261, -4244, 124113, 140934, 86412, 6039, -104371, -217824, -254257, -169923, -2965, 171913, 278333, 257540, 131999, 20957, 5567, 15049, -46683, -105617, -4815, 215491, 303687, 125941, -140930, -243286, -158074, -47402, 3811, 57604, 163625, 272640, 330513, 350149, 342716, 259354, 76121, -105817, -138096]
36292a38096J20673R4194q6530k00671j14724N0511J05476M6558O650K4766K6117
36281f5076L063L6460J20701J41411O6733q400n1049j28045j91024o1584K32954
36270I6144L51197Q6353k73340l08766n2437J08332K7758n5697J5491P2772l1783
36259C6024j37651m4910J36066J44455l1512j46211n9683Q8270J02738j4219j16862
36248d3495j34469j26510j32750q4427O4741J99661J68815K6193j6208Q6783J21879
36237A30213m5759k28293j85971N655Q9266L0207K5205J41248K14005J37011J6479
36226C29266k3623M017M6411Q4482P0510l1566j18436n5264P3084M7988j22196
36215C04673j97313j10421o6219j40243j28099M1367J08609n4857j48423N8532
$$ y = [-138096, -17423, 76771, -9759, -210430, -325154, -274643, -169167, -122609, -115959, -91193, -65076, -62013, -25553, 95148, 236559, 303292, 294892, 243843, 115798, -75226, -136810, 96144, 447341, 533694, 260354, -48412, -100849, 7483, 35241, -20456, -4965, 67807, 36024, -101627, -146537, -10471, 133984, 102472, -43739, -103422, -15152, 87586, 73367, -43495, -177964, -304474, -437224, -521651, -456910, -257249, -88434, -62241, -78449, 8334, 130213, 84454, -143839, -329810, -324155, -234889, -204682, -179477, -38229, 175776, 312787, 329266, 305643, 309660, 356071, 440553, 511063, 479497, 361061, 305797, 378881, 426869, 304673, 107360, -3061, -69280, -209523, -337622, -296255, -187646, -242503, -390926, -332394]
36205c32394K63170R6567k16397j85637J24642J86697j16564l02811q1349K16868
36195c47208K20976O2969M0481J09441N4099j00086j71739j38373q6173m219J21114
36184b38718J63225M9387n9178k2339J7054j02945k17280q2290J72458K15259
36174a05367M7068l3122L9851K6705j21947j41278N5461J78005N0234p7357L6103
36163d5644K05160J48560l6873q1682j2100m0621j37420r7350M8799P0742m4818
36152b3247p9736J1665M4912j8012l825R2507M8642j40993j56629J12196L05909
36141A93389J48858q4691k0286J92022J45694j23449k01302R278J49888J4025
36131D23426j53201j04072L5847L4704r2154j95431k27553j80111N068K71784
$$ y = [-332394, -69224, 27343, -189054, -374691, -250049, -63352, -179916, -482727, -564076, -347208, -126232, -63263, -22782, 86659, 140758, 40672, -131067, -269440, -355613, -359832, -238718, -75493, -26106, -85284, -107623, -90569, -193514, -410794, -493084, -320626, -105367, -58299, -91421, -51570, -24865, -146812, -288090, -232629, -54624, -4390, -81747, -45644, 159516, 308076, 271203, 189521, 177421, 136800, -620, -97970, -49171, 21571, -23247, -102983, -91318, -46406, -64418, -68243, 24264, 72906, -68087, -224716, -112520, 193389, 342247, 257556, 237270, 429292, 574986, 451537, 250235, 259513, 409401, 423426, 270225, 166153, 202000, 236704, 144550, -50881, -278434, -458545, -453477, -181693]
36121a81693L79153J91504j06458k53976k26295j41899l1304J00041J34767K968
36111a33192j36607j00702L7403R5210R3200J58404K18369J00119j17606j79378
36101C5220p6092n5138j67261j59459O6228K33743J25471o4868n7485P6870Q7386
36090D4615k7587o4315J7843O2391K723p5313j33660k01528k03687j9309K54917
36079c42910L38275J39706j00901j34698R278J56778K33224K39550J30936r8589
36069E70649k87194k43211n237J75236J33114l2870j18395o7047J361j5582o0275
36058E0549j0659J18605J65351M8442q8379o5639O4977R4219k7519j30034j10628
36047A09285q3120j46867j95129j04074M1929R7065R9077J56892J98080Q0284
$$ y = [-181693, 197460, 388964, 282506, 28530, -197765, -339664, -370968, -270927, -136160, -133192, -269799, -370501, -333098, -237888, -144688, 13716, 232085, 332204, 214598, 35220, -40872, -96010, -263271, -422730, -356502, -122759, 2712, -62156, -119641, -42771, 44615, 17028, -47287, -29444, 32947, 35670, -39643, -173303, -374831, -578518, -597827, -342910, -4635, 135071, 34170, -100528, -91250, 65528, 298752, 538302, 669238, 570649, 283455, 40244, 35007, 210243, 343357, 310487, 192092, 125045, 126406, 110824, 50549, 39890, 158495, 323846, 372288, 283909, 218270, 283247, 377466, 349947, 219913, 109285, 26165, -120702, -315831, -419905, -377976, -280911, -181834, -24942, 173138, 253422]
36037B53422j05562j24312J7699O9784l9144q6723K5933O7907j10291k52898p8857
36026c63042K31857K79131M3393j19103l7650P9397M7871l5698m6791m7420r5431
36015f3486q2423N8364J73627J07265m9300j02011l1869L7229M2702l274j02664
36004a5840k11631j90157J3057K10191J91759K1758p1494k7356L2843N9948J00820
35993A13898R6027p3916l09474l27953o1599K21451K97210K46004J96088O2897
35983D60633k25721m40972k91645J24942L90394K83974N17j77250j99936j62076
35973b37140q4051O4395K18861K50557J35181n83k2510O3330J28666P8785l3432
35962E62059p7320k3297P579q9658k46959l07594k28931j05891p502R4895K09472
$$ y = [253422, 147860, 23548, 41247, 111031, 71887, -14836, 11097, 79004, -31287, -284185, -363042, -131185, 147946, 191339, 72236, 34586, 113983, 161854, 126156, 79365, 31945, -63486, -145909, -87545, 86082, 193347, 144047, 42036, 10167, 47396, 90098, 86824, -15840, -227471, -417628, -404571, -194380, -2621, 19137, -52357, -79713, -46870, 13078, 113898, 209925, 136009, -173465, -501418, -563017, -341566, -44356, 201648, 397736, 460633, 234912, -206060, -497705, -372763, 17631, 301605, 302122, 124872, -75064, -237140, -321191, -256796, -37935, 212622, 347803, 347220, 324710, 388040, 516706, 595491, 562059, 484739, 461442, 469021, 379363, 132404, -175190, -404121, -510012, -517514, -422619, -213147]
35951b13147K46953J39777k9989j11928o9846n558p464m8090m9880M930O8751
35940g5491J02211J09824J07242Q9696M6717j4095p7398j38205j82409j60296
35930a92204k6914J71340K93443K37261O3390o6341p8309n7425j00396j61767
35920H2078j24545Q28N8676k8243j15736k3856J85292K57790R2273j10313j21826
35909A52418R481O5627p243m9354L2403J17654P9943k683K9276J62025K16460
35898H06007R7782q0190j52740j08985q1724j57959k54059k09710L520K14078
35888G6020K28840N0432j42686k12517j69500o4045J03457K94553L62282J96367
35878G23203r9427k91767k76637j60518q3948o6385n5594l5888j9518J3423Q5713
$$ y = [-213147, 33806, 173583, 143594, 31666, -38180, -43738, -51202, -99292, -149172, -144242, -75491, 26720, 136544, 243786, 333482, 380199, 366104, 288706, 150501, -31908, -192204, -219118, -47778, 245665, 482926, 546316, 479975, 401666, 344241, 243845, 82078, -42467, -41639, 17037, -11206, -126942, -150798, 34494, 292284, 384557, 274244, 152418, 161899, 227526, 220283, 170929, 203332, 320986, 400929, 398246, 427522, 589547, 806007, 903789, 823599, 670859, 561874, 480150, 322191, 68132, -141578, -138058, 76020, 304860, 355292, 212606, 89, -169411, -233456, -129999, 164554, 526836, 723203, 623776, 332009, 55372, -105146, -189094, -255479, -311073, -346961, -366479, -353056, -267343]
35867b67343J47147J02778n4102j86179j49538J9927J27289O0307n7259l1598
35857b88571J32632K50723K30699J72025J47725N9864j59372l37048k45086N2265
35847A5856K33081J19606j18667k16461j27205Q65O0552P9556J08370J13803K3061
35836B92417j48136k54399j59327P6036K18155J31551m7521r6976K222R2520R8476
35825B05018Q5468P7606J9185n0990k852J23194P9632k09710m33834k81380R6700
35814b91963K78047J50353P396N5242J30042K9872j31609j21055K1498M2073j15992
35803E3904k02740k7501K44229K91218N0822k06588k14139o174J70299J63651
35793C16981M4814m9845q9891j15325j15097m4895N5396P1280k5235j06896m9161
$$ y = [-267343, -120196, -17418, -71520, -257699, -407237, -387310, -260021, -199714, -256973, -288571, -155939, 94784, 325483, 497508, 645233, 705097, 545725, 208677, -36409, 15856, 248937, 368543, 249876, 33415, -93790, -92925, -32373, 47183, 155553, 269356, 292417, 144281, -110118, -269445, -193409, 24746, 156297, 108776, 11800, 14022, 106542, 205018, 290486, 368092, 387277, 336287, 333435, 456629, 536261, 326551, -107283, -388663, -291963, -13916, 136437, 143833, 199075, 329117, 358989, 227380, 106325, 127823, 169896, 53904, -148836, -176337, 67892, 359110, 409932, 203344, -10795, -16969, 153330, 316981, 361795, 311950, 222059, 106734, -8363, -53258, 2138, 73418, 48183, -58713, -107874]
35782a07874R2572J45421M6900p4741p9651p799j6780j47910k43976j45331Q8109
35771d51060K29562J53436k5463j07767l9344O8585J02904N6335j3408n1953j9754
35760i7927R2703K19001K38416J01975q7767j79134j43705r0345j03760j32618
35750a83161p6349N9187J53598J18226J554p4570n6237k065P961k5566l2110K9258
35738h0274J12407J39113Q9662J2811m1568o1661m6159J0984Q1666R6382K5232
35727C38595o3978q5907n4106m7615p3105n2322L2222P7479J0689p5921l9445
35716c3414R6866J49479J8664j59789j73862j2465J01226j0536k28155k63291
35706e15277m4389J58886R2117j18248j36993R4540K80756K14500N0142J3881
$$ y = [-107874, -15302, 130119, 177019, 102278, 22627, 14828, -1952, -149862, -393838, -539169, -451060, -221498, -68062, -93525, -201292, -240636, -172051, -69147, -12812, -26220, -78173, -97927, -5224, 213777, 452193, 554168, 466401, 287267, 143562, 53217, -50543, -183161, -259510, -200323, -46725, 71501, 73055, -1515, -57752, -59817, -51856, -77422, -109532, -80274, 32133, 171246, 260908, 273719, 232151, 170490, 124331, 135315, 216981, 313363, 338595, 274617, 188710, 134604, 86989, 13884, -38438, -6216, 71263, 81952, 6031, -33414, 63452, 212931, 231595, 71806, -102056, -114521, -13295, -23831, -251986, -515277, -559666, -400780, -308663, -426911, -563904, -469364, -188608, 25892, 76034, 89915]
35696H9915P0089P0518M7224J03064J42279M531j96777j82416M1380J48037k3035
35685C14809k31879k14301m1624O2695O0995O0019P6740M4387k7901o0885k3326
35674A9729N4434J19975R3323o5051k23381j75063N0884J68413M4612q9141j5342
35663a6608J13519N8593p0755q752J71459J43917j21537k81033j36623J11159
35653c6661K25197K30290K15316J22290q5351k62751k76209j93472j33637q3850
35643b78838j363O1046O8867Q9261J31313P8041p7025j23201M4515J88147N7854
35632B38617j98923k45307n7569R3902R9984J07468J56641P9189j49564k77859
35622a53421j56357J9766M1963K0930J38005K59245J21712j84372k68402q674
$$ y = [89915, 160004, 230522, 277746, 380810, 523089, 527620, 330843, 148427, 189807, 337844, 314809, 82930, -131371, -172995, -110300, -49305, 10714, 87454, 131841, 103940, 43055, 19729, 74163, 194138, 287461, 222410, -971, -176034, -125150, 43263, 87875, -1266, -16608, 96911, 155504, 84749, 75997, 247456, 391373, 269836, -11197, -147820, -36661, 188536, 418826, 634142, 756432, 671081, 408330, 132121, -61351, -194988, -278838, -280201, -219155, -150288, -61027, 70286, 148327, 71302, -51899, -7384, 180763, 238617, 39694, -205613, -263182, -169280, -69296, 38172, 194813, 274002, 124438, -153421, -309778, -290012, -248049, -227119, -89114, 170131, 291843, 107471, -160931, -169605]
35612a69605K42915J54857j31597k39334p9349R4339Q1235m0737r5234l1169P8774
35601a34905J32145N3314j27492k33201j13483J22472K15439J29613R2630J78122
35591C14654J33045j70143l86478j52707K95731L96329Q2700j37377J7174K08507
35581F01435Q4948j64263j82305l1007j0654j24201j37587m3428n3766j78495
35571b39323j94292m4411P9166R3652J32198K19202J68921n8960k00269o7207
35561a11323J51983J76870K3613j02652j44630j88474k26144j56830J0707J48812
35551d18068J93170J85707J54316Q8950J9791j6237p0284k00993l10246k26503
35541f00397J8368J67311P6885p0688k7453J55439K03632K7889j42993r9227N1545
$$ y = [-169605, 73310, 228167, 96570, -142764, -222113, -127774, -46539, -87276, -182510, -213679, -134905, -2760, 50554, -76938, -310139, -423622, -301150, -85711, 43902, 136532, 314654, 447699, 277556, -108922, -261629, 34102, 430431, 513131, 375754, 392928, 601435, 686383, 522120, 339815, 308808, 298154, 173953, 36366, -7062, -60828, -239323, -433615, -478026, -398860, -305208, -173010, 46192, 215113, 156153, -44116, -111323, 40660, 217530, 241143, 138491, -6139, -194613, -420757, -577587, -566880, -418068, -224898, -39191, 115125, 204075, 223866, 207629, 137345, -63648, -373894, -600397, -582029, -414718, -337833, -408521, -435974, -280535, -76903, -49014, -192007, -291234, -239689]
35530b39689O7627n1784p6123Q7807K51209K41745J51850J36817J19932p1900
35520F17491l51518m20152k05285K077l7704j73262j19460J00140K07983J09750
35510b69940K1570J13814K45232J85720l3750j66994r8056K9469M6958k5710p4411
35499b6098p7349p7574m9985N0349J40391Q3499p2962j16252J4422J15807L7341
35488B1589p5163k5647J04286J06813J2393K4105J39088J38977k1591j19365l9543
35477B65942L6213m2789j41256j01248l7792j30447k79724k38683n122J68818
35467e06088J34393K148n9490k938J28409K51491K54131R5944q9962j27118l3331
35456D7589Q776o8091j17071j0665J61733K20937J37675M6186M9070R2043N5683
$$ y = [-239689, -172062, -223846, -299969, -212162, 39047, 280792, 432642, 569459, 689391, 617491, 265973, -154179, -359464, -357387, -395091, -568353, -687813, -587673, -379690, -269940, -248370, -134556, 110676, 296396, 262646, 95652, -2404, 27065, 74023, 48313, -26098, -103447, -181021, -231006, -180657, -40266, 43233, -29729, -145981, -131559, -15752, 21589, -53574, -79221, 25065, 131878, 144271, 168376, 307464, 446441, 424850, 305485, 265942, 302155, 259366, 118110, 16862, -20930, -151377, -431101, -669784, -674906, -506088, -371695, -369547, -429037, -431975, -303566, -52075, 202056, 298000, 208038, 80920, 47589, 56365, -11726, -128797, -139462, 22271, 243208, 380883, 427069, 476139, 568182, 623865]
35445F23865o5766j34007m9014Q5060P1800j04737k44773k05788p0001K9424Q7634
35434B3697J17486L6018j52462k18378n259K46435J78297j34403k51927j8315
35424a78811K18384J56036l3724m9750M6321j4549k31004l32068j97757P32Q4974
35413e31216O4689K0882j1272M637J05234K20928K11561P3308j6025O3761J98931
35402D05418J97946M2058j20587j75431j33326n3878J8824M7228K0257m235L9809
35391B84083J05234O5728q6659j83023j01893M2648O4252j8673m1784Q486k0705
35380A17694j38299j32661P4929K33439J18530j03845j27784J8549N9279m2694
35370G7137l8671J44230K48115J08233q0508r9816m4742r9290j93285j51442l6683
$$ y = [623865, 558099, 424092, 375078, 460138, 531938, 427201, 182428, -23360, -93361, -63937, 23697, 141183, 177201, 24739, -193639, -198898, 47537, 225834, 91431, -160496, -178811, 39573, 195609, 161885, 112135, 158456, 143907, -87097, -419165, -616922, -616190, -531216, -466527, -445645, -456917, -452280, -347046, -126118, 85443, 158751, 142726, 206487, 405418, 603364, 645422, 524835, 349404, 216078, 162200, 181024, 228252, 248509, 244274, 284083, 389317, 455045, 368386, 185363, 83470, 126118, 190370, 171697, 129913, 138399, 117694, -20605, -153266, -78337, 155102, 273632, 169787, 42003, 60552, 119831, 77137, 38466, 182696, 430811, 539044, 458536, 358720, 313978, 214688, 21403, -130039, -166722]
35359a66722o0729k25416l13861k12528j5923J71899L19267L55584K12786J4988
35349G9345l48J71574K45574M9679k07177k35933q2381k3245j27560j70734r481
35338c10687J86270J93907O5897J9699Q7999R0567m6883j62806j29648n9017r0215
35327a54917j37378n4166P2502N5988l0634N8855K88084L12572J7795k53186k08253
35316c2738l7247n5562j76447j05189J07786J27691r5808k28232p5351J48141
35306d22956J91746J05432M5994O289o6701q0691N7655K25320K07369j3687k33950
$$ y = [-166722, -227451, -452867, -766728, -979256, -995179, -823280, -504013, -148429, 64357, 79345, 78997, 250571, 496145, 545824, 338647, 102714, 20333, -2912, -130472, -301206, -310687, -124417, 69490, 135387, 155086, 243085, 333652, 286769, 123963, -5685, -64702, -154917, -292295, -346461, -273959, -217971, -248605, -189750, 98334, 410906, 428701, 175515, -32738, -69985, -125547, -301994, -407183, -299397, -171706, -267514, -495746, -571097, -422956, -231210, -125778, -79784, -73495, -140196, -220887, -163232, 62088, 269457, 255770, 21820]
$$ [...]
##END NTUPLES=NMR SPECTRUM
##END=
