##TITLE=31Pdec_AEDM21609
 CDCl3, 24 sc
 17.9.2019
##JCAMPDX= 6.0         $$ Bruker NMR JCAMP-DX V2.0
##DATA TYPE= NMR SPECTRUM
##DATA CLASS= NTUPLES
##ORIGIN= UXNMR, Bruker Analytische Messtechnik GmbH
##OWNER= root
$$ XWIN-NMR		Version 3.5
$$ Tue Sep 17 14:13:10 2019 Russian Standard Time (UT+4h)  she@DPX200
##.OBSERVE FREQUENCY= 81.013821
##.OBSERVE NUCLEUS= ^31P
##.ACQUISITION MODE= SIMULTANEOUS
##.ACQUISITION SCHEME= undefined
##.AVERAGES= 24
##.DIGITISER RES= 17
##SPECTROMETER/DATA SYSTEM= spect
##.PULSE SEQUENCE= zgpg30
##.SOLVENT NAME= CDCl3
##.SHIFT REFERENCE= (INTERNAL, CDCl3, 0, 182.463)
##AUDIT TRAIL= $$ (NUMBER, WHEN, WHO, WHERE, WHAT)
$$ ##TITLE= Audit trail, XWIN-NMR		Version 3.5
$$ ##JCAMPDX= 5.01
$$ ##ORIGIN= Bruker BioSpin GmbH
$$ ##OWNER= she
$$ F:/spectra/data/she/nmr/P31/1/pdata/1/auditp.txt
$$ ##AUDIT TRAIL=  $$ (NUMBER, WHEN, WHO, WHERE, WHAT)
(   1,<2019-09-17 14:11:47.31 +0400>,<she>,<DPX200>,
      <created by zg, POWCHK disabled, PULCHK disabled
       configuration hash MD5:
       00 E9 B6 7A A2 85 ED C7 34 08 36 98 17 FE 4E 26
       data hash MD5: 32K
       1C 12 7E 6E 69 1C E7 D7 A9 3C 5C CD 03 77 FE 79>)
(   2,<2019-09-17 14:11:54.09 +0400>,<she>,<DPX200>,
      <Start of raw data processing
       efp BC_mod = 2 LB = 1 FT_mod = 6 PKNL = 1 PHC0 = -485.8724 PHC1 = 287.8003 SI = 64K 
       data hash MD5: 64K
       24 18 96 79 71 64 4F F4 24 93 5F D7 19 77 5A 68>)
(   3,<2019-09-17 14:12:06.51 +0400>,<she>,<DPX200>,
      <pk PHC0 = 14.92006 PHC1 = 0 
       data hash MD5: 64K
       C7 68 CB 15 10 1D 26 10 82 B6 87 5A 79 3E 19 89>)
(   4,<2019-09-17 14:12:10.06 +0400>,<she>,<DPX200>,
      <abs ABSG = 5 
       data hash MD5: 64K
       8B B1 29 F7 C3 A5 51 9C 80 2D 14 67 80 44 9C 31>)
$$ ##END=
$$ 
$$ hash MD5
$$ 24 1E 79 20 4F 88 52 ED AB 73 D2 77 76 86 71 C5
##$RELAX= 
##$RELAX= 
##$RELAX= 
##$RELAX= 
##$RELAX= 
##$RELAX= 
##$RELAX= 
##$RELAX= 
$$ Bruker specific parameters
$$ --------------------------
##$DU= <F:/spectra>
##$EXPNO= 1
##$NAME= <P31>
##$PROCNO= 1
##$TYPE= <nmr>
##$USER= <she>
##$AMP= (0..31)
100 100 100 100 100 100 100 100 100 100 100 100 100 100 100 100 100 100 
100 100 100 100 100 100 100 100 100 100 100 100 100 100 
##$AQSEQ= 0
##$AQ_mod= 1
##$AUNM= <au_zg>
##$AUTOPOS= <>
##$BF1= 81.014009
##$BF2= 200.13
##$BF3= 200.13
##$BF4= 200.13
##$BF5= 200.13
##$BF6= 200.13
##$BF7= 200.13
##$BF8= 200.13
##$BYTORDA= 1
##$CFDGTYP= 0
##$CFRGTYP= 5
##$CHEMSTR= <none>
##$CNST= (0..31)
1 1 145 1 1 1 1 1 1 1 1 1 1 1 1 1 1 1 1 1 1 1 1 1 1 1 1 1 1 1 1 1 
##$CPDPRG= <waltz16>
##$CPDPRG1= <>
##$CPDPRG2= <waltz16>
##$CPDPRG3= <>
##$CPDPRG4= <mlev>
##$CPDPRG5= <mlev>
##$CPDPRG6= <mlev>
##$CPDPRG7= <mlev>
##$CPDPRG8= <mlev>
##$CPDPRGB= <>
##$CPDPRGT= <>
##$D= (0..31)
0 1 0 0 0 0 0 0 0 0 0 0.03 2e-05 3e-06 0 0 0 0 0 0 0 0 0 0 0 0 0 0 0 0 
0 0 
##$DATE= 1568715106
##$DBL= (0..7)
120 120 120 11 120 120 24 19 
##$DBP= (0..7)
150 150 150 150 150 150 150 150 
##$DBP07= 0
##$DBPNAM0= <>
##$DBPNAM1= <>
##$DBPNAM2= <>
$$ [...]
##$SUBNAM3= <"">
##$SUBNAM4= <"">
##$SUBNAM5= <"">
##$SUBNAM6= <"">
##$SUBNAM7= <"">
##$SUBNAM8= <"">
##$SUBNAM9= <"">
##$SW= 369.568048894756
##$SWIBOX= (0..15)
0 1 3 0 0 0 0 0 0 0 0 0 0 0 0 0 
##$SW_h= 29940.119760479
##$TD= 32768
##$TD0= 1
##$TE= 0
##$TE2= 300
##$TE3= 300
##$TEG= 300
##$TL= (0..7)
0 120 53 12 22 120 120 120 
##$TP= (0..7)
150 150 150 150 150 150 150 150 
##$TP07= 0
##$TPNAME0= <>
##$TPNAME1= <>
##$TPNAME2= <>
##$TPNAME3= <>
##$TPNAME4= <>
##$TPNAME5= <>
##$TPNAME6= <>
##$TPNAME7= <>
##$TPOAL= (0..7)
0.5 0.5 0.5 0.5 0.5 0.5 0.5 0.5 
##$TPOFFS= (0..7)
0 0 0 0 0 0 0 0 
##$TUNHIN= 0
##$TUNHOUT= 0
##$TUNXOUT= 0
##$USERA1= <user>
##$USERA2= <user>
##$USERA3= <user>
##$USERA4= <user>
##$USERA5= <user>
##$V9= 5
##$VALIST= <valist>
##$VCLIST= <CCCCCCCCCCCCCCC>
##$VD= 0
##$VDLIST= <DDDDDDDDDDDDDDD>
##$VPLIST= <PPPPPPPPPPPPPPP>
##$VTLIST= <TTTTTTTTTTTTTTT>
##$WBST= 1024
##$WBSW= 4
##$XGAIN= (0..3)
0 0 0 0 
##$XL= 0
##$YL= 0
##$YMAX_a= 65081
##$YMIN_a= -65699
##$ZGOPTNS= <>
##$ZL1= 120
##$ZL2= 120
##$ZL3= 120
##$ZL4= 120
##$ABSF1= 182.463
##$ABSF2= -187.1042
##$ABSG= 5
##$ABSL= 3
##$ALPHA= 0
##$AQORDER= 0
##$ASSFAC= 0
##$ASSFACI= 0
##$ASSFACX= 0
##$ASSWID= 0
##$AUNMP= <proc_1d>
##$AZFE= 0.1
##$AZFW= 0.5
##$BCFW= 0
##$BC_mod= 2
##$BYTORDP= 0
##$COROFFS= 0
##$CY= -3
##$DATMOD= 1
##$DC= 0
##$DFILT= <>
##$DTYPP= 0
##$F1P= 0
##$F2P= 0
##$FCOR= 1
##$FTSIZE= 65536
##$FT_mod= 6
##$GAMMA= 0
##$GB= 0
##$INTBC= 1
##$INTSCL= 5.30512e-09
##$ISEN= 30
##$LB= 1
##$LEV0= 0
##$LPBIN= 0
##$MAXI= 10000
##$MC2= 0
##$MEAN= 0
##$ME_mod= 0
##$MI= 50
##$NCOEF= 0
##$NC_proc= -3
##$NLEV= 6
##$NOISF1= 182.463
##$NOISF2= 159.3651
##$NSP= 0
##$NTH_PI= 0
##$NZP= 0
##$OFFSET= 182.463
##$PC= 4
##$PHC0= -470.9523
##$PHC1= 287.8003
##$PH_mod= 1
##$PKNL= yes
##$PPARMOD= 0
##$PSCAL= 0
##$PSIGN= 0
##$REVERSE= no
##$SF= 81.0140089999434
##$SI= 65536
##$SIGF1= 159.3651
##$SIGF2= -187.1042
##$SINO= 113.3802
##$SIOLD= 16384
##$SREGLST= <1H.CDCl3>
##$SSB= 0
##$STSI= 65536
##$STSR= 0
##$SW_p= 29940.119760479
##$SYMM= 0
##$S_DEV= 0
##$TDeff= 32768
##$TDoff= 0
##$TI= <>
##$TILT= no
##$TM1= 0
##$TM2= 0
##$TOPLEV= 0
##$USERP1= <user>
##$USERP2= <user>
##$USERP3= <user>
##$USERP4= <user>
##$USERP5= <user>
##$WDW= 1
##$XDIM= 65536
##$YMAX_p= 409081649
##$YMIN_p= -7263397
$$ End of Bruker specific parameters
$$ ---------------------------------
##NTUPLES= NMR SPECTRUM
##VAR_NAME=  FREQUENCY,     SPECTRUM/REAL,   SPECTRUM/IMAG
##SYMBOL=    X,             R,               I
##VAR_TYPE=  INDEPENDENT,   DEPENDENT,       DEPENDENT
##VAR_FORM=  AFFN,          ASDF,            ASDF
##VAR_DIM=   65536,         65536,           65536
##UNITS=     HZ,            ARBITRARY UNITS, ARBITRARY UNITS
##FACTOR=    0.456856943014862, 1,           1
##FIRST=     14782.0589164792, 0,            0
##LAST=      -15158.0608439998, 0,           0
##MIN=       -15158.0608439998, -7263397,    0
##MAX=       14782.0589164792, 409081649,    0
$$ Real data points
##PAGE= N=1
##DATA TABLE= (X++(R..R)), XYDATA
$$ [...]
41556f9588J25303j33509k14456n0680J50049J39524k9820o7060J02722J93305
$$ -69588 55715 -77794 -292250 -342930 -192881 -53357 -83177 -150237 -47515 145790
41546A45790Q226k23162j96223r51N7621l8355l0187J59060K93616J85307n6355
$$ 145790 154016 -69146 -265369 -266320 -208699 -247054 -277241 -118181 175435 360742 304387
41535C04387j94936j25897P0369K13626J58673n6790k29172k32778j57673j05411
$$ 304387 109451 -16446 53923 267549 426222 369432 140260 -92518 -250191 -355602
41525c55602J205K23940L75776K45232l5726j40463k9709J8802j22913k50653
$$ -355602 -354397 -130457 245319 490551 454825 314362 284653 303455 180542 -70111
41515g0111j94497p4279m7121n1355J6131P3600J7726m4572L6093J55328Q6935
$$ -70111 -264608 -338887 -386008 -437363 -421232 -347632 -329906 -374478 -338385 -183057 -96122
41504i6122j17595j32478J63189M38413L16737j02914l54073k05839P4808J43290
$$ -96122 -213717 -346195 -183006 255407 572144 469230 115157 -90682 -15874 127416
41494A27416L8826K3302J10400O5133j39209k02149L2906K78455K06412o2216
$$ 127416 166242 189544 299944 365077 225868 23719 56625 335080 541492 479276
41484D79276j62419m2584J7846r3873j56571j8214J33988O5794j49137k52622
$$ 479276 316857 274273 292119 198246 41675 23461 157449 223243 74106 -178516
41474a78516j62025l5889k8558j10115j31207k291J96512K78988J56332l9497
$$ -178516 -340541 -376430 -404988 -515103 -646310 -648601 -452089 -173101 -16769 -56266
41464e6266j02772j0989N9501j6471j49843j65190j8702J53708J70015j7552k38997
$$ -56266 -159038 -170027 -110526 -126997 -276840 -442030 -460732 -307024 -137009 -154561 -393558
41453c93558k44811K224K35401J99011q374p3989P9778K02369J03808q6472j52489
$$ -393558 -638369 -636145 -400744 -201733 -210107 -284096 -204318 -1949 101859 15387 -137102
41442a37102r4154m6501l4597J5648R6678J19296P7082P2851J56314K28368J57270
$$ -137102 -231256 -277757 -312354 -296706 -200028 -80732 -3650 69201 225515 453883 611153
41431F11153m4728k10365k05506j02185r2399k14588k77220j33612Q9196J81547
$$ 611153 566425 356060 150554 48369 -44030 -258618 -535838 -669450 -580254 -398707
41421c98707J61536J85663K26629J12913j15914j91518k7254J33141R5467k0312
$$ -398707 -237171 -51508 175121 288034 172120 -19398 -46652 86489 181956 161644
41411A61644m9530n9459j50505k07571r7925O0734Q9165N5174J20497K03638R8980
$$ 161644 112114 52655 -97850 -305421 -403346 -342612 -253447 -198273 -77776 125862 224842
41400B24842j38504k36419j17011K1657N1344O4716J30953J57718Q6570J1969
$$ 224842 86338 -150081 -267092 -245435 -194091 -129375 1578 159296 245866 257835
41390B57835N376N71m8476n9196K3338R9918O1121m2538p6344r51R6098J00255
$$ 257835 263211 263782 215306 156110 179448 279366 340487 297949 221605 220654 316752 417007
41378D17007l2063k21956l09795k15604m1916O2776R5366J33725J45272M2975
$$ 417007 384944 162988 -146807 -362411 -404327 -341551 -246185 -112460 32812 75787
41368G5787r9552j08076O576N1973j9245l5417O4031R2995m3902j35084N876K02797
$$ 75787 -23765 -131841 -125265 -73292 -92537 -127954 -63923 29072 -14830 -149914 -144038 58759
41356E8759J69759m4147j38771j3769J31524J29613L7983k3625l4452k3792l218
$$ 58759 228518 184371 45600 31831 163355 292968 330951 307326 272874 249082 245864
41345B45864J0463J843o641o595n4784j67858k24220j13159O6549J22851N1146
$$ 245864 256327 258170 251529 244934 190150 22292 -201928 -315087 -248538 -125687 -74541
41334g4541J4631O3030Q0511K7688J0212N0908K1675r9429j26975K8126J56384
$$ -74541 -59910 3120 83631 111319 121531 172439 194114 94685 -32290 -4164 152220
41323A52220M9367j59384j88903l7572M7416j6637l9023J03000K58604K39629
$$ 152220 201587 42203 -146700 -184272 -136856 -153493 -192516 -89516 169088 408717
41313D08717P5369q8621j95076k41546j68890M3945K41475K26132K2865j40743
$$ 408717 484086 395465 200389 -41157 -210047 -166102 75373 301505 324370 183627
41303A83627j34255o3723o6583j00936l9832J01913J55176R627k33319l43177
$$ 183627 49372 -14351 -80934 -181870 -221702 -119789 35387 45014 -188305 -531482
41293e31482j78721J66758M25120L85880R6972j82042k38830r3899P1232J09202
$$ -531482 -710203 -543445 -118325 267555 364527 182485 -56345 -150244 -79012 30190
41283C0190O300j40104j91416p8993R5073J37581J5291o4699N8953K28275J63720
$$ 30190 36490 -103614 -295030 -374023 -278950 -141369 -126078 -190777 -131824 96451 260171
41272B60171j05204k36255m7493K23475K49795L1328j74450k07961j12977L1362
$$ 260171 154967 -81288 -128781 94694 344489 375817 201367 -6594 -119571 -88209
41262h8209J82315K49740J25684j47480l58126l39840j41270N4527J25397R2610
$$ -88209 94106 343846 469530 322050 -36076 -375916 -517186 -462659 -337262 -244652
41252b44652N1566N9814R1079R1363O2941N3832O4966L5007n5934j39518j55923
$$ -244652 -193086 -133272 -42193 49170 112111 165943 230909 265916 209982 70464 -85459
41241h5459j20111m9614O7846J66472R7487j40464k93510j56654J12677K04442
$$ -85459 -205570 -255184 -187338 -20866 76621 -63843 -357353 -514007 -401330 -196888
41231a96888J06651P3549J61359J24584j26979k86001q0776K76786L50022O3019
$$ -196888 -90237 -16688 144671 269255 142276 -143725 -224501 52285 402307 465326
41221D65326k38638k63902p2926J01335J15908l1728k33093k92065p7442K69547
$$ 465326 226688 -37214 -110140 -8805 107103 75375 -157718 -449783 -527225 -257678
41211b57678M11337J92485j57923l00795j78949j4225K9402K0938P5761J36643
$$ -257678 153659 346144 188221 -112574 -291523 -305748 -276346 -255408 -179647 -43004
41201d3004N5661j56598k93738k00794L0451J84763J83050J19728P2223J1171
$$ -43004 12657 -143941 -437679 -638473 -608022 -423259 -240209 -120481 -48258 -37087
41191c7087o7106o2626O7502J74135R4662q1680j02187Q2884K22233J13243j08275
$$ -37087 -104193 -166819 -99317 74818 169480 87800 -14387 68497 290730 403973 295698
41180B95698j74412o9615o663n7306m8596J02813J84811K759k60428k57372P541
$$ 295698 121286 51671 45008 -12298 -60894 41919 226730 229489 -30939 -288311 -280770
41169b80770J65362L0341j33452m6538J44453J18411j00970j98916p4524M3997
$$ -280770 -115408 -85067 -218519 -265057 -120604 -2193 -103163 -302079 -376603 -332606
41159c32606J5842o350R5519J57313J0087k02886k16764k5767J46853J81023J52463
$$ -332606 -316764 -323114 -227595 -70282 -60195 -263081 -479845 -505612 -358759 -177736 -25273
41148b5273J28593O8185n4814j66646j69606l6019J60928K63390J46002j05981
$$ -25273 103320 171505 116691 -49955 -219561 -255580 -94652 168738 314740 208759
41138B08759k26557q5242J25215J56267N2289L7351J29711J14733r3787k97380
$$ 208759 -17798 -103040 22175 178442 230731 268082 397793 512526 418739 121359
41128A21359k84249q4798J11531J60519M1055j39808j88329o586K42723K98963
$$ 121359 -162890 -247688 -136157 24362 65417 -74391 -262720 -269306 -26583 272380
41118B72380J44230P292O680O733r9699j93044j44753l9278j5109l9213j0530
$$ 272380 416610 423902 430582 437315 337616 144572 -181 -39459 -54568 -93781 -104311
41107a04311M0529K9497j1142o004J2455j0578j2462O6651J15390O27j80570k05542
$$ -104311 -63782 -34285 -45427 -51431 -38976 -49554 -62016 4635 120025 120652 -59918 -265460
41095b65460m6961J10446J52751J36136J08750M0635m1852m7083N906k0804j53296
$$ -265460 -312421 -201975 -49224 86912 195662 236297 194445 147362 153268 132464 -20832
41084b0832k29310j28381O4829K04109K51107K17973Q3022j16596k21400j24436
$$ -20832 -250142 -378523 -313694 -109585 141522 359495 442517 325921 104521 -19915
41074a9915M9724P6243p8415k10102j37307P4277J91494Q8268j08589j76380p1630
$$ -19915 29809 106052 27637 -182465 -319772 -245495 -54001 34267 -74322 -250702 -322332
41063c22332L4701K0597r699P8858J85890R7556j57938k94516j51732R8697K08748
$$ -322332 -287631 -267034 -276733 -197875 -11985 85571 -72367 -366883 -518615 -419918 -211170
41052b11170J43751J5514j09228j94577j61663Q145J75818J94040R6300J7972
$$ -211170 -67419 -51905 -161133 -355710 -517373 -509228 -333410 -139370 -43070 -25098
41042b5098n411l8379j04241j63094j75369q6221J59712M54301M93874J23129
$$ -25098 -30509 -68888 -173129 -336223 -511592 -597813 -438101 16200 510074 633203
41032F33203l53891m54618j15113K32059K25956j2744j46489q1137J5422J7142
$$ 633203 279312 -175306 -290419 -58360 167596 154852 8363 -72774 -57352 -40210
41022d0210l5703o5037m7255J5589J02686J52797J20911N2387K8540M7129K9768
$$ -40210 -75913 -140950 -188205 -172616 -69930 82867 203778 256165 284705 331834 361602
41011C61602n1804j28522j30878p5621k3473J1741O5056J35702J48860M5139j06388
$$ 361602 309798 181276 50398 -25223 -48696 -36955 28101 163803 312663 357802 251414
41000B51414j53259n0281N9309K2963j09109j50079l3312J13701J63703J36252
$$ 251414 98155 47874 107183 130146 21037 -129042 -162354 -48653 115050 251302
40990B51302J03174N9891k6362j16415j37432q2825r082L5488L5305L095j3344
$$ 251302 354476 414367 388005 271590 134158 51333 42251 77739 113044 116139 102795
40979A02795K6857P9723N4039m0314q0685k1729K1299l5985j00810p2081k5960
$$ 102795 129652 209375 263414 223100 142415 120686 141985 106000 5190 -66891 -92851
40968i2851o1141p4823P5976K60127K00895p1652j91579J7898K55645J60894j76587
$$ -92851 -153992 -228815 -152839 107288 308183 236531 44952 62850 318495 479389 302802
40957C02802l53557j93319P9580J77330O8819p0157r5327k2528L3032J2495p627
$$ 302802 -50755 -244074 -164494 12836 81655 11498 -83829 -106357 -73325 -60830 -68457
40946f8457O6147J69769J43504j0363r0355M136J07701O0262k9634M371O5062
$$ -68457 -2310 167459 310963 300600 210245 214381 322082 382344 352710 357081 422143
40935D22143m2810k20185j77692P5314J92437K1531j59553r5968O4864Q2598M5995
$$ 422143 379333 159148 -18544 56770 249207 270738 111185 15217 80081 162679 208674
40924B08674J64406L15004J78963k13872m40972k57428Q5109K17241J15996J9074
$$ 208674 373080 688084 867047 653175 212203 -45225 39884 257125 373121 392195
40914C92195L9190O9011J0255p9023q8955j4036L7189k9632j67425k12307p4064
$$ 392195 431385 500396 510651 431628 342673 328637 365826 336194 168769 -43538 -117602
40903a17602J24978J79063N5675p8586r5027l8248J5489Q9253J95447K18551N5196
$$ -117602 7376 186439 242114 163528 68501 30253 45742 134995 330442 548993 604189
40892F04189j95173l23863k62529j11312M2390J79662K41581J45604m8518j50190
$$ 604189 409016 85153 -177376 -288688 -246298 -66636 174945 320549 272031 121841
40882A21841q5381R380J8703J7468Q3942R9924o1046k43607j61352J65343L68881
$$ 121841 36460 45840 64543 82011 165953 265877 204831 -38776 -200128 -34785 334096
40871C34096K09067j17985k69064j82523n4018p321J1417N9426J03953J10392
$$ 334096 543163 425178 156114 -26409 -80427 -87748 -76331 -16905 87048 197440
40861A97440Q3916J3405j05136j88589j41011j9397J1541q2770j53281r3930K1955
$$ 197440 281356 294761 189625 1036 -139975 -159372 -147831 -230601 -383882 -477812 -455857
40850d55857R3997J36706J79257J63811O4309j0808L1347J11959J08048M2289
$$ -455857 -361860 -225154 -45897 117914 182223 171415 202762 314721 422769 465058
40840D65058K841k8625r9602j28490k6233R0243L4586j33627j74761m4907N6532
$$ 465058 467899 439274 339672 211182 184949 275192 309778 176151 1390 -43517 13015
40829A3015M0850M1636R4116J5707k29996l44812j17788K01194K43747O0110j5704
$$ 13015 53865 95501 189617 205324 -24672 -369484 -487272 -286078 -42331 17779 2075
40818B075Q3238J09405l0203j32460q2064l3102q3783p6214R8729K55163J96596
$$ 2075 85313 194718 164515 32055 -50009 -83111 -166894 -243108 -144379 110784 307380
40807C07380M4033K3549P6067k6084k44520k73813j6074K20711J33388j58820
$$ 307380 351413 374962 451029 424945 180425 -93388 -109462 111249 244637 85817
40797H5817k86494j20773R7381J14853q736k2753J45745K77164J48846j55499
$$ 85817 -200677 -321450 -224069 -109216 -117952 -140705 5040 282204 431050 275551
40787B75551l32760k31580j0544J05017R2525O7799O5767L5892l519J9743O7539
$$ 275551 -57209 -288789 -299333 -194316 -101791 -33992 31775 67667 64148 83891 151430
40776A51430J4424j28493j78592m7430J09352J20649M9304O3619J52787J50485
$$ 151430 165854 37361 -141231 -188661 -79309 41340 90644 154263 307050 457535
40766D57535P877j32794j51780r0414l9735j7312p909k4876p0324j03030q5726
$$ 457535 465412 332618 180838 90424 50689 33377 25468 592 -69732 -172762 -258488
40755b58488j0006J24169K67161K76045N6430k34773l01646q8601J28065J23079
$$ -258488 -268494 -144325 122836 398881 455311 220538 -81108 -169709 -41644 81435
40745H1435O679j8857Q952n4299j51200j24249l2703o5640j75499j16542J29589
$$ 81435 88114 69257 78209 23910 -127290 -251539 -284242 -349882 -525381 -641923 -512334
40734e12334K88574K31135J57706K10848K14056Q066k18301k02263j8921O1765
$$ -512334 -223760 7375 165081 375929 589985 598051 379750 177487 158566 220331
40724B20331r205o5404m2305j1123K8328J10820J23780m2087k04166q6259J89165
$$ 220331 211126 145722 103417 92294 120622 231442 355222 313135 108969 22710 211875
40713B11875J85352j74717m06165j51113K67584L06779j8600k14338o3616J15191
$$ 211875 397227 222510 -183655 -334768 -67184 239595 220995 6657 -56959 58232
40703E8232K4587j69528j49441N1802J31792n901j33814p1511O2556P6567P033
$$ 58232 82819 -86709 -236150 -184348 -52556 -58457 -192271 -263782 -201226 -124659 -117626
40692a17626K2023J19711J30967J0458q0043l4950L1840r967r6318r7110k8275
$$ -117626 -95603 24108 155075 165533 85490 50540 82380 72413 -23905 -121015 -149290
40681a49290J9173N5648J25861J53702M7567j00218j18538j9132M7141N1719Q1324
$$ -149290 -130117 -74469 51392 205094 252661 152443 33905 14773 61914 113633 194957
40670A94957J03686J070j60830j77412n4146j6694j06257q8511J09270K10272
$$ 194957 298643 299713 138883 -38529 -92675 -109369 -215626 -304137 -194867 15405
40660A5405M3408j30696k8503J88748J88294N32q7212l3521n2112j77581k00768
$$ 15405 58813 -71883 -100386 88362 276656 277188 189976 156455 104343 -73238 -274006
40649b74006n4683O9677N1604j155Q149K3152O992K3282O4793J8192j17000j77710
$$ -274006 -328689 -259012 -207408 -208563 -200414 -177262 -170270 -146988 -82195 -64003 -181003 -358713
40637c58713q9149K6264P0693J00857J46012J03916n7600j79214j28750J1072
$$ -358713 -447862 -421598 -350905 -250048 -104036 -120 -57720 -236934 -365684 -354612
40627c54612R7810J20987J13864L2091j27050k18740j27769M6719J26389Q3561
$$ -354612 -256802 -135815 -21951 10140 -116910 -335650 -463419 -416700 -290311 -206750
40617b06750J1866l2036l2263L4761J23874J07414k9442j06036j2204Q3783q404
$$ -206750 -194884 -226920 -259183 -224422 -100548 6866 -22576 -128612 -140816 -57033 -65437
40606f5437j66453j27811Q5408J94320R6606j1161J1732L8125p4449k28690k33754
$$ -65437 -231890 -359701 -274293 -79973 16633 5472 17204 55329 -19120 -247810 -481564
40595d81564p7596P9416J09054K0537q4867j03450j5930Q8791J19488R4748P4481
$$ -481564 -559160 -479744 -370690 -350153 -435020 -538470 -554400 -465609 -346121 -251373 -176892
40584a76892K4786j13546k47306k00151J9483K01402K30026K07268K11751J51226
$$ -176892 -152106 -265652 -512958 -713109 -693626 -492224 -262198 -54930 156821 308047
40574C08047j8133j33469p0536K4825l3382j52774j22485J9634O5948J8233O2125
$$ 308047 289914 156445 85909 110734 77352 -75422 -197907 -178273 -112325 -94092 -31967
40563c1967J64964O1897k55183l94062j25950K06602J56206j62619k46768M7188
$$ -31967 132997 194894 -60289 -454351 -580301 -373699 -217493 -380112 -626880 -579692
40553e79692L24744K59744J2542j01765o0365k6163j4219O3779J43522P5786q2646
$$ -579692 -254948 4796 17338 -84427 -144792 -170955 -185174 -121395 22127 97913 15267
40542A5267r9695P9404K26356J49098n9230j85675j67472q3646O797Q4216J01464
$$ 15267 -84428 -5024 221332 370430 311200 125525 -41947 -125593 -118796 -34580 66884
40531F6884L6199k5918J3190R8590P4719q2544k01364j33975M3120J27407N0478
$$ 66884 103083 77165 90355 188945 263664 181120 -20244 -154219 -111099 16308 66786
40520F6786m3663N790J62668K30779R4771j36746k61769k10568p8953K9885J00575
$$ 66786 23123 28913 191581 422360 517131 380385 118616 -91952 -170905 -141020 -40445
40509d0445J38464J15221L2540m0880n6209m3809l5535o677M3009M3569k1790
$$ -40445 98019 213240 245780 204900 148691 104882 69347 62670 105679 149248 127458
40498A27458m4546M0884J14141N0123m4028K0686J79444J79232j1606j35365o6979
$$ 127458 82912 123796 237937 288060 244032 264718 444162 623394 611788 476423 409444
40487D09444k1823j75218l30535k21697L8873J23738K078m3145J01505K07547
$$ 409444 387621 212403 -118132 -339829 -300956 -177218 -175140 -218285 -116780 90767
40477I0767R5857q5335j20126m0179n267l7164n8406p0122j01368p5754P6283
$$ 90767 186624 101289 -18837 -59016 -64283 -101447 -159853 -229975 -331343 -407097 -330814
40466c30814K37036K31860J01319M0442Q2761O6436o0213j35519p1853k0086r7835
$$ -330814 -93778 138082 239401 279843 362604 429040 368827 233308 161455 141369 43534
40455D3534j48118J9199K77377L21786J02805j25951j87945j64321j46253o4994
$$ 43534 -104584 -85385 191992 513778 616583 490632 302687 138366 -7887 -72881
40445g2881R7033J53153j3391j80092n9311K32410K80629k4253k91811j77570
$$ -72881 24152 177305 163914 -16178 -75489 156921 437550 413297 121486 -56084
40435e6084J32024K16519L1331q6623K9114J47094M7545j25038j13603L6595O4303
$$ -56084 75940 292459 323790 237167 266281 413375 460920 335882 222279 258874 323177
40424C23177q9348k01911j18814L8361Q6422L2233K25K7841N6824N7436M5071
$$ 323177 233829 31918 -86896 -48535 37887 70120 70345 98186 155010 212446 257517
40413B57517J1805n6515j14858j01483l9934j9184o5721j02604n4339N3764J21508
$$ 257517 269322 212807 97949 -3534 -43468 -62652 -128373 -230977 -285316 -231552 -110044
40402a10044P8441m0793j17870o8901M6349P4922l9451j64798j29236P7458L02682
$$ -110044 -31603 -72396 -190266 -259167 -212818 -137896 -177347 -342145 -471381 -393923 -91241
40391i1241L92109K96571O8993j62891k55079j71723m0859j0119o7244q5650j8505
$$ -91241 300868 597439 666432 503541 248462 76739 35880 25761 -41483 -127133 -145638
40380a45638O2047J06813J43190J65754R8406p4511k29914k29028o9898J25132
$$ -145638 -83591 23222 166412 332166 430572 356061 126147 -102881 -172779 -47647
40370d7647K29242J90669M3559j22053k21379k18442j12642O3819K01772J61576
$$ -47647 181595 372264 415823 293770 72391 -146051 -258693 -194874 6898 168474
40360A68474m0638j81453j01629N3241M1660r9569j28134n162O1008R266M0083
$$ 168474 127836 -53617 -155246 -102005 -60345 -159914 -288048 -293210 -232202 -222936 -182853
40349a82853K18211K78749L9002k58302k75766o1819P6306M0507K00O3815J52364
$$ -182853 35358 314107 353109 94807 -180959 -242778 -166472 -125965 -125765 -61950 90414
40338I0414J67087Q1449q7936k37071j95716K7509J51409o375k12789j52165P2016
$$ 90414 257501 338950 251014 13943 -181773 -154264 -2855 -9230 -222019 -374184 -302168
40327c02168J23152J1783N6147K75919K97220k1428l01532j95446J21435K52836
$$ -302168 -179016 -167233 -111086 164833 462053 440625 139093 -56353 65082 317918
40317C17918J03940j32496k77839k33399L1321L30592L24126k9583l02375j57961
$$ 317918 421858 289362 11523 -221876 -190555 140037 464163 434580 132205 -25756
40307b5756J34418R8622k09226k93855J575K69621J82124m6696n3081J22769J63743
$$ -25756 108662 207284 -1942 -295797 -294222 -24601 157523 110827 57746 180515 344258
40296C44258j1952j67895j39333l8768j1891j909R6357J82383O2488k06240l10115
$$ 344258 332306 164411 25078 -13690 -25581 -27490 68867 251250 313738 107498 -202617
40285b02617j01082J70154K00075M9852m075Q4041J17420L5489k1055l9525j76527
$$ -202617 -303699 -133545 66530 116382 112307 196348 313768 349257 328202 288677 112150
40274A12150l73953l01288J17492M50241L13976p7909k52123j47161p2843j37537
$$ 112150 -261803 -563091 -445599 4642 318618 240709 -11414 -158575 -231418 -368955
40264c68955j34332K0894J29847O9673m127O2353J73538J51947o503j57272j81324
$$ -368955 -503287 -482393 -352546 -282873 -287000 -224647 -51109 100838 94335 -62937 -244261
40253b44261o8656Q2956J24134j050j60374j73461k7652J42340K43699K70474
$$ -244261 -312917 -229961 -105827 -106877 -267251 -440712 -468364 -326024 -82325 188149
40243A88149K12679P3629n5307q6652p0776r7469j22254n5304M3271M9579l925
$$ 188149 400828 474457 419150 332498 261722 164253 41999 -13305 29966 79545 75620
40232G5620n884r78j03332k24611j67986K2215R9603J6453k2543N5407Q3397J3374
$$ 75620 69736 68758 -34574 -259185 -427171 -404956 -305353 -288900 -311443 -256036 -172639 -159265
40220a59265L9769K21211L05972J35136o9678n9409M9677M032j62748k20088j25260
$$ -159265 -119496 101715 407687 542823 473145 413736 463413 467445 304697 84609 -40651
40209d0651m2271m6148n0374m553K8031n442o7056o6302P0365K99234M04388J89040
$$ -40651 -82922 -129070 -179444 -183997 -155966 -161408 -228464 -294766 -224401 74833 479221 668261
40197F68261k17771m24058k43937P8037K26396J93182J41123J00782K1195m3130
$$ 668261 450490 26432 -217505 -139468 86928 280110 421233 522015 543210 500080
40187E00080k8639k3122j15134j98726j39315k0504n826n7228j7683J09666J85477
$$ 500080 471441 448319 333185 134459 -4856 -25360 -31186 -88414 -106097 3569 189046
40176A89046J65827J05892J0212j18506j65879n1698R0123Q3483k2819o4504l7612
$$ 189046 354873 460765 470977 352471 186592 134894 225017 308500 285681 221177 183565
40165A83565m5079p4280o2500p3663j61647j80804q419J74040J32533j8671k1367
$$ 183565 138486 64206 1706 -71957 -233604 -414408 -422827 -248787 -116254 -134925 -156292
40154a56292N0608n9415k55774j87935J26005K72538J03268o4916k0042N9317
$$ -156292 -105684 -165099 -420873 -608808 -482803 -210265 -106997 -171913 -191955 -132638
40144a32638M4189R4836K46564K28100l7913k01268n9714O9800q1358k24612k6855
$$ -132638 -88449 6387 252951 481051 443138 241870 182156 251956 170598 -54014 -80869
40133h0869K43764J28110k35219l15523l8749J47093K0234j38214p4841R0924
$$ -80869 162895 291005 55786 -259737 -298486 -151393 -131159 -269373 -344214 -253290
40123b53290J64333J41120N8100j03334k53824k16529j4566J08396L9858o1818
$$ -253290 -88957 52163 110263 6929 -246895 -463424 -477990 -369594 -329736 -391554
40113c91554n0670J7384N5676Q5211J18516J02766M7867K7904J7581p0429j63566
$$ -391554 -442224 -424840 -369164 -283953 -165437 -62671 -14804 13100 30681 -39748 -203314
40102b03314q6182J21684K06861R2610j1043J8080K3803r7617j67751l7073J22498
$$ -203314 -289496 -167812 39049 131659 120616 138696 162499 64882 -102869 -139942 -17444
40091a7444Q3235p1721j00502K3145J29149J31777P0109k8658j19226q1963R0579
$$ -17444 65791 -5930 -106432 -83287 45862 177639 247748 219090 99864 17901 108480
40080A08480J71570N682j82925q2044J92429K17045j05046l86989l23302q4874
$$ 108480 280050 285732 102807 20763 213192 430237 325191 -61798 -385100 -469974
40070d69974J5487k3295l918R0393R6094k6728j20169o0828R1190J96141J82875
$$ -469974 -454487 -477782 -481700 -391307 -295213 -321941 -442110 -502938 -411748 -215607 -32732
40059c2732P7781l9391r4217p1947r342P5092J85455K60307J81833m4916k15459
$$ -32732 45049 5658 -88559 -160506 -169848 -94756 90699 351006 532839 487923 272464
40048B72464j58226J4532M2391j15239k18096q9678J37735K14769R2934o7316
$$ 272464 114238 128770 171161 55922 -162174 -251852 -114117 100652 193586 126270
40038A26270j32106j11431p0628l7906o247M6621J38547K26981K03463K7594j61357
$$ 126270 -5836 -117267 -187895 -225801 -232048 -185427 -46880 180101 383564 411158 249801
40027B49801j79099m0408N5556N701o8818l1888P2504J35422J60873J82893J17535
$$ 249801 70702 30294 85850 91551 22733 -9155 63349 198771 359644 542537 660072
40016F60072j02411l08337k53102K349J12814n5002k00141l6531K48851K56560
$$ 660072 557661 249324 -3778 -1429 111385 56383 -143758 -180289 68562 325122
40006C25122k8146k21336j17492M6297J0448j14896q8881M3138N3154o0524p3050
$$ 325122 296976 75640 -41852 4445 14893 -100003 -188884 -145746 -92592 -153116 -226166
39995b26166P0991J56637O4215l0225M1374J60723J42565N4213P2721J38796L4825
$$ -226166 -155175 1462 65677 35452 76826 237549 380114 434327 507048 645844 680669
39984F80669k22449l50140k10357m556M3437j6610k2682K1460Q714n2056o4816
$$ 680669 458220 108080 -102277 -106833 -63396 -80006 -102688 -81228 -72514 -124570 -189386
39973a89386k3986K788J8140O4676R5759M2353j9507M9376J94525J81671p1574
$$ -189386 -213372 -210584 -192444 -127768 -32009 10344 -9163 40213 234738 416409 344835
39962C44835l38257l52689j23343J25978K38940K36670J94898J29958K1606j15352
$$ 344835 6578 -346111 -469454 -343476 -104536 132134 327032 456990 478596 363244
39952C63244k12313j96397o9735O2854Q1887j6957j13251r6254J9030J17337R5943
$$ 363244 150931 -45466 -115201 -52347 29540 12583 -100668 -196922 -177892 -60555 35388
39941C5388m5070j88157j84066o003J86916K04370M5416j06159j13128k4827L9121
$$ 35388 -9682 -197839 -381905 -387908 -200992 3378 48794 -57365 -170493 -195320 -156199
39930a56199M7213L5449O709n8901j27537j26730l5300R0392J77631J93139J46282
$$ -156199 -108986 -73537 -66828 -125729 -253266 -379996 -415296 -324904 -147273 45866 192148
39919A92148O5407k4845j05179j39242q2970L8931R9213j040j70166k00517l7074
$$ 192148 257555 232710 127531 -11711 -94681 -55750 43463 42423 -127743 -328260 -365334
39908c65334J35411J34994J0950o1212k6725K8672N3421Q3473J24121J09899K1253
$$ -365334 -229923 -94929 -83979 -145191 -171916 -143244 -89823 -6350 117771 227670 248923
39897B48923n9275o4479m0784n9600q5883k8987Q8279J16274j7601j71716j53326
$$ 248923 189648 125169 84385 24785 -61098 -90085 -1806 114468 96867 -74849 -228175
39886b28175J7048J30484R1828M6905J25040K03489R6714j14812j65040Q770J83256
$$ -228175 -211127 -80643 11185 58090 183130 386619 483333 368521 203481 212251 395507
39875C95507J89665J15366Q5154N9187j8992o7997l4511m7741k04434l35591k25573
$$ 395507 585172 700538 785692 844879 825887 757890 723379 675638 471204 135613 -89960
39864h9960K5490J15976j5636j22125l9398R6836R8352j4270j00570j01487n0497
$$ -89960 -64470 51506 35870 -86255 -125653 -28817 69535 55265 -45305 -146792 -197289
39853a97289R431L9120J6696j1506K3797R3096R2940J1864m9391m7161m4934n8029
$$ -197289 -187858 -148738 -132042 -143548 -119751 -26655 66285 78149 28758 -18403 -63337 -121366
39841a21366q343R9321J22565P787q1600N51J47714J57376K8576o7193n6078l2211
$$ -121366 -129709 -30388 92177 99964 18364 18915 166629 324005 352581 285388 229310 197099
39829A97099o9996j15765r4283k1440K6075K999n6775o7122J2314R9208P4086
$$ 197099 127103 11338 -82945 -104385 -78310 -75311 -132086 -199208 -186894 -87686 -13600
39818a3600m3063j01651m2842J5142j4948m4252Q718L8329o5390j72506p7521
$$ -13600 -56663 -158314 -201156 -186014 -200962 -245214 -236496 -198167 -263557 -436063 -513584
39807e13584J54267K46876J16242k1545R342J06315Q2059o2329j63185r7027J09351
$$ -513584 -359317 -112441 3801 -17744 -8402 97913 179972 117643 -45542 -142569 -33218
39796c3218K94837K69702P156k62496k74257n3862J22963J04227J3995l506J5157
$$ -33218 261619 531321 538477 275981 1724 -52138 70825 175052 189047 185541 200698
39785B00698o808l9983n6110j03432j56958q4599R5393J33772p5545k45064q1457
$$ 200698 193890 153907 97797 -5635 -162593 -247192 -151799 -18027 -93572 -338636 -420093
39774d20093K40415L09606Q4303q7313k5941O4523O216p0325j460J24072J40549
$$ -420093 -179678 129928 214231 126918 100977 165500 171716 101391 99931 224003 364552
39763C64552O5952O503m0256j12989j46912p2545N0733J42557K27442L04728K28995
$$ 364552 430504 437007 396751 283762 136850 64305 115038 257595 485037 789765 1018760
39752A018760p3759l67611l31281m197K21966R9610j80346k72951j08342Q3189
$$ 1018760 945001 577390 246109 241912 463878 563488 383142 110191 1849 85038
39742H5038R5894k6846r7969l7798M5584L1035l6357l0972K8257n932j39336j67949
$$ 85038 180932 154086 56117 18319 63903 94938 58581 27609 55866 49934 -89402 -257351
39730b57351J0767J91515J44102l2840o6985O6670J40907O5997Q158P1885J21253
$$ -257351 -246584 -55069 89033 56193 -10792 55878 196785 262782 270940 342825 464078
39719D64078K7429j14267j53975j15827j12452j47366j40619p1884J6050R2865
$$ 464078 491507 377240 223265 107438 -5014 -152380 -292999 -364883 -348833 -255968
39709b55968J31058Q8770j5138p2366p936J17895J81101J17091m2730j80337j48202
$$ -255968 -124910 -36140 -51278 -123644 -131580 -13685 167416 284507 241777 61440 -86762
39698h6762N6994J93986L8725k45349k53851O7068K75668N8869k91066l08522
$$ -86762 -29768 164218 202943 -42406 -296257 -229189 46479 105348 -185718 -494240
39688d94240l0742J22837J3158p8598M0205J99781J90438O8500J1592O4506J38149
$$ -494240 -524982 -402145 -388987 -467585 -427380 -227599 -37161 31339 42931 107437 245586
39677B45586J34002J9389j15971r8624R8868K34968R9167j47899j93884o0990
$$ 245586 379588 398977 283006 184382 283250 518218 617385 469486 275602 214612
39667B14612l6742j46730j07578J23106J90806p1076l06028j67999J47634K43042
$$ 214612 177870 31140 -76438 46668 237474 166398 -139630 -307629 -159995 83047
39657H3047J15856M4677P9755M7353n4025m8835O7602J16831N9145K3806K5772
$$ 83047 198903 243580 323335 370688 316663 267828 335430 452261 511406 535212 560984
39646E60984n2131j85188k04384j01620o1791j34155j33259M6643K45984K68719
$$ 560984 508853 323665 119281 17661 -44130 -178285 -311544 -264901 -18917 249802
39636B49802J16414q3507k21928k29102j14017j6319n2536j06573K0670K53838
$$ 249802 366216 282709 60781 -168321 -282338 -298657 -351193 -457766 -437096 -183258
39626a83258K98339R2398r1172q8392p7507k06391k90195j26139J32488K02974
$$ -183258 115081 207479 116307 27915 -49592 -255983 -546178 -672317 -539829 -336855
39616c36855R8748L6160M7354o249j09024r1795N0276J25010O7193L9760J31051
$$ -336855 -238107 -201947 -154593 -160842 -269866 -361661 -311385 -186375 -119182 -79422 51629
39605E1629J75749J3314k29981k79171o8426J73489K02577M1740o8983J4969J60261
$$ 51629 227378 240692 10711 -268460 -336886 -163397 39180 80920 11937 26906 187167
39594A87167J52747J0307n2429L3491Q4636k2942j43397j15069l7055p5731j44246
$$ 187167 339914 350221 297792 331283 415919 392977 249580 134511 97456 21725 -122521
39583a22521m5768J50379J73380k3114j86213j49500k7891L5587O1104P6589J9038
$$ -122521 -168289 -17910 155470 132356 -53857 -203357 -231248 -195661 -134557 -57968 -38930
39572c8930p7822k8110K02889L38911J42683k19317l74469k08758O0063J93603
$$ -38930 -116752 -144862 58027 396938 539621 320304 -54165 -262923 -202860 -9257
39562i257J26774q3924l06667l59156j71781Q1341J71318J13524J10852K19464
$$ -9257 117517 33593 -273074 -632230 -804011 -722670 -551352 -437828 -326976 -107512
39552a07512K73618J70315K5830l0260m4555j12654j93824j77735n5464Q0135
$$ -107512 166106 336421 362251 331991 287436 174782 -19042 -196777 -252241 -172106
39542a72106J47255J14765j936j14078j05882J4510R1124L0837n6085l5974K8537
$$ -172106 -24851 89914 87978 -26100 -131982 -117472 -26348 4489 -51596 -87570 -59033
39531e9033m038r2742p0306O1625J08592q070j20399p2929O3762J43585J48989
$$ -59033 -63071 -155813 -226119 -164494 -55902 -63972 -184371 -257300 -193538 -49953 99036
39520I9036J19955L3534q9175r6292Q2808K54828K10308N4362L0128Q8510l5577
$$ 99036 218991 252525 163350 67058 149866 404694 615002 669364 699492 788002 752425
39509G52425l16401l83728r6997J83502J20745j08927j44732j4375j2348j60114
$$ 752425 436024 52296 -44701 138801 259546 150619 5887 -8488 -20836 -180950
39499a80950j91279k9219J07468J03561R0814J20749M7288j32191j58785O0749
$$ -180950 -372229 -401448 -293980 -190419 -99605 21144 68432 -63759 -222544 -161795
39489a61795K09220J3023k93869k80981N0497K87237J96272j8454p6094L1377
$$ -161795 47425 60448 -233421 -514402 -463905 -176668 19604 1150 -74944 -43567
39479d3567J27863R7764m5686k04901k46627j06390J17739K57672K63011K06152
$$ -43567 84296 182060 136374 -68527 -315154 -421544 -303805 -46133 216878 423030
39469D23030J32313L8172k5970j972K6948p8035k45938k27558K4125K15825J02886
$$ 423030 555343 593515 567545 565573 592521 514486 268548 40990 65115 280940 383826
39458C83826j58870k40662r2931N0289M9161K886J3994L1238k20j1348N1653Q8633
$$ 383826 224956 -15706 -108637 -58348 -9187 -6301 7693 38931 38711 27363 79016 167649
39446A67649q621j42643j05494J12447K63723J66052l2978m6798J42289K34186
$$ 167649 159028 16385 -89109 23338 287061 453113 420135 373337 515626 749812
39436G49812J7065l23529m25161j96758J02224K04193J02765l8946j02531o9381
$$ 749812 766877 443348 18187 -178571 -76347 127846 230611 191665 89134 19753
39426A9753K6858J13137J07773J0492q6706j22394j30122j34630p8217O7948K02061
$$ 19753 46611 159748 267521 278013 191307 68913 -61209 -195839 -274056 -206108 -4047
39415d047K04322R4078k2071r9790j47872j31000j9139R8486R5105k001m3049
$$ -4047 200275 294353 272282 172492 24620 -106380 -125519 -27033 68072 66071 23022
39404B3022J0552L3210m5061j15539o7846L5494P2507O0383J08539K11354K21760
$$ 23022 33574 66784 21723 -93816 -161662 -126168 -53661 6722 115261 326615 548375
39393E48375N8771j48274j87873j7882J65267J39595q0385k51911j89792K7760
$$ 548375 607146 458872 270999 253117 418384 557979 477594 225683 35891 63651
39383F3651J91724K18149J65594O6390r3429k39438k43517j38531j13506k08425
$$ 63651 255375 473524 639118 705508 612079 372641 129124 -9407 -122913 -331338
39373c31338k03303M0380K96817K51263m4933k40115j65991k149O6762R8643J87486
$$ -331338 -534641 -494261 -197444 53819 8886 -231229 -397220 -399369 -332607 -233964 -46478
39362d6478K30620R4463j15075j60088j1554J03090J7182j56786j92869m2745
$$ -46478 184142 278605 163530 3442 -8112 94978 112160 -44626 -237495 -280240
39352b80240J24516J40563K4644n9008K652J43874J94617P2628j20796k07685
$$ -280240 -155724 -15161 9483 -49525 -46873 97001 291618 364246 243450 35765
39342C5765j18730M5485J25018N0938j03362j91813j17217Q4238K60685K63998
$$ 35765 -82965 -37480 87538 138476 35114 -156699 -273916 -189678 71007 335005
39332C35005Q0430j46652k33739j13875J09801K63352K58527J53808O4984L3022
$$ 335005 415435 268783 35044 -78831 30970 294322 552849 706657 771641 804663
39322H04663K512p3930j49548j33122p652J41729K21460K09810J27467j9746k11873
$$ 804663 807175 733245 583697 450575 442923 584652 806112 1015922 1143389 1123643 911770
39311I11770l54788l31592j40996P0334J51393Q8999j9376q9140j04057q8598
$$ 911770 556982 225390 84394 154728 306121 395120 375744 286604 182547 93949
39301I3949p4780p0612l1399Q5723K03591J56410p1410k38929j32716J17785K08677
$$ 93949 19169 -51443 -82842 2881 206472 362882 291472 52543 -80173 37612 246289
39290B46289J04146N5299J51897J55887p9888l08011k42206p836N7746p9434j58811
$$ 246289 350435 405734 557631 713518 633630 325619 83413 75577 133323 53889 -104922
39279a04922q7213m7255j15872j05528R3235K77734K14801k5100j83987j44541
$$ -104922 -192135 -239390 -355262 -460790 -367555 -89821 124980 99880 -84107 -228648
39269b28648p31J06109J03805J5050m6405K5287J78955K43450J45605k5586j89122
$$ -228648 -229379 -123270 -19465 -4415 -50820 -25533 153422 396872 542477 516891 327769
39258C27769l33631l71614j63326K01708L79936K03853o9345j36642o2371n7076
$$ 327769 -5862 -377476 -540802 -339094 40842 244695 175350 38708 -23663 -80739
39248h0739n4538J31806L57062K69847j08837l34405j69436Q3898N3573j85135
$$ -80739 -135277 -3471 353591 623438 514601 180196 10760 94658 148231 -36904
39238c6904k83128j08810J62993L32047L37174K04378K24j80552k79955l05015
$$ -36904 -320032 -428842 -265849 66198 403372 607750 607974 427422 147467 -157548
39228a57548k51444q6358J33712K39031J39236m4281j30085q1554K1923J19449
$$ -157548 -408992 -495350 -361638 -122607 16629 -27652 -157737 -239291 -217368 -97919
39218i7919J65191Q2917j34416l28727l15095j01469J29280K34009K13125J30232
$$ -97919 67272 150189 15773 -312954 -628049 -729518 -600238 -366229 -153104 -22872
39208b2872L8710j2010P323O3440R6316J01494J16675J24585M1843j57048l47264
$$ -22872 15838 3828 11151 74591 170907 272401 389076 513661 555504 398456 51192
39197E1192l48286j30798J12528J66532N4143l729Q0712J23176j9497j59732m3511
$$ 51192 -297094 -427892 -315364 -148832 -94689 -98418 -17706 105470 85973 -73759 -117270
39186a17270J96259J80998j11725k56397j8696K68541K10064o7314j58322K808
$$ -117270 78989 259987 148262 -108135 -126831 141710 351774 284460 126138 128946
39176A28946J33445R3335J6612o345l6617o7657r348P8286K9250j09138r9895
$$ 128946 262391 355726 372338 365993 329376 261719 252371 330657 359907 250769 150874
39165A50874P5680J47768Q651q3979O3586K37066J48599j08861k25842j40725
$$ 150874 226554 374322 382973 298994 362580 599646 748245 639384 413542 272817
39155B72817m4117j1341O3048J76304J52769n7607k39612j93229q976O5685m7806
$$ 272817 228700 217359 280407 456711 609480 551873 312261 119032 110056 175741 127935
39144A27935j90000j91750o4418O1487J12542J21101J22234Q8903O250o0218m4381
$$ 127935 -62065 -253815 -318233 -256746 -144204 -23103 99131 188034 194284 134066 89685
39133H9685J6855M3614M1295O8391J01787N5053p0121j72698k00870j86875j26078
$$ 89685 106540 150154 191449 259840 361627 416680 346559 173861 -27009 -213884 -339962
39122c39962K6234K02241K30542P3335q9203r8201n858O4619J07156J60237J70592
$$ -339962 -313728 -111487 119055 192390 103187 4986 -872 63747 170903 331140 501732
39111E01732P4784o2109j16078n6999N3707J42144J31344j5489j82769j75343
$$ 501732 576516 514407 398329 341330 395037 537181 668525 653036 470267 294924
39101B94924n143O3011j05790k73574j75512O1664J21054k148k1235J51307K59120
$$ 294924 289781 352792 247002 -26572 -202084 -140420 -19366 -21514 -42749 108558 367678
39090C67678J10017j38174k11545n7346J48651K04089L9056k11046k84789q0066
$$ 367678 477695 339521 127976 70630 219281 423370 462426 251380 -33409 -113475
39080a13475J63063J37889j01109k12438o7195R7525Q4396R114L1050O5705l3035
$$ -113475 49588 187477 86368 -126070 -193265 -95740 -11344 -2230 28820 94525 61490
39069F1490j86929k03707n8993J12631K15879K26568J18687p4537j95408j19207
$$ 61490 -125439 -329146 -388139 -275508 -59629 166939 285626 211089 15681 -103526
39059a03526O0888J39675N8678n7609r4195o2366l1666l0648k5941K9838J17725
$$ -103526 -42638 97037 155715 98106 3911 -58455 -90121 -120769 -146710 -116872 853
39048H53J34479J8453j30828j66485j03341o3368l6093R2173K56430K28140o180
$$ 853 135332 153785 22957 -143528 -246869 -310237 -346330 -254157 2273 230413 224233
39037B24233j60844p8273M6281L9973L6574J39137J30843j21829k77772R98M00711
$$ 224233 63389 -14884 31397 71370 107944 247081 377924 256095 -21677 -20679 380032
39026C80032L34461j38536l67772j00297J95283J38134k3889L4033J41687J1985
$$ 380032 714493 575957 208185 107888 303171 441305 417416 451449 593136 605121
39016F05121k05905j97485k8226K3704k3121M6836J71890Q7263j72047k60854
$$ 605121 399216 201731 173505 197209 174088 220924 392814 480077 308030 47176
39006D7176m8803J97051K19140O3845r6233j70455j14046P1129K26103J46614
$$ 47176 -1627 195424 414564 478409 382176 211721 97675 168804 394907 541521
38996E41521j24254l14997k80940j28124L9677K29415L58210K52080k9220j66116
$$ 541521 417267 102270 -178670 -306794 -267117 -37702 320508 572588 543368 377252
38986C77252m8932K5229j52407l17588j62121J15285J01411j50586j96409Q6547
$$ 377252 328320 353549 201142 -116446 -278567 -163282 -61871 -212457 -408866 -322319
38976c22319L27399K70701J22621J25027J63371M5436j20821j14892K5382R4041
$$ -322319 5080 275781 398402 523429 686800 732236 611415 496523 521905 615946
38966F15946M5130j5923o3093j36276j78051j07526N605M5416N5122J25004J61213
$$ 615946 661076 645153 582060 445784 267733 160207 165812 211228 266350 391354 552567
38955E52567K5020j58564j31292O9195J30438l6991j50835k4298J28721M7150
$$ 552567 577587 419023 287731 356926 487364 450373 299538 275240 403961 451111
38945D51111j70728k43982j11384O4681J58450J44051K3165j20437j14735O6013
$$ 451111 280383 36401 -74983 -10302 148148 292199 315364 194927 80192 146205
38935A46205J87894P2786j13050j10927K9802P2213m714l1698j50n0217j36850
$$ 146205 334099 406885 293835 182908 212710 284923 280209 248511 248361 198144 61294
38924F1294o0866J40938J88559J4709j13847m1106N0550J1493j1897R8153J49366
$$ 61294 428 141366 329925 344634 230787 189681 240231 251724 239827 337980 487346
38913D87346l8140k70026k45486j3390J38494J16529N0742k394q7922j45964o2740
$$ 487346 449206 179180 -66306 -79696 58798 175327 226069 223675 135753 -10211 -72951
38902g2951R6833J55397R6638M3186N634r6380j98949j50925L707P2931M6246
$$ -72951 23882 179279 275917 319103 324737 228357 29408 -121517 -117810 -44879 1367
38891A367Q7924J84101J19678j21352k60165j53315r697j7898n8072J2635P9296
$$ 1367 89291 273392 393070 271718 11553 -141762 -151459 -169357 -227429 -214794 -135498
38880a35498K8972K3932K04627L45847J73771j38931j97688q848N4663j07272
$$ -135498 -106526 -82594 122033 467880 641651 502720 305032 296184 350847 243575
38870B43575j74600J0004J56329L2546j28893l3160J63614J08987j59747k70416
$$ 243575 68975 78979 235308 267854 138961 105801 269415 378402 218655 -51761
38860e1761q5744J46077K18409K06303K05370J41467j0184p2328O4902K08596
$$ -51761 -137505 8572 226981 433284 638654 780121 769937 697609 762511 971107
38850I71107J23205j02428j89301r2963l4413j15859j68965n9080Q8219R8566
$$ 971107 1094312 991884 802583 709620 675207 559348 390383 331303 419522 518088
38840E18088J2494k6481j8412n2752r1421j9590J08180R0710j05221k48477j60375
$$ 518088 530582 504101 485689 432937 341516 321926 430106 520816 415595 167118 6743
38829F743L3203J04049M9395L7622R9481Q7471m6855j40651o9325N6054P2047
$$ 6743 39946 143995 193390 231012 330493 417964 371109 230458 161133 217187 289234
38818B89234K1543N8473J61857J46046l3841j77522j16829N2228J23624N4931
$$ 289234 310777 369250 531107 677153 643312 465790 348961 401189 524813 579744
38808E79744l9874q8934j11208j09867n6336K8297Q4636R1958M1909j06301l07544
$$ 579744 539870 450936 339728 229861 173525 201822 286458 378416 420325 314024 6480
38797F480l37901l5742L75076M54367J04775k76952l20786j21975P134K035K1558
$$ 6480 -331421 -367163 7913 462280 567055 290103 -30683 -152658 -145524 -143489 -121931
38786a21931J11456J61775J28068O3382j5600q9156m1351J62034K88319J11093
$$ -121931 -10475 151300 279368 342750 327150 237994 196643 358677 646996 758089
38776G58089j93064k46754m8590K7651j43397k33253l3636J73345R0111r9539
$$ 758089 565025 318271 269681 297332 153935 -79318 -112954 60391 150502 50963
38766E0963o3863J12146J07690n8763p9283Q3354J28512n0726j78416o3552R7369
$$ 50963 -12900 99246 206936 148173 68890 152244 280756 230030 51614 -11938 85431
38755H5431P5533k2747J5810J29311R8860p2066j62756q1807K2726K0304k1862
$$ 85431 160964 138217 154027 283338 382198 310132 147376 65569 88295 108599 86737
38744H6737J9299J28623J83794J15229k8719j41765j43001k9523J11764J60023
$$ 86737 106036 234659 418453 533682 504963 363198 220197 190674 302438 462461
38734D62461P1744o0373r8805k7797J7024o8396j87179j48944N7406K18717J74932
$$ 462461 534205 473832 375027 347230 364254 295858 108679 -40265 17141 235858 410790
38723D10790K1693n9899o3571r9820j60818j39020n1505k9210o1598J4587J93081
$$ 410790 432483 372584 309013 209193 48375 -90645 -142150 -171360 -232958 -218371 -25290
38712b5290K11736m6241k84226j75112J39967K40711M4716j04402Q385J73973
$$ -25290 186446 140205 -144021 -319133 -179166 61545 106261 1859 10244 184217
38702A84217J50859L7633K7318M3026p9853k18115j15550J60569K71682J18873
$$ 184217 335076 372709 400027 443053 363200 145085 29535 190104 461786 580659
38692E80659m4879o5785q7139j68350q9729K14695L73681Q7000l37097l74869
$$ 580659 535780 469995 382856 214506 124777 339472 713153 800153 463056 88187
38682H8187n3412J40139L6353m1227Q0025J26586q5431k80644j79335M4546Q9005
$$ 88187 34775 174914 211267 170040 250065 376651 291220 10576 -168759 -124213 -35208
38671c5208R514K4602Q2468J0185q8218O788J89403J65278l2763q4852O8348J42694
$$ -35208 -25694 -1092 81376 91561 3343 10131 199534 364812 332049 247197 315545 458239
38659D58239K9750k5580R8930J47599p1788l19498k71988l861J57884J01536r010
$$ 458239 487989 462409 561339 708938 637150 317652 45664 41803 199687 301223 292213
38648B92213l6335M109N9733Q8876L3856j00680j88515j32082j3161L3308K6763
$$ 292213 255878 259987 319720 408596 442452 341772 153257 21175 8014 41322 68085
38637F8085P9633J82816K04906Q9452p0118j49518j02654K6571J29945J09461
$$ 68085 147718 330534 535440 624892 554774 405256 302602 329173 459118 568579
38627E68579p054p1145P213J48517K24569K01766J03262n2127j79693j30432R7576
$$ 568579 561525 490380 497593 646110 870679 1072445 1175707 1123580 943887 813455 911031
38616I11031K60813J46186j37557l04234k48603r6120K4596P3488L4184m1332
$$ 911031 1171844 1318030 1180473 876239 627636 531516 556112 629600 663784 622452
38606F22452J1465K45545M00132K01192j66679k28304Q8506K96940O1633k78775
$$ 622452 633917 879462 1279594 1480786 1314107 1085803 1174309 1471249 1532882 1254107
38596A254107j99864K41183N06821L45918O7215P361P4978m959k30819l48254
$$ 1254107 1054243 1295426 1802247 2148165 2215380 2222741 2297719 2292760 2061941 1713687
38586A713687k39858p0366l2098j07355j53536j26070j13458j71698k16330j23506
$$ 1713687 1473829 1403463 1371365 1264010 1110474 984404 870946 699248 482918 359412
38576C59412R6571K77742K59729N4592j56998j93878m3249J32896J62402L1649
$$ 359412 455983 733725 993454 1048046 891048 697170 653921 786817 949219 980868
38566I80868j18392j51718o2870N1443R9006N6602k3602m8453K3304R2915j266
$$ 980868 862476 710758 647888 699331 798337 854939 831337 782884 806188 899103 897837
38555H97837k54464m17588k64853R3336L04890K03351K162r546J57712K54425
$$ 897837 643373 225785 -39068 54268 359158 562509 564671 555125 712837 967262
38545I67262J58944J2158k8873l995j9419k9963Q2191K55475K65555L9498k07095
$$ 967262 1126206 1138364 1109491 1105496 1086077 1056114 1138305 1393780 1659335 1698833 1491738
38534A491738k43948j12127j3738k0024m3449k8349M277O1379J47319J54844j3334
$$ 1491738 1247790 1135663 1121925 1101901 1058452 1030103 1034380 1095759 1243078 1397922 1384588
38523A384588k17120j98557L5674J90150J14411P634N9559J43075P2240n0080
$$ 1384588 1167468 968911 1004585 1194735 1309146 1316780 1376339 1519414 1591654 1541574
38513A541574j2460J19492Q8951j40221l20843k65792m4123J62913K22524Q5782
$$ 1541574 1529114 1648606 1737557 1597336 1276493 1010701 966578 1129491 1352015 1437797
38503A437797j56166k66835r6207J90683K90847J55026J8021M5726J55543K14815
$$ 1437797 1281631 1014796 918589 1109272 1400119 1555145 1573166 1618892 1774435 1989250
38493A989250K18233K00311J34156N971j13522j39994o2659N0865R0763r473j57409
$$ 1989250 2207483 2407794 2541950 2547921 2434399 2294405 2231746 2282611 2373374 2363901 2206492
38482B206492j54629M0599K17577K06957J23010J30038J33720k9133k28794j98036
$$ 2206492 2051863 2092462 2310039 2516996 2640006 2770044 2903764 2874631 2645837 2447801
38472B447801K5701J56013J18526J03283J67110J59340P5638J00909K27727K17858
$$ 2447801 2473502 2629515 2748041 2851324 3018434 3177774 3253412 3354321 3582048 3799906
38462C799906M9140R369J99525L37328K53522K02655M18366O90680O89787M57467
$$ 3799906 3849046 3858415 4057940 4395268 4648790 4851445 5269811 5960491 6650278 7107745
38452G107745K81456K75041L46748M35237N46812O69629P98830R37229J019202
$$ 7107745 7389201 7664242 8010990 8446227 8993039 9662668 10461498 11398727 12417929
38443A2417929J008489J063449J342090J680429J826484J944411K400673L069771
$$ 12417929 13426418 14489867 15831957 17512386 19338870 21283281 23683954 26753725
38435B6753725L468140L637096M178786N270886O452032P618277R312209J1665744
$$ 26753725 30221865 33858961 38037747 43308633 49760665 57378942 66691151 78356895
38427G8356895J4092311J6550595K0004660K5032331L1311002L9046791M8443851
$$ 78356895 92449206 108999801 129004461 154036792 185347794 224394585 272838436
38420B72838436N5594056N1390969K9258188n351246l6752262n2241877n1780089
$$ 272838436 328432492 379823461 409081649 403730403 366978141 314736264 262956175
38413B62956175m3983793l5865429k9010655k3087792j8571732j5609838j3191800
$$ 262956175 218972382 183106953 154096298 131008506 112436774 96826936 83635136
38406H3635136j0658702q545686p279922o326104n197848m213910l684958l273649
$$ 83635136 72976434 64430748 57150826 50824722 45626874 41412964 37728006 34454357
38398C4454357k692829k243480k155181k082424j730628j373065j295624j274149
$$ 34454357 31761528 29518048 27362867 25280443 23549815 22176750 20881126 19606977
38390A9606977j040331p83602p66435q54698q14884p09505o60235n76007m22774
$$ 19606977 18566646 17783044 17016609 16161911 15347027 14637522 13977287 13401280 12978506
38381A2978506l98016n38013n30436k35509j0561j58903m20581m11245k37551
$$ 12978506 12580490 12042477 11512041 11276532 11265971 11107068 10686487 10275242 10037691
38372A0037691k27986l20260k07813O9080J65434Q953r2677N2075K54585K49482
$$ 10037691 9809705 9489445 9281632 9350712 9516146 9525099 9432422 9484497 9739082 9988564
38362I988564L0124j83072j74766P2535L35961L63643J94531J38554L54338O30985
$$ 9988564 10018688 9835616 9660850 9733385 10069346 10432989 10627520 10766074 11120412 11751397
38352A1751397P23323O96288P38047Q17069P68450N86820L89480J87092p8283
$$ 11751397 12474720 13171008 13909055 14726124 15494574 16081394 16470874 16657966 16579683
38343A6579683l43574m85656n09923m98014m47424l40683k80654l63769m97799
$$ 16579683 16236109 15750453 15240530 14742516 14295092 13954409 13673755 13309986 12812187
38334A2812187n27931m59080l76686k54967m9161J22437J15323L398k9544L0017
$$ 12812187 12284256 11825176 11448490 11193523 11144362 11266799 11382122 11385520 11355976 11385993
38324A1385993O7360P6681J20557J33262K6330p1772L3653K45968K70374O9885
$$ 11385993 11453353 11530034 11650591 11783853 11810183 11738411 11772064 12018032 12288406 12358291
38314A2358291p7395k5061M0295n3334j91236k03656j52001j99355l36607m11459
$$ 12358291 12280896 12255835 12296130 12242796 12051560 11847904 11695903 11496548 11159941 10748482
38304A0748482l58619k69660k58565l28071l64846k67478r6848l6439j46426k66283
$$ 10748482 10389863 10120203 9861638 9533567 9168721 8901243 8804395 8767956 8621530 8355247
38294H355247k72395k88396m48428n96778n05830k95368k86432m64945m78918
$$ 8355247 8082852 7794456 7346028 6749250 6243420 5948052 5661620 5196675 4717757
38285D717757k24841l4374j32157k92923k63400j75975k42000l24003j79640O4884
$$ 4717757 4492916 4458542 4326385 4033462 3770062 3594087 3352087 3028084 2848444 2913328
38275B913328P5647j50564k76715j36567O7792J10650J1758r6681j45419j05216
$$ 2913328 2988975 2838411 2561696 2425129 2492921 2603571 2615329 2518648 2373229 2268013
38265B268013K0327J15821L8366j55355k23720n3891J82070K69036K20714K02982
$$ 2268013 2288340 2404161 2442527 2287172 2063452 2009561 2191631 2460667 2681381 2884363
38255B884363K71203L01854J68257q7859k73348k23810K3685K56455L13971K50449
$$ 2884363 3155566 3457420 3625677 3537818 3264470 3040660 3064345 3320800 3634771 3885220
38245C885220K10632J96020P4538j79555l89963l83489j98300r921Q6381J25546
$$ 3885220 4095852 4291872 4366410 4186855 3796892 3413403 3215103 3205182 3291563 3417109
38235C417109J37298Q0414m1632r0573O3588L20820M11670K53376J21893L16882
$$ 3417109 3554407 3634821 3593189 3502616 3566204 3887024 4298694 4552070 4673963 4990845
38225D990845P33246R82310R38183R15393J215576J748739K289315K876314L626913
$$ 4990845 5724091 6706401 7644584 8559977 9775553 11524292 13813607 16689921 20316834
38216B0316834M222279L947307K404281L7857k166425l443482l694215l325786
$$ 20316834 24539113 28486420 30890701 30928558 28762133 25318651 21624436 18298650
38208A8298650k794586k305289j863162j489196j257894j133247r45119o34399
$$ 18298650 15504064 13198775 11335613 9846417 8588523 7455276 6510157 5875758
38200E875758l85509l73962n00152n42414m66055l79719k84464j14859L2257j0737
$$ 5875758 5490249 5116287 4616135 4073721 3607666 3227947 2943483 2828624 2860881 2850144
38190B850144j77275k36566j77863k18749l83118m06290j77801N0155P2696M0205
$$ 2850144 2672869 2436303 2258440 2039691 1656573 1250283 1072482 1122637 1195333 1235538
38180A235538J28722J95094N8268j16327o5783J01627O2473j82489k99756j44192
$$ 1235538 1364260 1559354 1617622 1501295 1435512 1537139 1599612 1417123 1117367 973175
38170I73175O2183J25366J36719K22004K89874J87336n6550k77508l67377l33639
$$ 973175 1035358 1160724 1297443 1519447 1809321 1996657 1940107 1662599 1295222 961583
38160I61583k47322j82551j48036p8415L9461Q8507r403j15723m2592J50612K33118
$$ 961583 714261 531710 383674 305259 344720 433227 423824 308101 265509 416121 649239
38149F49239J45516L6656k8062j27124k27141j65688K4642P6448q7468j81887
$$ 649239 794755 831411 803349 676225 449084 283396 308038 384486 297018 115131
38139A15131n274K21162K14083P7946P5179J42506K1506k25071k38877O7569L40309
$$ 115131 109857 331019 545102 623048 698227 840733 862239 637168 398291 465860 806169
38128H06169K89906O1408o0105n9465r5060j69256j40983J840J00977O6612p647
$$ 806169 1096075 1157483 1097378 1037913 942853 773597 632614 634454 735431 802043 794396
38117G94396j3069J6766l946m7348q174J10114J61797O1175p3245p0277O0827
$$ 794396 781327 798093 794147 746799 738625 848739 1010536 1071711 998466 928189 989016
38106I89016J74340K28418L15593M38305M40162K43652l507j29769j46217j34733
$$ 989016 1163356 1391774 1707367 2145672 2585834 2829486 2825979 2696210 2549993 2415260
38096B415260q7139j5264o2790k85847m45597k90252K2796Q5506j78182l88910
$$ 2415260 2328121 2312857 2250067 1964220 1518623 1228371 1251167 1336673 1158491 769581
38086G69581k45059R0135K59943J52209p9005k50628k57972q7678J32096K06026
$$ 769581 524522 614657 874600 1026809 947804 697176 439204 351526 483622 689648
38076F89648J07537J7764L7398L2728r6413j92031r1766O0071K6828j06891n3833
$$ 689648 797185 814949 852347 885075 788662 596631 504865 564936 591764 484873 431040
38065D31040J76482K38952j3668k74197k28164j2742Q190k17019l71247k14859
$$ 431040 607522 846474 832806 558609 330445 317703 325893 108874 -262373 -477232
38055d77232J29128L67754L57589J74369k2387j20005j09492p1961q2640j11678
$$ -477232 -348104 19650 377239 551608 529221 409216 299724 227763 145123 33445
38045C3445o6992N4522J37174J11651O8466J19904K05692J56633n4158k43563
$$ 33445 -33547 20975 158149 269800 338266 458170 663862 820495 766337 522774
38035E22774k39570p5871Q7232J56307J50235J13088O3068L224p2891j62812k11294
$$ 522774 283204 207333 294565 450872 601107 714195 777263 780487 707596 544784 333490
38024C33490j40779K6567J46479J24349M4020L8328R8440J24080J05861J16248
$$ 333490 192711 219278 365757 490106 534126 572454 670894 794974 900835 1017083
38014A017083J45547R9676k5995j07901o5478L7413R5150P1759j1369j05793j35083
$$ 1017083 1162630 1262306 1236311 1128410 1062932 1100345 1195495 1267254 1255885 1150092 1015009
38003A015009n5128O4739R8943P541j47322k89856l42431k18154N0945K42109
$$ 1015009 959881 1024620 1123563 1131104 983782 693926 351495 133341 184286 426395
37993D26395J85042K1856K755Q2975K0647j47081j08212J63923K64926k5526l55483
$$ 426395 611437 633293 636048 719023 739670 592589 484377 648300 913226 887700 532217
37982E32217l11762m270J91182K02549J95872J61402p887j68063r3486Q4390M2999
$$ 532217 220455 216185 407367 609916 805788 967190 959303 791240 697754 782144 825143
37971H25143j62504j49589J41716L07364J06975j84727k35995j05213j1592K7375
$$ 825143 662639 513050 654766 962130 1069105 884378 648383 543170 531578 558953
37961E58953P7477O1817p6097j71011n9848J27304J42588q392r5977j4808R3913
$$ 558953 636430 698247 622150 451139 391291 518595 661183 652791 556814 542006 635919
37950F35919O2457r7713k22483j67053L3282J71104J05421l4037j8951J26716
$$ 635919 698376 600663 378180 211127 244409 415513 520934 486897 467946 594662
37940E94662J58776J0064j08454q1191p0972j76628k00779L153K03706J12691
$$ 594662 753438 763502 655048 573857 502885 326257 125478 128631 332337 445028
37930D45028j46786k17023l3839J43819J61035J01641K2260j24996k67060k02666
$$ 445028 298242 81219 47380 191199 352234 453875 476135 351139 84079 -118587
37920a18587Q2290L18528K79729L9781j74011k34040j51089k981J00348Q9937
$$ -118587 -36297 282231 561960 601741 427730 193690 42601 39620 139968 229905
37910B29905K4535O202M676q9797k23532j79986R2893L27901K54066m0544k15353
$$ 229905 254440 260642 265318 175521 -48011 -227997 -135104 192797 446863 406319 190966
37899A90966r9934J30063K03815O9116r6514j25879l3026N8532Q1805N8668J3719
$$ 190966 91032 221095 424910 494026 397512 271633 238607 297139 378944 437612 451331
37888D51331m5254p1442j6218O3301N2375m0674q5160m0671o149r572M7798J52851
$$ 451331 406077 334635 318417 381718 434093 393419 308259 267588 261439 251867 299665 452516
37876D52516J27570m4404j03525O4571J74703K807j78352k6333K44465J75217
$$ 452516 580086 535682 432157 496728 671431 674238 495886 469553 714018 889235
37866H89235j43112j82814J32635K91598O7059j13519O1775K47706P4581j86841
$$ 889235 746123 563309 695944 987542 1054601 941082 1002857 1250563 1325144 1138303
37856A138303j02843J69133J70705p5823j60180j0240N0020p5303j14480M1471
$$ 1138303 1035460 1204593 1375298 1299475 1139295 1129055 1179075 1103772 989292 1030763
37846A030763J50559O0921p6165j43850k23613l01222j91103Q6622K15590O4093
$$ 1030763 1181322 1242243 1166078 1022228 798615 497393 306290 392912 608502 672595
37836F72595q1328J1820J41844M7150j27076q3038J14411J50744k1949j42538
$$ 672595 591267 603087 744931 792081 665005 581967 696378 847122 825173 682635
37826F82635q0350P832j5713q0726q6318n2880l4612m4799j01157j92170j93873
$$ 682635 602285 610117 594404 513678 427360 374480 339868 295069 193912 1742 -192131
37815a92131P4K53756K96628R5385q8361p3423K7132O3866Q9433J75597K01622
$$ -192131 -192057 61699 358327 453712 365351 291928 319060 382926 472359 647956 849578
37804H49578N4163j09889o0178J33346J91920O0042l0170M5416J14653J7065j29397
$$ 849578 903741 793852 733674 867020 1058940 1118982 1088812 1134228 1248881 1265946 1136549
37793A136549j20173M3899K13099L10911L47424L19243K56311K82176M61637O53180
$$ 1136549 1016376 1060275 1273374 1584285 1931709 2250952 2507263 2789439 3251076 3904256
37783C904256O75786N59766M52600L37735P6993k79619m83393m44079l54720l56194
$$ 3904256 4580042 5139808 5592408 5930143 6007136 5727517 5244124 4800045 4445325 4089131
37773D089131l19678j36739n923j65794m73377n51721l26301j16960j46150k39400
$$ 4089131 3769453 3632714 3626791 3460997 2987620 2435899 2109598 1992638 1846488 1607088
37763A607088j55380K2483M7236q4812j50682p8227m4886j54592k53637j92844
$$ 1607088 1451708 1474191 1521427 1436615 1285933 1207706 1162820 1008228 754591 561747
37753E61747q1075q7797j24931K8059L24012M41767K41265j3361k0242J62064
$$ 561747 480672 392875 267944 296003 620015 1061782 1303047 1289686 1269444 1431508
37743A431508K64754K09876J35423J05196M2205o3427j16305j15306j71283k68456
$$ 1431508 1696262 1906138 2041561 2146757 2188962 2125535 2009230 1893924 1722641 1454185
37733A454185k29131j7130J34222M7101j27558j48615n2341n7232j90139k53532
$$ 1454185 1225054 1207924 1342146 1389247 1261689 1113074 1060733 1003501 813362 559830
37723E59830j51067j7318J8355K936J8501K9442k4351r5788j03614n9769j8270
$$ 559830 408763 391445 409800 412736 431237 460679 436328 340540 236926 177157 158887
37712A58887L9164J43833K04828Q6310j53472k52232p3399J68204J67607m7561
$$ 158887 198051 341884 546712 633022 479550 227318 153919 322123 489730 442169
37702D42169j64607o1436K2064r4303j99205l1699K39191K32970k6619j23569
$$ 442169 277562 216126 238190 143887 -55318 -87017 152174 385144 358525 234956
37692B34956Q1665K16493j503l10450l28746j23209p225l115R6049K62148K45001
$$ 234956 316621 533114 531611 221161 -107585 -230794 -238019 -241134 -145085 117063 362064
37681C62064K1608j40997j02070k353L9921P8673J21225O1096p4713q9782N8677
$$ 362064 383672 242675 140605 138252 178173 256846 378071 439167 364454 274672 333349
37670C33349J62498J04840L3933N9436N4650n6686r1927P1024K08667P9619j51571
$$ 333349 495847 600687 634620 694056 748706 692020 600093 671117 879784 959403 807832
37659H07832j48457O1583J36258l9384k04899j59745l9181m0740j11255o4012
$$ 807832 659375 720958 857216 817832 612933 453188 414007 373267 262012 198000
37649A98000J32720L27897L83447L08335K32872K83473M39989N19913L75026R1422
$$ 198000 330720 658617 1042064 1350399 1583271 1866744 2306733 2826646 3201672 3293094
37639C293094j05875j44836j76170l17792m62429m32326k43053j00562j51467
$$ 3293094 3187219 3042383 2866213 2548421 2085992 1653666 1410613 1310051 1158584
37630A158584l18391m03197l11336j39511m3164n2605o3224K710R6635J35096
$$ 1158584 840193 436996 125660 -13851 -57015 -109620 -172844 -170134 -73499 61597
37620F1597J16682Q5515L9147m2408j15687j15236n6948j1902R325N3257J08465
$$ 61597 178279 263794 302941 260533 144846 29610 -27338 -39240 -29915 23342 131807
37609A31807R6371O3q8078q7722k8969J2885J9622J7311J1241m207J786O4675
$$ 131807 228178 228241 140163 52441 23472 36357 55979 73290 84531 80324 82110 146785
37597A46785J40999J21473k9224j85122j82396k5981J12836J30434J10152J29986
$$ 146785 287784 409257 380033 194911 12515 -13466 99370 229804 339956 469942
37587D69942Q6379j15608k95779j84952J32194K56602L5014k20317k22822j13579
$$ 469942 556321 440713 144934 -40018 92176 348778 383792 163475 -59347 -172926
37577a72926j26951j46654M4171K84526K47528K2458R123K36058K76326m7018
$$ -172926 -299877 -446531 -402360 -117834 129694 152152 161275 397333 673659 626641
37567F26641l44374k67414k1814K4209r3318j07779o313L5365K7949J02047J75724
$$ 626641 282267 14853 -6961 17248 -76070 -183849 -190162 -154797 -126848 -24801 150923
37556A50923N7360j69969k19942n9740L3118q5293k21856j68908J9881J70195
$$ 150923 208283 38314 -181628 -241368 -208250 -293543 -515399 -684307 -664426 -494231
37546d94231J98616J04488o3613j68222q7981Q9322J60497J14627J20871J85436
$$ -494231 -295615 -191127 -254740 -422962 -510943 -421621 -261124 -146497 -25626 159810
37536A59810J15345q8065j29794J04501K90853J45147j17553j32055L1633K7292
$$ 159810 275155 187090 57296 161797 452650 597797 480244 348189 379822 407114
37526D07114j64174k27770p3384L4113m2362j07765l4409J4501n8722n8697J31248
$$ 407114 242940 15170 -58214 -24101 -66463 -174228 -208637 -194136 -252858 -311555 -180307
37515a80307K63359J15713r3503m0867J52881J21171j17554j83013J9673J40944
$$ -180307 83052 198765 105262 64395 217276 338447 220893 37880 57553 198497
37505A98497j2416j55307l0908J37590L4615j85978j37976J39667K02351j11187
$$ 198497 186081 30774 -134 137456 172071 -13907 -151883 -12216 190135 78948
37495G8948m09035l05874N4835K53359J63318J7231J962M4982J9146m4033m1512
$$ 78948 -330087 -635961 -581126 -327767 -164449 -147218 -145256 -100274 -81128 -125161 -166673
37484a66673J8187L8788L478O256R6079J79139J44629L3038k2563q049m9992j84333
$$ -166673 -148486 -109698 -106220 -99964 -3885 175254 319883 352921 330358 322309 272317 87984
37472H7984k46515j10126P9011Q4879o4017j18093m609O2681m3934j29449J002
$$ 87984 -158531 -268657 -189646 -104767 -168784 -286877 -291486 -228805 -272739 -402188 -401186
37461d01186J75765Q8238j94257k64341M8398M15664M52770K00063k5199r5754
$$ -401186 -225421 -137183 -331440 -595781 -547383 -131719 321051 521114 495915 400161
37451D00161j45802k39584k37307n4330J50856J76760M6572n6346m4989J2968
$$ 400161 254359 14775 -222532 -276862 -126006 50754 97326 40980 -4009 8959
37441H959N0243P2109P7240M0124k615K5425Q7155L3924j55818k68618j25501
$$ 8959 59202 131311 208551 248675 246060 271485 358640 392564 236746 -31872 -157373
37430a57373J30423J91324l225j94545j64572O488J06574O6229l0123r0974o6312
$$ -157373 -26950 164374 161149 -33396 -197968 -191480 -84906 -18677 -48800 -139774 -206086
37419b06086O0791K15525K32617L6502k21911l16563k00455j2681J20558J74281
$$ -206086 -145295 70230 302847 339349 117438 -199125 -399580 -412261 -291703 -117422
37409a17422J51550O1888k5877l0708K8317O5418O3305O1743L4147p2649j79115
$$ -117422 34128 96016 70139 39431 67748 133166 196471 258214 292361 219712 40597
37398D0597j34367L3237J22638P7651P8884K07326K55016O7930j37764q3983R6579
$$ 40597 -93770 -60533 62105 139756 218640 425966 680982 748912 611148 527165 623744
37387F23744M3099k35895l30363n6475K45875K14699l2015j41873o1816l1327
$$ 623744 666843 430948 100585 44110 289985 504684 472669 330796 268980 237653
37377B37653j48162k34756j39206N9023J90446J82770O4719r0279j85076j64023
$$ 237653 89491 -145265 -284471 -225448 -35002 147768 212487 122208 -62868 -226891
37367b26891q5306m7707m5804M431R9042J24374K5673j10591j76187j48714n3154
$$ -226891 -312197 -359904 -405708 -401277 -302235 -177861 -152188 -262779 -438966 -587680 -640834
37356f40834Q2702J94777J98451Q8237m5906j26621j40543q2349M1132J39234
$$ -640834 -558132 -363355 -164904 -76667 -122573 -249194 -389737 -472086 -430954 -291720
37346b91720J07933R381K9562J93495K87994J71843l025l3121J7111o1419k65745
$$ -291720 -183787 -174406 -144844 48651 336645 508488 505463 472342 489453 428034 162289
37335A62289l64766k23675L6091K13101K23069J13190l60p947P9948J14761r3
$$ 162289 -202477 -426152 -390061 -176960 46109 159299 158939 150992 230940 345701 345608
37324C45608j54968j87626j15792n9047j0295J02767J88008Q7375r9039q2403
$$ 345608 190640 3014 -112778 -171825 -182120 -79353 108655 196030 96991 14588
37314A4588J56749K76665P5656j87883j77168M1428J40812P779j73133k27393
$$ 14588 171337 448002 523658 335775 158607 200035 340847 348626 175493 -51900
37304e1900j58498m6382L9494M4360j8176m7327O138M9055j290p0004n6284k461
$$ -51900 -210398 -256780 -217286 -172926 -191102 -238429 -232291 -183236 -184526 -254530 -310814 -313275
37292c13275J5343M2463J14222J03347p2260k09592p3293J88425K06601m4001
$$ -313275 -297932 -255469 -141247 -37900 -110160 -319752 -393045 -204620 1981 -42020
37282d2020j89787k8246J85766J61093j6521q2279K2645J60396K16608J37724
$$ -42020 -231807 -260053 -74287 86806 70285 -11994 10651 171047 387655 525379
37272E25379q7693l18424l02789j5878K17469J50328q693P9978L23629L10221
$$ 525379 437686 119262 -183527 -199405 18064 168392 159699 239677 563306 873527
37262H73527m5536l34468k26749Q9793K17817P3678j13673j86345j97022k02931
$$ 873527 827991 493523 266774 356567 574384 648062 534389 348044 151022 -51909
37252e1909j46511k266J14347R1521j1757n5846k8206k9795o5055q910J55296
$$ -51909 -198420 -200686 -86339 5182 -6575 -62421 -90627 -120422 -185477 -194387 -39091
37241c9091K29234P0528j58572k05883j00256o5825j15639l5215J93565K87691
$$ -39091 190143 260671 102099 -103784 -204040 -269865 -385504 -420719 -227154 60537
37231F0537J22141k5229Q1988K31245J11075j51973j91941j1407L4159j59032
$$ 60537 182678 157449 239437 470682 581757 429784 237843 226436 260595 101563
37221A01563k78822j25268Q0677Q9561Q557O4980K17099K50071J13970n8014j72646
$$ 101563 -177259 -302527 -221850 -132289 -123732 -58752 158347 408418 522388 464374 291728
37210B91728k25271j97346p8716M9261Q7436M0722k5006p9930r8412k9334R2657
$$ 291728 66457 -130889 -209605 -160344 -72908 -32186 -57192 -137122 -235534 -264868 -172211
37199a72211J15011j8237j25961k6875J76355K40314J37953N5188O3115L3424
$$ -172211 -57200 -75437 -201398 -228273 -51918 188396 326349 381537 444652 478076
37189D78076q8064j52707m9380J03478J28302K8475n8936n9890k092P2906J24534
$$ 478076 390012 237305 187925 291403 419705 448180 389244 329354 327262 400168 524702
37178E24702Q7218n6396j91814j71002j4316P6676l6031k26881k37726n932K31104
$$ 524702 611920 555524 363710 192708 178392 255068 219037 -7844 -245570 -251502 -20398
37167b0398K20873J8848q8764K4366J54704N9878j96454l21250j67497R7622K09928
$$ -20398 200475 219323 130559 154925 309629 369507 173053 -148197 -315694 -218072 -8144
37156h144R8711p4252j15148l907R9852O0909n1592o0927N4098J25678O5401J877
$$ -8144 90567 16315 -98833 -102740 -2888 58021 6429 -54498 -400 125278 190679 192556
37144A92556M6334Q9672L912j03412o5608K5120m5285k17069k10855J5888J88653
$$ 192556 238890 328562 332474 229062 163454 188574 143289 -73780 -284635 -268747 -80094
37133h0094J57607R6092J34151J17274o6243k05443q8436J12593Q4535j40921
$$ -80094 77513 173605 307756 425030 358787 153344 64908 177501 262036 121115
37123A21115k52428j27393N7431J43542J44449R0779k0510j03239m3917P9209
$$ 121115 -131313 -258706 -201275 -57733 86716 177495 156985 53746 9829 89038
37113H9038N7516j24529k39992j53544K292O9907R0939J66934K50459K16993N6030
$$ 89038 146554 22025 -217967 -371511 -369219 -299312 -208373 -41439 209020 426013 482043
37102D82043j18907j95407j39529j5427M1991l7589j35826p6355J00873J53390
$$ 482043 363136 167729 28200 12773 54764 17175 -118651 -195006 -94133 59257
37092E9257j6859j97936j58273L9081J53495R9736J4390L6592J46793K12938J26272
$$ 59257 42398 -155538 -313811 -274730 -121235 -21499 -7109 29483 176276 389214 515486
37081E15486q8409k65582k55894j10176j6300k9839m727J43244K61500J75872
$$ 515486 427077 161495 -94399 -204575 -220875 -250714 -255441 -112197 149303 325175
37071C25175m5885j99005k15702j72375r9791K7680J44087J19976l6020j47893
$$ 325175 279290 80285 -135417 -307792 -407583 -379903 -235816 -115840 -151860 -299753
37061b99753r1309N6296J27135O1021l8922k2420J31476K51636J53589r6244k08300
$$ -299753 -391062 -334766 -207631 -146610 -185532 -207952 -76476 175160 328749 232505 24205
37050B4205l8158J96403J96123k7558k07600j91737o6619M5695J10334R9561j1287
$$ 24205 -13953 182450 378573 351015 143415 -48322 -114941 -69246 41088 140649 129362
37039A29362j33800j26768r759M5098k0210n9766L1350J45159J31768J0298r2918
$$ 129362 -4438 -131206 -140965 -95867 -116077 -175843 -144493 666 132434 142732 49814
37028D9814j09010l9573Q6375J75914J06101r3601j97604n7754J63860J90495
$$ 49814 -59196 -98769 -12394 163520 269621 176020 -21584 -79338 84522 275017
37018B75017M979j45060j09659k3638o5550j73942j37042Q9768K96061K75546
$$ 275017 279996 134936 25277 1639 -63911 -237853 -374895 -285127 10934 286480
37008B86480P3582r9348j41182j33079j49802j30963o352J57527K39411K22319
$$ 286480 360062 260714 119532 -13547 -163349 -294312 -300664 -143137 96274 318593
36998C18593J64635P4465o0911j64835j36918k0387L2176l1908j12786j21517
$$ 318593 483228 557693 496782 331947 195029 174642 206818 174910 62124 -59393
36988e9393p4833j6806L5710N9554M6462M7744Q1679M0672j44122k94115j70252
$$ -59393 -134226 -151032 -115322 -55768 -9306 38438 120117 160789 16667 -277448 -447700
36977d47700J35653K62827Q4969j24532j25763k3944L373R495R2795J50049P1821
$$ -447700 -312047 -49220 35749 -88783 -214546 -238490 -235117 -225622 -132827 17222 89043
36966H9043r140O8119J92850J70083O1958M9857Q2602j5896j76391j64671M234
$$ 89043 79903 148022 340872 510955 572913 622770 705372 689476 513085 348414 352648
36955C52648P1648l8629j26666q5763m7083q4421p7064L0101J03670P3308N2934
$$ 352648 424296 385667 259001 173238 126155 41734 -35330 -5229 98441 171749 224683
36944B24683R4724P3669n3191j23393n4312m866q1667j32188l7269L4233p8730
$$ 224683 319407 393076 339885 216492 162180 157314 75647 -56541 -93810 -59577 -138307
36933a38307j94616o1354J95647K40694N2019p5250k4511L060j02434j53929j2793
$$ -138307 -332923 -394277 -198630 42064 94083 18833 -5678 -2618 -105052 -258981 -271774
36922b71774J41290Q8192q3765j30331k5089M9884K5852K7850J17834J64888O1044
$$ -271774 -130484 -42292 -126057 -256388 -281477 -231593 -205741 -177891 -60057 104831 165875
36911A65875q4950j02375j5474J1384m9758m7490P5943J43753R89k11248k15680
$$ 165875 80925 -21450 -36924 -25540 -75298 -122788 -46845 96908 97897 -113351 -329031
36900c29031J4062K08055J55735n1378j80174j29166K0639J25939R3754m4902
$$ -329031 -314969 -106914 48821 -2557 -182731 -311897 -291258 -165319 -71565 -116467
36890a16467j38188p2967O3379R9877N4144R9704K25138J73635j37973l79587
$$ -116467 -254655 -327622 -264243 -164366 -110222 -10518 214620 388255 250282 -129305
36880a29305k30818J23033K21338j6056j85481R100L47648M12220J21640k18775
$$ -129305 -360123 -237090 -15752 -31808 -217289 -208189 139459 551679 673319 454544
36870D54544l08781j49682K9853M7908n8789j15786l2869J05260J78807J74233
$$ 454544 145763 -3919 25934 73842 15053 -100733 -133602 -28342 150465 324698
36860C24698J26736K3981j20716j90439j13343k1420p8545j96490j40456Q7390
$$ 324698 451434 475415 354699 164260 50917 29497 -49048 -245538 -385994 -298604
36850b98604K14272J01522n8430n9687K4183K1900m9920p5975o8800r3051p6036
$$ -298604 -84332 17190 -41240 -100927 -76744 -54844 -104764 -180739 -249539 -342590 -418626
36839d18626P3347K28393J76555l2657j20518J0838J38865O7593j01874j66620
$$ -418626 -345279 -116886 59669 27012 -93506 -82668 56197 123790 21916 -144704
36829a44704j06972l1783J4779L5012r292r5529o6138J42658K94913J31065j97388
$$ -144704 -251676 -283459 -268680 -233668 -242960 -338489 -404627 -261969 32944 164009 -33379
36818c3379k68151L916K18769Q2260j62020j30569J17586K20997Q8818l2281j6557
$$ -33379 -301530 -297614 -78845 3415 -158605 -289174 -171588 49409 138227 105946 89389
36807H9389j3421r7092j11142J2589Q5610j0983r5694N367J47472J13318j7708
$$ 89389 75968 -21124 -132266 -119677 -34067 -45050 -140744 -135377 12095 125413 107705
36796A07705l1216K9417m9361k35784k50809l315K53516K70850Q8783r7351j64216
$$ 107705 76489 105906 56545 -179239 -430048 -433363 -179847 91003 179786 82435 -81781
36785h1781q8560P3928J69874P2656j13014j37818L9779J73184Q7541p3053r3928
$$ -81781 -170341 -96413 73461 146117 33103 -104715 -64936 108248 195789 122736 28808
36774B8808j5479k7133j43545j82921m0251J69796K58230J65184O165n1461K9908
$$ 28808 13329 -13804 -157349 -340270 -380521 -210725 47505 212689 218854 167393 197301
36763A97301J04989K7594j37740j93898r0836K3514N0933N9202R0561N7496n1965
$$ 197301 302290 329884 192144 -1754 -92590 -69076 -18143 41059 131620 189116 137151
36752A37151o3874J09198K52747J32827j21523j73877K7692J72639L4805k22153
$$ 137151 73277 182475 435222 568049 446526 272649 300341 472980 507785 285632
36742B85632k84111q9961J25264J40640K692o9101J204K7024j51725l56272k64261
$$ 285632 1521 -88440 36824 177464 180156 111055 112259 139283 -12442 -368714 -632975
36731f32975R1129L04244J77454P223Q1853K01651L8193k67323l02888n8145P7546
$$ -632975 -541846 -237602 -60148 -52925 28928 230579 268772 1449 -301439 -359584 -282038
36720b82038k6627p1175R6282J98759K6469j83144j34577O7725J47269R9008R7085
$$ -282038 -308665 -379840 -283558 -84799 -58330 -241474 -376051 -308326 -161057 -62049 35036
36709C5036J38533Q7506l5776q6426m3981J332M0693J09509J29683P817j59361
$$ 35036 173569 261075 225299 138873 94892 96224 136917 246426 376109 383926 224565
36698B24565j81911m2654J08306J70908J38123R24j95268k75539j30626P7406
$$ 224565 42654 0 108306 279214 417337 418261 222993 -52546 -183172 -105766
36688a05766J22918N5447P9048J64770R7481j02424j48202M7402J93529N0110
$$ -105766 17152 72599 151647 316417 413898 311474 163272 210674 404203 454313
36678D54313k21812l04693j26216J32351K72024K03223j2496j59219o7626J20238
$$ 454313 232501 -72192 -198408 -66057 205967 409190 396694 237475 169849 290087
36668B90087R5797j44526k49911n9183J24268K2684j54635o0278K13424K85837
$$ 290087 385884 241358 -8553 -67736 56532 79216 -75419 -135697 77727 363564
36658C63564Q3846r6309p1270L5118P4098L8066o4418k14737k60644p1942J74695
$$ 363564 447410 351101 279831 314949 389047 427113 362695 147958 -112686 -184628 -9933
36647i933J66313p4112k07758j09991k3892r4067j24049L1183J82885J48484O5822
$$ -9933 156380 82268 -125490 -235481 -259373 -353440 -477489 -446306 -263421 -114937 -49115
36636d9115J06699J51471M1279q4550k1874J23565J20076R10n7012q3323j85000
$$ -49115 57584 209055 250334 165784 143910 267475 387551 388461 331449 248126 63126
36625F3126k16258J0933K87404K28736j00354k53081j09321j6172j25591j24585
$$ 63126 -153132 -142199 145205 373941 273587 20506 -88815 -104987 -230578 -355163
36615c55163J50663L35361J19571k00876j78906Q8272J75644K3976o2454R017
$$ -355163 -204500 130861 250432 49556 -129350 -41078 134566 158542 96088 105105
36605A05105K5622p0364p2583P6006J46180J2372j38802j21881r949N2853O4954
$$ 105105 130727 60363 -12220 63786 209966 222338 83536 -38345 -48294 4559 69513
36594F9513O0318o659j28032j64313l4785J47713K32772J92676N9445j32954k67022
$$ 69513 129831 123172 -4860 -169173 -203958 -56245 176527 369203 428648 295694 28672
36583B8672j91921L7983J61580O8147m0101J4009R5833J2874j35725j19619M5243
$$ 28672 -163249 -125266 36314 104461 64360 78369 174202 187076 51351 -68268 -23025
36572b3025J45674J09614L5897m5590j71008k38308r4707J57540K20323K3194
$$ -23025 122649 232263 268160 222570 51562 -186746 -281453 -123913 96410 119604
36562A19604j60974j05300R0484K03720J67121L7704j20101k03615j03488J08178
$$ 119604 -41370 -146670 -56186 147534 314655 352359 232258 28643 -74845 33333
36552C3333J87863M3619j24179j39036j06628j69123j99375j2130K49880K58571
$$ 33333 221196 264815 140636 1600 -105028 -274151 -473526 -485656 -235776 22795
36542B2795m744k02687j27360M5443Q2350K6146M3049J16114R3903l8735j29477
$$ 22795 18051 -184636 -311996 -266553 -184203 -158057 -115008 1106 95009 56274 -73203
36531g3203r2763k7539n5007j33984j19602K0098J34789Q7198m0013l7951J29423
$$ -73203 -165966 -193505 -248512 -382496 -502098 -482000 -347211 -260013 -300026 -337977 -208554
36520b08554K52743J66542j8766r1964l7772M287j830K6893Q1616N4211m1582
$$ -208554 44189 210731 191965 100001 62229 66516 64686 91579 173195 227406 185824
36509A85824n8947J6876J0226j39572k24392p1016J73616K44590J18466k3489
$$ 185824 126877 143753 153979 14407 -209985 -281001 -107385 137205 255671 232182
36499B32182r4268j50984j96457j48628k0177N1975J501p5147o5161K2402R9245
$$ 232182 137914 -13070 -209527 -358155 -378332 -326357 -324856 -400003 -465164 -442762 -343517
36488c43517J01412L2768l3768q719R6364J44484N5884m3063J1186J47643J40703
$$ -343517 -242105 -209337 -243105 -251824 -155460 -10976 44908 1845 13031 160674 301377
36477C01377l7003j45510k7966J55104J60170j2743j71616k12827j92198j60908
$$ 301377 264374 118864 90898 246002 406172 393429 221813 8986 -183212 -344120
36467c44120q3812O1031K05472K55463J87465O1439l8039o8697n2613l2993k0126
$$ -344120 -427932 -366901 -161429 94034 281499 342938 304899 236202 183589 150596 130470
36456A30470n088q897o1206j29957j39823p9045k2251j9046k4807J6877P9060
$$ 130470 125382 116485 55279 -74678 -214501 -293546 -315797 -334843 -359650 -342773 -263713
36445b63713R1071M0427j0475K70O2078R5241M2299l6218j5594J03053J49684
$$ -263713 -172642 -132215 -142690 -142420 -80342 14899 57198 20980 5386 108439 258123
36434B58123L1617q2810l270J41956O0434k21554l36100j18903J29984J07006
$$ 258123 289740 206930 203660 345616 406050 184496 -151604 -270507 -140523 -33517
36424c3517n1876m5164J00918J32267K0714k0592Q1776J81738K01238J99612J48612
$$ -33517 -85393 -130557 -29639 102628 123342 102750 184526 366264 567502 767114 915726
36413I15726n6061l10478l37270j06458O3955l0008j80108j15675Q1197J45392
$$ 915726 859665 549187 211917 105459 169414 139406 -40702 -156377 -75180 70212
36403G0212M3177l9739k3987k540k2841k3364J0074M061o2808j15693r9238l2047
$$ 70212 113389 73650 49663 47123 24282 918 10992 15053 -47755 -163448 -262686 -294733
36391b94733N6091J38805J50710M3575j03472j35565j3289J29960J50489M6863
$$ -294733 -238642 -99837 50873 94448 -9024 -144589 -157878 -27918 122571 169434
36381A69434p5022j28148j00675k4062P7087J95085K91674K62354K4722l22196
$$ 169434 94412 -33736 -134411 -158473 -81386 113699 405373 667727 692449 370253
36371C70253n12522l78391n4572J73789J92157J21210Q7236O6128q923j01924
$$ 370253 -142269 -520660 -575232 -401443 -209286 -88076 -840 65288 56365 -45559
36361d5559j19666m7362L8002P5238Q3885J10965J46543J28210L6580n3232o3243
$$ -45559 -165225 -212587 -174585 -99347 -15462 95503 242046 370256 406836 353604 290361
36350B90361k9211m2977q3026k4696J34067J95567K5651k15868k67425j20625
$$ 290361 261150 218173 135147 110451 244518 440085 465736 249868 -17557 -138182
36340a38182j784k6073o8306o355R4850J19800P3436K2903j5254m2204l4564j5930
$$ -138182 -139966 -166039 -234345 -240700 -145850 -26050 47386 70289 55035 12831 -21733 -37663
36328c7663o2265j49232j18107Q3891K47928J57090q3636j67360j1584J35533
$$ -37663 -99928 -249160 -367267 -283376 -35448 121642 38006 -129354 -140938 -5405
36318e405N1106j74309k88355j93181j0146J00712R7050N9521R3288K05750K70606
$$ -5405 45701 -128608 -416963 -610144 -620290 -519578 -422528 -363007 -269719 -63969 206637
36307B06637J60346p6932k41851k09141n7691N5646P3639M4406K9680P0749J72778
$$ 206637 366983 290051 48200 -160941 -218632 -162986 -89347 -44941 -15261 55488 228266
36296B28266K49402J56067j23825l82360l89821j64934O3423J37121R1403J4771
$$ 228266 477668 633735 509910 127550 -262271 -427205 -363782 -226661 -135258 -120487
36286a20487o2656j07458n2424R1127J89831J46098L2248j4522K2393M2231j6175
$$ -120487 -183143 -290601 -343025 -251898 -62067 84031 116279 101757 124150 166381 150206
36275A50206r6818r9931J0435J62267K22033J18435o8329j90377k08149k01497
$$ 150206 53388 -46543 -36108 126159 348192 466627 398298 207921 -228 -201725
36265b01725j96724j09919Q0372K39427K55920J92470J36123L2680j58815k72824
$$ -201725 -398449 -508368 -427996 -188569 67351 259821 395944 428624 269809 -3015
36255c015j39207R1292J02366j07280j91217K2734K63091K23568J435r4502j0065
$$ -3015 -142222 -50930 51436 -55844 -247061 -224327 38764 262332 263767 169265 159200
36244A59200L5510p1714j83805j35395K5363J13559L4097j14427j46955n712J53315
$$ 159200 194710 122996 -60809 -196204 -170841 -57282 -23185 -137612 -284567 -290279 -136964
36233a36964J53658N0337M7168J55035J40660r1032k84003j83227P7050J67701
$$ -136964 16694 67031 114199 269234 409894 318862 34859 -148368 -71318 96383
36223I6383K0003j62135k46763k53660j50809J16801L85233L67795P0813j57583
$$ 96383 116386 -45749 -292512 -546172 -696981 -580180 -194947 172848 243661 86078
36213H6078j00882N1712M0413q5565j08121R263J09647Q4553l1426j43217j61959
$$ 86078 -14804 36908 77321 -8244 -116365 -107102 2545 87098 55672 -87545 -249504
36202b49504n7403Q0799J20473P0914O1229J00587N2763q2062j06536J8776L4451
$$ -249504 -306907 -226108 -105635 -34721 26508 127095 179858 97796 -8740 10036 44487
36191D4487j81588l09557m8107L35656L31861m8325k85516j22866J27163J40664
$$ 44487 -137101 -446658 -494765 -159109 172752 124427 -161089 -283955 -156792 -16128
36181a6128K1304r062K594p7266j65037j08866M3165J55537K22031K62355J82320
$$ -16128 5176 -3886 -1292 -78558 -243595 -352461 -309296 -153759 68272 330627 512947
36170E12947l1296j51517j2383J79721J23674j12600k18508j33396p0785j07976
$$ 512947 481651 330134 317751 497472 621146 508546 290038 156642 85857 -22119
36160b2119j16588q9587j52458k16714l7621K84754L04112p7655l49431j23512
$$ -22119 -138707 -228294 -380752 -597466 -635087 -350333 -46221 -123876 -473307 -596819
36150e96819K66932L01543O7497J7207J62485J01700k15444l53962j20619J19882
$$ -596819 -329887 -28344 39153 56360 218845 320545 105101 -248861 -369480 -249598
36140b49598O3630p3120q205R7440l1484k42490j80182J08868K31002N7958j13023
$$ -249598 -185968 -259088 -267293 -169853 -201337 -443827 -624009 -515141 -284139 -226181 -339204
36129c39204n4430P9459N2991r9044j71763p2018J32465L24443L89159K54543
$$ -339204 -393634 -314175 -261184 -360228 -531991 -604009 -471544 -147101 242058 496601
36119D96601j7595k43657k93235j99451o1836O8275J49711J07540o0159j92748
$$ 496601 479006 235349 -57886 -257337 -319173 -250898 -101187 6353 -53806 -246554
36109b46554j14823J28188K93231K33896Q0902N5997J68720K16882Q4931j00346
$$ -246554 -361377 -233189 60042 293938 374840 430837 599557 816439 901370 801024
36099H01024j80689j91770k30498k13302k887K64823K73510O047j70582m7335
$$ 801024 620335 428565 198067 -15235 -18122 246701 520211 526258 355676 308341
36089C08341J00881k4545k36893j73218Q3094J29686q1609j72208J4906J58325
$$ 308341 409222 384677 147784 -25434 57660 187346 105737 -66471 -51565 106760
36079A06760J8330j56943n3785J95803K45928O6812q1649p8372l7708l6576j4777
$$ 106760 125090 -31853 -85638 110165 356093 422905 341256 262884 225176 188600 173823
36068A73823M9556O5785m0337k32168l77361l04341M1186M14268M28918N4702
$$ 173823 223379 289164 248827 16659 -360702 -665043 -623857 -209589 219329 274031
36058B74031k46164j08026K12004K17644p7340k04118O632J92090P2299j37491
$$ 274031 27867 -80159 131845 349489 272149 68031 74663 266753 339052 201561
36048B01561j38196j2545r50q0911p9404j6908k4939m5599P1295K38818K11801
$$ 201561 63365 50820 49870 -31041 -110445 -127353 -152292 -197891 -126596 112222 324023
36037C24023j3635j69123j16274p860K0865N2220J50638J73833J3228j63016j36748
$$ 324023 310388 141265 24991 17131 37996 90216 240854 414687 427915 264899 128151
36026A28151J5254M7273o1210j03497k1370P16j16948j76961k7859J60491J48965
$$ 128151 143405 190678 129468 25971 4601 5317 -111631 -288592 -316451 -155960 -6995
36015f995k035n0448M3433J05735P5768P6522J40283J24253j8361j12917l4089
$$ -6995 -9030 -59478 -16045 89690 165458 241980 382263 506516 488155 375238 341149
36004C41149Q8171Q0426j5858o1263n9363r5912j36781q4707J9544M5038q130
$$ 341149 429320 509746 493888 432625 373262 277350 140569 55862 75406 120444 112314
35993A12314k0555J9910p882j25273j73712m9410J18835J37285J3119n9527M4041
$$ 112314 91759 111669 103787 -21486 -195198 -244608 -125773 11512 24631 -34896 9145
35982I145K25144K83543J45302p0887k04217k13770j56616o5167N8097J50314
$$ 9145 234289 517832 663134 592247 388030 174260 17644 -47523 10574 160888
35972A60888J24160J4316m3915k0522k8129r5949q5649N4900J37573P694j81367
$$ 160888 285048 299364 255449 234927 206798 110849 25200 80100 217673 225367 44000
35961D4000j79099p879J06309Q5124L6363L250o4602j16268l9881R4896R0760
$$ 44000 -135099 -142978 -36669 48455 84818 88068 23466 -92802 -132683 -37787 52973
35950E2973n4525j32280p0696l6535j18779j73285r0504K5885P5183J24110K11702
$$ 52973 -1552 -133832 -204528 -241063 -359842 -533127 -623631 -597746 -522563 -398453 -186751
35939a86751K14368P7240k7504K9119R0514l2030k16598j95367L1629J98479J51924
$$ -186751 27617 104857 77353 106472 196986 164956 -51642 -247009 -215380 -16901 135023
35928A35023O496p6013p1200l0719J1713K7956j0810q8107j42072j25157m2149
$$ 135023 141519 65506 -5694 -36413 -24700 3256 -7554 -95661 -237733 -362890 -405039
35917d05039N2961R2144P0165P4092J56419K08376R7187q9141j28046q901M3557
$$ -405039 -352078 -259934 -189769 -115677 40742 249118 346305 257164 129118 120217 163774
35906A63774m6397p2710P0684J63721K6279j55409j42164n0502j17951k43017
$$ 163774 117377 44667 115351 279072 305351 149942 7778 -42724 -160675 -403692
35896d03692j41946J39137K65940J43346K2443N3412R0617K2075l3581J8676P2009
$$ -403692 -545638 -406501 -140561 2785 25228 78640 169257 191332 157751 176427 248436
35885B48436K6616m6375o4629n8168m3287K0824P0757l5175k33928k49803l972
$$ 248436 275052 228677 164048 105880 62593 83417 154174 118999 -114929 -364732 -368704
35874c68704K15057J64767k009k0573O0515J5317j34888j41127N9147K19135J28420
$$ -368704 -153647 11120 9111 -11462 49053 64370 -70518 -211645 -152498 66637 195057
35863A95057j05339k03743m9514J90998K45867K7020k55453l10896j02782J20555
$$ 195057 89718 -114025 -163539 27459 273326 300346 44893 -266003 -368785 -248230
35853b48230J46973K7143p1328q7037l9574P5539K16382K29130L1013k04399k21316
$$ -248230 -101257 -74114 -145442 -232479 -272053 -196514 19868 248998 280011 75612 -145704
35842a45704j3690J77167J84855P9395o378n4563j02658j19071l4653J32323K47867
$$ -145704 -159394 17773 202628 282023 275645 221082 118424 -647 -35300 97023 344890
35831C44890J84644k4361j82603j34549L7840J12500K6817n3552j5476J8664q0581
$$ 344890 529534 505173 322570 188021 225861 338361 365178 311626 296150 314814 234233
35820B34233j85463q0318J78862K97200J31474j46447l04926k95976j93146n0105
$$ 234233 48770 -31548 147314 444514 575988 429541 124615 -171361 -364507 -414612
35810d14612Q9406J57204J28806N6610j5724r2060j39657p4972R7061K26916J92736
$$ -414612 -325206 -168002 -39196 17414 1690 -90370 -230027 -304999 -207938 18978 211714
35799B11714N4575n0362r4408j36371j68779j18854P748J04868J12838R0928J00423
$$ 211714 266289 215927 121519 -14852 -183631 -302485 -294737 -189869 -77031 13897 114320
35788A14320R7016R129j23840j74867r1805K7218N0056l3515j10111q2118L2865
$$ 114320 211336 220465 96625 -78242 -170047 -142829 -92773 -126288 -236399 -318517 -285652
35777b85652J45869J94675J69954Q2507l6980j14658p9383M0840J24754J06266
$$ -285652 -139783 54892 224846 307353 270373 155715 76332 117172 241926 348192
35767C48192O6090J00838J39215J1895k70541m42888k93046M0850K23616J39622
$$ 348192 414282 515120 654335 666230 395689 -47199 -340245 -299395 -75779 63843
35757F3843l346m53R2728J08339K0253q0565j55690k10383j87939m2251J17776
$$ 63843 60497 60044 152772 261111 281364 200799 45109 -165274 -353213 -395464 -277688
35746b77688J25821j723q1003k4909O8423J11763J37547J59504J05588k2699r0437
$$ -277688 -151867 -153590 -234593 -259502 -191079 -79316 58231 217735 323323 300624 210187
35735B10187m0292n917q0261j28201j1470J33479P4841j30979j89292Q68K05538
$$ 210187 169895 163978 83717 -44484 -55954 77525 152366 21387 -167905 -167037 38501
35724C8501K03140O3051k2638j4209J781p449j3929l4068j01338j59328j04788
$$ 38501 241641 304692 282054 267845 269626 262177 248248 214180 112842 -46486 -151274
35713a51274N2665J69444J37298O128j02096j49286j86529k20182j57987N3674
$$ -151274 -98609 70835 208133 214261 112165 -37121 -223650 -443832 -601819 -548145
35703e48145K82590L02578O7584j84106j79327O9222K79251K35937K3933j15051
$$ -548145 -265555 37023 104607 -79499 -258826 -189604 89647 325584 349517 234466
35693B34466q0401J4466L9187J1223J5498L4920k8092j60276j88580j317K59559
$$ 234466 154065 168531 207718 218941 234439 269359 241267 80991 -107589 -108906 150653
35682A50653L38469J64833r5289k56427k54558r6499J50104K88340J23250k31975
$$ 150653 489122 653955 558666 302239 47681 -48818 101286 389626 512876 280901
35672B80901l71515q4190L27103M12957J41707j40131k19539j94051j52410j0722
$$ 280901 -90614 -174804 152299 565256 706963 566832 347293 153242 832 -9890
35662i890K21085K95511N7763k65182l33156j42409J5018j6737r4905n9245L5416
$$ -9890 211195 506706 564469 299287 -33869 -176278 -161260 -177997 -272902 -332147 -296731
35651b96731N4055K02k1551J7767N1636M4952L3613L1344q734r9388j58742j10721
$$ -296731 -242676 -242474 -264025 -246258 -194622 -149670 -116057 -84713 -93447 -192835 -351577 -462298
35639d62298j916N9655N6974O0851P9390L3655p0063p3163J14720L16424K69258
$$ -462298 -464214 -404559 -347585 -286734 -207344 -173689 -243752 -316915 -202195 114229 383487
35628C83487j5498k39466j99711l3559R654p7763q6658P0702K14847J53504l4227
$$ 383487 367989 128523 -71188 -104747 -95093 -172856 -259514 -188812 26035 179539 145312
35617A45312r5590M5305J79817J11070o8921j28250m5270k1859j39517k06264
$$ 145312 49722 95027 274844 385914 316993 188743 143473 121614 -17903 -224167
35607b24167m9323K00403K74881J23495o4719j36439j03615k2651Q2499J55417
$$ -224167 -273490 -73087 201794 325289 260570 124131 20516 -2135 80364 235781
35597B35781J17062m591o6709P268J20549J33291M2869j8859M9807J80757J74652
$$ 235781 352843 348252 281543 288811 409360 542651 585520 566661 616468 797225 971877
35586I71877p5634l97302m78135k52276j3486k3004j45867q0649J56450K56494
$$ 971877 896243 498941 20806 -231470 -244956 -267960 -413827 -494476 -338026 -81532
35576h1532J05200n5979k6501P0826M1962o9101j00532l9362J3510L1925N3167
$$ -81532 23668 -32311 -58812 12014 53976 -15125 -115657 -155019 -141509 -109584 -56417
35565e6417O0375K0537k3515j5964K0501N0471R9774J67624J62345L9096r0763
$$ -56417 3958 24495 980 -14984 5517 55988 155762 323386 485731 524827 434064
35554D34064j10871p4642j00342j72005j82048j05759j067J00242J70832J33935
$$ 434064 323193 248551 148209 -23796 -205844 -311603 -312670 -212428 -41596 92339
35544I2339j7528j18345k2382J49584J41461p3414k48883k09159n8262J2862j6598
$$ 92339 74811 -43534 -65916 83668 225129 151715 -97168 -306327 -364589 -351727 -368325
35533c68325k2435O8400J89227K14204R4227p8537j56204j00926j6408J1856J9796
$$ -368325 -390760 -322360 -133133 81071 175298 96761 -59443 -160369 -176777 -164921 -145125
35522a45125M9778M5392l1805q7714l8583K8800O948j5278J02337K51916J77122
$$ -145125 -95347 -49955 -81760 -169474 -208057 -179257 -172309 -187587 -85250 166666 343788
35511C43788j23008l39665k64963m1567Q3526O5427J6607J1443M9232J02574J17739
$$ 343788 220780 -118885 -383848 -425415 -341889 -276462 -259855 -248412 -199180 -96606 21133
35500B1133N7172j6868j1488L0531j0854r2381l4416J53245K13951L5838j39642
$$ 21133 78305 61437 49949 80480 69626 -22755 -57171 96074 310025 345863 206221
35489B06221q7316M3386r583j72366j56449N7180J76515M8854j34505j54499m7692
$$ 206221 118905 162291 152708 -19658 -176107 -118927 57588 106442 -28063 -182562 -230254
35478b30254L4850O3761R0636J00043M5020l3371l7979N3751J62237J95493J23982
$$ -230254 -195404 -131643 -41007 59036 104056 70685 32706 86457 248694 444187 568169
35467E68169j4993j49163k10865j68414m1024R0816J03897o1689k83330l34400
$$ 568169 553176 404013 193148 24734 -16290 74526 178423 116734 -166596 -500996
35457e00996j54396N3941J03499Q8865J96988L40292K43718r4023l17152k04120
$$ -500996 -655392 -601451 -497952 -409087 -212099 128193 371911 277888 -39264 -243384
35447b43384K1541O1533o502P5646K59919K47789o519k02343j67945j01146j82765
$$ -243384 -221843 -160310 -166812 -91166 168753 416542 410023 207680 39735 -61411 -244176
35436b44176k44144o7893J96951K31749M2765p1890j6247j2535j59356k10570
$$ -244176 -488320 -556213 -359262 -127513 -84748 -156638 -172885 -185420 -344776 -555346
35426e55346K1722L05134K86390k747k08768j52081j797L3777m4011j25106j45817
$$ -555346 -533624 -228490 57900 55153 -153615 -305696 -307493 -273716 -317727 -442833 -588650
35415e88650p9339P0470K00935J75997K2915o9326p915R0134J08915R1895Q5529
$$ -588650 -667989 -597519 -396584 -220587 -197672 -266998 -274913 -184779 -75864 16031 101560
35404A01560L647j84125k80021j00988J91488K50989K0071j88205j19194J17904
$$ 101560 105207 -78918 -358939 -459927 -268439 -17450 2621 -185584 -304778 -186874
35394a86874K45725J51341o4493k35559k41212p9526R9979J37233P0994O6277
$$ -186874 58851 210192 145699 -89860 -331072 -410598 -310619 -173386 -102392 -36115
35384c6115J04559k7196l27437m24645p6206L81773M18285L5068k58304j75432
$$ -36115 68444 41248 -286189 -710834 -787040 -405267 13018 48086 -210218 -385650
35374c85650L4404Q1953M9977J15334J99989J74045J41164K09336J93181r6658
$$ -385650 -351246 -269293 -219316 -103982 96007 270052 411216 620552 813733 717075
35364G17075m24137l91438n8398J20615j8349j54722n8939O3351r771j26295n2269
$$ 717075 292938 -98500 -156898 -36283 -54632 -209354 -268293 -204942 -214713 -341008 -393277
35353c93277J34894K25047K13306J80667N5055j99316l43963j66231J20795J44531
$$ -393277 -258383 -33336 179970 360637 415692 216376 -127587 -293818 -173023 -28492
35343b8492n6259j15398N1496J38401j4169j81567j68639r2169q4471m5203R9567
$$ -28492 -84751 -200149 -148653 -10252 -24421 -205988 -374627 -466796 -551267 -596470 -496903
35332d96903J72734K7328j66173j63870j0760P9039O1660M5901N2711L0180K4446
$$ -496903 -324169 -296841 -463014 -626884 -637644 -558605 -496945 -451044 -398333 -368153 -343707
35321c43707J06005J82994J05293p9706j74145j11319j0793K9801K8067J3566
$$ -343707 -237702 -54708 50585 -29121 -203266 -314585 -325378 -295577 -267510 -253944
$$ [...]
##END NTUPLES=NMR SPECTRUM
##END=
