##TITLE=31Pdec_AEDB-4
 CDCl3
 24 sc
 28.5.2024
##JCAMPDX= 6.0         $$ Bruker NMR JCAMP-DX V2.0
##DATA TYPE= NMR SPECTRUM
##DATA CLASS= NTUPLES
##ORIGIN= UXNMR, Bruker Analytische Messtechnik GmbH
##OWNER= root
$$ XWIN-NMR		Version 3.5
$$ Tue May 28 14:06:44 2024 Russian Standard Time (UT+4h)  she@DPX200
##.OBSERVE FREQUENCY= 81.013821
##.OBSERVE NUCLEUS= ^31P
##.ACQUISITION MODE= SIMULTANEOUS
##.ACQUISITION SCHEME= undefined
##.AVERAGES= 24
##.DIGITISER RES= 16
##SPECTROMETER/DATA SYSTEM= spect
##.PULSE SEQUENCE= zgpg30
##.SOLVENT NAME= CDCl3
##.SHIFT REFERENCE= (INTERNAL, CDCl3, 0, 248.564)
##AUDIT TRAIL= $$ (NUMBER, WHEN, WHO, WHERE, WHAT)
$$ ##TITLE= Audit trail, XWIN-NMR		Version 3.5
$$ ##JCAMPDX= 5.01
$$ ##ORIGIN= Bruker BioSpin GmbH
$$ ##OWNER= she
$$ F:/spectra/data/she/nmr/P31/1/pdata/1/auditp.txt
$$ ##AUDIT TRAIL=  $$ (NUMBER, WHEN, WHO, WHERE, WHAT)
(   1,<2024-05-28 14:05:38.34 +0400>,<she>,<DPX200>,
      <created by zg, POWCHK disabled, PULCHK disabled
       configuration hash MD5:
       00 E9 B6 7A A2 85 ED C7 34 08 36 98 17 FE 4E 26
       data hash MD5: 32K
       2B 7F 07 F3 FF EF 86 5E 79 67 1A 10 E3 E0 40 5A>)
(   2,<2024-05-28 14:05:40.43 +0400>,<she>,<DPX200>,
      <Start of raw data processing
       efp BC_mod = 2 LB = 10 FT_mod = 6 PKNL = 1 PHC0 = -172.1879 PHC1 = 0 SI = 64K 
       data hash MD5: 64K
       52 92 C6 CB F4 55 95 CD 13 B9 C9 0A 60 F9 30 A9>)
$$ ##END=
$$ 
$$ hash MD5
$$ D3 6D 42 3B 41 E2 1A 5B CE 17 B3 D3 CB 74 B4 E7
##$RELAX= 
##$RELAX= 
##$RELAX= 
##$RELAX= 
##$RELAX= 
##$RELAX= 
##$RELAX= 
##$RELAX= 
##$RELAX= 
$$ Bruker specific parameters
$$ --------------------------
##$DU= <F:/spectra>
##$EXPNO= 1
##$NAME= <P31>
##$PROCNO= 1
##$TYPE= <nmr>
##$USER= <she>
##$AMP= (0..31)
100 100 100 100 100 100 100 100 100 100 100 100 100 100 100 100 100 100 
100 100 100 100 100 100 100 100 100 100 100 100 100 100 
##$AQSEQ= 0
##$AQ_mod= 1
##$AUNM= <au_zg>
##$AUTOPOS= <>
##$BF1= 81.014009
##$BF2= 200.13
##$BF3= 200.13
##$BF4= 200.13
##$BF5= 200.13
##$BF6= 200.13
##$BF7= 200.13
##$BF8= 200.13
##$BYTORDA= 1
##$CFDGTYP= 0
##$CFRGTYP= 5
##$CHEMSTR= <none>
##$CNST= (0..31)
1 1 145 1 1 1 1 1 1 1 1 1 1 1 1 1 1 1 1 1 1 1 1 1 1 1 1 1 1 1 1 1 
##$CPDPRG= <waltz16>
##$CPDPRG1= <>
##$CPDPRG2= <waltz16>
##$CPDPRG3= <>
##$CPDPRG4= <mlev>
##$CPDPRG5= <mlev>
##$CPDPRG6= <mlev>
##$CPDPRG7= <mlev>
##$CPDPRG8= <mlev>
##$CPDPRGB= <>
##$CPDPRGT= <>
##$D= (0..31)
0 1 0 0 0 0 0 0 0 0 0 0.03 2e-05 3e-06 0 0 0 0 0 0 0 0 0 0 0 0 0 0 0 0 
0 0 
##$DATE= 1716890737
##$DBL= (0..7)
120 120 120 11 120 120 24 19 
##$DBP= (0..7)
150 150 150 150 150 150 150 150 
##$DBP07= 0
##$DBPNAM0= <>
##$DBPNAM1= <>
##$DBPNAM2= <>
##$DBPNAM3= <>
##$DBPNAM4= <>
##$DBPNAM5= <>
##$DBPNAM6= <>
##$DBPNAM7= <>
##$DBPOAL= (0..7)
0.5 0.5 0.5 0.5 0.5 0.5 0.5 0.5 
##$DBPOFFS= (0..7)
0 0 0 0 0 0 0 0 
##$DE= 6
##$DECBNUC= <off>
##$DECIM= 3
##$DECNUC= <off>
##$DECSTAT= 4
##$DIGMOD= 1
##$DIGTYP= 9
##$DL= (0..7)
0 0 52 120 120 21 21 25 
##$DP= (0..7)
$$ [...]
##$SUBNAM2= <"">
##$SUBNAM3= <"">
##$SUBNAM4= <"">
##$SUBNAM5= <"">
##$SUBNAM6= <"">
##$SUBNAM7= <"">
##$SUBNAM8= <"">
##$SUBNAM9= <"">
##$SW= 501.771253377433
##$SWIBOX= (0..15)
0 1 3 0 0 0 0 0 0 0 0 0 0 0 0 0 
##$SW_h= 40650.406504065
##$TD= 32768
##$TD0= 1
##$TE= 0
##$TE2= 300
##$TE3= 300
##$TEG= 300
##$TL= (0..7)
0 120 53 12 22 120 120 120 
##$TP= (0..7)
150 150 150 150 150 150 150 150 
##$TP07= 0
##$TPNAME0= <>
##$TPNAME1= <>
##$TPNAME2= <>
##$TPNAME3= <>
##$TPNAME4= <>
##$TPNAME5= <>
##$TPNAME6= <>
##$TPNAME7= <>
##$TPOAL= (0..7)
0.5 0.5 0.5 0.5 0.5 0.5 0.5 0.5 
##$TPOFFS= (0..7)
0 0 0 0 0 0 0 0 
##$TUNHIN= 0
##$TUNHOUT= 0
##$TUNXOUT= 0
##$USERA1= <user>
##$USERA2= <user>
##$USERA3= <user>
##$USERA4= <user>
##$USERA5= <user>
##$V9= 5
##$VALIST= <valist>
##$VCLIST= <CCCCCCCCCCCCCCC>
##$VD= 0
##$VDLIST= <DDDDDDDDDDDDDDD>
##$VPLIST= <PPPPPPPPPPPPPPP>
##$VTLIST= <TTTTTTTTTTTTTTT>
##$WBST= 1024
##$WBSW= 4
##$XGAIN= (0..3)
0 0 0 0 
##$XL= 0
##$YL= 0
##$YMAX_a= 2272
##$YMIN_a= -2152
##$ZGOPTNS= <>
##$ZL1= 120
##$ZL2= 120
##$ZL3= 120
##$ZL4= 120
##$ABSF1= 0
##$ABSF2= 0
##$ABSG= 0
##$ABSL= 0
##$ALPHA= 0
##$AQORDER= 0
##$ASSFAC= 0
##$ASSFACI= 0
##$ASSFACX= 0
##$ASSWID= 0
##$AUNMP= <proc_1d>
##$AZFE= 0.1
##$AZFW= 0.5
##$BCFW= 0
##$BC_mod= 2
##$BYTORDP= 0
##$COROFFS= 0
##$CY= -3
##$DATMOD= 1
##$DC= 0
##$DFILT= <>
##$DTYPP= 0
##$F1P= 0
##$F2P= 0
##$FCOR= 1
##$FTSIZE= 65536
##$FT_mod= 6
##$GAMMA= 0
##$GB= 0
##$INTBC= 1
##$INTSCL= 6.047779e-11
##$ISEN= 30
##$LB= 10
##$LEV0= 0
##$LPBIN= 0
##$MAXI= 10000
##$MC2= 0
##$MEAN= 0
##$ME_mod= 0
##$MI= 50
##$NCOEF= 0
##$NC_proc= -8
##$NLEV= 6
##$NOISF1= 182.463
##$NOISF2= 159.3651
##$NSP= 0
##$NTH_PI= 0
##$NZP= 0
##$OFFSET= 248.5645
##$PC= 4
##$PHC0= -172.1879
##$PHC1= 0
##$PH_mod= 1
##$PKNL= yes
##$PPARMOD= 0
##$PSCAL= 0
##$PSIGN= 0
##$REVERSE= no
##$SF= 81.0140089999694
##$SI= 65536
##$SIGF1= 159.3651
##$SIGF2= -187.1042
##$SINO= 113.3802
##$SIOLD= 16384
##$SREGLST= <1H.CDCl3>
##$SSB= 0
##$STSI= 65536
##$STSR= 0
##$SW_p= 40650.406504065
##$SYMM= 0
##$S_DEV= 0
##$TDeff= 32768
##$TDoff= 0
##$TI= <>
##$TILT= no
##$TM1= 0
##$TM2= 0
##$TOPLEV= 0
##$USERP1= <user>
##$USERP2= <user>
##$USERP3= <user>
##$USERP4= <user>
##$USERP5= <user>
##$WDW= 1
##$XDIM= 65536
##$YMAX_p= 379309824
##$YMIN_p= -23367024
$$ End of Bruker specific parameters
$$ ---------------------------------
##NTUPLES= NMR SPECTRUM
##VAR_NAME=  FREQUENCY,     SPECTRUM/REAL,   SPECTRUM/IMAG
##SYMBOL=    X,             R,               I
##VAR_TYPE=  INDEPENDENT,   DEPENDENT,       DEPENDENT
##VAR_FORM=  AFFN,          ASDF,            ASDF
##VAR_DIM=   65536,         65536,           65536
##UNITS=     HZ,            ARBITRARY UNITS, ARBITRARY UNITS
##FACTOR=    0.620285442955139, 1,           1
##FIRST=     20137.2065510682, 0,            0
##LAST=      -20513.1999529968, 0,           0
##MIN=       -20513.1999529968, -23367024,   0
##MAX=       20137.2065510682, 379309824,    0
$$ Real data points
##PAGE= N=1
##DATA TABLE= (X++(R..R)), XYDATA
$$ [...]
$$ plain form
39275 -266537 -279356 -302768 -334930 -373166 -413398 -451027 -483617 -513358 -547026 -593190 -658453
39264 -658453 -744509 -846787 -954808 -1054245 -1130217 -1170618 -1168347 -1122038 -1035649 -917330 -777736
39253 -777736 -627892 -476874 -329849 -187149 -44872 102993 261520 431820 609130 783032
39243 783032 940260 1069191 1163866 1225478 1260873 1279436 1290272 1300618 1315162 1335392 1358664
39232 1358664 1377608 1380859 1355608 1291432 1184039 1037525 864447 683962 518871 392139
39222 392139 322932 322397 390390 514923 674961 845206 1000605 1119383 1185106 1188674 1130075
39211 1130075 1018418 868798 696382 510519 312743 100519 -125508 -355933 -572782
39202 -572782 -755392 -888175 -965954 -994825 -989008 -965569 -939103 -918226 -904852 -896020 -886983 -874063
$$ packed form
39275b66537j2819k3412l2162l8236m0232l7629l2590k9741l3668m6164o5263
39264f58453q6056j02278j08021r9437p5972m0401K271M6309Q6389J18319J39594
39253g77736J49844J51018J47025J42700J42277J47865J58527J70300J77310J73902
39243G83032J57228J28931R4675O1612L5395J8563J0836J0346J4544K0230K3272
39232A358664J8944L251k5251o4176j07393j46514j73078j80485j65091j26732
39222C92139o9207n35O7993J24533J60038J70245J55399J18778O5723L568n8599
39211A130075j11657j49620j72416j85863j97776k12224k26027k30425k16849
39202e72782j82610j32783p7779k8871N817K3439K6466K0877J3374Q832R037J2920
$$ plain form
39190 -874063 -856431 -836618 -819955 -813116 -821954 -848927 -890775 -937538 -974076 -984250 -956180 -885988
39178 -885988 -778361 -644511 -499347 -358950 -237929 -146194 -86265 -53231 -38121 -32843 -33588
39167 -33588 -41096 -58703 -90177 -138319 -204018 -285363 -377252 -472183 -562059 -639927 -700712 -741045
39155 -741045 -759123 -755076 -731269 -691461 -638791 -574091 -496209 -404412 -301130 -193315 -92086
39144 -92086 -11208 35378 37016 -10057 -100862 -223038 -361086 -501566 -637211 -768665 -903485
39133 -903485 -1052895 -1227481 -1433325 -1669708 -1928823 -2197344 -2459259 -2699069 -2904539 -3068479
39123 -3068479 -3189290 -3270006 -3315945 -3331935 -3320633 -3282719 -3218224 -3127502 -3011125 -2869351 -2702314
39112 -2702314 -2511395 -2301152 -2080634 -1863064 -1663789 -1497393 -1375305 -1304495 -1286769 -1317972
$$ packed form
39190h74063J7632J9813J6663O839q838k6973m1848m6763l6538j0174K8070P0192
39178h85988J07627J33850J45164J40397J21021R1735N9929L3034J5110N278p45
39167c3588p508j7607l1474m8142o5699q1345r1889r4931q9876p7868o0785m0333
39155g41045j8078M047K3807L9808N2670O4700P7882R1797J03282J07815J01229
39144i2086Q0878M6586J638m7073r0805j22176j38048j40480j35645j31454j34820
39133i03485j49410j74586k05844k36383k59115k68521k61915k39810k05470j63940
39123c068479j20811q0716m5939j5990J1302L7914O4495R0722J16377J41774J67037
39112b702314J90919K10243K20518K17570J99275J66396J22088P0810J7726l1203
$$ plain form
39102 -1317972 -1387425 -1479021 -1574912 -1660877 -1730741 -1787358 -1839686 -1897812 -1968569 -2053288 -2147507
39091 -2147507 -2241805 -2323447 -2378977 -2397370 -2372635 -2304954 -2200344 -2069416 -1925597 -1782879
39081 -1782879 -1653376 -1545341 -1462155 -1402346 -1360453 -1328683 -1299274 -1267022 -1230900 -1193797 -1160404
39070 -1160404 -1134551 -1117662 -1109115 -1107783 -1113315 -1126297 -1147480 -1176669 -1211572 -1246809 -1273757 -1282336
39058 -1282336 -1264920 -1220584 -1156618 -1085576 -1019288 -963608 -916918 -872453 -822158 -759628 -681143
39047 -681143 -585408 -473344 -348878 -220231 -99902 -1920 62941 91332 88458 65902 37669
39036 37669 16263 9820 20444 43734 69682 85386 79402 46201 -11679 -85021 -161616 -229669
39024 -229669 -279387 -303169 -295607 -253884 -178461 -73763 51542 185324 314197 426606 515501
$$ packed form
39102a317972o9453r1596r5891q5965o9864n6617n2328n8126p0757q4719r4219
39091b147507r4298q1642n5530j8393K4735O7681J04610J30928J43819J42718
39081a782879J29503J08035Q3186N9809M1893L1770K9409L2252L6122L7103L3393
39070a160404K5853J6889Q547J332n532j2982k1183k9189l4903l5237k6948q579
39058a282336J7416M4336O3966P1042O6288N5680M6690M4465N0295O2530P8485
39047f81143R5735J12064J24466J28647J20329R7982O4861K8391k874k2556k8233
39036C7669k1406o443J0624K3290K5948J5704n984l3201n7880p3342p6595o8053
39024b29669m9718k3782P562M1723P5423J04698J25305J33782J28873J12409Q8895
$$ plain form
39013 515501 579568 622921 653737 682392 719407 773382 849172 946786 1061465 1184926 1307102
39002 1307102 1417596 1506773 1566900 1593312 1584722 1542037 1466538 1359239 1222195 1060468 882635
38991 882635 699112 519406 350002 193742 50702 -79723 -196113 -292910 -360451 -387832
38981 -387832 -367626 -300200 -195586 -72123 47562 141908 195458 201932 164213 91474 -4589
38970 -4589 -112009 -218471 -310729 -376209 -407452 -406712 -386777 -366530 -363609 -388298 -441198 -514404
38958 -514404 -594677 -667591 -722079 -754135 -767707 -771774 -774891 -780202 -783760 -777062 -752316 -707375
38946 -707375 -647523 -583332 -526298 -484969 -463108 -459561 -468740 -481284 -485327 -468816 -422622 -343451
38934 -343451 -235432 -109657 18298 132142 218894 272260 294461 295669 290803 294750 318135
$$ packed form
39013E15501O4067M3353L0816K8655L7015N3975P5790R7614J14679J23461J22176
39002A307102J10494Q9177O0127K6412q590m2685p5499j07299j37044j61727j77833
38991H82635j83523j79706j69404j56260j43040j30425j16390r6797o7541k7381
38981c87832K0206O7426J04614J23463J19685R4346N3550O474l7719p2739r6063
38970d589j07420j06462r2258o5480l1243P40J9935K0247K921k4689n2900p3206
38958e14404q0273p2914n4488l2056j3572m067l117n311l558O698K4746M4941
38946g07375N9852O4191N7034M1329K1861L547r179j2544m043J6511M6194P9171
38934c43451J08019J25775J27955J13844Q6752N3366K2201J208m866L947K3385
$$ plain form
38923 318135 365389 435136 521605 615940 707474 785538 841746 871896 876670 861142 833741 805230
38911 805230 787542 791826 825416 888712 973933 1067137 1152893 1219403 1261856 1283004 1291062 1295763
38899 1295763 1304242 1318764 1337310 1355923 1370617 1377476 1371401 1344955 1288667 1193334 1053707 871759
38887 871759 657706 428537 205554 12211 -128140 -195758 -179040 -78262 93326 311546
38877 311546 545959 766306 949229 1083031 1168468 1215460 1237633 1247451 1253783 1262245 1277171
38866 1277171 1303420 1346538 1410971 1497286 1599835 1706095 1798316 1857299 1867065 1818517 1710505
38855 1710505 1548147 1339765 1094364 821027 530397 237163 -38336 -271194 -436188
38846 -436188 -513998 -497008 -392465 -221918 -17254 185391 352293 458078 489978 449632
$$ packed form
38923C18135M7254O9747Q6469R4335R1534P8064N6208L0150M774j5528k7401k8511
38911H05230j7688M284L3590O3296Q5221R3204Q5756O6510M2453K1148Q058M701
38899A295763Q479J4522J8546J8613J4694O859o075k6446n6288r5333j39627j81948
38887H71759k14053k29169k22983j93343j40351o7618J6718J00778J71588K18220
38877C11546K34413K20347J82923J33802Q5437M6992K2173R818O332Q462J4926
38866A277171K6249M3118O4433Q6315J02549J06260R2221N8983R766m8548j08012
38855A710505j62358k08382k45401k73337k90630k93234k75499k32858j64994
38846d36188p7810J6990J04543J70547K04664K02645J66902J05785L1900m0346
$$ plain form
38836 449632 351879 220762 83900 -33171 -111564 -141951 -125298 -70672 9793 106979 218787
38825 218787 349770 506646 692487 902982 1126533 1347482 1550248 1722515 1856989 1952237
38815 1952237 2012876 2048548 2071080 2090391 2111159 2132305 2149757 2160740 2166962 2174944 2193558 2230106
38803 2230106 2286637 2357898 2431693 2491578 2520835 2506218 2440191 2321420 2154229 1947997 1716633
38792 1716633 1477298 1247747 1043171 874400 748282 668778 636636 647329 689269 744466
38782 744466 791831 811506 788475 714741 590119 421852 223301 12098 -191744 -367669
38772 -367669 -496757 -564633 -564562 -499237 -380021 -223867 -49603 124775 283325 412494 501345
38761 501345 542015 530294 465968 352562 196367 4922 -214625 -456751 -717849 -995570
$$ packed form
38836D49632r7753j31117j36862j17071p8393l0387J6653N4626Q0465R7186J11808
38825B18787J30983J56876J85841K10495K23551K20949K02766J72267J34474R5248
38815A952237O0639L5672K2532J9311K0768K1146J7452J0983O222P982J8614L6548
38803B230106N6531P1261P3795N9885K9257j4617o6027j18771j67191k06232k31364
38792A716633k39335k29551k04576j68771j26118p9504l2142J0693M1940N5197
38782G44466M7365J9675k3031p3734j24622j68267j98551k11203k03842j75925
38772c67669j29088o7876P1O5325J19216J56154J74264J74378J58550J29169Q8851
38761E01345M0670j1721o4326j13406j56195j91445k19547k42126k61098k77721
$$ plain form
38751 -995570 -1287869 -1592569 -1907484 -2230276 -2557484 -2883169 -3198078 -3489703 -3743126 -3942641
38741 -3942641 -4074322 -4129147 -4105599 -4010714 -3859237 -3671212 -3468530 -3271053 -3093125 -2941458
38731 -2941458 -2815318 -2709170 -2616599 -2533265 -2456995 -2385042 -2310629 -2221583 -2102780 -1941998
38721 -1941998 -1736528 -1496883 -1245162 -1008446 -810046 -661954 -560967 -489786 -422939 -335411
38711 -335411 -210506 -44151 154859 367457 568526 732079 836455 868058 822416 702737
38701 702737 517448 278464 913 -296405 -591244 -859597 -1078543 -1229419 -1300657 -1289737
38691 -1289737 -1203528 -1056520 -867303 -654506 -433772 -216991 -14027 164480 305789 396854
38681 396854 428292 397669 309998 175673 7367 -182838 -385634 -595654 -811319 -1033331
$$ packed form
38751i95570k92299l04700l14915l22792l27208l25685l14909k91625k53423j99515
38741c942641j31681n4825K3548R4885J51477J88025K02682J97477J77928J51667
38731b941458J26140J06148R2571Q3334P6270P1953P4413Q9046J18803J60782
38721a941998K05470K39645K51721K36716J98400J48092J00987P1181O6847Q7528
38711c35411J24905J66355J99010K12598K01069J63553J04376L1603m5642j19679
38701G02737j85289k38984k77551k97318k94839k68353k18946j50876p1238J0920
38691a289737Q6209J47008J89217K12797K20734K16781K02964J78507J41309R1065
38681C96854L1438l0623q7671j34325j68306j90205k02796k10020k15665k22012
$$ plain form
38671 -1033331 -1262262 -1496081 -1728560 -1949306 -2145463 -2304273 -2415424 -2472593 -2474242 -2423862
38661 -2423862 -2329642 -2203310 -2058073 -1906058 -1756190 -1613393 -1479261 -1353511 -1235252 -1123511
38651 -1123511 -1017068 -914033 -811720 -707157 -598077 -483776 -365462 -246200 -130776
38642 -130776 -25442 62772 127254 163129 168374 144652 97791 37405 -24914 -78652 -117371
38631 -117371 -140115 -150668 -155339 -160365 -169669 -183524 -198820 -211225 -218168 -220695 -222993 -230151 -245676
38618 -245676 -269785 -298664 -324870 -339080 -332787 -300503 -240044 -150854 -31928 118676 301905
38607 301905 514408 746205 981473 1202813 1396954 1558416 1688581 1790712 1864394 1903162
38597 1903162 1896644 1835485 1716113 1543145 1328680 1089014 840379 595647 363175 147308
$$ packed form
38671a033331k28931k33819k32479k20746j96157j58810j11151n7169j649N0380
38661b423862R4220J26332J45237J52015J49868J42797J34132J25750J18259J11741
38651a123511J06443J03035J02313J04563J09080J14301J18314J19262J15424
38642a30776J05334Q8214O4482L5875N245k3722m6861o0386o2319n3738l8719
38631a17371k2744j0553m671n026r304j3855j5296j2405o943k527k298p158j5525
38618b45676k4109k8879k6206j4210O293L2284O0459Q9190J18926J50604J83229
38607C01905K12503K31797K35268K21340J94141J61462J30165J02131P3682L8768
38597A903162o518o1159j19372j72968k14465k39666k48635k44732k32472k15867
$$ plain form
38587 147308 -50801 -232883 -403314 -568070 -732446 -898228 -1061684 -1213756 -1342696 -1437835
38577 -1437835 -1492270 -1502951 -1468515 -1386964 -1255449 -1072939 -844239 -582481 -307949 -43386
38567 -43386 192034 387356 541243 659754 751644 823611 877925 913380 928268 922906 899880
38556 899880 862161 810805 744225 659731 556306 436743 307789 178173 55434 -57090
38546 -57090 -161794 -266115 -380006 -512826 -670876 -856066 -1065517 -1291864 -1524208 -1749573
38536 -1749573 -1954555 -2126838 -2256549 -2337477 -2368081 -2351899 -2297045 -2214759 -2117408 -2016488
38526 -2016488 -1921120 -1837373 -1768524 -1715921 -1679636 -1658093 -1646714 -1636744 -1615810 -1570843 -1492334
38515 -1492334 -1377700 -1231819 -1064391 -885595 -702311 -516507 -326041 -126889 84469
$$ packed form
38587A47308j98109j82082j70431j64756j64376j65782j63456j52072j28940r5139
38577a437835n4435j0681L4436Q1551J31515J82510K28700K61758K74532K64563
38567d3386K35420J95322J53887J18511R1890P1967N4314L5455J4888n362k3026
38556H99880l7719n1356o6580q4494j03425j19563j28954j29616j22739j12524
38546e7090j04704j04321j13891j32820j58050j85190k09451k26347k32344k25365
38536a749573k04982j72283j29711q0928l0604J6182N4854Q2286R7351J00920
38526b016488R5368Q3747O8849N2603L6285K1543J1379R970K0934M4967P8509
38515a492334J14634J45881J67428J78796J83284J85804J90466J99152K11358
$$ plain form
38506 84469 309294 545433 786585 1022312 1239440 1424703 1567139 1658644 1692720 1663214
38496 1663214 1564750 1395026 1157754 864730 535997 197699 -121903 -396997 -608029 -744071
38486 -744071 -803635 -794016 -729187 -626491 -502827 -371466 -240559 -113648 8847 128587
38476 128587 248916 373813 505244 640304 770717 885569 975397 1035100 1064922 1070231
38466 1070231 1060703 1048648 1046375 1063117 1102413 1160613 1227008 1285858 1320008 1315023 1262525 1161674
38454 1161674 1018362 842401 643707 428984 200268 -44028 -305896 -583631 -868867
38445 -868867 -1146454 -1397510 -1604208 -1754013 -1841582 -1867808 -1836929 -1753616 -1622065 -1447687
38435 -1447687 -1239827 -1012962 -784968 -573349 -391525 -246787 -140192 -67737 -22007 6219
$$ packed form
38506H4469K24825K36139K41152K35727K17128J85263J42436R1505L4076k9506
38496A663214r8464j69724k37272k93024l28733l38298l19602k75094k11032j36042
38486g44071n9564R619O4829J02696J23664J31361J30907J26911J22495J19740
38476A28587J20329J24897J31431J35060J30413J14852Q9828N9703K9822N309
38466A070231r528j2055k273J6742L9296N8200O6395N8850L4150m985n2498j00851
38454A161674j43312j75961j98694k14723k28716k44296k61868k77735k85236
38445h68867k77587k51056k06698j49805q7569k6226L0879Q3313J31551J74378
38435a447687K07860K26865K27994K11619J81824J44738J06595P2455M5730K8226
$$ plain form
38425 6219 26421 46661 71977 103660 140260 180066 223522 273722 334237 405320 480802 548056
38413 548056 591854 600681 572269 515237 445855 381706 335659 313014 312398 328781 356289 389743
38401 389743 425333 461193 497670 536462 578500 621766 660538 686528 691142 667890 614425 533848
38389 533848 434574 328256 226457 137809 67090 16020 -15549 -29092 -27354 -14221 5661
38378 5661 27331 46130 58985 66150 72142 84552 110970 155909 219604 298846 388524 482778
38366 482778 575871 663474 744308 821154 900232 988999 1093539 1216999 1359783 1520893 1699200
38355 1699200 1893848 2104016 2328449 2564660 2807505 3047733 3271949 3464800 3612463
38346 3612463 3705433 3739513 3715601 3639541 3522300 3379282 3227466 3080579 2944382 2814629
$$ packed form
38425F219K0202K0240K5316L1683L6600L9806M3456N0200O0515P1083P5482O7254
38413E48056M3798Q827k8412n7032o9382o4149m6047k2645o16J6383K7508L3454
38401C89743L5590L5860L6477L8792M2038M3266L8772K5990M614k3252n3465q0577
38389E33848r9274j06318j01799q8648p0719n1070l1569j3543J738J3133J9882
38378E661K1670J8799J2855P165N992J2410K6418M4939O3695P9242Q9678R4254
38366D82778R3093Q7603Q0834P6846P9078Q8767J04540J23460J42784J61110J78307
38355A699200J94648K10168K24433K36211K42845K40228K24216J92851J47663
38346C612463R2970L4080k3912p6060j17241j43018j51816j46887j36197j29753
$$ plain form
38336 2814629 2678822 2520758 2325674 2083975 1792700 1455056 1079039 676131 260484
38327 260484 -151475 -541354 -889503 -1176777 -1387679 -1513941 -1556398 -1523362 -1425827 -1272234
38317 -1272234 -1066000 -807277 -497678 -144920 235291 620923 987619 1313226 1581467
38308 1581467 1783962 1920180 1995553 2018891 2000438 1951018 1881562 1802135 1720393 1640227 1561594
38297 1561594 1482011 1399129 1312843 1225488 1140101 1058326 979621 902090 823957 744780 666178
38286 666178 592133 528633 482323 458486 459341 483663 527823 587515 659176 740567 830328 926469
38274 926469 1024243 1114635 1184866 1221048 1211529 1149333 1033472 869752 670990 455548 243718
38263 243718 53132 -104800 -226188 -313574 -373009 -410275 -427839 -424110 -395232 -338096 -252665
$$ packed form
38336B814629j35807j58064j95084k41699k91275l37644l76017m02908m15647
38327B60484m11959l89879l48149k87274k10902j26262m2457L3036R7535J53593
38317a272234K06234K58723L09599L52758L80211L85632L66696L25607K68241
38308A581467K02495J36218P5373K3338j8453m9420o9456p9427q1742q0166p8633
38297A561594p9583q2882q6286q7355q5387q1775p8705p7531p8133p9177p8602
38286F66178p4045o3500m6310k3837Q55K4322M4160N9692P1661Q1391Q9761R6141
38274I26469R7774R0392P0231L6182r519o2196j15861j63720j98762k15442k11830
38263B43718j90586j57932j21388q7386n9435l7266j7564L729K8878N7136Q5431
$$ plain form
38252 -252665 -142509 -13670 127195 274198 422349 566765 702093 823015 925508 1007854
38242 1007854 1070816 1117354 1152430 1182896 1216833 1261827 1322418 1397841 1481406 1561984 1626768
38231 1626768 1664010 1665119 1626244 1549157 1440687 1310396 1167635 1019822 872876 733063
38221 733063 608597 509643 446402 426093 450461 515230 611654 728945 856007 981820 1095062
38210 1095062 1184255 1239441 1255378 1234920 1190485 1142039 1111823 1117873 1168998 1262789 1386668
38199 1386668 1521114 1644186 1736443 1784781 1783666 1733540 1638109 1502718 1334582 1143885
38189 1143885 944402 753041 588289 467678 404666 405782 468950 583453 731667 892484
38179 892484 1045814 1176698 1277421 1347082 1389420 1410301 1415899 1411863 1403145 1393877 1386997 1383975
$$ packed form
38252b52665J10156J28839J40865J47003J48151J44416J35328J20922J02493Q2346
38242A007854O2962M6538L5076L0466L3937M4994O0591P5423Q3565Q0578O4784
38231A626768L7242J109l8875p7087j08470j30291j42761j47813j46946j39813
38221G33063j24466r8954o3241k0309K4368O4769R6424J17291J27062J25813J13242
38210A095062Q9193N5186J5937k0458m4435m8446l0216O050N1125R3791J23879
38199A386668J34446J23072R2257M8338j115n0126r5431j35391j68136j90697
38189A143885j99483j91361j64752j20611o3012J116O3168J14503J48214J60817
38179H92484J53330J30884J00723O9661M2338K0881N598m036q718r268o880l022
$$ plain form
38167 1383975 1385271 1391447 1404040 1425266 1456501 1496256 1538586 1572768 1584878 1561320 1493150 1379234
38155 1379234 1226701 1048731 861025 678388 512063 368097 247066 145421 57707 -21784
38145 -21784 -98822 -179815 -271754 -380993 -511655 -664754 -838203 -1027207 -1224654 -1421676
38135 -1421676 -1608612 -1776139 -1915932 -2020351 -2081471 -2090747 -2040576 -1927524 -1755139 -1534117
38125 -1534117 -1279512 -1006938 -730046 -459774 -204273 31360 245049 436437 604682
38116 604682 746890 858457 934866 973540 974837 942356 882939 806324 724301 649589 594874
38105 594874 572041 591188 659155 777959 943937 1148165 1377932 1618409 1853848 2068411
38095 2068411 2247228 2377814 2451496 2464554 2419136 2323528 2190574 2033658 1861945 1678099
$$ packed form
38167A383975J296O176J2593K1226L1235L9755M2330L4182J2110k3558o8170j13916
38155A379234j52533j77970j87706j82637j66325j43966j21031j01645q7714p9491
38145b1784p7038q0993r1939j09239j30662j53099j73449j89004j97447j97022
38135a421676j86936j67527j39793j04419o1120r276N0171J13052J72385K21022
38125a534117K54605K72574K76892K70272K55501K35633K13689J91388J68245
38116F04682J42208J11567P6409L8674J297l2481n9417p6615q2023p4712n4715
38105E94874k2833J9147O7967J18804J65978K04228K29767K40477K35439K14563
38095B068411J78817J30586P3682J3058m5418r5608j32954j56916j71713j83846
$$ plain form
38085 1678099 1480332 1267279 1042123 813268 591451 385344 198162 26863 -136045
38076 -136045 -299327 -470007 -651554 -843529 -1042490 -1243486 -1441293 -1630959 -1808112 -1969823
38066 -1969823 -2115907 -2249384 -2374784 -2494670 -2606602 -2703067 -2775178 -2818321 -2836373 -2841619
38056 -2841619 -2849956 -2873922 -2917586 -2976165 -3040025 -3099730 -3148568 -3181610 -3193274 -3176122 -3122131
38045 -3122131 -3025821 -2887717 -2716401 -2527758 -2341329 -2175431 -2043398 -1951941 -1900967 -1884160
38035 -1884160 -1890837 -1909583 -1932430 -1957100 -1986127 -2024187 -2075982 -2145458 -2235274 -2345345 -2470797
38024 -2470797 -2601011 -2721126 -2815968 -2874843 -2895098 -2883053 -2852364 -2821121 -2808971 -2834628 -2913342
38013 -2913342 -3054066 -3256797 -3511051 -3796387 -4085545 -4349956 -4566035 -4719752 -4807668 -4834757
$$ packed form
38085A678099j97767k13053k25156k28855k21817k06107j87182j71299j62908
38076a36045j63282j70680j81547j91975j98961k00996j97807j89666j77153j61711
38066a969823j46084j33477j25400j19886j11932r6465p2111m3143j8052n246
38056b841619q337k3966m3664n8579o3860n9705m8838l3042j1664J7152N3991
38045c122131R6310J38104J71316J88643J86429J65898J32033R1457N0974J6807
38035a884160o677j8746k2847k4670k9027l8060n1795o9476q9816j10071j25452
38024b470797j30214j20115r4842n8875k0255J2045L0689L1243J2150k5657p8714
38013b913342j40724k02731k54254k85336k89158k64411k16079j53717q7916k7089
$$ plain form
38003 -4834757 -4810848 -4747252 -4654069 -4538206 -4402528 -4246556 -4068534 -3868158 -3648916 -3418916
37993 -3418916 -3189313 -2970753 -2769730 -2587006 -2418772 -2259558 -2105420 -1956348 -1817148
37984 -1817148 -1696301 -1602882 -1542634 -1514855 -1511660 -1520301 -1527755 -1525250 -1510189 -1484619 -1451859 -1413830
37972 -1413830 -1370556 -1321418 -1266874 -1209497 -1153858 -1105356 -1068499 -1045299 -1034358 -1031107 -1029469 -1024623
37960 -1024623 -1015607 -1006009 -1001800 -1007193 -1021107 -1036711 -1044691 -1038354 -1017582 -989572 -966275 -959958 -978705
37947 -978705 -1023572 -1088565 -1163431 -1237640 -1303282 -1355724 -1392659 -1413142 -1417679 -1409194 -1393822 -1380422
37935 -1380422 -1378580 -1395984 -1436465 -1499257 -1579315 -1668481 -1757540 -1838565 -1906234 -1957441 -1990174
37924 -1990174 -2003177 -1996446 -1971307 -1929538 -1872711 -1802978 -1724858 -1646253 -1577344 -1527535 -1501876
$$ packed form
38003d834757K3909O3596R3183J15863J35678J55972J78022K00376K19242K30000
37993c418916K29603K18560K01023J82724J68234J59214J54138J49072J39200
37984a817148J20847R3419O0248K7779L195q641p454K505J5061K5570L2760L8029
37972a413830M3274M9138N4544N7377N5639M8502L6857K3200J0941L251J638M846
37960a024623R016R598M209n393j3914j5604p980O337K0772K8010K3297O317j8747
37947i78705m4867o4993p4866p4209o5642n2442l6935k0483m537Q485J5372J3400
37935a380422J842j7404m0481o2792q0058q9166q9059q1025o7669n1207l2733
37924a990174j3003O731K5139M1769N6827O9733P8120P8605O8909M9809K5659
$$ plain form
37913 -1501876 -1499033 -1512278 -1533192 -1555622 -1577301 -1598674 -1620602 -1642673 -1662351 -1674514 -1671430 -1643745
37901 -1643745 -1582537 -1481711 -1339728 -1159944 -949429 -716928 -471363 -221994 20069 240780
37891 240780 424296 556491 628913 640839 598547 513031 397949 268265 138744 21758
37881 21758 -74787 -148197 -200240 -235738 -261294 -284542 -314047 -359593 -431733 -539462 -686592
37870 -686592 -869459 -1078332 -1302093 -1533029 -1768585 -2009417 -2255714 -2504428 -2748776 -2979377
37860 -2979377 -3185445 -3355004 -3474631 -3530124 -3508945 -3403801 -3215562 -2953854 -2634986 -2278340
37850 -2278340 -1903020 -1526074 -1162522 -826375 -531255 -289363 -108560 11040 78606 110554
37840 110554 125327 137280 152363 167150 171153 151179 96233 1713 -127979 -279151 -431288
$$ packed form
37913a501876K843j3245k0914k2430k1679k1373k1928k2071j9678j2163L084K7685
37901a643745O1208J00826J41983J79784K10515K32501K45565K49369K42063K20711
37891B40780J83516J32195P2422J1926m2292q5516j15082j29684j29521j16986
37881B1758r6545p3410n2043l5498k5556k3248k9505m5546p2140j07729j47130
37870f86592j82867k08873k23761k30936k35556k40832k46297k48714k44348k30601
37860b979377k06068j69559j19627n5493K1179J05144J88239K61708L18868L56646
37850b278340L75320L76946L63552L36147K95120K41892J80803J19600O7566L1948
37840A10554J4773J1953J5083J4787M003j9974n4946r4520j29692j51172j52137
$$ plain form
37829 -431288 -561814 -651500 -688335 -668531 -594914 -474133 -314176 -122929 92271 324456
37819 324456 566331 809088 1041273 1249134 1419582 1544998 1626906 1675528 1704949 1726711
37809 1726711 1745489 1758770 1759894 1742291 1702792 1642865 1567889 1485174 1401332 1319430 1236881
37798 1236881 1145627 1035374 898526 734025 548179 352794 162239 -9350 -150503 -254281
37788 -254281 -318960 -347018 -342988 -311653 -257855 -187639 -109203 -32417 32811 78089 97511 88503
37776 88503 52650 -4585 -76171 -156824 -244841 -340778 -443744 -547863 -641165 -707588 -730860
37765 -730860 -698125 -601755 -439479 -214106 66180 387304 729501 1068972 1380998 1643911
37755 1643911 1842715 1970834 2029258 2023869 1962814 1855428 1712794 1548768 1379893 1223386
$$ packed form
37829d31288j30526q9686l6835J9804P3617J20781J59957J91247K15200K32185
37819C24456K41875K42757K32185K07861J70448J25416Q1908M8622K9421K1762
37809A726711J8778J3281J124j7603l9499n9927p4976q2715q3842q1902q2549
37798A236881r1254j10253j36848j64501j85846j95385j90555j71589j41153j03778
37788b54281o4679k8058M030L1335N3798P0216P8436P6786O5228M5278J9422r008
37776H8503l5853n7235p1586q0653q8017r5937j02966j04119r3302o6423k3272
37765g30860L2735R6370J62276K25373K80286L21124L42197L39471L12026K62913
37755A643911J98804J28119N8424n389o1055j07386j42634j64026j68875j56507
$$ plain form
37745 1223386 1093829 1000369 946056 929394 946603 993014 1063251 1151172 1250500 1356091 1464790
37734 1464790 1575022 1685371 1793494 1896578 1993157 2084668 2174936 2267505 2362656 2456386
37724 2456386 2541865 2611976 2661217 2686521 2687460 2666037 2625863 2570875 2504270 2428158 2343848 2252588
37712 2252588 2156618 2059978 1967962 1884862 1811440 1744310 1678135 1609131 1537304 1465760 1397527
37701 1397527 1331882 1262276 1176844 1061129 901995 691449 428997 121494 -219264 -579550
37691 -579550 -945560 -1303730 -1640415 -1941907 -2195263 -2389936 -2519798 -2584378 -2588086 -2537532
37681 -2537532 -2438671 -2295675 -2111837 -1891336 -1640551 -1368358 -1085514 -803410 -532599 -281563
37671 -281563 -56031 141133 309558 450489 565348 654109 714393 742187 734232 690885 617792
$$ packed form
37745A223386j29557r3460n4313j6662J7209M6411P0237Q7921R9328J05591J08699
37734A464790J10232J10349J08123J03084R6579R1511R0268R2569R5151R3730
37724B456386Q5479P0111M9241K5304R39k1423m0174n4988o6605p6112q4310r1260
37712B252588r5970r6640r2016q3100p3422o7130o6175o9004p1827p1544o8233
37701A397527o5645o9606q5432j15715j59134k10546k62452l07503l40758l60286
37691e79550l66010l58170l36685l01492k53356j94673j29862o4580l708N0554
37681b537532R8861J42996J83838K20501K50785K72193K82844K82104K70811K51036
37671b81563K25532J97164J68425J40931J14859Q8761O0284K7794p955m3347p3093
$$ plain form
37660 617792 525217 425076 326851 234253 144431 50264 -55445 -176060 -308978 -445502
37650 -445502 -572274 -674057 -737498 -754653 -724540 -651875 -544073 -408587 -251976 -80378
37640 -80378 99947 283141 465475 647451 834627 1035503 1256172 1494139 1735442 1957888
37630 1957888 2139248 2265999 2338134 2368176 2375488 2378586 2388497 2405428 2419528 2414886 2375091 2288688
37618 2288688 2153087 1975766 1772278 1561712 1361394 1182855 1030568 903651 799405
37609 799405 716655 657195 624927 623819 656299 722892 822442 951566 1102922 1263618 1415638
37598 1415638 1538862 1615443 1633744 1590758 1492533 1352261 1186196 1008829 829633 652947
37588 652947 480605 315150 161253 24284 -92833 -191957 -279187 -361558 -443084 -522548
$$ packed form
37660F17792r2575j00141r8225r2598q9822r4167j05709j20615j32918j36524
37650d45502j26772j01783o3441j7155L0113P2665J07802J35486J56611J71598
37640h0378J80325J83194J82334J81976J87176K00876K20669K37967K41303K22446
37630A957888J81360J26751P2135L0042P312L098R911J6931J4100m642l9795q6403
37618B288688j35601j77321k03488k10566k00318j78539j52287j26917j04246
37609G99405q2750n9460l2268j108L2480O6593R9550J29124J51356J60696J52020
37598A415638J23224P6581J8301m2986r8225j40272j66065j77367j79196j76686
37588F52947j72342j65455j53897j36969j17117r9124q7230q2371q1526p9464
$$ plain form
37578 -522548 -594116 -650045 -683785 -691962 -674803 -635634 -580205 -515758 -449252 -384881 -322348 -257533
37566 -257533 -185555 -104087 -14282 81565 183686 296504 426433 577016 744665 917646
37556 917646 1078400 1207513 1287556 1306111 1257872 1145674 980083 777583 557968 341839
37546 341839 148685 -4849 -107204 -154659 -153287 -118240 -69592 -26066 573 7844 648
37535 648 -13641 -30328 -49868 -76450 -114065 -163145 -220083 -279440 -336650 -389333 -437125 -481207
37523 -481207 -524196 -569716 -620604 -675962 -728905 -767004 -775779 -743448 -664339 -539295 -373279
37512 -373279 -171930 60765 322339 609515 915429 1228299 1532390 1810724 2048221 2234138
37502 2234138 2363230 2435751 2456764 2435286 2383438 2315401 2245894 2188097 2151431 2139965 2152265
$$ packed form
37578e22548p1568n5929l3740q177J7159L9169N5429O4447O6506O4371O2533O4815
37566b57533P1978Q1468Q9805R5847J02121J12818J29929J50583J67649J72981
37556I17646J60754J29113Q0043J8555m8239j12198j65591k02500k19615k16129
37546C41839j93154j53534j02355m7455J372L5047M8648M3526K6639P271p196
37535F48j4289j6687j9540k6582l7615m9080n6938n9357n7210n2683m7792m4082
37523d81207m2989m5520n0888n5358n2943l8099q775L2331P9109J25044J66016
37512c73279K01349K32695K61574K87176L05914L12870L04091K78334K37497J85917
37502B234138J29092P2521K1013k1478n1848o8037o9507n7797l6666j1466J2300
$$ plain form
37491 2152265 2182720 2223498 2265997 2301390 2320596 2314254 2273101 2189040 2056897 1876273 1652511
37480 1652511 1396281 1122000 845405 580526 336810 117973 -76369 -247098 -392405
37471 -392405 -507129 -584882 -621600 -618507 -582935 -526692 -463139 -404644 -361293 -340431 -346260 -379280
37459 -379280 -436109 -510305 -594357 -682352 -772351 -867456 -974971 -1103650 -1259777 -1443655 -1648465
37448 -1648465 -1862555 -2073934 -2274085 -2458913 -2627176 -2778514 -2912587 -3029097 -3127821 -3208408
37438 -3208408 -3270302 -3312629 -3333502 -3328869 -3292285 -3216838 -3098566 -2939260 -2747308 -2537049 -2327606
37427 -2327606 -2140770 -1996973 -1910031 -1883519 -1911247 -1981488 -2082091 -2203607 -2339379 -2483510
37417 -2483510 -2628620 -2765089 -2882311 -2970890 -3024144 -3038041 -3009978 -2937507 -2817923 -2649170
$$ packed form
37491B152265L0455M0778M2499L5393J9206o342m1153q4061j32143j80624k23762
37480A652511k56230k74281k76595k64879k43716k18837j94342j70729j45307
37471c92405j14724p7753l6718L093L5572N6243O3553N8495M3351K0862n829l3020
37459c79280n6829p4196q4052q7995q9999r5105j07515j28679j56127j83878k04810
37448a648465k14090k11379k00151j84828j68263j51338j34073j16510r8724q0587
37438c208408o1894m2327k0873M633L6584P5447J18272J59306J91952K10259K09443
37427b327606J86836J43797Q6942K6512k7728p0241j00603j21516j35772j44131
37417b483510j45110j36469j17222q8579n3254j3897K8063P2471J19584J68753
$$ plain form
37407 -2649170 -2431732 -2170505 -1875402 -1560306 -1241122 -933978 -653854 -413221 -220475
37398 -220475 -78877 13081 59632 64977 31421 -40510 -150095 -293725 -463063 -645088 -824217
37387 -824217 -985722 -1119017 -1219480 -1288326 -1331065 -1355457 -1369525 -1379601 -1388316 -1392916 -1384879
37376 -1384879 -1351742 -1281106 -1165201 -1003697 -803380 -575378 -332010 -84765 156543 384268
37366 384268 593340 781079 945925 1085640 1196482 1274602 1319304 1336153 1337681 1340959 1363136
37355 1363136 1416751 1506261 1626640 1764638 1902546 2023023 2112834 2164031 2172715 2136732 2053773
37344 2053773 1920904 1735909 1499954 1220223 910796 590743 279983 -5206 -255034
37335 -255034 -466542 -641980 -786268 -904401 -999574 -1072881 -1124853 -1157750 -1176668 -1188408 -1198848
$$ packed form
37407b649170K17438K61227K95103L15096L19184L07144K80124K40633J92746
37398b20475J41598R1958M6551N345l3556p1931j09585j43630j69338j82025j79129
37387h24217j61505j33295j00463o8846m2739k4392j4068j0076q715m600Q037
37376a384879L3137P0636J15905J61504K00317K28002K43368K47245K41308K27725
37366C84268K09072J87739J64846J39715J10842P8120M4702J6849J528L278K2177
37355A363136N3615Q9510J20379J37998J37908J20477Q9811N1197Q684l5983q2959
37344B053773j32869j84995k35955k79731l09427l20053l10760k85189k49828
37335b55034k11508j75438j44288j18133r5173p3307n1972l2897j8918j1740j0440
$$ plain form
37324 -1198848 -1210654 -1222759 -1231972 -1235900 -1235536 -1235876 -1244353 -1268686 -1316051 -1393715 -1509201 -1668099
37312 -1668099 -1869752 -2103397 -2347847 -2575892 -2761636 -2887102 -2945212 -2938837 -2877871 -2776385
37302 -2776385 -2650547 -2516773 -2389553 -2279155 -2190169 -2121869 -2070424 -2031638 -2002462 -1980567
37292 -1980567 -1962834 -1944437 -1919482 -1882858 -1831980 -1767212 -1690734 -1604793 -1510542 -1408085 -1297608
37281 -1297608 -1181080 -1063713 -954142 -862617 -797780 -763654 -758374 -775046 -804186 -836791 -866869
37270 -866869 -892387 -914383 -935112 -956530 -979775 -1005438 -1034031 -1066063 -1101488 -1138842 -1174947
37259 -1174947 -1205822 -1228422 -1241948 -1247546 -1246336 -1237143 -1215916 -1177883 -1121322 -1050271 -974188 -904823
37247 -904823 -852177 -821157 -809718 -808939 -805295 -784390 -734479 -648426 -524214 -365002 -179058
$$ packed form
37324a198848j1806j2105r213l928L64l40q477k4333m7365p7664j15486j58898
37312a668099k01653k33645k44450k28045j85744j25466n8110O375O0966J01486
37302b776385J25838J33774J27220J10398Q8986O8300N1445L8786K9176K1895
37292a980567J7733J8397K4955L6624N0878O4768P6478Q5941R4251J02457J10477
37281a297608J16528J17367J09571R1525O4837L4126N280j6672k9140l2605l0078
37270h66869k5518k1996k0729k1418k3245k5663k8593l2032l5425l7354l6105
37259a174947l0875k2600j3526n598J210R193K1227L8033N6561P1051P6083O9365
37247i04823N2646L1020J1439P79L644K0905M9911Q6053J24212J59212J85944
$$ plain form
37236 -179058 21200 222006 412490 588420 753202 915367 1083905 1263709 1452907 1642750
37226 1642750 1819947 1970546 2083576 2152691 2175451 2151723 2082963 1972897 1828720 1661671
37216 1661671 1486408 1319084 1174384 1062127 984599 936035 904974 878715 847722 807927
37206 807927 760516 710251 663471 626094 601714 590344 588341 589474 586611 573652 547439 509140
37194 509140 464547 423168 396375 394854 425657 489748 581215 688744 798945 900446 987327
37183 987327 1060278 1124303 1183608 1236395 1272775 1277191 1233927 1132708 971872 758409 505869
37172 505869 231505 -46615 -312262 -552877 -759909 -927940 -1054181 -1139715 -1191726 -1224118
37162 -1224118 -1254487 -1298131 -1362182 -1442929 -1527137 -1595917 -1629078 -1608992 -1523957 -1370767 -1155440
$$ packed form
37236a79058K00258K00806J90484J75930J64782J62165J68538J79804J89198J89843
37226A642750J77197J50599J13030O9115K2760k3728o8760j10066j44177j67049
37216A661671j75263j67324j44700j12257p7528m8564l1061k6259l0993l9795
37206H07927m7411n0265m6780l7377k4380j1370k003J133k863j2959k6213l8299
37194E09140m4593m1379k6793j521L0803O4091R1467J07529J10201J01501Q6881
37183I87327P2951O4025N9305N2787L6380M416m3264j01219j60836k13463k52540
37172E05869k74364k78120k65647k40615k07032j68031j26241q5534n2011l2392
37162a224118l0369m3644o4051q0747q4208o8780l3161K0086Q5035J53190K15327
$$ plain form
37151 -1155440 -891299 -595067 -282658 33776 346922 653425 951427 1237454 1504188
37142 1504188 1740180 1931425 2063849 2125983 2111613 2022104 1867401 1664593 1434023 1194648
37132 1194648 960817 741414 540537 358338 191661 35081 -117284 -269802 -424221
37123 -424221 -580023 -735997 -892305 -1052014 -1221124 -1406814 -1614658 -1846261 -2098391 -2363658
37113 -2363658 -2632045 -2892633 -3135185 -3351347 -3534932 -3680986 -3784344 -3839296 -3841480 -3791331
37103 -3791331 -3696934 -3574307 -3444698 -3329974 -3247884 -3208764 -3214427 -3258846 -3329602 -3409466 -3478289
37092 -3478289 -3515448 -3502521 -3425590 -3276880 -3055846 -2769613 -2432467 -2064187 -1687425 -1324741
37082 -1324741 -996043 -717120 -499291 -349495 -270197 -259293 -310517 -414286 -558217 -727083
$$ packed form
37151a155440K64141K96232L12409L16434L13146L06503K98002K86027K66734
37142A504188K35992J91245J32424O2134j4370q9509j54703k02808k30570k39375
37132A194648k33831k19403k00877j82199j66677j56580j52365j52518j54419
37123d24221j55802j55974j56308j59709j69110j85690k07844k31603k52130k65267
37113b363658k68387k60588k42552k16162j83585j46054j03358n4952k184N0149
37103c791331R4397J22627J29609J14724Q2090L9120n663m4419p0756p9864o8823
37092c478289l7159J2927P6931J48710K21034K86233L37146L68280L76762L62684
37082a324741L28698K78923K17829J49796P9298J0904n1224j03769j43931j68866
$$ plain form
37072 -727083 -903056 -1067339 -1203068 -1298061 -1345887 -1345152 -1298420 -1212184 -1097624 -970249 -847070
37061 -847070 -742256 -663736 -612287 -582736 -566219 -552857 -534448 -506511 -469314 -428240 -393538
37050 -393538 -378596 -396005 -452478 -544976 -659756 -774474 -862796 -900776 -873448 -779126 -629686
37039 -629686 -447165 -258559 -90511 35125 104239 111576 60363 -38861 -169970 -313830
37029 -313830 -451738 -568903 -656991 -715314 -750723 -776112 -807304 -858664 -938847 -1048612 -1181806
37018 -1181806 -1328804 -1480265 -1629341 -1772035 -1906607 -2032668 -2149790 -2255709 -2345325 -2411775
37008 -2411775 -2449288 -2455791 -2433356 -2386441 -2319512 -2235579 -2136110 -2021864 -1894022 -1755143 -1609457
36997 -1609457 -1462062 -1317094 -1175732 -1035358 -890538 -735208 -564682 -376562 -170684
$$ packed form
37072g27083j75973j64283j35729r4993m7826P35M6732Q6236J14560J27375J23179
37061h47070J04814P8520N1449K9551J6517J3362J8409K7937L7197M1074L4702
37050c93538J4942j7409n6473r2498j14780j14718q8322l7980K7328R4322J49440
37039f29686J82521J88606J68048J25636O9114P337n1213r9224j31109j43860
37029c13830j37908j17165q8088n8323l5409k5389l1192n1360q0183j09765j33194
37018a181806j46998j51461j49076j42694j34572j26061j17122j05919q9616o6450
37008b411775l7513o503K2435M6915O6929Q3933R9469J14246J27842J38879J45686
36997a609457J47395J44968J41362J40374J44820J55330J70526J88120K05878
$$ plain form
36988 -170684 51250 286016 529223 775935 1021672 1263666 1501752 1737981 1974633 2211572
36978 2211572 2444575 2665547 2864378 3031583 3161021 3251890 3308904 3339836 3351060 3343366
36968 3343366 3310808 3243863 3135531 2986945 2809119 2619792 2437196 2273975 2133905 2012240
36958 2012240 1898873 1782619 1655023 1512726 1358085 1197964 1040856 893254 756957
36949 756957 628824 503126 375100 243708 112205 -13591 -128043 -227543 -310349 -375089
36939 -375089 -419719 -442047 -441099 -417680 -373390 -309088 -224477 -119484 3551 138682 277310
36928 277310 411072 535229 650688 763306 880599 1007775 1145693 1292015 1444313 1602418
36918 1602418 1768042 1941933 2120602 2294902 2451487 2576417 2658918 2693515 2679943 2621475
$$ packed form
36988a70684K21934K34766K43207K46712K45737K41994K38086K36229K36652K36939
36978B211572K33003K20972J98831J67205J29438R0869N7014L0932J1224p694
36968C343366l2558o6945j08332j48586j77826j89327j82596j63221j40070j21665
36958B012240j13367j16254j27596j42297j54641j60121j57108j47602j36297
36949G56957j28133j25698j28026j31392j31503j25796j14452r9500q2806o4740
36939c75089m4630k2328R48K3419M4290O4302Q4611J04993J23035J35131J38628
36928B77310J33762J24157J15459J12618J17293J27176J37918J46322J52298J58105
36918A602418J65624J73891J78669J74300J56585J24930Q2501L4597j3572n8468
$$ plain form
36908 2621475 2522737 2388012 2220701 2023982 1801865 1559565 1302863 1037153 767031 496553
36898 496553 229645 -29778 -277827 -510252 -721326 -902299 -1040501 -1120413 -1127287 -1052549
36888 -1052549 -898826 -682032 -428873 -170358 65784 260378 404155 496167 541174 547029
36878 547029 522026 472400 401011 308157 194243 62871 -77289 -212850 -328422 -411000
36868 -411000 -454392 -461689 -444409 -418478 -398702 -393852 -404049 -421253 -432639 -425536 -392039 -331773
36856 -331773 -252236 -166601 -89115 -29206 13007 46926 86813 144928 226368 328049 441665
36845 441665 558594 674108 788779 906609 1031414 1163830 1300499 1435379 1562277 1677610
36835 1677610 1782536 1883550 1990965 2115509 2264246 2437456 2627666 2821181 3001495
$$ packed form
36908B621475r8738j34725j67311j96719k22117k42300k56702k65710k70122k70478
36898D96553k66908k59423k48049k32425k11074j80973j38202p9912o874P4738
36888a052549J53723K16794K53159K58515K36142J94594J43777R2012M5007N855
36878E47029k5003m9626p1389r2854j13914j31372j40160j35561j15572q2578
36868d11000m3392p297J7280K5931J9776M850j0197j7204j1386P103L3497O0266
36856c31773P9537Q5635P7486N9909M2213L3919L9887N8115Q1440J01681J13616
36845D41665J16929J15514J14671J17830J24805J32416J36669J34880J26898J15333
36835A677610J04926J01014J07415J24544J48737J73210J90210J93515J80314
$$ plain form
36826 3001495 3153414 3266517 3336959 3367418 3365917 3344315 3316513 3296001 3293097 3313280 3357589
36815 3357589 3424401 3510948 3613763 3728697 3851361 3977991 4106099 4234551 4363117 4491717
36805 4491717 4619521 4744148 4861228 4964437 5045859 5096502 5107024 5069073 4977598 4833509
36795 4833509 4645013 4426037 4191986 3955210 3722809 3497743 3281989 3079337 2895761
36786 2895761 2736967 2604837 2495788 2402937 2320877 2249626 2195063 2166098 2170949 2214613 2297853
36775 2297853 2417049 2564527 2729500 2899770 3063882 3213142 3342739 3451339 3539045 3604766
36765 3604766 3644880 3654677 3632156 3581899 3516337 3453183 3410053 3398834 3422361 3474508 3543070
36754 3543070 3613881 3674650 3717396 3738744 3738088 3714906 3667250 3592618 3490396 3363790 3219801
$$ packed form
36826C001495J51919J13103P0442L0459j501k1602k7802k0512k904K0183M4309
36815C357589O6812Q6547J02815J14934J22664J26630J28108J28452J28566J28600
36805D491717J27804J24627J17080J03209Q1422N0643J0522l7951r1475j44089
36795D833509j88496k18976k34051k36776k32401k25066k15754k02652j83576
36786B895761j58794j32130j09049r2851q2060p1251n4563k8965M851M3664Q3240
36775B297853J19196J47478J64973J70270J64112J49260J29597J08600Q7706O5721
36765C604766M0114R797k2521n0257o5562o3154m3130j1219K3527N2147O8562
36754C543070P0811O0769M2746K1348o56k3182m7656p4632j02222j26606j43989
$$ plain form
36743 3219801 3067511 2916091 2773671 2647176 2542405 2463567 2411983 2384576 2373434 2367584
36733 2367584 2356844 2335995 2306784 2276356 2252973 2241539 2241387 2247125 2251544 2248723 2235780 2212799
36721 2212799 2181475 2143471 2099279 2047995 1988144 1919371 1844152 1768217 1698892 1642087 1599803
36710 1599803 1569683 1546631 1525371 1502896 1480312 1463648 1463070 1490211 1554438 1659593 1802465
36699 1802465 1973265 2157574 2339080 2502536 2636407 2734743 2797951 2832220 2847692 2855792
36689 2855792 2866394 2885404 2913171 2944367 2969991 2981208 2973111 2945972 2903069 2846599 2774377
36678 2774377 2679293 2551746 2383761 2172781 1923450 1646752 1357074 1068454 791545 532601
36668 532601 294791 80488 -107560 -267094 -398140 -504080 -591431 -668764 -745049 -827429
$$ packed form
36743C219801j52290j51420j42420j26495j04771p8838n1584k7407j1142n850
36733B367584j0740k0849k9211l0428k3383j1434j52N738M419k821j2943k2981
36721B212799l1324l8004m4192n1284n9851o8773p5219p5935o9325n6805m2284
36710A599803l0120k3052k1260k2475k2584j6664n78K7141O4227J05155J42872
36699A802465J70800J84309J81506J63456J33871R8336O3208L4269J5472Q100
36689B855792J0602J9010K7767L1196K5624J1217q097k7139m2903n6470p2222
36678B774377r5084j27547j67985k10980k49331k76698k89678k88620k76909k58944
36668E32601k37810k14303j88048j59534j31046j05940q7351p7333p6285q2380
$$ plain form
36658 -827429 -919015 -1017852 -1117658 -1209940 -1286703 -1343145 -1379507 -1400974 -1415257 -1428952 -1444574
36647 -1444574 -1459665 -1468341 -1464629 -1446193 -1416549 -1384492 -1360928 -1354774 -1369972 -1404960 -1454549 -1512641
36635 -1512641 -1573885 -1633688 -1687814 -1732776 -1766557 -1788095 -1795371 -1783795 -1746659 -1677487 -1572663
36624 -1572663 -1432854 -1262916 -1070963 -867752 -666984 -485719 -343107 -256644 -237554 -288065
36614 -288065 -402003 -567840 -772242 -1002425 -1246266 -1490133 -1716153 -1901775 -2023253 -2061610
36604 -2061610 -2007575 -1863068 -1639456 -1354409 -1028788 -684002 -340052 -14758 275798 516666
36594 516666 694831 801911 837161 808444 730207 619773 494128 368275 254754 163543
36584 163543 101902 74060 80649 118193 179381 254613 334498 412387 486249 559461 640082 738354
$$ packed form
36658h27429r1586r8837r9806r2282p6763n6442l6362k1467j4283j3695j5622
36647a444574j5091q676L712J8436K9644L2057K3564O154j5198l4988m9589n8092
36635a512641o1244n9803n4126m4962l3781k1538p276J1576L7136O9172J04824
36624a572663J39809J69938J91953K03211K00768J81265J42612Q6463J9090n0511
36614b88065j13938j65837k04402k30183k43841k43867k26020j85622j21478l8357
36604b061610N4035J44507K23612K85047L25621L44786L43950L25294K90556K40868
36594E16666J78165J07080L5250k8717p8237j10434j25645j25853j13521r1211
36584A63543o1641k7842O589L7544O1188P5232P9885P7889P3862P3212Q0621R8272
$$ plain form
36572 738354 862975 1017605 1198977 1397097 1597177 1782641 1938370 2053186 2120812 2139322
36562 2139322 2109771 2034670 1916612 1757275 1557291 1317377 1040589 734787 413889 96653
36552 96653 -197067 -450798 -654067 -802105 -894142 -932611 -923635 -876894 -803235 -710742 -601635
36541 -601635 -471726 -312413 -114085 130424 423462 761840 1137430 1538147 1948736 2351564
36531 2351564 2727857 3059480 3330985 3531600 3656738 3708477 3694743 3627533 3520847 3388772
36521 3388772 3243757 3095035 2947405 2800795 2651103 2492403 2319651 2130320 1923920
36512 1923920 1700000 1456541 1190184 898196 580897 243214 -105383 -452516 -785215
36503 -785215 -1091667 -1361760 -1586979 -1760476 -1877376 -1934891 -1932528 -1873223 -1765170 -1622468
$$ packed form
36572G38354J24621J54630J81372J98120K00080J85464J55729J14816O7626J8510
36562B139322k9551p5101j18058j59337j99984k39914k76788l05802l20898l17236
36552I6653k93720k53731k03269j48038r2037l8469Q976M6741P3659R2493J09107
36541f01635J29909J59313J98328K44509K93038L38378L75590M00717M10589M02828
36531B351564L76293L31623K71505K00615J25138N1739j3734o7210j06686j32075
36521C388772j45015j48722j47630j46610j49692j58700j72752j89331k06400
36512A923920k23920k43459k66357k91988l17299l37683l48597l47133l32699
36503g85215l06452k70093k25219j73497j16900n7515K363N9305J08053J42702
$$ plain form
36493 -1622468 -1462926 -1303827 -1158370 -1034574 -935906 -861869 -808267 -768541 -736957 -712100
36483 -712100 -697753 -699786 -720888 -756983 -797967 -832045 -850416 -849485 -830281 -796755 -754468 -709742
36471 -709742 -668561 -635097 -610604 -593371 -579594 -564467 -543030 -510658 -462967 -394856 -299011
36460 -299011 -165369 16873 254666 546121 878283 1229459 1575313 1895716 2178999 2421905
36450 2421905 2626244 2795035 2930666 3035621 3114387 3174647 3226671 3281017 3345508 3422840
36440 3422840 3509929 3599348 3682182 3751288 3804211 3845277 3886089 3943300 4033376 4166107 4340164
36429 4340164 4543216 4756334 4959934 5138333 5281723 5386270 5453531 5489841 5505369 5512237
36419 5512237 5521755 5541799 5575711 5622953 5680442 5743378 5805593 5860245 5901093 5923656 5925705 5907321
$$ packed form
36493a622468J59542J59099J45457J23796R8668P4037N3602L9726L1584K4857
36483g12100J4347k033k1102l6095m0984l4078j8371R31J9204L3526M2287M4726
36471g09742M1181L3464K4493J7233J3777J5127K1437L2372M7691O8111R5845
36460b99011J33642J82242K37793K91455L32162L51176L45854L20403K83283K42906
36450B421905K04339J68791J35631J04955P8766O0260N2024N4346O4491P7332
36440C422840Q7089Q9419Q2834O9106N2923M1066M0812N7211R0076J32731J74057
36429D340164K03052K13118K03600J78399J43390J04547O7261L6310J5528O868
36419E512237R518K0044L3912M7242N7489O2936O2215N4652M0848K2563K049j8384
$$ plain form
36407 5907321 5870993 5821535 5765332 5709043 5658569 5618788 5593606 5585612 5595324 5620902 5659072 5706981
36395 5706981 5763901 5832011 5916500 6025533 6169844 6360912 6607378 6911158 7265642 7657238
36385 7657238 8069310 8486176 8895482 9288812 9661531 10012764 10345519 10666315 10983949
36376 10983949 11307819 11646674 12008105 12398339 12821986 13282215 13782226 14327598 14927519
36367 14927519 15593156 16333817 17153768 18051975 19024516 20067566 21179450 22361648 23619110
36358 23619110 24959951 26394583 27934812 29593444 31384472 33323686 35429622 37724630
36350 37724630 40235439 42992805 46030510 49384413 53092032 57192911 61730180 66753500
36342 66753500 72322420 78508362 85394054 93070794 101634736 111182935 121809353 133601034
$$ packed form
36407E907321l6328m9458n6203n6289n0474l9781k5182p994R712K5578L8170M7909
36395E706981N6920O8110Q4489J09033J44311J91068K46466L03780L54484L91596
36385G657238M12072M16866M09306L93330L72719L51233L32755L20796L17634
36376A0983949L23870L38855L61431L90234M23647M60229N00011N45372N99921
36367A4927519O65637P40661Q19951Q98207R72541J043050J111884J182198J257462
36358B3619110J340841J434632J540229J658632J791028J939214K105936K295008
36350C7724630K510809K757366L037705L353903L707619M100879M537269N023320
36342F6753500N568920O185942O885692P676740Q563942R548199J0626418J1791681
$$ plain form
36334 133601034 146634626 160972524 176656741 193698451 212062121 231644217 252246593
36327 252246593 273544793 295053161 316093466 335781294 353051975 366748267 375776989
36320 375776989 379309824 376968872 368925939 355872104 338869076 319141773 297883751
36313 297883751 276123303 254661352 234066074 214700719 196764619 180334843 165402731
36306 165402731 151903733 139740570 128800005 118963945 110116298 102147291 94956683
36299 94956683 88456474 82572646 77244779 72422946 68062963 64122167 60557385 57325177
36291 57325177 54383388 51692769 49217796 46926558 44790548 42785506 40893501 39105027
36283 39105027 37419577 35843770 34387066 33056039 31849335 30755991 29758275 28837353
$$ packed form
36334A33601034J3033592J4337898J5684217J7041710J8363670J9582096K0602376
36327B52246593K1298200K1508368K1040305J9687828J7270681J3696292R028722
36320C75776989L532835k340952q042933j3053835j7003028j9727303k1258022
36313B97883751k1760448k1461951k0595278j9365355j7936100j6429776j4932112
36306A65402731j3498998j2163163j0940565r836060q847647p969007p190608
36299I4956683o500209n883828n327867m821833m359983l940796l564782l232208
36291E7325177k941789k690619k474973k291238k136010k005042j892005j788474
36283C9105027j685450j575807j456704j331027j206704j093344r97716r20922
$$ plain form
36275 28837353 27978373 27172639 26416967 25711742 25059038 24461499 23921949 23443182 23027090
36266 23027090 22672847 22374736 22120761 21893058 21670639 21434185 21171318 20879975 20568117
36257 20568117 20250089 19941693 19656278 19403013 19187259 19012146 18880052 18792991 18751938 18756178
36247 18756178 18803673 18892361 19021268 19190543 19400416 19649841 19935661 20252935 20596465 20962791
36237 20962791 21351293 21763551 22201275 22664010 23147540 23643303 24139010 24620869 25077453
36228 25077453 25504005 25904938 26292486 26681200 27080468 27488897 27893562 28274076 28608339
36219 28608339 28876425 29061397 29148536 29125061 28981137 28711536 28316924 27804318 27186892 26483425
36209 26483425 25717078 24912779 24093146 23274442 22464825 21665914 20876487 20095952 19326018
$$ packed form
36275B8837353q58980q05734p55672p05225o52704n97539n39550m78767m16092
36266B3027090l54243k98111k53975k27703k22419k36454k62867k91343l11858
36257B0568117l18028l08396k85415k53265k15754j75113j32094q7061m1053M240
36247A8756178M7495Q8688J28907J69275K09873K49425K85820L17274L43530L66326
36237B0962791L88502M12258M37724M62735M83530M95763M95707M81859M56584
36228B5077453M26552M00933L87548L88714L99268M08429M04665L80514L34263
36219B8608339K68086J84972Q7139k3475j43924k69601l94612n12606o17426p03467
36209B6483425p66347q04299q19633q18704q09617p98911p89427p80535p69934
$$ plain form
36200 19326018 18570436 17833543 17118345 16424712 15748266 15080608 14411362 13731751 13038333
36191 13038333 12335079 11632778 10946357 10291619 9682601 9129944 8640108 8215260 7853636
36182 7853636 7550280 7298181 7089745 6918217 6778529 6667254 6581745 6518717 6472693 6434972
36172 6434972 6393801 6335950 6249143 6124482 5958045 5751164 5509315 5240124 4951376 4649811
36162 4649811 4340973 4029920 3722314 3425229 3147136 2897028 2683194 2512171 2388071
36153 2388071 2312176 2282774 2295326 2342961 2417237 2509066 2609748 2711988 2810672 2903097 2988388
36142 2988388 3066222 3135578 3194442 3240723 3273759 3295537 3311132 3328096 3354544 3396095 3452869
36131 3452869 3518179 3579640 3621886 3629439 3588685 3488850 3322506 3086348 2782558 2420098 2014815
$$ packed form
36200A9326018p55582p36893p15198o93633o76446o67658o69246o79611o93418
36191A3038333p03254p02301o86421o54738o09018n52657m89836m24848l61624
36182G853636l03356k52099k08436j71528j39688j11275q5509o3028m6024l7721
36172F434972m1171n7851q6807j24661j66437k06881k41849k69191k88748l01565
36162D649811l08838l11053l07606k97085k78093k50108k13834j71023j24100
36153B388071p5895k9402J2552M7635P4276R1829J00682J02240R8684R2425Q5291
36142B988388P7834O9356N8864M6281L3036K1778J5595J6964K6448M1551N6774
36131C452869O5310O1461M2246P553m0754r9835j66344k36158l03790l62460m05283
$$ plain form
36120 2014815 1587782 1162464 761623 404337 103250 -137117 -319720 -451731 -540303 -589747
36110 -589747 -601326 -575004 -511587 -414144 -288414 -142238 15904 178977 343322 509357
36100 509357 680250 858924 1045019 1233862 1418151 1591015 1748086 1887481 2008611 2111217
36090 2111217 2194731 2257161 2293725 2296994 2259794 2179656 2061954 1919721 1770438 1631414 1515250
36079 1515250 1426361 1359428 1300484 1230670 1131686 991107 805607 581072 330235 69681
36069 69681 -182469 -408566 -594305 -732564 -826359 -888688 -938624 -995262 -1072152 -1174272 -1298169
36058 -1298169 -1434576 -1572110 -1700646 -1813406 -1907525 -1983538 -2044483 -2095105 -2140945 -2186764
36048 -2186764 -2234138 -2279056 -2311071 -2315161 -2276109 -2183865 -2037841 -1848615 -1636514 -1427378 -1246682
$$ packed form
36120B014815m27033m25318m00841l57286l01087k40367j82603j32011q8572m9444
36110e89747j1579K6322O3417R7443J25730J46176J58142J63073J64345J66035
36100E09357J70893J78674J86095J88843J84289J72864J57071J39395J21130J02606
36090B111217Q3514O2430L6564L269l7200q0138j17702j42233j49283j39024j16164
36079A515250q8889o6933n8944o9814r8984j40579j85500k24535k50837k60554
36069F9681k52150k26097j85739j38259r3795o2329m9936n6638p6890j02120j23897
36058a298169j36407j37534j28536j12760r4119p6013o0945n0622m5840m5819
36048b186764m7374m4918l2015m090L9052R2244J46024J89226K12101K09136J80696
$$ plain form
36037 -1246682 -1113943 -1039513 -1024742 -1064501 -1149920 -1269832 -1411084 -1558822 -1697506 -1812564
36027 -1812564 -1892193 -1928737 -1919195 -1864767 -1769970 -1642214 -1492157 -1334152 -1185555 -1064166
36017 -1064166 -984347 -953435 -970135 -1025436 -1105143 -1192566 -1270676 -1324008 -1340671 -1314107 -1243769
36006 -1243769 -1134337 -993977 -832597 -660775 -489216 -328112 -186057 -68931 20559 82613
35996 82613 119917 137606 143381 147188 160050 192160 250769 338829 455284 597016 761218
35985 761218 946425 1151325 1372050 1599892 1821363 2020984 2185011 2303501 2369793 2379245
35975 2379245 2329637 2223385 2069291 1881667 1677041 1470412 1273000 1092256 933471 801233
35965 801233 699005 626659 577921 540025 496197 429739 328197 186835 10752 -185275
$$ packed form
36037a246682J32739P4430J4771l9759q5419j19912j41252j47738j38684j15058
36027a812564p9629l6544R542N4428R4797J27756J50057J58005J48597J21389
36017a064166P9819L0912j6700n5301p9707q7423p8110n3332j6663K6564P0338
36006a243769J09432J40360J61380J71822J71559J61104J42055J17126Q9490O2054
35996H2613L7304J7689N775L807J2862L2110N8609Q8060J16455J41732J64202
35985G61218J85207K04900K20725K27842K21471J99621J64027J18490O6292R452
35975B379245m9608j06252j54094j87624k04626k06629j97412j80744j58785j32238
35965H01233j02228p2346m8738l7896m3828o6458j01542j41362j76083j96027
$$ plain form
35955 -185275 -379812 -549807 -675587 -743886 -748374 -688604 -568797 -397430 -187669 42020
35945 42020 268250 465200 609593 686766 695112 646445 562001 465982 379259 315084 277580
35934 277580 262861 262037 264960 263650 254647 239667 224282 215091 216828 230785 254719 283470 309808
35921 309808 326085 327208 313838 293348 276939 274026 287272 311311 335724 350284 349541 334516
35909 334516 311066 286342 265641 251192 242573 237523 232632 224668 212903 201108 196858 207322
35897 207322 233711 268276 296534 303918 282991 236860 176963 117000 67008 30994 8860 523
35885 523 9152 41603 106325 210303 356466 542203 759308 995546 1237317 1472064 1689239
35874 1689239 1880033 2037144 2155462 2233358 2273693 2283875 2274656 2257682 2242345 2233160 2228670
$$ packed form
35955a85275j94537j69995j25780o8299m488N9770J19807J71367K09761K29689
35945D2020K26230J96950J44393P7173Q346m8667q4444r6019q6723o4175l7504
35934B77580j4719q24K923j310r003j4980j5385r191J737J3957K3934K8751K6338
35921C09808J6277J123j3370k0490j6409k913J3246K4039K4413J4560p43j5025
35909C34516k3450k4724k0701j4449q619n050m891p964j1765j1795m250J0464
35897B07322K6389L4565K8258P384k0927m6131n9897n9963m9992l6014k2134q337
35885E23Q629L2451O4722J03978J46163J85737K17105K36238K41771K34747K17175
35874A689239J90794J57111J18318P7896M0335J0182r219j6974j5337r185m490
$$ plain form
35863 2228670 2221912 2201752 2154668 2067109 1928525 1734498 1488959 1204491 900237 597745
35853 597745 316053 67826 -142169 -316127 -460689 -584085 -694025 -796934 -898133 -1001733
35843 -1001733 -1109285 -1217642 -1317757 -1395953 -1437701 -1432311 -1376390 -1274485 -1136937 -976420
35833 -976420 -804990 -632419 -465335 -306764 -156397 -11971 128957 268025 406094 543336
35823 543336 678529 807809 923669 1014783 1067213 1067606 1008023 890186 726431 536567 342486
35812 342486 163140 11222 -108396 -198562 -267880 -327104 -385067 -445809 -508049 -566799 -615773
35801 -615773 -649220 -662883 -654629 -624963 -576701 -513267 -436507 -345875 -240034 -119912 9147
35790 9147 138024 257193 360606 447211 518974 577141 619818 642463 640321 610706 553859
$$ packed form
35863B228670o758k0160m7084q7559j38584j94027k45539k84468l04254l02492
35853E97745k81692k48227k09995j73958j44562j23396j09940j02909j01199j03600
35843a001733j07552j08357j00115p8196m1748N390N5921J01905J37548J60517
35833i76420J71430J72571J67084J58571J50367J44426J40928J39068J38069J37242
35823E43336J35193J29280J15860R1114N2430L93n9583j17837j63755j89864j94081
35812C42486j79346j51918j19618r0166o9318n9224n7963o0742o2240n8750m8974
35801f15773l3447j3663Q254K9666M8262O3434P6760R0632J05841J20122J29059
35790I147J28877J19169J03413Q6605P1763N8167M2677K2645k142k9615n6847
$$ plain form
35779 553859 472325 369235 246203 102106 -65945 -259379 -474484 -700770 -922623 -1123261
35769 -1123261 -1288743 -1410228 -1484255 -1511846 -1497131 -1445743 -1363407 -1255696 -1129532 -995577
35759 -995577 -869456 -770081 -715147 -715677 -772234 -874559 -1004565 -1140915 -1263081 -1353895 -1401010
35748 -1401010 -1398015 -1345297 -1250108 -1125424 -987814 -855005 -743696 -667725 -636282 -652118 -710344
35737 -710344 -798768 -900209 -996151 -1070394 -1111523 -1113919 -1077798 -1008861 -917601 -817808 -724021
35726 -724021 -648456 -598430 -575097 -573708 -585177 -598573 -603899 -594464 -568307 -528527 -482477 -439801
35714 -439801 -409596 -397727 -405618 -431059 -470175 -519004 -573780 -630381 -683948 -729021 -759656 -769130
35702 -769130 -749787 -693960 -596120 -455431 -277818 -76982 126314 307558 444442 523527
$$ packed form
35779E53859q1534j03090j23032j44097j68051j93434k15105k26286k21853k00638
35769a123261j65482j21485p4027k7591J4715N1388Q2336J07711J26164J33955
35759i95577J26121R9375N4934n30n6557j02325j30006j36350j22166r0814m7115
35748a401010K995N2718R5189J24684J37610J32809J11309P5971L1443j5836n8226
35737g10344q8424j01441r5942p4243m1129k396L6121O8937R1260R9793R3787
35726g24021P5565N0026K3333J389j1469j3396n326R435K6157L9780M6050M2676
35714d39801L0205J1869p891k5441l9116m8829n4776n6601n3567m5073l0635r474
35702g69130J9343N5827R7840J40689J77613K00836K03296J81244J36884P9085
$$ plain form
35692 523527 544245 517830 461647 392113 319856 248618 176724 98973 8199 -102619 -237170
35681 -237170 -392888 -560454 -726353 -876934 -1001958 -1096743 -1162989 -1208049 -1242209 -1274462
35671 -1274462 -1308773 -1342991 -1370747 -1384494 -1377441 -1343941 -1279587 -1182170 -1052971 -896930 -721177
35660 -721177 -532881 -337789 -140003 57283 250705 435987 608288 763907 902559 1028517
35650 1028517 1149079 1270475 1393392 1511138 1612069 1685076 1725137 1736285 1731027 1726595 1739239
35639 1739239 1778802 1846259 1935411 2037000 2141927 2241923 2328906 2395252 2435494 2447954 2434643
35628 2434643 2399315 2345103 2273471 2185045 2081309 1965274 1840139 1706871 1562857 1403175
35618 1403175 1224128 1026998 819641 614632 424808 258894 120036 7871 -78037 -136542
$$ packed form
35692E23527K0718k6415n6183o9534p2257p1238p1894p7751r0774j10818j34551
35681b37170j55718j67566j65899j50581j25024r4785o6246m5060l4160l2253
35671a274462l4311l4218k7756j3747P053L3500O4354R7417J29199J56041J75753
35660g21177J88296J95092J97786J97286J93422J85282J72301J55619J38652J25958
35650A028517J20562J21396J22917J17746J00931P3007M0061J1148n258m432J2644
35639A739239L9563O7457Q9152J01589J04927R9996Q6983O6346M0242J2460j3311
35628B434643l5328n4212p1632q8426j03736j16035j25135j33268j44014j59682
35618A403175j79047j97130k07357k05009j89824j65914j38858j12165q5908n8505
$$ plain form
35608 -136542 -166357 -169221 -152108 -126791 -106807 -103234 -121214 -158931 -209543 -264734 -317423 -362135
35596 -362135 -393731 -406373 -393791 -350393 -272368 -158615 -11605 162163 352547 546736
35586 546736 730083 886796 1001458 1061903 1062239 1003871 893481 739204 547467 322207
35576 322207 66388 -215505 -515364 -820449 -1113641 -1375008 -1584669 -1726418 -1790845 -1776521
35566 -1776521 -1688713 -1536586 -1330782 -1082740 -805373 -513321 -221451 57637 314779 542719
35556 542719 733323 876459 961979 983446 940983 841925 699805 532661 360955 204796
35546 204796 80575 -2045 -41581 -43943 -19730 19401 64171 109887 156712 207727 265547
35535 265547 328970 391059 439311 458027 432677 355209 228195 65757 -109035 -268815 -386959
$$ packed form
35608a36542k9815k864J7113K5317J9984L573j7980l7717n0612n5191n2689m4712
35596c62135l1596j2642J2582M3398P8025J13753J47010J73768J90384J94189
35586E46736J83347J56713J14662O0445L36n8368j10390j54277j91737k25260
35576C22207k55819k81893k99859l05085k93192k61367k09661j41749o4427J4324
35566a776521Q7808J52127K05804K48042K77367K92052K91870K79088K57142K27940
35556E42719J90604J43136Q5520K1467m2463r9058j42120j67144j71706j56159
35546B04796j24221q2620l9536k362K4213L9131M4770M5716M6825N1015N7820
35535B65547O3423O2089M8252J8716k5350p7468j27014j62438j74792j59780j18144
$$ plain form
35524 -386959 -442308 -423034 -328557 -168664 39442 274292 512444 730674 909156 1035314
35514 1035314 1106566 1130269 1120504 1092891 1059504 1026056 992626 957416 921422 891359 879033
35503 879033 897065 952794 1043456 1155535 1268978 1364138 1427867 1456201 1453389 1428616 1392073
35492 1392073 1351680 1311376 1271315 1229500 1183854 1133860 1081321 1030083 984826 949495 926175
35481 926175 914826 913589 919150 927041 932207 930112 918169 896756 869026 839397 811466 786340
35469 786340 761793 732090 688629 621977 525301 397760 245733 80895 -83938 -239030
35459 -239030 -379920 -506712 -621152 -723426 -810630 -877501 -918638 -931061 -916234 -880808 -835321
35448 -835321 -790941 -755670 -732045 -717530 -707201 -697381 -688730 -687629 -705203 -754072 -843903 -977564
$$ packed form
35524c86959n5349J9274R4477J59893K08106K34850K38152K18230J78482J26158
35514A035314P1252K3703r765k7613l3387l3448l3430l5210l5994l0063j2326
35503H79033J8032N5729R0662J12079J13443R5160O3729K8334k812k4773l6543
35492A392073m0393m0304m0061m1815m5646m9994n2539n1238m5257l5331k3320
35481I26175j1349j237N561P891N166k095j1943k1413k7730k9629k7931k5126
35469G86340k4547k9703m3461o6652r6676j27541j52027j64838j64833j55092
35459b39030j40890j26792j14440j02274q7204o6871m1137j2423J4827L5426M5487
35448h35321M4380L5271K3625J4515J0329R820Q651J101j7574m8869q9831j33661
$$ plain form
35436 -977564 -1149747 -1348920 -1561705 -1777308 -1989638 -2196278 -2395267 -2581560 -2744868 -2869842
35426 -2869842 -2938771 -2936064 -2853091 -2691713 -2465251 -2196513 -1913410 -1643304 -1407566 -1217846
35416 -1217846 -1075284 -973130 -901779 -853845 -826722 -821639 -840405 -882162 -941934 -1011327 -1080603
35405 -1080603 -1140925 -1185591 -1209754 -1209076 -1178770 -1114288 -1013518 -878972 -718413 -543789 -369532
35394 -369532 -210939 -82230 6242 50876 55905 31545 -9925 -57871 -105096 -147620 -183470
35383 -183470 -211396 -229799 -235867 -225338 -193611 -138293 -61983 26727 115294 191554 248036 283932
35371 283932 304072 316136 328236 348069 383110 440142 523200 631039 756362 887896 1013990
35360 1013990 1125296 1215421 1280543 1319487 1334304 1330022 1312625 1286092 1250375 1201653 1134621
$$ packed form
35436i77564j72183j99173k12785k15603k12330k06640j98989j86293j63308j24974
35426b869842o8929K707Q2973J61378K26462K68738K83103K70106K35738J89720
35416a217846J42562J02154P1351M7934K7123N083j8766m1757n9772o9393o9276
35405a080603o0322m4666k4163O78L0306O4482J00770J34546J60559J74624J74257
35394c69532J58593J28709Q8472M4634N029k4360m1470m7946m7225m2524l5850
35383a83470k7926j8403o068J0529L1727N5318P6310Q8710Q8567P6260N6482L5896
35371B83932K0140J2064J2100J9833L5041N7032Q3058J07839J25323J31534J26094
35360A013990J11306R0125O5122L8944J4817m282j7397k6533l5717m8722o7032
$$ plain form
35349 1134621 1045322 932875 799383 648778 486120 318095 153758 3674 -123136 -222860
35339 -222860 -298557 -358403 -411354 -462821 -512947 -558254 -595005 -621552 -638116 -644874 -640289 -620799
35327 -620799 -581530 -517326 -423762 -297965 -138881 53081 276383 527870 801461 1086874
35317 1086874 1369368 1630980 1853325 2021569 2128354 2175657 2173070 2133155 2066825 1981661
35307 1981661 1883422 1778276 1673205 1574336 1484972 1404994 1331914 1262829 1196178 1132307 1072463
35296 1072463 1017187 965851 918121 875981 844098 827777 829899 849005 879604 914216 945809
35285 945809 969335 981863 981777 968095 940691 901373 854900 808806 771542 749684 745774 758045
35273 758045 781998 812779 847305 885564 930714 987644 1060113 1147542 1243145 1334791 1408611
$$ packed form
35349A134621q9299j12447j33492j50605j62658j68025j64337j50084j26810r9724
35339b22860p5697n9846n2951n1467n0126m5307l6751k6547j6564o758M585J9490
35327f20799L9269O4204R3564J25797J59084J91962K23302K51487K73591K85413
35317A086874K82494K61612K22345J68244J06785M7303k587l9915o6330q5164
35307A981661r8239j05146j05071r8869q9364p9978p3080o9085o6651o3871n9844
35296A072463n5276n1336m7730m2140l1883j6321K122J9106L0599L4612L1593
35285I45809K3526J2528q6j3682k7404l9318m6473m6094l7264k1858l910J2271
35273G58045K3953L0781L4526L8259M5150N6930P2469Q7429R5603R1646P3820
$$ plain form
35262 1408611 1453777 1465839 1446699 1401480 1334654 1248020 1141264 1013806 866242 700845
35252 700845 521625 334441 146939 -32226 -194968 -335450 -450936 -541317 -607604 -650384
35242 -650384 -669296 -663915 -635374 -587428 -526133 -458526 -391459 -331291 -284056 -255005 -247012 -258591
35230 -258591 -282998 -309247 -324403 -315721 -271939 -184259 -47827 136471 360997 612094 872628
35219 872628 1125476 1356691 1557293 1723397 1855354 1956668 2032862 2089978 2132983 2164927
35209 2164927 2187207 2200320 2204369 2199551 2187307 2171873 2160770 2163015 2185523 2229807 2291162 2360958
35197 2360958 2430723 2495804 2556906 2618972 2687831 2765902 2849069 2926909 2986789 3019657 3023962
35186 3023962 3005280 2971898 2928877 2873959 2797895 2689542 2543140 2363443 2165595 1969953
$$ packed form
35262A408611M5166J2062j9140m5219o6826q6634j06756j27458j47564j65397
35252G00845j79220j87184j87502j79165j62742j40482j15486r0381o6287m2780
35242f50384j8912N381K8541M7946O1295O7607O7067O0168M7235K9051P993j1579
35230b58591k4407k6249j5156Q682M3782Q7680J36432J84298K24526K51097K60534
35219H72628K52848K31215K00602J66104J31957J01314P6194N7116M3005L1944
35209B164927K2280J3113M049m818j2244j5434j1103K245K2508M4284O1355O9796
35197B360958O9765O5081O1102O2066O8859P8071Q3167P7840N9880L2868M305
35186C023962j8682l3382m3021n4918p6064j08353j46402j79697j97848j95642
$$ plain form
35176 1969953 1794925 1651248 1539401 1450166 1367690 1274371 1156415 1008153 833391 643538
35166 643538 453839 279364 131469 15134 -71988 -137809 -191766 -240549 -285671 -323393 -346155
35155 -346155 -344686 -310394 -237565 -124620 25812 207276 409374 617307 812406 974939
35145 974939 1088902 1146849 1152322 1118445 1062909 1001233 941370 882433 818084 742077 652092
35134 652092 549913 439197 323566 206292 90690 -20085 -123955 -220427 -309881 -392055
35124 -392055 -465198 -527101 -577709 -621428 -666953 -724049 -798919 -890880 -992188 -1090999 -1175894
35113 -1175894 -1239874 -1282244 -1307902 -1324713 -1340472 -1360903 -1389374 -1427939 -1478623 -1543886 -1625896
35102 -1625896 -1725073 -1838840 -1961360 -2084458 -2199406 -2298927 -2378587 -2436841 -2473749 -2489371
$$ packed form
35176A969953j75028j43677j11847q9235q2476r3319j17956j48262j74762j89853
35166F43538j89699j74475j47895j16335q7122o5821n3957m8783m5122l7722k2762
35155c46155J469L4292P2829J12945J50432J81464K02098K07933J95099J62533
35145I74939J13963N7947N473l3877n5536o1676n9863n8937o4349p6007q9985
35134F52092j02179j10716j15631j17274j15602j10775j03870r6472q9454q2174
35124c92055p3143o1903n0608m3719m5525n7096p4870r1961j01308r8811q4895
35113a175894o3980m2370k5658j6811j5759k0431k8471l8565n0684o5263q2010
35102a625896r9177j13767j22520j23098j14948r9521p9660n8254l6908j5622
$$ plain form
35092 -2489371 -2483296 -2455637 -2408331 -2345250 -2270962 -2189369 -2103390 -2015584 -1928770 -1845955 -1769653
35081 -1769653 -1701126 -1639951 -1583959 -1529294 -1470429 -1400464 -1312239 -1200195 -1061854 -897807 -710348
35070 -710348 -502230 -276784 -39055 203589 442308 668364 873923 1051537 1193531 1292942
35060 1292942 1346238 1356118 1332208 1288844 1240995 1200445 1174010 1164174 1171051 1194052 1232460 1285524
35048 1285524 1353062 1436606 1539972 1668138 1824524 2008008 2211248 2421169 2621265 2794490
35038 2794490 2925600 3002516 3017116 2965994 2851279 2681029 2468514 2230150 1982637 1740348
35028 1740348 1513734 1308763 1127103 967011 824835 696369 577042 460995 340696
35019 340696 208749 61605 -97255 -257086 -402886 -519749 -596320 -626491 -609920 -551899
$$ packed form
35092b489371O075K7659M7306O3081P4288Q1593Q5979Q7806Q6814Q2815P6302
35081a769653O8527O1175N5992N4665N8865O9965Q8225J12044J38341J64047J87459
35070g10348K08118K25446K37729K42644K38719K26056K05559J77614J41994R9411
35060A292942N3296R880k3910m3364m7849m0550k6435r836O877K3001L8408N3064
35048A285524O7538Q3544J03366J28166J56386J83484K03240K09921K00096J73225
35038B794490J31110P6916J4600n1122j14715j70250k12515k38364k47513k42289
35028A740348k26614k04971j81660j60092j42176j28466j19327j16047j20299
35019C40696j31947j47144j58860j59831j45800j16863p6571l0171J6571N8021
$$ plain form
35009 -551899 -462329 -353701 -239065 -131404 -44279 8236 13904 -34006 -134395 -278929 -454701
34998 -454701 -647043 -841551 -1025572 -1189539 -1327912 -1439185 -1524748 -1586934 -1627010 -1643937
34988 -1643937 -1634435 -1594356 -1520885 -1414646 -1280641 -1127567 -966186 -808039 -665021 -548785
34978 -548785 -468890 -430201 -431680 -467890 -532054 -617936 -718968 -825706 -924355 -998324 -1032513
34967 -1032513 -1018071 -955110 -852201 -723395 -584585 -450790 -334855 -247103 -195260 -184172
34957 -184172 -215141 -284883 -384457 -499074 -609882 -698008 -749557 -759159 -730378 -673153 -599937
34946 -599937 -522185 -448019 -381274 -321935 -267708 -216094 -166140 -119086 -77256 -41135 -5988
34935 -5988 39491 110748 221976 380742 585146 823983 1079018 1328627 1552381 1735589
$$ packed form
35009e51899Q9570J08628J14636J07661Q7125N2515N668m7910j00389j44534j75772
34998d54701j92342j94508j84021j63967j38373j11273q5563o2186m0076j6927
34988a643937R502M0079P3471J06239J34005J53074J61381J58147J43018J16236
34978e48785P9895L8689j479l6210o4164q5882j01032j06738r8649p3969l4189
34967a032513J4442O2961J02909J28806J38810J33795J15935Q7752N1843J1088
34957a84172l0969o9742r9574j14617j10808q8126n1549r602K8781N7225P3216
34946e99937P7752P4166O6745N9339N4227N1614M9954M7054M1830L6121L5147
34935e988M5479P1257J11228J58766K04404K38837K55035K49609K23754J83208
$$ plain form
34925 1735589 1872339 1966124 2028161 2073927 2118464 2171624 2235198 2303372 2365940 2412050 2432685
34914 2432685 2421818 2377063 2300051 2195872 2071340 1932806 1784599 1628464 1463536 1286452
34904 1286452 1091753 872991 624639 344364 35091 -293566 -624874 -936147 -1202045
34895 -1202045 -1399680 -1513936 -1540819 -1487568 -1369953 -1208296 -1023629 -834549 -654836 -491964
34885 -491964 -346987 -216196 -94282 22314 133574 236452 326933 401827 459210 497978
34875 497978 517591 518314 501388 468663 421998 363092 293919 217375 137596 59573 -12107 -75176
34863 -75176 -131445 -187364 -252858 -338921 -454875 -605994 -792068 -1007578 -1243764 -1491624
34853 -1491624 -1744043 -1995843 -2242235 -2476938 -2690914 -2872092 -3006463 -3080789 -3086256 -3021632
$$ packed form
34925A735589J36750R3785O2037M5766M4537N3160O3574O8174O2568M6110K0635
34914B432685j0867m4755p7012j04179j24532j38534j48207j56135j64928j77084
34904A286452j94699k18762k48352k80275l09273l28657l31308l11273k65898
34895a202045j97635j14256k6883N3251J17615J61657J84667J89080J79713J62872
34885d91964J44977J30791J21914J16596J11260J02878R0481P4894N7383L8768
34875D97978J9613P23j6926l2725m6665n8906o9173p6544p9779p8023p1680o3069
34863g5176n6269n5919o5494q6063j15954j51119j86074k15510k36186k47860
34853a491624k52419k51800k46392k34703k13976j81178j34371p4326n467O4624
$$ plain form
34843 -3021632 -2894689 -2721525 -2523883 -2324788 -2143463 -1991280 -1870429 -1775679 -1698176 -1629472
34833 -1629472 -1564115 -1500002 -1437160 -1376740 -1321608 -1278014 -1256301 -1269023 -1326870 -1434335 -1587201
34822 -1587201 -1772741 -1972207 -2164426 -2329296 -2450460 -2517045 -2524634 -2475671 -2379105 -2248730
34812 -2248730 -2099951 -1945922 -1795072 -1651410 -1516905 -1393800 -1285348 -1195232 -1126893 -1083518
34802 -1083518 -1068587 -1086321 -1141090 -1235181 -1365680 -1522584 -1690012 -1850328 -1988946 -2097383
34792 -2097383 -2173382 -2218361 -2233613 -2217352 -2164521 -2069683 -1931177 -1753946 -1549509 -1333502
34782 -1333502 -1122292 -929969 -766191 -634920 -534212 -457527 -396530 -344363 -297823 -257683
34772 -257683 -227810 -214193 -224173 -265289 -343363 -460302 -612561 -790945 -981928 -1170204 -1341614
$$ packed form
34843c021632J26943J73164J97642J99095J81325J52183J20851R4750P7503O8704
34833a629472O5357O4113O2842O0420N5132M3594K1713j2722n7847j07465j52866
34822a587201j85540j99466j92219j64870j21164o6585p589M8963R6566J30375
34812b248730J48779J54029J50850J43662J34505J23105J08452R0116O8339M3375
34802a083518J4931j7734n4769r4091j30499j56904j67428j60316j38618j08437
34792b097383p5999m4979j5252J6261N2831R4838J38506J77231K04437K16007
34782a333502K11210J92323J63778J31271J00708P6685O0997N2167M6540M0140
34772b57683K9873J3617r980m1116p8074j16939j52259j78384j90983j88276j71410
$$ plain form
34761 -1341614 -1485207 -1593735 -1663130 -1692295 -1683912 -1645548 -1589747 -1532511 -1490550 -1478005 -1503086
34750 -1503086 -1565123 -1653074 -1746872 -1822288 -1858282 -1844074 -1782809 -1690290 -1589809 -1505795 -1458600
34739 -1458600 -1461323 -1518605 -1627286 -1778613 -1961031 -2162302 -2370640 -2575704 -2770120 -2950898
34729 -2950898 -3119413 -3279597 -3435358 -3588615 -3738515 -3881716 -4013440 -4128757 -4223249 -4292423
34719 -4292423 -4330422 -4329651 -4282564 -4185111 -4039886 -3857041 -3652422 -3443874 -3247336 -3074081
34709 -3074081 -2929690 -2814664 -2725993 -2658738 -2606850 -2563230 -2519880 -2468969 -2404591 -2323893 -2226621
34698 -2226621 -2113437 -1984379 -1838389 -1673944 -1490333 -1289156 -1075626 -859086 -652309
34689 -652309 -469480 -323199 -221253 -164447 -146819 -158456 -189584 -233818 -289134 -356349 -435996
$$ packed form
34761a341614j43593j08528o9395k9165Q383L8364N5801N7236M1961J2545k5081
34750a503086o2037q7951r3798p5416l5994J4208O1265R2519J00481Q4014M7195
34739a458600k723n7282j08681j51327j82418k01271k08338k05064j94416j80778
34729b950898j68515j60184j55761j53257j49900j43201j31724j15317r4492o9174
34719d292423l7999P71M7087R7453J45225J82845K04619K08548J96538J73255
34709c074081J44391J15026Q8671O7255N1888M3620M3350N0911O4378Q0698R7272
34698b226621J13184J29058J45990J64445J83611K01177K13530K16540K06777
34689f52309J82829J46281J01946N6806J7628j1637l1128m4234n5316o7215p9647
$$ plain form
34678 -435996 -525136 -615857 -696347 -753958 -778699 -766131 -719393 -649808 -574807 -512647 -475778
34667 -475778 -466470 -477197 -495236 -508661 -510941 -502698 -490374 -482457 -485056 -499447 -523344 -554956
34655 -554956 -596615 -655240 -739670 -857057 -1010264 -1196761 -1408818 -1635121 -1863643 -2084485
34645 -2084485 -2290852 -2477569 -2638496 -2764965 -2846396 -2872786 -2838049 -2743167 -2597988 -2420280
34635 -2420280 -2231357 -2049521 -1884621 -1736837 -1600126 -1467643 -1335745 -1204989 -1078781
34626 -1078781 -961153 -854881 -760707 -677920 -605767 -544691 -496736 -465212 -453820 -465215 -499291
34615 -499291 -552354 -618337 -691744 -770325 -855527 -950393 -1056283 -1170215 -1283944 -1384987 -1459187
34604 -1459187 -1494139 -1482550 -1424385 -1326674 -1200712 -1057778 -905485 -746396 -579164 -401184
$$ packed form
34678d35996q9140r0721q0490n7611k4741J2568M6738O9585P5001O2160L6869
34667d75778R308j0727j8039j3425k280Q243J2324P917k599j4391k3897l1612
34655e54956m1659n8625q4430j17387j53207j86497k12057k26303k28522k20842
34645b084485k06367j86717j60927j26469q1431k6390L4737R4882J45179J77708
34635b420280J88923J81836J64900J47784J36711J32483J31898J30756J26208
34626a078781J17628J06272R4174Q2787P2153O1076M7955L1524J1392j1395l4076
34615d99291n3063o5983p3407p8581q5202r4866j05890j13932j13729j01043p4200
34604a459187l4952J1589N8165R7711J25962J42934J52293J59089J67232J77980
$$ plain form
34594 -401184 -211584 -13534 185047 373008 539310 676595 783055 861859 918931 960520
34584 960520 991460 1014112 1027773 1028730 1011547 971733 908871 828472 741318 660560 598215 562633
34572 562633 557360 580931 627287 687110 750199 808112 855824 891882 917610 936321 952849 973067
34560 973067 1002856 1046392 1104081 1170982 1236810 1288135 1312306 1301573 1255816 1183078 1097969
34549 1097969 1018360 961062 937703 952346 1001772 1077803 1169946 1267013 1357780 1431443 1478077
34538 1478077 1488676 1454818 1369044 1226832 1029379 785157 508834 217981 -70822 -344998
34528 -344998 -597254 -824930 -1028048 -1207441 -1364183 -1500129 -1618264 -1721823 -1812529 -1889203
34518 -1889203 -1947572 -1981213 -1983056 -1947020 -1869632 -1751526 -1598539 -1421926 -1237174 -1061219
$$ packed form
34594d01184J89600J98050J98581J87961J66302J37285J06460P8804N7072M1589
34584I60520L0940K2652J3661R57j7183l9814o2862q0399q7154q0758o2345l5582
34572E62633n273K3571M6356N9823O3089N7913M7712L6058K5728J8711J6528K0218
34560I73067K9789M3536N7689O6901O5828N1325K4171j0733m5757p2738q5109
34549A097969p9609n7298k3359J4643M9426P6031R2143R7067R0767P3663M6634
34538A478077J0599l3858q5774j42212j97453k44222k76323k90853k88803k74176
34528c44998k52256k27676k03118j79393j56742j35946j18135j03559r0706p6674
34518a889203n8369l3641j843L6036P7388J18106J52987J76613J84752J75955
$$ plain form
34508 -1061219 -908598 -788013 -701060 -643899 -610678 -596207 -596178 -605496 -617013 -622385 -614639 -590404
34496 -590404 -550103 -496061 -430066 -352120 -261060 -156286 -39167 86978 218431 353223
34486 353223 492275 638144 791484 947402 1094629 1218872 1308731 1360812 1381244 1383213
34476 1383213 1382318 1392271 1422446 1477072 1555115 1650612 1754033 1854754 1943367 2012380 2055395
34465 2055395 2066212 2038879 1968368 1851119 1685441 1472273 1216303 926856 618027 307890
34455 307890 16642 -236396 -436341 -575406 -653263 -675120 -649080 -584492 -491747 -382559
34445 -382559 -269584 -165061 -78917 -16997 19940 35750 36758 28832 15351 -2792 -25447
34434 -25447 -50974 -74770 -89244 -85439 -55906 2249 85482 183924 283528 369668 431269 464056
$$ packed form
34508a061219J52621J20585Q6953N7161L3221J4471K9r318j1517n372P746K4235
34496e90404M0301N4042O5995P7946R1060J04774J17119J26145J31453J34792
34486C53223J39052J45869J53340J55918J47227J24243Q9859N2081K0432J969
34476A383213q95R953L0175N4626P8043R5497J03421J00721Q8613O9013M3015
34465B055395J0817k7333p0511j17249j65678k13168k55970k89447l08829l10137
34455C07890k91248k53038j99945j39065p7857k1857K6040O4588R2745J09188
34445c82559J12975J04523Q6144O1920L6937J5810J008p926j3481j8143k2655
34434b5447k5527k3796j4474L805K9533N8155Q3233R8442R9604Q6140O1601L2787
$$ plain form
34422 464056 471413 462323 447585 436538 435669 448691 476620 517210 564368 608558 638272 641887
34410 641887 609333 533563 411791 245929 41578 -194342 -456159 -740611 -1045646 -1367427
34400 -1367427 -1697646 -2023398 -2330142 -2605863 -2843715 -3041910 -3201763 -3325538 -3414845 -3469305
34390 -3469305 -3485393 -3456111 -3372366 -3226127 -3014265 -2741268 -2419443 -2066476 -1701675 -1342774
34380 -1342774 -1004476 -698582 -434612 -219892 -58938 47186 100723 106145 68956 -4579
34370 -4579 -106699 -227509 -355786 -481113 -595611 -693494 -768555 -811748 -811257 -755472 -637023
34359 -637023 -455304 -216271 69794 390946 735576 1093560 1456602 1817743 2170154 2506001
34349 2506001 2816293 3091853 3324525 3507600 3635456 3703448 3709089 3654392 3547895 3404442
$$ packed form
34422D64056P357r090j4738j1047q69J3022K7929M0590M7158M4190K9714L615
34410F41887l2554p5770j21772j65862k04351k35920k61817k84452l05035l21781
34400a367427l30219l25752l06744k75721k37852j98195j59853j23775q9307n4460
34390c469305j6088K9282Q3745J46239K11862K72997L21825L52967L64801L58901
34380a342774L38298L05894K63970K14720J60954J06124N3537N422l7189p3535
34370d579j02120j20810j28277j25327j14498r7883p5061m3193M91N5785J18449
34359f37023J81719K39033K86065L21152L44630L57984L63042L61141L52411L35847
34349B506001L10292K75560K32672J83075J27856O7992N641n4697j06497j43453
$$ plain form
34339 3404442 3241872 3075823 2915413 2762338 2613917 2468238 2328341 2202946 2103046 2035889
34329 2035889 1999385 1979996 1955588 1902217 1801891 1647929 1445860 1209998 957899 705725
34319 705725 466691 252595 76367 -47079 -103067 -81677 17815 185146 401239 643546
34309 643546 891892 1131836 1354332 1553099 1722383 1856833 1953290 2013105 2043618 2057702
34299 2057702 2070692 2095044 2134916 2183814 2227226 2249067 2238249 2191775 2113446 2010215 1889100
34288 1889100 1756095 1616485 1475254 1337031 1205840 1084968 976896 883189 804459 740583
34278 740583 691030 654909 630418 613867 599046 577793 542012 486356 410302 318811 221659
34267 221659 131952 64131 31523 43673 104146 209636 350844 514854 688132 859042
$$ packed form
34339C404442j62570j66049j60410j53075j48421j45679j39897j25395r9900o7157
34329B035889l6504j9389k4408n3371j00326j53962k02069k35862k52099k52174
34319G05725k39034k14096j76228j23446n5988K1390R9492J67331K16093K42307
34309F43546K48346K39944K22496J98767J69284J34450R6457N9815L0513J4084
34299B057702J2990K4352L9872M8898M3412K1841j0818m6474p8329j03231j21115
34288A889100j33005j39610j41231j38223j31191j20872j08072r3707p8730o3876
34278G40583m9553l6121k4491j6551j4821k1253l5781n5656p6054r1491r7152
34267B21659q9707o7821l2608J2150O0473J05490J41208J64010J73278J70910
$$ plain form
34257 859042 1018962 1161730 1281965 1373482 1428949 1440926 1403398 1312700 1167674 969692
34247 969692 723118 435886 119434 -212315 -544372 -861658 -1149381 -1393446 -1581651 -1705665
34237 -1705665 -1762906 -1757415 -1699459 -1604178 -1489512 -1373411 -1270523 -1189147 -1129638 -1085197 -1044948
34226 -1044948 -998060 -936913 -857803 -759297 -639930 -497243 -329011 -135971 75474 291968
34216 291968 494134 659878 769466 810942 783898 699879 579073 444693 317352 211275
34206 211275 133084 83091 58472 56802 77688 121028 182985 253251 316906 360836 380828 384378
34194 384378 386930 403572 440929 493358 544607 573221 558884 487502 353999 162731 -74093
34183 -74093 -339400 -614896 -884569 -1137142 -1366903 -1572892 -1757009 -1921798 -2068552 -2196339
$$ packed form
34257H59042J59920J42768J20235R1517N5467J1977l7528r0698j45026j97982
34247I69692k46574k87232l16452l31749l32057l17286k87723k44065j88205j24014
34237a705665n7241N491N7956R5281J14666J16101J02888Q1376N9509M4441M0249
34226a044948M6888O1147P9110R8506J19367J42687J68232J93040K11445K16494
34216B91968K02166J65744J09588M1476k7044q4019j20806j34380j27341j06077
34206B11275p8191m9993k4619j670K0886M3340O1957P0266O3655M3930J9992L550
34194C84378K552J6642L7357N2429N1249K8614j4337p1382j33503j91268k36824
34183g4093k65307k75496k69673k52573k29761k05989j84117j64789j46754j27787
$$ plain form
34173 -2196339 -2302280 -2382857 -2435423 -2459214 -2455740 -2428648 -2382580 -2320626 -2241305 -2137538 -1999328
34162 -1999328 -1819138 -1596647 -1340158 -1064386 -786338 -521235 -279749 -67100 116097
34153 116097 271998 403732 514350 606640 683623 749355 809456 870736 939603 1019430 1107761
34142 1107761 1194702 1263936 1296847 1278579 1203570 1078253 919843 751724 597056 472733
34132 472733 385664 332376 301683 279242 252617 215542 170246 126946 100423 104743 148184 230415
34120 230415 342906 472166 604504 730704 849038 965285 1089417 1230234 1390451 1564353
34110 1564353 1738408 1893647 2008435 2061352 2034738 1919029 1716579 1442828 1123649 789848
34100 789848 471136 191599 -32691 -194319 -294074 -339964 -345878 -329689 -310576 -305827 -327873
$$ packed form
34173b196339j05941q0577n2566k3791L474K7092M6068O1954P9321J03767J38210
34162a999328J80190K22491K56489K75772K78048K65103K41486K12649J83197
34153A16097J55901J31734J10618R2290P6983O5732O0101O1280O8867P9827Q8331
34142A107761Q6941O9234L2911j8268p5009j25317j58410j68119j54668j24323
34132D72733q7069n3288l0693k2441k6625l7075m5296m3300k6523M320M3441Q2231
34120B30415J12491J29260J32338J26200J18334J16247J24132J40817J60217J73902
34110A564353J74055J55239J14788N2917k6614j15709k02450k73751l19179l33801
34100G89848l18712k79537k24290j61628r9755m5890n914J6189J9113M749k2046
$$ plain form
34089 -327873 -382080 -465521 -567233 -671062 -761532 -830934 -883961 -936881 -1011424 -1126679 -1293025
34078 -1293025 -1510013 -1767422 -2047413 -2326548 -2577804 -2773217 -2887221 -2900100 -2800878 -2589077
34068 -2589077 -2274989 -1878346 -1425654 -946661 -470371 -21168 384049 736818 1035988
34059 1035988 1285343 1491028 1659324 1794822 1899133 1970609 2005477 2000120 1953579 1869353
34049 1869353 1755923 1625705 1492360 1367112 1255707 1157650 1067848 979195 884607 778406
34039 778406 657664 523482 381335 239808 108142 -6346 -100013 -173337 -230171 -276365
34029 -276365 -318462 -362880 -415565 -481924 -566767 -673998 -806016 -963120 -1143165 -1341414
34019 -1341414 -1550530 -1761010 -1962370 -2144713 -2299969 -2422763 -2511369 -2568546 -2601013 -2616850
$$ packed form
34089c27873n4207q3441j01712j03829r0470o9402n3027n2920p4543j15255j66346
34078a293025k16988k57409k79991k79135k51256j95413j14004j2879R9222K11801
34068b589077L14088L96643M52692M78993M76290M49203M05217L52769K99170
34059A035988K49355K05685J68296J35498J04311P1476L4868n357m6541q4226
34049A869353j13430j30218j33345j25248j11405r8057q9802q8653r4588j06201
34039G78406j20742j34182j42147j41527j31666j14488r3667p3324n6834m6194
34029b76365m2097m4418n2685o6359q4843j07231j32018j57104j80045j98249
34019a341414k09116k10480k01360j82343j55256j22794q8606n7177l2467j5837
$$ plain form
34009 -2616850 -2621973 -2617917 -2602358 -2571989 -2526141 -2469164 -2410133 -2360099 -2328851 -2323269 -2347241 -2401282
33997 -2401282 -2480753 -2573958 -2662548 -2725298 -2744096 -2709700 -2624811 -2502871 -2362721 -2221402 -2088561
33986 -2088561 -1964960 -1845210 -1722700 -1593913 -1460047 -1325616 -1195513 -1072582 -956608
33977 -956608 -844279 -729668 -605694 -466898 -312335 -146455 22921 188122 344373 490513
33967 490513 627811 757727 879772 990855 1086900 1165778 1229190 1281726 1327710 1368268 1400519
33956 1400519 1418704 1415863 1385286 1322233 1226201 1102501 961401 814738 672009 538091
33946 538091 412976 292626 170421 39354 -105330 -264099 -432422 -601117 -757251 -885799
33936 -885799 -972521 -1007563 -988479 -921470 -820537 -704669 -593449 -501931 -436541 -393919 -363518
$$ packed form
34009b616850n123M056J5559L0369M5848N6977N9031N0034L1248N582k3972n4041
33997b401282p9471r3205q8590o2750j8798L4396Q4889J21940J40150J41319J32841
33986b088561J23601J19750J22510J28787J33866J34431J30103J22931J15974
33977i56608J12329J14611J23974J38796J54563J65880J69376J65201J56251J46140
33967D90513J37298J29916J22045J11083R6045P8878O3412N2536M5984M0558L2251
33956A400519J8185k841l0577o3053r6032j23700j41100j46663j42729j33918
33946E38091j25115j20350j22205j31067j44684j58769j68323j68695j56134j28548
33936h85799q6722l5042J9084O7009J00933J15868J11220R1518O5390M2622L0401
$$ plain form
33925 -363518 -332691 -291617 -235760 -165388 -83384 7128 104586 210068 327338 461439 615965
33914 615965 790017 976092 1159814 1321819 1441677 1503152 1499168 1434355 1323691 1187680
33904 1187680 1046425 915336 803780 715950 652252 610152 584780 570066 560493 552365 543423
33893 543423 530877 509474 471291 407391 309897 173121 -6152 -228101 -488363 -776523
33883 -776523 -1076257 -1367987 -1633036 -1857181 -2032150 -2155426 -2229599 -2261806 -2262500 -2242965 -2212315
33872 -2212315 -2175598 -2133834 -2085288 -2026645 -1953574 -1861284 -1745768 -1605257 -1440472 -1252981
33862 -1252981 -1043124 -809983 -554115 -280684 281 277265 541694 790069 1022561
33853 1022561 1239539 1438631 1614215 1759649 1870978 1950077 2005440 2050029 2096983 2155122
$$ packed form
33925c63518L0827M1074N5857P0372Q2004R0512R7458J05482J17270J34101J54526
33914F15965J74052J86075J83722J62005J19858O1475l984o4813j10664j36011
33904A187680j41255j31089j11556q7830o3698m2100k5372j4714r573q128q942
33893E43423j2546k1403l8183o3900r7494j36776j79273k21949k60262k88160
33883g76523k99734k91730k65049k24145j74969j23276p4173l2207o94J9535L0650
33872b212315L6717M1764M8546N8643P3071R2290J15516J40511J64785J87491
33862a252981K09857K33141K55868K73431K80965K76984K64429K48375K32492
33853A022561K16978J99092J75584J45434J11329P9099N5363M4589M6954N8139
$$ plain form
33843 2155122 2226342 2306166 2387066 2462711 2530824 2592862 2650337 2699653 2728842 2718999 2650311
33832 2650311 2509565 2295284 2018448 1699170 1361167 1026197 710292 422577 166200
33823 166200 -59702 -257867 -431031 -580742 -707046 -808742 -883737 -929658 -945266 -932272
33813 -932272 -895921 -843239 -779993 -708832 -629880 -542639 -447203 -344054 -233382 -115043 10752
33802 10752 142657 277713 410931 534752 638901 711698 743386 730678 680382 609870 543238
33791 543238 504080 507542 555043 634000 722631 797635 841474 846626 815785 758818 688385 616216
33779 616216 551156 498999 463445 447248 452631 480438 528468 590428 656646 716163 758528 774217
33767 774217 754383 691603 582207 429025 242662 40319 -157423 -330720 -464427 -551130
$$ packed form
33843B155122P1220P9824Q0900P5645O8113O2038N7475M9316K9189r843o8688
33832B650311j40746k14281k76836l19278l38003l34970l15905k87715k56377
33823A66200k25902j98165j73164j49711j26304j01696p4995m5921j5608J2994
33813i32272L6351N2682O3246P1161P8952Q7241R5436J03149J10672J18339J25795
33802A0752J31905J35056J33218J23821J04149P2797L1688j2708n0296p0512o6632
33791E43238l9158L462M7501P8957Q8631P5004M3839N152l0841n6967p0433p2169
33779F16216o5060n2157l5554j6197N383K7807M8030O1960O6218N9517M2365J5689
33767G74217j9834o2780j09396j53182j86363k02343j97742j73297j33707q6703
$$ plain form
33757 -551130 -592424 -597754 -580920 -555529 -531246 -512092 -496823 -480657 -457593 -422796 -374451 -314450
33745 -314450 -247501 -178935 -112137 -46921 20298 94699 180746 280717 394680 521542 660089
33734 660089 809003 965641 1124614 1277588 1414719 1526592 1605409 1645459 1644040 1603234
33724 1603234 1531327 1442158 1351956 1274974 1220024 1189564 1181444 1191737 1216238 1249472 1282431
33713 1282431 1301726 1291721 1238791 1135323 981725 786060 561707 323635 84405 -148308
33703 -148308 -371231 -582421 -777957 -950792 -1092317 -1195098 -1254662 -1269284 -1238258 -1160183
33693 -1160183 -1032687 -854103 -626180 -356201 -57242 253493 557320 836677 1077319
33684 1077319 1270223 1413108 1510803 1573572 1613482 1640213 1658323 1667155 1662977 1641679 1600234
$$ packed form
33757e51130m1294n330J6834K5391K4283J9154J5269J6166K3064L4797M8345O0001
33745c14450O6949O8566O6798O5216O7219P4401Q6047R9971J13963J26862J38547
33734F60089J48914J56638J58973J52974J37131J11873P8817M0050j419m0806
33724A603234p1907q9169r0202p6982n4950l0460q120J0293K4501L3234L2959
33713A282431J9295j0005n2930j03468j53598j95665k24353k38072k39230k32713
33703a48308k22923k11190j95536j72835j41525j02781n9564j4622L1026P8075
33693a160183J27496J78584K27923K69979K98959L10735L03827K79357K40642
33684A077319J92904J42885R7695O2769L9910K6731J8110Q832m178k1298m1445
$$ plain form
33673 1600234 1536416 1447922 1332662 1190709 1026543 849678 673031 509912 370981 262110
33663 262110 183663 131390 98603 78886 68458 67490 79773 110737 164851 243776 345835 466333
33651 466333 598417 734740 869638 1000188 1124569 1238506 1332618 1393175 1406178 1362548
33641 1362548 1261822 1112888 931780 737683 548577 377767 232212 113151 18636 -53510
33631 -53510 -104010 -132224 -137167 -118392 -76376 -12524 71234 173120 291770 425428 570341
33620 570341 719735 864579 995946 1107524 1196791 1264601 1313972 1348850 1372909 1388209 1394055
33609 1394055 1386867 1361405 1312899 1239240 1142462 1028797 906940 785180 668993 560284
33599 560284 457951 358799 258548 153468 42414 -72140 -185106 -291205 -387170 -472718
$$ packed form
33673A600234o3818q8494j15260j41953j64166j76865j76647j63119j38931j08871
33663B62110p8447n2273l2787j9717j0428r68J2283L0964N4114P8925J02059J20498
33651D66333J32084J36323J34898J30550J24381J13937R4112O0557J3003m3630
33641A362548j00726j48934j81108j94097j89106j70810j45555j19061r4515p2146
33631e3510n0500k8214m943J8775M2016O3852Q3758J01886J18650J33658J44913
33620E70341J49394J44844J31367J11578Q9267O7810M9371L4878K4059J5300N846
33609A394055p188k5462m8506p3659r6778j13665j21857j21760j16187j08709
33599E60284j02333r9152j00251j05080j11054j14554j12966j06099r5965q5548
$$ plain form
33589 -472718 -550373 -624516 -699825 -779373 -862908 -945642 -1017661 -1064477 -1069656 -1019551 -908275
33578 -908275 -740074 -527736 -288131 -37377 212431 454270 685266 904578 1111156 1302392
33568 1302392 1473954 1620358 1735557 1813418 1848403 1836640 1776711 1669249 1515459 1316166
33558 1316166 1073051 791666 483605 165467 -145188 -434302 -693570 -919573 -1110755
33549 -1110755 -1264307 -1375135 -1437910 -1450890 -1418549 -1350821 -1259465 -1154275 -1041606 -925689
33539 -925689 -811345 -706116 -620531 -566394 -553920 -588803 -670117 -789796 -934233 -1087820
33529 -1087820 -1237159 -1374153 -1496921 -1608656 -1715294 -1822871 -1935483 -2054718 -2180948
33520 -2180948 -2315654 -2463174 -2630512 -2825031 -3050932 -3305832 -3578912 -3851822 -4102730
$$ packed form
33589d72718p7655p4143p5309p9548q3535q2734p2019m6816n179N0105J11276
33578i08275J68201K12338K39605K50754K49808K41839K30996K19312K06578J91236
33568A302392J71562J46404J15199P7861L4985j1763n9929j07462j53790j99293
33558A316166k43115k81385l08061l18138l10655k89114k59268k26003j91182
33549a110755j53552j10828o2775j2980L2341O7728R1356J05190J12669J15917
33539i25689J14344J05229Q5585N4137J2474l4883q1314j19679j44437j53587
33529a087820j49339j36994j22768j11735j06638j07577j12612j19235j26230
33520b180948j34706j47520j67338j94519k25901k54900k73080k72910k50908
$$ plain form
33511 -4102730 -4312327 -4469352 -4573235 -4632811 -4661741 -4672309 -4669859 -4650128 -4600946 -4507791 -4360677
33500 -4360677 -4159299 -3914494 -3645668 -3375180 -3121686 -2895350 -2697390 -2523969 -2371493
33491 -2371493 -2239774 -2131699 -2051011 -2000528 -1981632 -1994114 -2035391 -2099252 -2175403 -2250901 -2313316
33480 -2313316 -2354064 -2370019 -2362626 -2335538 -2292685 -2237957 -2176113 -2113577 -2058143 -2017556 -1997521
33469 -1997521 -1999748 -2020533 -2050520 -2076282 -2083648 -2061602 -2004900 -1914216 -1794225 -1651144 -1491089
33458 -1491089 -1319640 -1142304 -965341 -796232 -643030 -512477 -407980 -329080 -273033 -237564
33448 -237564 -223068 -232952 -271835 -342398 -442722 -565999 -702976 -845277 -987262 -1125810
33438 -1125810 -1259387 -1387641 -1511225 -1630842 -1745540 -1851520 -1942523 -2011621 -2053258 -2064350
$$ packed form
33511d102730k09597j57025j03883n9576k8930j0568K450J9731M9182R3155J47114
33500d360677K01378K44805K68826K70488K53494K26336J97960J73421J52476
33491b371493J31719J08075Q0688N0483J8896j2482m1277o3861p6151p5498o2415
33480b313316m0748j5955P393K7088M2853N4728O1844O2536N5434M0587K0035
33469a997521k227k0785k9987k5762p366K2046N6702R0684J19991J43081J60055
33458a491089J71449J77336J76963J69109J53202J30553J04497P8900N6047L5469
33448b37564J4496r884l8883p0563j00324j23277j36977j42301j41985j38548
33438a125810j33577j28254j23584j19617j14698j05980r1003o9098m1637j1092
$$ plain form
33428 -2064350 -2043998 -1992387 -1910105 -1798602 -1661244 -1503696 -1333254 -1158031 -986763 -828605
33418 -828605 -691685 -580624 -494975 -430422 -382418 -349997 -337367 -352405 -402928 -492846 -620303
33407 -620303 -778743 -959994 -1157385 -1367224 -1588241 -1819519 -2057891 -2295918 -2521598 -2720317
33397 -2720317 -2878300 -2985705 -3037649 -3032978 -2972198 -2856501 -2688677 -2474989 -2226231 -1956825
33387 -1956825 -1682215 -1415866 -1167337 -942236 -743853 -575252 -440284 -342638 -283393 -258584
$$ packed form
33428b064350K0352N1611Q2282J11503J37358J57548J70442J75223J71268J58158
33418h28605J36920J11061Q5649O4553M8004L2421J2630j5038n0523q9918j27457
33407f20303j58440j81251j97391k09839k21017k31278k38372k38027k25680j98719
33397b720317j57983j07405n1944M671O0780J15697J67824K13688K48758K69406
33387a956825K74610K66349K48529K25101J98383J68601J34968R7646N9245K4809
$$ [...]
##END NTUPLES=NMR SPECTRUM
##END=
