##TITLE=31Pdec_AEDB-3
 CDCl3
 24 sc
 28.5.2024
##JCAMPDX= 6.0         $$ Bruker NMR JCAMP-DX V2.0
##DATA TYPE= NMR SPECTRUM
##DATA CLASS= NTUPLES
##ORIGIN= UXNMR, Bruker Analytische Messtechnik GmbH
##OWNER= root
$$ XWIN-NMR		Version 3.5
$$ Tue May 28 13:59:50 2024 Russian Standard Time (UT+4h)  she@DPX200
##.OBSERVE FREQUENCY= 81.013821
##.OBSERVE NUCLEUS= ^31P
##.ACQUISITION MODE= SIMULTANEOUS
##.ACQUISITION SCHEME= undefined
##.AVERAGES= 24
##.DIGITISER RES= 16
##SPECTROMETER/DATA SYSTEM= spect
##.PULSE SEQUENCE= zgpg30
##.SOLVENT NAME= CDCl3
##.SHIFT REFERENCE= (INTERNAL, CDCl3, 0, 248.564)
##AUDIT TRAIL= $$ (NUMBER, WHEN, WHO, WHERE, WHAT)
$$ ##TITLE= Audit trail, XWIN-NMR		Version 3.5
$$ ##JCAMPDX= 5.01
$$ ##ORIGIN= Bruker BioSpin GmbH
$$ ##OWNER= she
$$ F:/spectra/data/she/nmr/P31/1/pdata/1/auditp.txt
$$ ##AUDIT TRAIL=  $$ (NUMBER, WHEN, WHO, WHERE, WHAT)
(   1,<2024-05-28 13:58:54.15 +0400>,<she>,<DPX200>,
      <created by zg, POWCHK disabled, PULCHK disabled
       configuration hash MD5:
       00 E9 B6 7A A2 85 ED C7 34 08 36 98 17 FE 4E 26
       data hash MD5: 32K
       D7 CA 6A 3A 7C C5 ED FD 17 FA 4F 17 C9 BD 2E B5>)
(   2,<2024-05-28 13:59:02.32 +0400>,<she>,<DPX200>,
      <Start of raw data processing
       ef BC_mod = 2 LB = 10 FT_mod = 6 PKNL = 1 SI = 64K 
       data hash MD5: 64K
       41 AC 34 CF 83 C1 77 4E C0 B9 83 74 B6 EE 23 BE>)
(   3,<2024-05-28 13:59:16.42 +0400>,<she>,<DPX200>,
      <pk PHC0 = -172.1879 PHC1 = 0 
       data hash MD5: 64K
       58 9E 3C 07 1E 1A 3C 6B FB FD 39 15 07 A5 3E 73>)
(   4,<2024-05-28 13:59:19.28 +0400>,<she>,<DPX200>,
      <abs ABSG = 5 
       data hash MD5: 64K
       00 52 C9 B3 F5 93 43 42 6A DC 40 C3 58 9E 92 15>)
$$ ##END=
$$ 
$$ hash MD5
$$ 91 AE 6E 6B 0D 40 84 B2 0B 1E FB 4A 27 D3 A6 0B
##$RELAX= 
##$RELAX= 
##$RELAX= 
##$RELAX= 
##$RELAX= 
##$RELAX= 
##$RELAX= 
##$RELAX= 
##$RELAX= 
$$ Bruker specific parameters
$$ --------------------------
##$DU= <F:/spectra>
##$EXPNO= 1
##$NAME= <P31>
##$PROCNO= 1
##$TYPE= <nmr>
##$USER= <she>
##$AMP= (0..31)
100 100 100 100 100 100 100 100 100 100 100 100 100 100 100 100 100 100 
100 100 100 100 100 100 100 100 100 100 100 100 100 100 
##$AQSEQ= 0
##$AQ_mod= 1
##$AUNM= <au_zg>
##$AUTOPOS= <>
##$BF1= 81.014009
##$BF2= 200.13
##$BF3= 200.13
##$BF4= 200.13
##$BF5= 200.13
##$BF6= 200.13
##$BF7= 200.13
##$BF8= 200.13
##$BYTORDA= 1
##$CFDGTYP= 0
##$CFRGTYP= 5
##$CHEMSTR= <none>
##$CNST= (0..31)
1 1 145 1 1 1 1 1 1 1 1 1 1 1 1 1 1 1 1 1 1 1 1 1 1 1 1 1 1 1 1 1 
##$CPDPRG= <waltz16>
##$CPDPRG1= <>
##$CPDPRG2= <waltz16>
##$CPDPRG3= <>
##$CPDPRG4= <mlev>
##$CPDPRG5= <mlev>
##$CPDPRG6= <mlev>
##$CPDPRG7= <mlev>
##$CPDPRG8= <mlev>
##$CPDPRGB= <>
##$CPDPRGT= <>
##$D= (0..31)
0 1 0 0 0 0 0 0 0 0 0 0.03 2e-05 3e-06 0 0 0 0 0 0 0 0 0 0 0 0 0 0 0 0 
0 0 
##$DATE= 1716890333
##$DBL= (0..7)
120 120 120 11 120 120 24 19 
##$DBP= (0..7)
150 150 150 150 150 150 150 150 
##$DBP07= 0
##$DBPNAM0= <>
##$DBPNAM1= <>
##$DBPNAM2= <>
##$DBPNAM3= <>
##$DBPNAM4= <>
$$ [...]
##$SUBNAM3= <"">
##$SUBNAM4= <"">
##$SUBNAM5= <"">
##$SUBNAM6= <"">
##$SUBNAM7= <"">
##$SUBNAM8= <"">
##$SUBNAM9= <"">
##$SW= 501.771253377433
##$SWIBOX= (0..15)
0 1 3 0 0 0 0 0 0 0 0 0 0 0 0 0 
##$SW_h= 40650.406504065
##$TD= 32768
##$TD0= 1
##$TE= 0
##$TE2= 300
##$TE3= 300
##$TEG= 300
##$TL= (0..7)
0 120 53 12 22 120 120 120 
##$TP= (0..7)
150 150 150 150 150 150 150 150 
##$TP07= 0
##$TPNAME0= <>
##$TPNAME1= <>
##$TPNAME2= <>
##$TPNAME3= <>
##$TPNAME4= <>
##$TPNAME5= <>
##$TPNAME6= <>
##$TPNAME7= <>
##$TPOAL= (0..7)
0.5 0.5 0.5 0.5 0.5 0.5 0.5 0.5 
##$TPOFFS= (0..7)
0 0 0 0 0 0 0 0 
##$TUNHIN= 0
##$TUNHOUT= 0
##$TUNXOUT= 0
##$USERA1= <user>
##$USERA2= <user>
##$USERA3= <user>
##$USERA4= <user>
##$USERA5= <user>
##$V9= 5
##$VALIST= <valist>
##$VCLIST= <CCCCCCCCCCCCCCC>
##$VD= 0
##$VDLIST= <DDDDDDDDDDDDDDD>
##$VPLIST= <PPPPPPPPPPPPPPP>
##$VTLIST= <TTTTTTTTTTTTTTT>
##$WBST= 1024
##$WBSW= 4
##$XGAIN= (0..3)
0 0 0 0 
##$XL= 0
##$YL= 0
##$YMAX_a= 3042
##$YMIN_a= -3032
##$ZGOPTNS= <>
##$ZL1= 120
##$ZL2= 120
##$ZL3= 120
##$ZL4= 120
##$ABSF1= 248.5645
##$ABSF2= -253.2056
##$ABSG= 5
##$ABSL= 3
##$ALPHA= 0
##$AQORDER= 0
##$ASSFAC= 0
##$ASSFACI= 0
##$ASSFACX= 0
##$ASSWID= 0
##$AUNMP= <proc_1d>
##$AZFE= 0.1
##$AZFW= 0.5
##$BCFW= 0
##$BC_mod= 2
##$BYTORDP= 0
##$COROFFS= 0
##$CY= -3
##$DATMOD= 1
##$DC= 0
##$DFILT= <>
##$DTYPP= 0
##$F1P= 0
##$F2P= 0
##$FCOR= 1
##$FTSIZE= 65536
##$FT_mod= 6
##$GAMMA= 0
##$GB= 0
##$INTBC= 1
##$INTSCL= 6.047779e-11
##$ISEN= 30
##$LB= 10
##$LEV0= 0
##$LPBIN= 0
##$MAXI= 10000
##$MC2= 0
##$MEAN= 0
##$ME_mod= 0
##$MI= 50
##$NCOEF= 0
##$NC_proc= -8
##$NLEV= 6
##$NOISF1= 182.463
##$NOISF2= 159.3651
##$NSP= 0
##$NTH_PI= 0
##$NZP= 0
##$OFFSET= 248.5645
##$PC= 4
##$PHC0= -172.1879
##$PHC1= 0
##$PH_mod= 1
##$PKNL= yes
##$PPARMOD= 0
##$PSCAL= 0
##$PSIGN= 0
##$REVERSE= no
##$SF= 81.0140089999694
##$SI= 65536
##$SIGF1= 159.3651
##$SIGF2= -187.1042
##$SINO= 113.3802
##$SIOLD= 16384
##$SREGLST= <1H.CDCl3>
##$SSB= 0
##$STSI= 65536
##$STSR= 0
##$SW_p= 40650.406504065
##$SYMM= 0
##$S_DEV= 0
##$TDeff= 32768
##$TDoff= 0
##$TI= <>
##$TILT= no
##$TM1= 0
##$TM2= 0
##$TOPLEV= 0
##$USERP1= <user>
##$USERP2= <user>
##$USERP3= <user>
##$USERP4= <user>
##$USERP5= <user>
##$WDW= 1
##$XDIM= 65536
##$YMAX_p= 459793756
##$YMIN_p= -35183066
$$ End of Bruker specific parameters
$$ ---------------------------------
##NTUPLES= NMR SPECTRUM
##VAR_NAME=  FREQUENCY,     SPECTRUM/REAL,   SPECTRUM/IMAG
##SYMBOL=    X,             R,               I
##VAR_TYPE=  INDEPENDENT,   DEPENDENT,       DEPENDENT
##VAR_FORM=  AFFN,          ASDF,            ASDF
##VAR_DIM=   65536,         65536,           65536
##UNITS=     HZ,            ARBITRARY UNITS, ARBITRARY UNITS
##FACTOR=    0.620285442955139, 1,           1
##FIRST=     20137.2065510682, 0,            0
##LAST=      -20513.1999529968, 0,           0
##MIN=       -20513.1999529968, -35183066,   0
##MAX=       20137.2065510682, 459793756,    0
$$ Real data points
##PAGE= N=1
##DATA TABLE= (X++(R..R)), XYDATA
$$ [...]
39258A075477J34975R0439M5070K620l4663o5840r1010j11228j28019j42257j53358
39247F22206j59809j60702j56626j49028j38862j26175j11061r4822p9919o8501
39237f23299o0627n3709m3852k8480q275J3048L1077M3235M9788N3192N6865O4085
39225e06952P6817R4480J13537J28681J35282J31666J19883J04571R0484Q0012
39215E68461P2057O2944M8452K5681o086m5378q8822j31581j67790j91222j96568
39204d9852j81339j47614j02055n3518r706K5014M9413O3809O8676O4192N0521
39193b22459K8216j341l5548p0377j00694j21168j27441j17146r0540n0423j221
39182i10142N2518J07203J59955K07352K44523K65788K66488K44610K01268J40248
$$ y = [1075477, 1210452, 1300891, 1345961, 1348581, 1313918, 1248078, 1157068, 1045840, 917821, 775564, 622206, 462397, 301695, 145069, -3959, -142821, -268996, -380057, -474879, -554798, -623299, -683926, -737635, -781487, -809967, -818242, -805194, -774117, -730882, -681094, -627902, -571037, -506952, -430135, -335655, -222118, -93437, 41845, 173511, 293394, 397965, 488449, 568461, 640518, 703462, 751914, 777595, 771509, 726131, 637309, 505728, 337938, 146716, -49852, -231191, -378805, -480860, -534378, -544084, -519070, -469657, -405848, -337172, -272980, -222459, -194243, -195584, -231132, -301509, -402203, -523371, -650812, -767958, -858498, -908921, -910142, -857624, -750421, -590466, -383114, -138591, 127197, 393685, 638295, 839563, 979811]
39172I79811O7362j0148q4600j49501k01440k40825k70451k92304l04729l02536
39162h09361k80394k37057j77056j08619l9884K3463P7784J19828J46306J55544
39152a129446J49688J35200J20727J13469J16263J26897J39694J48268J48029
39143F8789J37449J17794R1770O2035L0419j944l4126o5320r5125j23573j50477
39132C7691j74614j93738k05622k09253k05093j94458j78894j60196j40345j20601
39122a745123j00186p6011m4407l860M3336R1710J34902J67969J88550J96699
39112a146421J93958J82347J63750J39607J10620P6500L6337j0011o0037j07516
39102d20866j43453j58842j48121j11729n6474O547O5501J10967J37215J41965
$$ y = [979811, 1047173, 1037025, 952425, 802924, 601484, 360659, 90208, -202096, -506825, -809361, -1089755, -1326812, -1503868, -1612487, -1652371, -1628908, -1551124, -1431296, -1284990, -1129446, -979758, -844558, -723831, -610362, -494099, -367202, -227508, -79240, 68789, 206238, 324032, 415802, 477837, 508256, 506312, 472186, 406866, 311741, 188168, 37691, -136923, -330661, -536283, -745536, -950629, -1145087, -1323981, -1484177, -1624522, -1745123, -1845309, -1921320, -1965727, -1969587, -1926251, -1834541, -1699639, -1531670, -1343120, -1146421, -952463, -770116, -606366, -466759, -356139, -279639, -243302, -253313, -313350, -420866, -564319, -723161, -871282, -983011, -1039485, -1032938, -967437, -856470, -719255, -577290]
39092e77290J25870R2514M8282J182m1328p4083r4548j02106r7445q2655o1537
39081h63144l9165k0477q425k638M55N787J6894L3844N3204O9935P9674P9846
39069e94210O9432M8290J6982k2675o6820j09274j42501j59870j58071j38054
39059a256771j03992o1402j5960K6891O2545Q8293J03640J09240J05427R2110
39049h49979P0091M2091J2192j5823l9606n8025p0158p4475o8943n2111k4663
39038a129409R629M4550P3646R2765J01367J02021R8767R5520R4935R7582J01593
39027b17034J03485J00321R1927Q1232P2264O7614O7350O9755P2574P3915P2884
39016F56287P0379O9448P4320Q8001J09977J35730J58708J73383J77237J70714
$$ y = [-577290, -451420, -358906, -310624, -309442, -350770, -424853, -519401, -621507, -718952, -801607, -863144, -902309, -922786, -931211, -933849, -933394, -927607, -910713, -876869, -823665, -753730, -674056, -594210, -524778, -476488, -459506, -482181, -549001, -658275, -800776, -960646, -1118717, -1256771, -1360763, -1422165, -1438125, -1411234, -1348689, -1260396, -1156756, -1047516, -942089, -849979, -779888, -737797, -725605, -741428, -781034, -839059, -909217, -983692, -1052635, -1104746, -1129409, -1119780, -1075230, -1001584, -908819, -807452, -705431, -606664, -511144, -416209, -318627, -217034, -113549, -13228, 78699, 159931, 232195, 299809, 367159, 436914, 509488, 583403, 656287, 726666, 796114, 870434, 958435, 1068412, 1204142, 1362850, 1536233, 1713470, 1884184]
39006A884184J55963J35884J13500R0861O7429L9518J985m8778j12682j85664
38996B142200k60694l29182l82922m16349m28074m20453l97554l63138l19890
38987a176056k69647k13796j53415q9341k2471M5591J11865J71902K20840K55389
38977a119139K75360K83374K82813K75761K62637K43637K20614J97891J81403
38968A104351J76492J85177K04104K24553K35271K27237J97828J51832R8933M9636
38958B855414J2149q910j2552r49K1655N0472Q1170J09527J30506J38454J28975
38947C505911J01151N8322P008m5227r1880j28826j54457j68954j73617j70871
38937B738560j64248j57206j50994j43343j29569j05513p0232k6754J9076O0622
$$ y = [1884184, 2040147, 2176031, 2289531, 2380392, 2447821, 2487339, 2489324, 2440546, 2327864, 2142200, 1881506, 1552324, 1169402, 753053, 324979, -95474, -493028, -856166, -1176056, -1445703, -1659499, -1812914, -1902255, -1924726, -1879135, -1767270, -1595368, -1374528, -1119139, -843779, -560405, -277592, -1831, 260806, 504443, 725057, 922948, 1104351, 1280843, 1466020, 1670124, 1894677, 2129948, 2357185, 2555013, 2706845, 2805778, 2855414, 2867563, 2858653, 2846101, 2845152, 2866807, 2917279, 2998449, 3107976, 3238482, 3376936, 3505911, 3607062, 3665384, 3672392, 3627165, 3535285, 3406459, 3252002, 3083048, 2909431, 2738560, 2574312, 2417106, 2266112, 2122769, 1993200, 1887687, 1817455, 1790701, 1809777, 1870399]
38927A870399R2427J11705J18992J17834J13518J11380J15248J26339J42702J59427
38917C079971J69884J67873J49940J16818P3170K5652j9793n9816r3617j21378
38907C488704j43021j58487j68851j76543j83887j91189j95918j93531j79292
38898A897985j50202j06295n1112Q613O3775J04524J22944J15837Q5764L9435
38888B131268j5058o9987j18551j55622j79149j90629j93372j89637j79071j59723
38878F80469j30694r4391n7031k7083j2430j7567m1749p8567j17271j46166j56963
38867a99443j47724j22377q7427m8520q832L0774P0977J13159J58471K06738K55355
38856B21151K98702L28950L38958L26114K94507K53517K13665J82591J63093J53410
$$ y = [1870399, 1962826, 2074531, 2193523, 2311357, 2424875, 2536255, 2651503, 2777842, 2920544, 3079971, 3249855, 3417728, 3567668, 3684486, 3757656, 3783308, 3763515, 3703699, 3610082, 3488704, 3345683, 3187196, 3018345, 2841802, 2657915, 2466726, 2270808, 2077277, 1897985, 1747783, 1641488, 1590376, 1598989, 1662764, 1767288, 1890232, 2006069, 2091833, 2131268, 2116210, 2046223, 1927672, 1772050, 1592901, 1402272, 1208900, 1019263, 840192, 680469, 549775, 455384, 398353, 371270, 358840, 341273, 299524, 220957, 103686, -42480, -199443, -347167, -469544, -556971, -605491, -614323, -583549, -512572, -399413, -240942, -34204, 221151, 519853, 848803, 1187761, 1513875, 1808382, 2061899, 2275564, 2458155, 2621248, 2774658]
38846B774658J48993J45062J39073J31685J25529J22628J22286J20738J12398
38837C943050R1792N5465L472n9758j25787j84164k25519k44341k40075k16353
38827B797782j79230j35242q9831m6584p693K4848M8540O1010O1283N0449L1025
38816B616357N607k4398n9202r9623j44830j90221k27648k48692k49030k30557
38806A147763j99666j63264j25723q8793n3739k3502l131J681j2931m6644r3801
38795C38250j44360j86948k12662k17620k02931j72690j31843q5361l8649K139
38785a052675L1039M4338M2418L0055J5012N610Q188K5192N4370Q9460J22251
38774e84742J45229J53657J46536J26386R8135O7418L8539J2976j0617l4703o0499
$$ y = [2774658, 2923651, 3068713, 3207786, 3339471, 3465000, 3587628, 3709914, 3830652, 3943050, 4034842, 4090307, 4093779, 4034021, 3908234, 3724070, 3498551, 3254210, 3014135, 2797782, 2618552, 2483310, 2393479, 2346895, 2339202, 2364050, 2412590, 2473600, 2534883, 2585332, 2616357, 2621964, 2597566, 2538364, 2438741, 2293911, 2103690, 1876042, 1627350, 1378320, 1147763, 948097, 784833, 659110, 570317, 516578, 493076, 489945, 491626, 478695, 432051, 338250, 193890, 6942, -205720, -423340, -626271, -798961, -930804, -1016165, -1054814, -1052675, -1021636, -977298, -934880, -904825, -889813, -884203, -876015, -850823, -796453, -706993, -584742, -439513, -285856, -139320, -12934, 85201, 152619, 191158, 204134, 193517, 158814, 98315]
38763I8315q6696j09954j26414j33105j28813j14566r3454o9463m5642k2831M1
38752h32582K4160M8686O9941Q2983Q4917P7347O5625N5283M8981M6684M8231
38741a79744N5149O9801R2943J22025J51430J74263J84516J78820J57307J23601
38731A130111Q4071M6435J7757K334M48Q768K2239L6467M9332O1031P2742Q4845
38719A616580R5945J03182J03491R5116P8709N7529L6251J8740O160l180j2210
38708B196313k3167l7002n4148p5377j01426j31508j61952j86466j98358j93738
38698A033171j73825j44811j15220r2314p9633p6686q0165q5338q7047q0619o3106
38687d5593l4484K036M1022P6633J04055J19938J22281J10593Q6425N3359J5750
$$ y = [98315, 11619, -98335, -224749, -357854, -486667, -601233, -694687, -764150, -809792, -832623, -832582, -808422, -759736, -689795, -606812, -521895, -444548, -378923, -323640, -274659, -227975, -179744, -124595, -54794, 38149, 160174, 311604, 485867, 670383, 849203, 1006510, 1130111, 1214182, 1260617, 1278374, 1280708, 1281156, 1289924, 1312163, 1348630, 1397962, 1458993, 1531735, 1616580, 1712525, 1815707, 1919198, 2014314, 2093023, 2150552, 2186803, 2205543, 2211703, 2208523, 2196313, 2173146, 2136144, 2081996, 2006619, 1905193, 1773685, 1611733, 1425267, 1226909, 1033171, 859346, 714535, 599315, 507001, 427368, 350682, 270517, 185179, 98132, 17513, -45593, -80077, -78041, -37019, 39614, 143669, 263607, 385888, 496481, 582906, 636265, 652015]
38676F52015k2829n9974r3655j21811j43220j58587j69957j78627j83698j82758
38666f63101j73842j56563j31645j00029o2969k3108J5087M6693O8924Q2797R2211
38655a005545J01101J11014J21099J30058J37970J46099J55109J63632J68750
38646B29287J67907J60441J47305J29587J07356P9857M6605Q453l2063p1001j03784
38635H69950j26300j36240j34245j24221j12342j04870j05772j15260j29921j44142
38625c63363j52229j50346j37622j15919q8475n8355k7796J434K7350M7576N9796
38614i57949O2317N4334L5960Q211k6954o6608j06935j43470j71632j87568j88909
38603a689203j74970j46560j06121n8258r689L2288O2101P7182P7601O5172M3204
$$ y = [652015, 629186, 569212, 475557, 353746, 210526, 51939, -118018, -296645, -480343, -663101, -836943, -993506, -1125151, -1225180, -1288149, -1311257, -1296170, -1249477, -1180553, -1097756, -1005545, -904444, -793430, -672331, -542273, -404303, -258204, -103095, 60537, 229287, 397194, 557635, 704940, 834527, 941883, 1021740, 1068345, 1076798, 1044735, 973734, 869950, 743650, 607410, 473165, 348944, 236602, 131732, 25960, -89300, -219221, -363363, -515592, -665938, -803560, -919479, -1007954, -1066309, -1094105, -1092671, -1065321, -1017745, -957949, -895632, -841298, -805338, -797127, -824081, -890689, -997624, -1141094, -1312726, -1500294, -1689203, -1864173, -2010733, -2116854, -2175112, -2184801, -2152513, -2090412, -2013230, -1935629, -1870457, -1827253]
38592a827253J6449r804l1199m5080n0228m6584l5844k2115j1332r142j8306l6983
38580b127421n8857p5479q0159p1388n3566l4462k1072j6497j9254k4618k6552
38569b609325j9106K818M2579J00374J71888K48314L18464L72064M02572M08457
38559e60901L93017L63221L27752K94233K66556K43765K21462J95011J62514J25589
38549B032219Q7541N0392J2852k9116p9255j37360j97494k49645k84012k95282
38539I10840k84315k56431k17889j73158j24733p5047k8299R825L4368M3384L8684
38528a22771K5126R388j599k744P116K4581M2998N4961N4784M0474J4742j5746
38516A31310m3121o1688o9869o9918o6140o2836o2568o5377o9182p1003o8043
$$ y = [-1827253, -1810804, -1820608, -1851807, -1896887, -1947115, -1993699, -2029543, -2051658, -2062990, -2072132, -2090438, -2127421, -2186278, -2261757, -2341916, -2413304, -2466870, -2501332, -2522404, -2538901, -2558155, -2582773, -2609325, -2628431, -2625613, -2583034, -2482660, -2310772, -2062458, -1743994, -1371930, -969358, -560901, -167884, 195337, 523089, 817322, 1083878, 1327643, 1549105, 1744116, 1906630, 2032219, 2119760, 2170152, 2183004, 2153888, 2074633, 1937273, 1739779, 1490134, 1206122, 910840, 626525, 370094, 152205, -20953, -145686, -220733, -249032, -239207, -204839, -161455, -122771, -97645, -88257, -89856, -92600, -85484, -60903, -17905, 37056, 91840, 132314, 147056, 131310, 88189, 26501, -43368, -113286, -179426, -242262, -304830, -370207, -439389, -510392, -578435]
38505e78435n8186m0553j6293J1073L6558N5543O5258O5200N6539M1122K0773
38494c41401k753k7342n0465o9639q2656q7082p9894n8514k2890K3330P3749J21512
38482f04045J61110J88834K02268J99703J80333J45223R8282M6004m293m6622
38472E66797p7524r6129j03637j02636r6287q7635p9427p4334p4899q2670r6957
38461d05338j14238j29156j37087j36792j31195j25462j23843j27571j34913j42466
38451a708061j46382j43023j29265j02723o2238q958N2452J13773J65611K01273
38441a767541K19687K25290K25057K24746K26438K28403K26717K17363J97505
38432B23665J65651J21601O7140P185n0212r6060j23625j30377j17661q9289n0703
$$ y = [-578435, -636621, -677174, -693467, -682394, -645836, -590293, -525035, -459835, -403296, -362174, -341401, -344154, -371496, -421961, -491600, -574256, -661338, -741232, -799746, -822636, -799306, -725557, -604045, -442935, -254101, -51833, 147870, 328203, 473426, 571708, 617712, 613419, 566797, 489273, 393144, 289507, 186871, 90584, 2949, -76478, -150812, -225711, -308381, -405338, -519576, -648732, -785819, -922611, -1053806, -1179268, -1303111, -1430682, -1565595, -1708061, -1854443, -1997466, -2126731, -2229454, -2291692, -2300650, -2248198, -2134425, -1968814, -1767541, -1547854, -1322564, -1097507, -872761, -646323, -417920, -191203, 26160, 223665, 389316, 510917, 578057, 585242, 535030, 438970, 315345, 184968, 67307, -21982, -72685]
38421g2685q614K9813N8371P2690P0274N0635J6181k7347p2454j12975j46137
38410a42248j71905j90615k01271k01770j90295j66618j32729r2808n2518j7439
38400a560216R074K7467M1695N6739P5308R5937J13786J23553J22523J12042R6842
38389f85250Q2853P4684P4061Q0116R1066J05776J23633J43002J60138J70014
38379D20093J68587J54665J30355J00283P0235M5475K9139K1582K1176K5851L4152
38368A221593M5306N8807P3807Q8413R9050J00798Q9044O1853K1643k4862o8770
38357A766682j02391j22103j28792j25827j16514j03168q7686p2011n7473m4030
38347H06687l0712j7231n219K119J985n707j7319k6877k9329k3721j4171p920
$$ y = [-72685, -81299, -51486, 6885, 79575, 149849, 200484, 216665, 189318, 116864, 3889, -142248, -314153, -504768, -706039, -907809, -1098104, -1264722, -1397451, -1490259, -1542777, -1560216, -1551142, -1523675, -1481980, -1425241, -1349933, -1253996, -1140210, -1016657, -894134, -782092, -685250, -602397, -527713, -453652, -373536, -282470, -176694, -53061, 89941, 250079, 420093, 588680, 743345, 873700, 973983, 1044218, 1089693, 1118832, 1140414, 1161590, 1187441, 1221593, 1266899, 1325706, 1399513, 1487926, 1586976, 1687774, 1776818, 1838671, 1860314, 1835452, 1766682, 1664291, 1542188, 1413396, 1287569, 1171055, 1067887, 980201, 908190, 850717, 806687, 775975, 758744, 753525, 755644, 757629, 751922, 734603, 707726, 678397, 654676, 640505, 632585]
38335F32585j1544k7493n2950q1601j07079j25906j38270j46821j54648j63451
38325c77178j72441j78377j77014j65365j43577j15282q6446o3254m9640m5471
38315a574045m6481m6593m1426l0787j8452r513p160j0888j7150k1980k3756k4285
38303a872516k7326l5588m8311o1211o8654o6368n2726k8180O016M8307R6291
38292b110266J46037J92209K29152K52469K60362K54076K37162K13993J88542
38283a36264J64009J42849J26257J13120R9583Q0271N0797R856m0273r4814j48128
38272C67263j95118k32192k57670k71612k75242k70513k59837k45651k29551k11599
38262b081722j90575j65138j34637r8842n7204q925M5853J04919J64021K18100
$$ y = [632585, 621041, 593548, 540598, 458997, 351918, 226012, 87742, -59079, -213727, -377178, -549619, -727996, -905010, -1070375, -1213952, -1329234, -1415680, -1478934, -1528574, -1574045, -1620526, -1667119, -1708545, -1739332, -1757784, -1767297, -1774457, -1785345, -1802495, -1824475, -1848231, -1872516, -1899842, -1935430, -1983741, -2044952, -2113606, -2179974, -2232700, -2260880, -2254864, -2206557, -2110266, -1964229, -1772020, -1542868, -1290399, -1030037, -775961, -538799, -324806, -136264, 27745, 170594, 296851, 409971, 509554, 589825, 640622, 650478, 610205, 515391, 367263, 172145, -60047, -317717, -589329, -864571, -1135084, -1394921, -1640572, -1870123, -2081722, -2272297, -2437435, -2572072, -2670914, -2728118, -2737043, -2691190, -2586271, -2422250, -2204150]
38252b204150K62684K94818L13596L20490L18876L12306L02160K86541K61710
38243D69031K25230J78408J26167P4696K8753r701m1307o8232r3079j18148j44961
38232F26857j73798k03135k29334k47134k51132k37444k04791j54748r1806k3452
38222a189917M0443Q9816J17657J22468J08236Q2175N1957K4101L751n052K24
38211e54141J9411M8618Q0697J07396J21933J20506J02395O9428K5604k3303p0573
38200D7971j09756j35948j46691j42202j24734r7253o2260k1478K3667P1543J20447
38189e76694J69302K18043K66815L13918L54100L79300L82289L60777L18683K63580
38179B450113K02479J39101P4197Q054n6772j14526j58017j82176j87153j78656
$$ y = [-2204150, -1941466, -1646648, -1333052, -1012562, -693686, -381380, -79220, 207321, 469031, 694261, 872669, 998836, 1073532, 1102285, 1092584, 1051277, 983045, 889966, 771818, 626857, 453059, 249924, 20590, -226544, -477676, -715120, -919911, -1074659, -1166465, -1189917, -1149474, -1059658, -942001, -819533, -711297, -629122, -577165, -553064, -549313, -554365, -554141, -534730, -486112, -405415, -298019, -176086, -55580, 46815, 116243, 141847, 118544, 47971, -61785, -197733, -344424, -486626, -611360, -708613, -770873, -792351, -768684, -697141, -576694, -407392, -189349, 77466, 391384, 745484, 1124784, 1507073, 1867850, 2186533, 2450113, 2652592, 2791693, 2865890, 2873944, 2817172, 2702646, 2544629, 2362453, 2175300, 1996644]
38169A996644j65211j53944j47611j44503j41002j34696j25769j16100j07465
38160G60343j00515r4897q9759q4042p6752o7282n5441m1125k4391o283J0343
38149A30199K1438K3863J7158L200j5773l8534o4136r0049j11503j23033j21260
38138c68430j06744q3962n9634m0529l1594l4794m8662o8543q7749r9591r9701
38127a129933q7526o6397m2344k2475j3214j8621l8966p0207j04756j33290j46902
38116a874631j38998j06690n1660J9796R7645J69837K24407K51775K46954K11189
38106i50376J51996Q1105J0965m8626r2641j21174j38031j47792j52671j51124
38096a558369j39234j13630p3580k0995M0797J08060J76776K42459L00296L45703
$$ y = [1996644, 1831433, 1677489, 1529878, 1385375, 1244373, 1109677, 983908, 867808, 760343, 659828, 564931, 475172, 391130, 314378, 247096, 191655, 150530, 126139, 119856, 130199, 151637, 175500, 192658, 195858, 180085, 141551, 77415, -12634, -124137, -247170, -368430, -475174, -559136, -618770, -659299, -690893, -725687, -774349, -842892, -930641, -1030232, -1129933, -1217459, -1283856, -1326200, -1348675, -1361889, -1380510, -1419476, -1489683, -1594439, -1727729, -1874631, -2013629, -2120319, -2171979, -2152183, -2054538, -1884701, -1660294, -1408519, -1161565, -950376, -798380, -717275, -706310, -754936, -847577, -968751, -1106782, -1254574, -1407245, -1558369, -1697603, -1811233, -1884813, -1905808, -1865011, -1756951, -1580175, -1337716, -1037420, -691717]
38086f91717L74864L84902L73909L41290K88225K17813J34649M4456m5892j28437
38076A294062j95128k39671k59149k54618k30489j93242j49853j06616o8516l9024
38066d42244j9873j1183j2431k3809m6454q0738j23949j69434k08325k32853k39233
38055a610526k28362k03954j69666j27503p8666k5447K8091P7317J18630J49836
38045b070250J69259J74984J65163J39372J00238N4164J0373k1719l5687l0298
38035a344401r739J8061M4163O1402O6426O0342M7673L3866K2558J4032N755n709
38023i85571k2950m7097p7738j12350j45435j68901j74801j59348j25358q1265
38013b100814l7399j912K1807L5878M6846O3021R0850J32027J82766K35347K80725
$$ y = [-691717, -316853, 68049, 441958, 783248, 1071473, 1289286, 1423935, 1468391, 1422499, 1294062, 1098934, 859263, 600114, 345496, 115007, -78235, -228088, -334704, -403220, -442244, -462117, -473300, -485731, -509540, -555994, -636732, -760681, -930115, -1138440, -1371293, -1610526, -1838888, -2042842, -2212508, -2340011, -2418677, -2444124, -2416033, -2338716, -2220086, -2070250, -1900991, -1726007, -1560844, -1421472, -1321234, -1267070, -1256697, -1278416, -1314103, -1344401, -1354140, -1336079, -1291916, -1230514, -1164088, -1103746, -1056073, -1022207, -999649, -985617, -979862, -985571, -1008521, -1055618, -1133356, -1245706, -1391141, -1560042, -1734843, -1894191, -2019549, -2100814, -2138213, -2140125, -2118318, -2082440, -2035594, -1972573, -1881723, -1749696, -1566930, -1331583, -1050858]
38002a050858L11115L21949L12647K85933K46122J97690J45236R4446N2575K7175
37992I44030K3123L9690O9824J02784J28685J42008J41993J30599J10362Q3859
37982A916957N4385K6293M062r427j4338j3960j3226j6296k4403l5026m2938m2650
37970A789433l1074r048J9095M7554P1231Q6890R3183R0431Q0782O8388N8820
37959B365685N7716O9355R5783J36520J88413K45612L00066L42983L67228L69698
37949D539059L52161L19724K77877K30226J78415J23744O8564J6256l0097o9159
37939F006770j01815j30196j55802j77951j93885k00649j97505j87197j75076
37930D486694j66597j64847j69500j77546j84987j88479j86456j79465j69488
$$ y = [-1050858, -739743, -417794, -105147, 180786, 426908, 624598, 769834, 864280, 916855, 944030, 967153, 1006843, 1076667, 1179451, 1308136, 1450144, 1592137, 1722736, 1833098, 1916957, 1971342, 1997635, 2001697, 1992270, 1977932, 1963972, 1950746, 1934450, 1910047, 1875021, 1832083, 1789433, 1758359, 1749311, 1768406, 1815960, 1887191, 1974081, 2067264, 2157695, 2238477, 2306865, 2365685, 2423401, 2492756, 2588539, 2725059, 2913472, 3159084, 3459150, 3802133, 4169361, 4539059, 4891220, 5210944, 5488821, 5719047, 5897462, 6021206, 6089770, 6106026, 6075929, 6006770, 5904955, 5774759, 5618957, 5441006, 5247121, 5046472, 4848967, 4661770, 4486694, 4320097, 4155250, 3985750, 3808204, 3623217, 3434738, 3248282, 3068817, 2899329]
37921B899329j58493j47144j34758j20475j04556q8938p6842p1526p4387q3236
37911A838974r2272r4495q5301o4953l8426j3173L793Q175l34j7918l7619n1497
37899A354954n3534m1981j9819P093L2881N3695O8026P5636P6370O9914N6734
37888A679969L9291K1942Q858J278l741j1958k9042n7961r7762j43750j88864
37877A218260k25894k49970k60107k58949k50807k39032k24264k04333j76018
37868h71114j37839r2334m6122p117J9411L3201L8074L8828L8553L7952L6284
37857i12223L2548K6289J7925Q712L70n589q439q506p048n723n753p086q046n895
37843h88464J939J6596L7268O1604Q6732J10275J31014J49004J65008J79399J91148
$$ y = [2899329, 2740836, 2593692, 2458934, 2338459, 2233903, 2144965, 2068123, 1996597, 1922210, 1838974, 1746702, 1652207, 1566906, 1501953, 1463527, 1450354, 1454147, 1462322, 1461988, 1444070, 1406451, 1354954, 1301420, 1259439, 1239620, 1246713, 1279594, 1333289, 1401315, 1476951, 1553321, 1623235, 1679969, 1719260, 1741202, 1750060, 1751338, 1747597, 1735639, 1706597, 1648636, 1550874, 1407124, 1218260, 992366, 742396, 482289, 223340, -27467, -266499, -490763, -695096, -871114, -1008953, -1101287, -1147409, -1154526, -1135115, -1101914, -1063840, -1025012, -986459, -948507, -912223, -879675, -853386, -835461, -826749, -826379, -831968, -840407, -848913, -855961, -861684, -867437, -874523, -882569, -888464, -886525, -869929, -832661, -771057, -684325, -574050, -443036, -294032, -129024, 50375, 241523]
37832B41523J97759J96520J86277J68456J46274J22592R7973P0616L8241K62m1389
37821A425104q2953j19940j48039j63956j66307j55974j35631j09143q1396n8154
37811B03611m4919m4968n7758p8969j02211j21279j31988j32780j24312j08587
37801g44160q8437o7366m9173l6973l1942l2686l5793l7248l3829k3647o007J8660
37789a168601M8284P8706J04235J19417J21005J09198Q7738O2960M1804K9369
37779c65885K7048L2478M1249M9244N4277N6284N6455N6097N6097N6977N9054
37768A79375O2064O4609O3911N6278L8122P382l4977q4289j33281j74766k04101
37757a59673k19700k21441k08836j80673j36570p9057j4585M7625R8430J31685
$$ y = [241523, 439282, 635802, 822079, 990535, 1136809, 1259401, 1357374, 1427990, 1466231, 1466493, 1425104, 1342151, 1222211, 1074172, 910216, 743909, 587935, 452304, 343161, 261765, 203611, 158692, 113724, 55966, -23003, -125214, -246493, -378481, -511261, -635573, -744160, -832597, -899963, -949136, -986109, -1018051, -1050737, -1086530, -1123778, -1157607, -1181254, -1187261, -1168601, -1120317, -1041611, -937376, -817959, -696954, -587756, -500018, -437058, -395254, -365885, -338837, -306359, -265110, -215866, -161589, -105305, -48850, 7247, 63344, 120321, 179375, 241439, 306048, 369959, 426237, 464359, 471741, 436764, 352475, 219194, 44428, -159673, -379373, -600814, -809650, -990323, -1126893, -1205950, -1220535, -1172910, -1074480, -942795]
37747i42795J45482J41282J21970R0481M9484J760m9432r9982j44597j76965j91206
37736a054518j84408j58817j21789q3204n1722l2163k5166k8627l9624n5751p5624
37725a911413r8631j24040j49870j72380j86914j89883j80545j61421j37328j13930
37715c426355r6410q8265r0024r8747j08991j15092j13201j01905q1713n4506
37705d375209k3325Q087L6390N9762P8087R2425J04510J16672J31523J51211J76722
37694c443145K07824K43286K80827L16934L47177L67006L72611L61636L34198
37685f11646K93845K47509K03750J70183J51395J48146J57779J75555J96509K16937
37675A349962K34755K48761K57795K60251K53965K36247K04324J56170R1526J2830
$$ y = [-942795, -797313, -656031, -534061, -443580, -394096, -392336, -441768, -541750, -686347, -863312, -1054518, -1238926, -1397743, -1519532, -1602736, -1654458, -1686621, -1711787, -1740414, -1780038, -1835789, -1911413, -2010044, -2134084, -2283954, -2456334, -2643248, -2833131, -3013676, -3175097, -3312425, -3426355, -3522765, -3611030, -3701054, -3799801, -3908792, -4023884, -4137085, -4238990, -4320703, -4375209, -4398534, -4390447, -4354057, -4294295, -4216208, -4123783, -4019273, -3902601, -3771078, -3619867, -3443145, -3235321, -2992035, -2711208, -2394274, -2047097, -1680091, -1307480, -945844, -611646, -317801, -70292, 133458, 303641, 455036, 603182, 760961, 936516, 1133025, 1349962, 1584717, 1833478, 2091273, 2351524, 2605489, 2841736, 3046060, 3202230, 3293756, 3306586]
37665C306586p4017j59772k33793k87662l18407l28635l23525l07106k81021k46208
37655G46440k05398j63740j27027r9254q1500p2560p0047p1200p3700p6801q1708
37644c76495r0061j01447j12381j18132j15487j04044q5385o1867l6130j1078
37634a212507J0512K6661L6732M1584M3152M3238M1920L7110K6260R300r614k3076
37622i28728k3452o254K7693P1997J16599J51137J68184J64885J42656J05764
37612i519N9792J0656l5778p3724r7685j03298q8516n4557o257M8317R8962J35375
37600a16232J49668J38513J03871N2109p904o6933j17143j53376j73905j80261
37590c71593j76088j65334j50931j34542j17001r8632p9268n8472l6135j3047
$$ y = [3306586, 3232569, 3072797, 2839004, 2551342, 2232935, 1904300, 1580775, 1273669, 992648, 746440, 541042, 377302, 250275, 151021, 69521, -3039, -73086, -144286, -217986, -294787, -376495, -466556, -568003, -680384, -798516, -914003, -1018047, -1103432, -1165299, -1201429, -1212507, -1201995, -1175334, -1138602, -1097018, -1053866, -1010628, -968708, -931598, -905338, -896038, -905652, -928728, -952180, -958434, -930741, -858744, -742145, -591008, -422824, -257939, -115283, -9519, 50273, 60929, 25151, -48573, -146258, -249556, -338072, -392629, -398886, -350569, -251607, -116232, 33436, 171949, 275820, 327929, 320025, 253092, 135949, -17427, -191332, -371593, -547681, -713015, -863946, -998488, -1115489, -1214121, -1293389, -1351861, -1387996, -1401043]
37580a401043R167K8756M4811N8018P0660Q5578J04547J27071J50363J70443J83650
37569c67979J88122J84506J75653J65378J57193J53660J56271J65323J79545J95704
37559A353376K08557K11609J99126J68987J24659P4686K9485k727j8976k2387
37549B326395k0774k3571l8091o6525j05006j45164j77602j95758j98282j89020
37539A166602j74977j63404j59072j62678j71228j80446j87544j92209j95204
37530d20160j96214j92882j81590j59320j25511q2930l6885O751M3451P0782Q8363
37519a186145R7721J01861J04146J06689J09472J10812J08617J01454Q8974P1554
37509a84845M9707K3753n829l7847p0350j01260j29153j53796j76364j99055k24000
$$ y = [-1401043, -1391876, -1363120, -1318309, -1260291, -1189631, -1104053, -999506, -872435, -722072, -551629, -367979, -179857, 4649, 180302, 345680, 502873, 656533, 812804, 978127, 1157672, 1353376, 1561933, 1773542, 1972668, 2141655, 2266314, 2341000, 2370485, 2367758, 2348782, 2326395, 2305621, 2282050, 2243959, 2177434, 2072428, 1927264, 1749662, 1553904, 1355622, 1166602, 991625, 828221, 669149, 506471, 335243, 154797, -32747, -224956, -420160, -616374, -809256, -990846, -1150166, -1275677, -1358607, -1395492, -1388741, -1345290, -1274508, -1186145, -1088424, -986563, -882417, -775728, -666256, -555444, -446827, -345373, -256399, -184845, -135138, -111385, -117214, -155061, -225411, -326671, -455824, -609620, -785984, -985039, -1209039]
37498a209039k51885k81333l09416l32461l46303l46267l27854k88140k27180
37489c919878j48646n9488L1383J15388J86714K43359K86156L16705L35943L44033
37479b268331L40793L25875K98825K59541K09004J49591Q4932J9752m0005q7533
37469g07556j16483j22620j04581o3595k993P1731J52907K31549K99040L48726
37459a3875L76831L82630L68011L36501K92013K38079J77969J15336N4526J15
37449B328136m3920p4909r1815r5328q7763p2582n3343l2551j1317R810K9419
37438A803837M4686N2412N0882M1043K5985R132p552k4159m1907o1560q2492j03012
37426A707295j21310j35871j44945j46035j36513j15376q4635m9045j4042J6713
$$ y = [-1209039, -1460924, -1742257, -2051673, -2384134, -2730437, -3076704, -3404558, -3692698, -3919878, -4068524, -4128012, -4096629, -3981241, -3794527, -3551168, -3265012, -2948307, -2612364, -2268331, -1927538, -1601663, -1302838, -1043297, -834293, -684702, -599770, -580018, -620023, -707556, -824039, -946659, -1051240, -1114835, -1117828, -1046097, -893190, -661641, -362601, -13875, 362956, 745586, 1113597, 1450098, 1742111, 1980190, 2158159, 2273495, 2328021, 2328136, 2284216, 2209307, 2117492, 2022164, 1934401, 1861819, 1808476, 1775925, 1764608, 1774418, 1803837, 1848523, 1900935, 1951817, 1992860, 2018845, 2027977, 2020425, 1996266, 1954359, 1892799, 1810307, 1707295, 1585985, 1450114, 1305169, 1159134, 1022621, 907245, 822610, 773565, 759523, 776236]
37416G76236M2361O3968Q2758R9133J12947J24006J31946J35872J34868J29178
37406A833273J20725J11981J04092R5900Q4587O7451M3723J5454j3308l8892o0382
37395B364604q0020j01093j24802j48473j66324j72274j62953j39233j05537o7771
37385A096124l1318k8K4032M0604N1173N8531O5879P5612Q8020J00447J07758
37374A676834J04517Q7877N9357K4289j0369l8389n5499n9414m9292k5265J1499
37363A726145N8152J09314J56804J90722K02040J85820J43329Q1778J1865n5413
37353B810556j11158j49734j69152j71063j60115j42474j23820j07801r5604q6509
37343A493126p8766p0169n8442m1647j8814R463M0771P1162R6055J11621J16154
$$ y = [776236, 818597, 882565, 965323, 1064456, 1177403, 1301409, 1433355, 1569227, 1704095, 1833273, 1953998, 2065979, 2170071, 2265971, 2350558, 2418009, 2461732, 2477186, 2463878, 2424986, 2364604, 2284584, 2183491, 2058689, 1910216, 1743892, 1571618, 1408665, 1269432, 1163895, 1096124, 1064806, 1064778, 1088810, 1129414, 1180587, 1239118, 1304997, 1380609, 1468629, 1569076, 1676834, 1781351, 1869228, 1928585, 1952874, 1942505, 1904116, 1848617, 1789203, 1739911, 1714646, 1726145, 1784297, 1893611, 2050415, 2241137, 2443177, 2628997, 2772326, 2854104, 2865969, 2810556, 2699398, 2549664, 2380512, 2209449, 2049334, 1906860, 1783040, 1675239, 1579635, 1493126, 1414360, 1344191, 1285749, 1244102, 1225288, 1234751, 1275522, 1346684, 1442739, 1554360, 1670514]
37332A670514J10665R8315Q3109O8695N7615N0887M7827M6488M4880M2179L8867
37321B360041L5661L2449K8452K3679K0225K1958L2440N2649Q0204J10444J38091
37310B936293J58398J67838J64918J50804J29039J04386Q1614O4641N5483N2977
37300D066391N2597M8242L5021J0884k3749o7202j16958j69210k18555k58923
37290C358538k85639k97337k96273k86555k71660k53017k30510k04046j74694
37281A058807j44641j16177r0856o9705n4211m6606m8398n8189p1140q1096q3625
37270A94163p7646o4934m8665l1873j6016o9J8664M1694O6393Q5777R1905Q0588
37258C39981N3841J8664j6348m3918n9259n9891m5237j6353K4288P3172J26189
$$ y = [1670514, 1781179, 1879494, 1962603, 2031298, 2088913, 2139800, 2187627, 2234115, 2278995, 2321174, 2360041, 2395702, 2428151, 2456603, 2480282, 2500507, 2522465, 2554905, 2607554, 2687758, 2798202, 2936293, 3094691, 3262529, 3427447, 3578251, 3707290, 3811676, 3893290, 3957931, 4013414, 4066391, 4118988, 4167230, 4202251, 4213135, 4189386, 4122184, 4005226, 3836016, 3617461, 3358538, 3072899, 2775562, 2479289, 2192734, 1921074, 1668057, 1437547, 1233501, 1058807, 914166, 797989, 707133, 637428, 583217, 536611, 488213, 430024, 358884, 277788, 194163, 116517, 51583, 2918, -28955, -44971, -45040, -26376, 15318, 81711, 167488, 259393, 339981, 393822, 412486, 396138, 352220, 292961, 233070, 187833, 171480, 195768, 268940, 395129]
37247C95129J78821K26076K62609K83829K87806K76635K55650K30599K04712J77441
37237B779307J45404J04831N4351l195o1241j12315j51481j78164j95495k07982
37227B174020k18952k28878k35248k34009k21694j97051j61624j19649p7618m3251
37217D36046k3666k3034m0800p1468j06308j36362j55350j61166j55570j42861
37207e80539j28422j17655j15053j23216j41931j67809j94937k16443k26342k21121
37197b233468k00838j69424j33516r9749p1806m9400k9951j1447N968K0646L1170
37186b941815L7401M0232M0862M0525M0671M2939M8482N7176O7343P6106Q0264
37175b369814P7435O7254N1799L4642J9003O547k292p163p271k067P725J9939
$$ y = [395129, 573950, 800026, 1062635, 1346464, 1634270, 1910905, 2166555, 2397154, 2601866, 2779307, 2924711, 3029542, 3083893, 3080698, 3019457, 2907142, 2755661, 2577497, 2382002, 2174020, 1955068, 1726190, 1490942, 1256933, 1035239, 838188, 676564, 556915, 479297, 436046, 412380, 389346, 348546, 277078, 170770, 34408, -120942, -282108, -437678, -580539, -708961, -826616, -941669, -1064885, -1206816, -1374625, -1569562, -1786005, -2012347, -2233468, -2434306, -2603730, -2737246, -2836995, -2908801, -2958201, -2988152, -2999599, -2993631, -2972985, -2941815, -2904414, -2864182, -2823320, -2782795, -2742124, -2699185, -2650703, -2593527, -2526184, -2450078, -2369814, -2292379, -2225125, -2173326, -2138684, -2119681, -2113134, -2115426, -2122589, -2129860, -2131927, -2124202, -2104263]
37163b104263L1965M2110M9916N5229N7111N4203M6641L7628L2615L6023M7950
37152a612872O3658P6379Q1477P8885P2528O7676O8254P5281Q6482R6785R9736
37141g45731Q9446O2242J7352m3119j14274j88545k56436l08303l36863l39232
37131b163463l17387k76676k23359j62832r9279l6122K3887P8977J28483J72431
37121b875340K11020K44411K72723K95792L12814L22303L22848L14356K98854
37112b80219K79657K59045K36061K06373J64856J09313M3021k5569q5770j28480
37102G78288j48828j46841j26826r6282o4204l8335k2228j4159q740M5J6461M1992
37090A70343P4800J09405J37444J50411J43552J18341Q1404M0456K70l8287p5966
$$ y = [-2104263, -2072298, -2030188, -1980272, -1925043, -1867932, -1813729, -1767088, -1729460, -1696845, -1660822, -1612872, -1549214, -1472835, -1391358, -1312473, -1239945, -1172269, -1104015, -1028734, -942252, -845467, -745731, -656285, -594043, -576691, -619810, -734084, -922629, -1179065, -1487368, -1824231, -2163463, -2480850, -2757526, -2980885, -3143717, -3242996, -3279118, -3255231, -3176254, -3047771, -2875340, -2664320, -2419909, -2147186, -1851394, -1538580, -1216277, -893429, -579073, -280219, -562, 258483, 494544, 700917, 865773, 975086, 1018107, 992538, 906768, 778288, 629460, 482619, 355793, 259511, 195307, 156972, 134744, 120585, 111845, 111890, 128351, 170343, 245143, 354548, 491992, 642403, 785955, 904296, 985700, 1026156, 1026426, 988139, 912173]
37079I12173j12204j44320j69280j86053j96283k02773k07084k08320k03981j91846
37069i09971j70909j40794j01061n2065L215N8625J07001J43592J67966J83008
37059g11393J92019J96260J94372J83425J60466J23660P3165J1950n3618j14265
37049B56041j59815j82234j78374j51046j07579n6298k810N1649J08622J68742
37039b53102K28562K80161L13915L22936L06692K71732K29057J89534J59553J38943
37029B187983J22108J01865P3918L9137K126l2344o1805q5685j03372j13458j14878
37018B015595j08438r6818q2969o8250n1535k9763M94M1222R1632J47674K02221
37007B061065K46017K69708K66744K35939J81986J13787M1920k3269p2916j01047
$$ y = [912173, 799969, 655649, 486369, 300316, 104033, -98740, -305824, -514144, -718125, -909971, -1080880, -1221674, -1322735, -1374800, -1371585, -1312960, -1205959, -1062367, -894401, -711393, -519374, -323114, -128742, 54683, 215149, 338809, 411974, 423924, 370306, 256041, 96226, -86008, -264382, -415428, -523007, -579305, -582115, -530466, -421844, -253102, -24540, 255621, 569536, 892472, 1199164, 1470896, 1699953, 1889487, 2049040, 2187983, 2310091, 2411956, 2485874, 2525011, 2527137, 2494793, 2432988, 2347303, 2243931, 2130473, 2015595, 1907157, 1810339, 1727370, 1659120, 1607585, 1577822, 1578316, 1619538, 1711170, 1858844, 2061065, 2307082, 2576790, 2843534, 3079473, 3261459, 3375246, 3417166, 3393897, 3320981, 3219934]
36997C219934j06134r1784o5558l6499j2608P15J300r761k8472m8840o4264o9116
36985B688913o0082l6960l023L5081O8345Q7846Q8086O9258L6618k734m3179q1811
36973B846358j17706j50928j82394k13955k47607k83791l20025l51121l71094
36964F07737l75456l62494l33068k89840k36830j79086j21824o8933k1994J9405
36954a362383N6311Q9154J17494J40786J59614J76369J94523K16444K40962K62442
36944B91716K72336K62619K29302J74113J03647K7027m6301j07828j50877j71913
36934H83841j71731j55449j30769j05341q4509p0234o1485n5681n0248m3310l3461
36923g8377j9585j494J8974L7673M9433N0249L8748J5980j6036n5498j00757j49562
$$ y = [3219934, 3113800, 3022016, 2956458, 2919959, 2907351, 2908066, 2909366, 2899605, 2871133, 2822293, 2758029, 2688913, 2628831, 2591871, 2588848, 2623929, 2692274, 2780120, 2868206, 2937464, 2974082, 2971348, 2928169, 2846358, 2728652, 2577724, 2395330, 2181375, 1933768, 1649977, 1329952, 978831, 607737, 232281, -130213, -463281, -753121, -989951, -1169037, -1290861, -1359794, -1381788, -1362383, -1306072, -1216918, -1099424, -958638, -799024, -622655, -428132, -211688, 29274, 291716, 564052, 826671, 1055973, 1230086, 1333733, 1360760, 1314459, 1206631, 1055754, 883841, 712110, 556661, 425892, 320551, 236042, 165808, 104323, 48642, -1606, -44916, -78377, -97962, -99456, -80482, -42809, 6624, 56873, 95621, 111601, 95565, 40067, -60690, -210252]
36911b10252j98666k44166k81923l07965l19184l14491k95442k65763k30322j94445
36901b862619j63430j41377j29453j24990j22563j16553j03750q4821o4278m8945
36891c962779m5179n5748p7876j03689j23026j27215j11752p6679k5012L9109
36881d669846J11041J84996K53473L08133L42077L51854L37571L01233K45290
36872b234178J73140R1021Q962o1030j08823j29850j26576j07261q2512o0902
36862b638009m5327l2031j3069J8958O6529J25562J86988K40183K76487K91421
36852a522308K85257K62173K28616J91577J57309J30405J12936J03935J00000
36843D9900R7324R4044R1113R0876R4621J01111J07232J09951J07969J01947R3486
$$ y = [-210252, -408918, -653084, -935007, -1242972, -1562156, -1876647, -2172089, -2437852, -2668174, -2862619, -3026049, -3167426, -3296879, -3421869, -3544432, -3660985, -3764735, -3849556, -3913834, -3962779, -4007958, -4063706, -4141582, -4245271, -4368297, -4495512, -4607264, -4683943, -4708955, -4669846, -4558805, -4373809, -4120336, -3812203, -3470126, -3118272, -2780701, -2479468, -2234178, -2061038, -1970017, -1961055, -2022085, -2130908, -2260758, -2387334, -2494595, -2577107, -2638009, -2683336, -2715367, -2728436, -2709478, -2642949, -2517387, -2330399, -2090216, -1813729, -1522308, -1237051, -974878, -746262, -554685, -397376, -266971, -154035, -50100, 49900, 147224, 241268, 332381, 423257, 517878, 618989, 726221, 836172, 944141, 1046088, 1139574]
36832A139574Q3954P4101O4476N5818M8654M2334L4692K3077O310j4004l3895
36821A525091m8955n6461n6454n1326m4472l8920l6577l8077m2946m9814n6814
36810A004275o2196o4895o4578o1011n3348m0299k1536O81K1250L3871L3286J6534
36798G42034j6857o4506j20451j75318k18646k42332k42956k21886j84148j37147
36788h82213q9181m7358j5530O337K0949L1553M0454M8709N6700O4925P4467Q6852
36776f03336J03113J22511J41694J55165J57208J44460J17685Q1781M3872J0526
36766D74679j4479l0764m0255m5403m7837m8119m6369m3030l9177l6115l4551
36755D8580l3917l2549k8798k2493j5773j2415j5747k6358m1339n5831o5712o9209
$$ y = [1139574, 1223528, 1297629, 1362105, 1417923, 1466577, 1508911, 1543603, 1566680, 1572990, 1558986, 1525091, 1476136, 1419675, 1363221, 1311895, 1267423, 1228503, 1191926, 1153849, 1110903, 1061089, 1004275, 942079, 877184, 812606, 751595, 698247, 657948, 636412, 637093, 658343, 692214, 725500, 742034, 725177, 660671, 540220, 364902, 146256, -96076, -339032, -560918, -745066, -882213, -971394, -1018752, -1034282, -1027945, -1006996, -975443, -934989, -886280, -829580, -764655, -690188, -603336, -500223, -377712, -236018, -80853, 76355, 220815, 338500, 420281, 464153, 474679, 460200, 429436, 389181, 343778, 295941, 247822, 201453, 158423, 119246, 83131, 48580, 14663, -17886, -46684, -69177, -84950, -97365, -113112, -139470, -180809, -236640, -302352, -371561]
36743c71561o6402n7661m2901k2296K570K8376N0831O5768O9782O0538L7224J200
36731b44532m3647r1574j36451j73213j98509k10715k09686j96372j72248j38999
36721a815946r8844n5110j1939K7178O0798Q9287J13074J31135J41210J41442
36711a277715J31887J14867R4396P5454O3337O2762P6513J04066J41068J80205
36701b33160K13268K33480K37103K23723J95414J55433J07323N4897K801m3334
36691A146948p7832r6837r9905r0227p3128n3545l3837j3371R562L4816N8881
36680G11525P6148Q1787P3783N2966K2038j5157n4041r0216j20813j45254j64551
36669D28215j79396j88616j89541j80452j63267j43712j28223j19834j16637j13914
$$ y = [-371561, -437963, -495624, -538525, -560821, -558251, -529875, -479044, -413276, -343494, -282956, -245732, -244532, -288179, -379753, -516204, -689417, -887926, -1098641, -1308327, -1504699, -1676947, -1815946, -1914790, -1969900, -1981839, -1954661, -1893863, -1804576, -1691502, -1560367, -1419157, -1277715, -1145828, -1030961, -936565, -861111, -797774, -735012, -658499, -554433, -413365, -233160, -19892, 213588, 450691, 674414, 869828, 1025261, 1132584, 1187481, 1190282, 1146948, 1069116, 972279, 872374, 782147, 709019, 655474, 621637, 608266, 617828, 652644, 711525, 787673, 869460, 943243, 996209, 1018247, 1003090, 949049, 858833, 738020, 592766, 428215, 248819, 60203, -129338, -309790, -473057, -616769, -744992, -864826, -981463, -1095377]
36659a095377j07884r7887q5708p3274o0894m7371l1546j3500N983K7197N2545
36648a527716Q5303J26904J74916K23323K64639K92469L03179K96442K74709K41907
36638G56075K01910J57702J11796O7280K8037k573k3499l6499m4855n1534n8117
36627A105723o4587o9429o9945o3130m7061k2087Q609L9177O1980O9474N6914
36616A005638K4567k2102p4605j24524j65780j95434k13489k22085k24119k21566
36606d33499k14616k02183j83187j57570j26670r3271o1146l3551j1069R447L3519
36595a473796O5832J07205J53364J95976K25634K35609K24586J96857J60176J22928
36585B14371R2142P2655O6818P4668R4708J24967J63426K07267K51656K89585
$$ y = [-1095377, -1203261, -1301148, -1386856, -1460130, -1521024, -1568395, -1599941, -1613441, -1607458, -1580261, -1527716, -1442413, -1315509, -1140593, -917270, -652631, -360162, -56983, 239459, 514168, 756075, 957985, 1115687, 1227483, 1294763, 1322800, 1320227, 1296728, 1260229, 1215374, 1163840, 1105723, 1041136, 971707, 901762, 838632, 791571, 769484, 778093, 817270, 879250, 948724, 1005638, 1030205, 1008103, 933498, 808974, 643194, 447760, 234271, 12186, -211933, -433499, -648115, -850298, -1033485, -1191055, -1317725, -1410996, -1472142, -1505693, -1516762, -1507315, -1473796, -1407964, -1300759, -1147395, -951419, -725785, -490176, -265590, -68733, 91443, 214371, 306513, 379168, 445986, 520654, 615362, 740329, 903755, 1111022, 1362678, 1652263]
36575A652263L13409L17449K99938K63383K13631J58478J06247O4269L7275K6286
36565C452628K8624L9290N3183O6920P9176Q9414R6088R5882Q4528N8684J7880
36554D162297l4242r0097j40131j76139j94254j95868j85830j69199j48687j24152
36544B703698r3970n6978j3705L3456Q0802J24100J59354J83513J95006J93992
36534C509268J82034J61278J33597J00484O3672K5557j1553m6804q1020j14889
36524C921624j46309j69386j76507j62237j26439p4808j7168L4829O9737P8664
36514C232000N8185J2309m8518j11508j66275k07515k35060k52298k64088k74616
36504A742616k85542k95165k99155k92513k71827k36782j90327j37778q5454l9390
$$ y = [1652263, 1965672, 2283121, 2583059, 2846442, 3060073, 3218551, 3324798, 3389067, 3426342, 3452628, 3481252, 3520542, 3573725, 3640645, 3719821, 3809235, 3905323, 4001205, 4085733, 4144417, 4162297, 4128055, 4037958, 3897827, 3721688, 3527434, 3331566, 3145736, 2976537, 2827850, 2703698, 2609728, 2552750, 2539045, 2572501, 2653303, 2777403, 2936757, 3120270, 3315276, 3509268, 3691302, 3852580, 3986177, 4086661, 4150333, 4175890, 4164337, 4117533, 4036513, 3921624, 3775315, 3605929, 3429422, 3267185, 3140746, 3065938, 3048770, 3083599, 3153336, 3232000, 3290185, 3302494, 3253976, 3142468, 2976193, 2768678, 2533618, 2281320, 2017232, 1742616, 1457074, 1161909, 862754, 570241, 298414, 61632, -128695, -266473, -351927, -391317]
36494c91317m239J7590K6415K5315J9704J6318K1446L8942O9048J08673J52510
36483A00405J94004K26160K42727K39960K18250J82639J41347J02584P1298M8477
36473A767851L3906K9664M0633P1104J20723J83317K48868L06500L47039L65223
36463C514828L61528L42312L17431K96141K83518K79214K78766K76199K66233
36454F216170K45062K10304J61302J00238L3055l1276q3342j16289j27611j19005
36444F488608r5112o2096k6542N448K9053M1327M1685L2278J7685L221p687j5038
36432F452830k1015k6818l0235k6057q970K2945O5990J11091J46764J63802J59331
36421G009658J37994J09760Q5675P3773P6760R2346J15597J41686J67337J90629
$$ y = [-391317, -395556, -377966, -351551, -326236, -306532, -290214, -268768, -229826, -160778, -52105, 100405, 294409, 520569, 763296, 1003256, 1221506, 1404145, 1545492, 1648076, 1719374, 1767851, 1801757, 1831421, 1872054, 1943158, 2063881, 2247198, 2496066, 2802566, 3149605, 3514828, 3876356, 4218668, 4536099, 4832240, 5115758, 5394972, 5673738, 5949937, 6216170, 6461232, 6671536, 6832838, 6933076, 6966131, 6934855, 6851513, 6735224, 6607613, 6488608, 6393496, 6331400, 6304858, 6310306, 6339359, 6380686, 6422371, 6454649, 6472334, 6475555, 6467868, 6452830, 6431815, 6404997, 6374762, 6348705, 6339735, 6362680, 6428670, 6539761, 6686525, 6850327, 7009658, 7147652, 7257412, 7343087, 7416860, 7493620, 7585966, 7701563, 7843249, 8010586, 8201215]
36411H201215K10230K24909K33509K35045K29041K16211J99011J81346J67392
36402A0097909J60256J61134J69010J80841J92435K00166K02968K03401K06832
36393A1774952K18943K42903K77664L18137L56986L87351M05493M12304M12681
36384A4807414M12795M16740M24618M33320M39460M42766M47831M62782M95090
36375A8782816N46811O12558O81667P43247P90975Q25462Q53477Q84629R26982
36366B5648624R84133J055743J140727J239774J354748J486200J632229J790137
36358C6332315J958822K139527K334706K546918K778961L034826L320154L641618
36350E8087847M005628M417154M879525N395219N967126O599506P298411Q071515
$$ y = [8201215, 8411445, 8636354, 8869863, 9104908, 9333949, 9550160, 9749171, 9930517, 10097909, 10258165, 10419299, 10588309, 10769150, 10961585, 11161751, 11364719, 11568120, 11774952, 11993895, 12236798, 12514462, 12832599, 13189585, 13576936, 13982429, 14394733, 14807414, 15220209, 15636949, 16061567, 16494887, 16934347, 17377113, 17824944, 18287726, 18782816, 19329627, 19942185, 20623852, 21367099, 22158074, 22983536, 23837013, 24721642, 25648624, 26632757, 27688500, 28829227, 30069001, 31423749, 32909949, 34542178, 36332315, 38291137, 40430664, 42765370, 45312288, 48091249, 51126075, 54446229, 58087847, 62093475, 66510629, 71390154, 76785373, 82752499, 89352005, 96650416, 104721931]
36342A04721931Q927386R874092J0917496J2059836J3298872J4627188J6031244
36335A90458045J7489981J8973003K0438058K1827397K3062651K4038440K4616413
36328C40903988K4623366K3859119K2120074J9241970J5158350R959753L927136
36321D59793756k487006q737744j4304135j8798216k2025623k3983892k4814003
36314C44643137k4734663k3984290k2782538k1311619j9711904j8085292j6501537
36307A97531294j5004778j3619262j2354101j1207637j0171837r236447q391753
36300A17545479p629382o941779o321741n762630n258897m806319m401673m041993
36292G2381065l723578l441103l187520k955044k736870k528597k328780k138703
$$ y = [104721931, 113649317, 123523409, 134440905, 146500741, 159799613, 174426801, 190458045, 207948026, 226921029, 247359087, 269186484, 292249135, 316287575, 340903988, 365527354, 389386473, 411506547, 430748517, 445906867, 455866620, 459793756, 457306750, 448569006, 434264871, 415466655, 393441032, 369457140, 344643137, 319908474, 295924184, 273141646, 251830027, 232118123, 214032831, 197531294, 182526516, 168907254, 156553153, 145345516, 135173679, 125937232, 117545479, 109916097, 102974318, 96652577, 90889947, 85631050, 80824731, 76423058, 72381065, 68657487, 65216384, 62028864, 59073820, 56336950, 53808353, 51479573, 49340870]
36284D9340870j961620j801482j661163j541011j438785j351091j275103j209326
36276C7101289j153255j106577j068297j035918j005189r71205r30483q82656
36268B8947709q30327p77265p26027o76386o25263n68267n02009m25796l41845
36259B3474524k54357j68441q9321k1798L0128O3510P7120P2831N6866L9411L1846
36248B3312319M2995P6236J28710J92789K59215L20455L72392M13553M43445M62374
36238B6024483M72894M80884M94157N19271N58560O09053O63383P12159P47059
36229C1281903P63386P60821P41910P09524O65028O08077N37701M53456L55813
36220C6877619K45849J25078l972j36867k67149l87370m90561n71500o27773o61068
$$ y = [49340870, 47379250, 45577768, 43916605, 42375594, 40936809, 39585718, 38310615, 37101289, 35948034, 34841457, 33773160, 32737242, 31732053, 30760848, 29830365, 28947709, 28117382, 27340117, 26614090, 25937704, 25312441, 24744174, 24242165, 23816369, 23474524, 23220167, 23051726, 22962405, 22940607, 22970735, 23034245, 23111365, 23184196, 23241062, 23280473, 23312319, 23355314, 23431550, 23560260, 23753049, 24012264, 24332719, 24705111, 25118664, 25562109, 26024483, 26497377, 26978261, 27472418, 27991689, 28550249, 29159302, 29822685, 30534844, 31281903, 32045289, 32806110, 33548020, 34257544, 34922572, 35530649, 36068350, 36521806, 36877619, 37123468, 37248546, 37244574, 37107707, 36840558, 36453188, 35962627, 35391127, 34763354, 34102286]
36210C4102286o77863o87906p00087p17951p38235p53751p58438p50925p34688
36201B7582442p15837p00655o94063o98861p15233p40577p69821p96421q13983
36192B0936991q18075q07484p84139p51836p14634o75835o37719o01775n69145
36183A4576349n40851n17514m98676m82470m66081m46631m21907l90907l54541
36174A0456771l16232k81440k55811k42953k43253k54204k71454k89700l03113
36165G998611l05916k93846k66258k27590j86673j53540j35473j34458j47350
36156F147507j68075j90210k08731k20565k24496k20669k09973j93513j72586
36147D338689j48989j24980j02217q0266n6196k6214J1365N3890R4745J26249
$$ y = [34102286, 33424423, 32736517, 32036430, 31318479, 30580244, 29826493, 29068055, 28317130, 27582442, 26866605, 26165950, 25471887, 24773026, 24057793, 23317216, 22547395, 21750974, 20936991, 20118916, 19311432, 18527293, 17775457, 17060823, 16384988, 15747269, 15145494, 14576349, 14035498, 13517984, 13019308, 12536838, 12070757, 11624126, 11202219, 10811312, 10456771, 10140539, 9859099, 9603288, 9360335, 9117082, 8862878, 8591424, 8301724, 7998611, 7692695, 7398849, 7132591, 6905001, 6718328, 6564788, 6429315, 6294857, 6147507, 5979432, 5789222, 5580491, 5359926, 5135430, 4914761, 4704788, 4511275, 4338689, 4189700, 4064720, 3962503, 3882237, 3826041, 3799827, 3811192, 3865082, 3959827, 4086076]
36137D086076J43190J44636J33218J12959Q7223N7590K3746j5553o0497j08514
36127D604074j54486j93014k20913k37806k44796k42943k33017k16398j96068
36118B664633j76586j62766j57758j61537j70476j78055j76597j59850j25510
36109A195498p5981j6701M6572J09203J67010K15044K47623K59932K50002K19758
36099B617960J74518J21190O6237J4481l0995o8403r6918j16232j25801j24203
36089B431834j09645q1820m3972l226L1485N2875N7919M8196K8326L814k0701
36078B395085m2642o2069q1100j02137j25783j49731j69273j79041j75050j56254
36068A152005j24896q5342m1916K883M8422R4014J36647J70659J90280J93416
$$ y = [4086076, 4229266, 4373902, 4507120, 4620079, 4707302, 4764892, 4788638, 4773085, 4712588, 4604074, 4449588, 4256574, 4035661, 3797855, 3553059, 3310116, 3077099, 2860701, 2664633, 2488047, 2325281, 2167523, 2005986, 1835510, 1657455, 1480858, 1321008, 1195498, 1119517, 1102816, 1149388, 1258591, 1425601, 1640645, 1888268, 2148200, 2398202, 2617960, 2792478, 2913668, 2979905, 2994386, 2963391, 2894988, 2798070, 2681838, 2556037, 2431834, 2322189, 2240369, 2196397, 2193171, 2224656, 2277531, 2335450, 2383646, 2411972, 2415786, 2395085, 2352443, 2290374, 2209274, 2107137, 1981354, 1831623, 1662350, 1483309, 1308259, 1152005, 1027109, 941767, 899851, 902734, 951156, 1045170, 1181817, 1352476, 1542756, 1736172]
36058A736172J83583J68252J54643J45927J40265J33037J20581J03040Q4374O9596
36048C039470O1215N7381N3145M3916K8742J1163k894q618m889N337J6579K3097
36036C323644K1031R808p837k7422m5083n9089o9730p8090q4977r0663r5329r9361
36024B696902j02847j04387j00498q6900o1382k5992J3500N0525Q0423J00843
36014B460187J10323J07367R1156O2923K6010j5629n8865j01119j38937j67579
36004B375837j82975j84768j77722j70107j70025j82101k06157k37932k70947
35995E93103k98548l15440l18318l05696k77500k35066j81598j22412o4160j2953
35985a538588K7790N8451Q2309J03029J22284J39277J52239J60143J63015J61110
$$ y = [1736172, 1919755, 2088007, 2242650, 2388577, 2528842, 2661879, 2782460, 2885500, 2969874, 3039470, 3100685, 3158066, 3211211, 3255127, 3283869, 3295032, 3292138, 3283520, 3278631, 3283968, 3300547, 3323644, 3344675, 3354483, 3346646, 3319224, 3274141, 3215052, 3145322, 3067232, 2982255, 2891592, 2796263, 2696902, 2594055, 2489668, 2389170, 2302270, 2240888, 2214896, 2228396, 2278921, 2359344, 2460187, 2570510, 2677877, 2769033, 2831956, 2857966, 2842337, 2783472, 2682353, 2543416, 2375837, 2192862, 2008094, 1830372, 1660265, 1490240, 1308139, 1101982, 864050, 593103, 294555, -20885, -339203, -644899, -922399, -1157465, -1339063, -1461475, -1525635, -1538588, -1510798, -1452347, -1370038, -1267009, -1144725, -1005448, -853209, -693066, -530051, -368941]
35975c68941J54543J44062J31804J20595J12027J05013R6222Q2202O1722L6803
35965F76052J1993p479j7493j6189m377J4619L5758N3624O3553O2141M7536K0424
35953I40162j4560m8635p1190p3780n3603j4505L4699Q3409J22263J44759J47476
35942A196495J29931R4727M7494m325n3444r4010j21414j31798j22599r4120n0543
35931G96394P50N1380R4437J25889J44360J49765J42273J22460R2082N4272J2803
35920A786865k8702o6936r8923j22715j38570j49482j60279j75556j97587k25387
35910D22728k55215k82021l00838l07613k99766k76772k40543j94885j43948r0618
35900a969491l6139J8798P2505J21912J63752J96359K20500K38708K53776K67457
$$ y = [-368941, -214398, -70336, 61468, 182063, 294090, 399103, 495325, 577527, 639249, 676052, 688045, 680566, 663073, 646884, 642507, 657126, 692884, 746508, 810061, 872202, 919738, 940162, 925602, 876967, 805777, 731997, 678394, 663889, 698588, 781997, 904260, 1049019, 1196495, 1326426, 1421153, 1468647, 1464322, 1410878, 1316868, 1195454, 1063656, 941057, 846937, 796394, 797144, 848524, 942961, 1068850, 1213210, 1362975, 1505248, 1627708, 1719790, 1774062, 1786865, 1758163, 1691227, 1592304, 1469589, 1331019, 1181537, 1021258, 845702, 648115, 422728, 167513, -114508, -415346, -722959, -1022725, -1299497, -1540040, -1734925, -1878873, -1969491, -2005630, -1986832, -1914327, -1792415, -1628663, -1432304, -1211804, -973096, -719320, -451863]
35890d51863K79732K88863K92238K87950K76202K59461K41094K23504K07084J90594
35880B094859J72496J52028J29227J04084P5801M2979M498l9696q8400j39117
35870B508759j87909k29349k57251k66210k53183k18247j64382r6880k2715N0304
35860H62937J14693J64317J94521K01789J84133J42862Q4211J8870m1221q7002
35850A840110j14984j27333j29759j28624j28593j31636j37190j42727j44546
35841F54718j39006j24245j01436p4502m8418k7380j3999r416j3335k3542l5643
35830D3796m4094m4414l4968j6915P434L6036O7103R8154J25557J45290J54464
35819E37443J52738J42831J29597J17798J09799J04644R9086Q9534P3499N0130
$$ y = [-451863, -172131, 116732, 408970, 696920, 973122, 1232583, 1473677, 1697181, 1904265, 2094859, 2267355, 2419383, 2548610, 2652694, 2728495, 2771474, 2775972, 2736276, 2647876, 2508759, 2320850, 2091501, 1834250, 1568040, 1314857, 1096610, 932228, 835348, 812633, 862937, 977630, 1141947, 1336468, 1538257, 1722390, 1865252, 1949463, 1968333, 1927112, 1840110, 1725126, 1597793, 1468034, 1339410, 1210817, 1079181, 941991, 799264, 654718, 515712, 391467, 290031, 215529, 167111, 139731, 125732, 116316, 102981, 79439, 43796, -298, -44712, -79680, -96595, -89161, -53125, 13978, 112132, 237689, 382979, 537443, 690181, 833012, 962609, 1080407, 1190206, 1294850, 1393936, 1483470, 1556969, 1607099]
35809A607099K0275j3423m6653p4289r2011r7902r2987q0313o3425m5384k8901
35798I92086j6812j1716j4529k3114l2526l7215l3793k2456o311J0432K4001L1755
35786H59802L2398K5939J3317m371k6492n2767q2319j12648j39395j57400j62562
35775A93502j53387j31104r8475n8356j3109L5269Q5117J35418J85659K34751
35765D15285K79811L16125L38727L44423L33290L09405K80873K58588K52983K69761
35755C399271L06947L55127M00583M29308M30266L97225L29426K31698J14436
35746F394287p195j16164j98876k50217k74748k82958k85295k87761k90561k89208
35736D111304k77026k48378k01611j40323p2330o973M8056Q9138J17289J36300
$$ y = [1607099, 1627374, 1613951, 1567298, 1493009, 1400998, 1303096, 1210109, 1129796, 1066371, 1020987, 992086, 975274, 963558, 949029, 925915, 893389, 856174, 822381, 799925, 793614, 804046, 828047, 859802, 892200, 918139, 931456, 927085, 900593, 847826, 765507, 652859, 513464, 356064, 193502, 40115, -90989, -189464, -247820, -260929, -225660, -140543, -5125, 180534, 415285, 695096, 1011221, 1349948, 1694371, 2027661, 2337066, 2617939, 2876527, 3129510, 3399271, 3706218, 4061345, 4461928, 4891236, 5321502, 5718727, 6048153, 6279851, 6394287, 6387092, 6270928, 6072052, 5821835, 5547087, 5264129, 4978834, 4691073, 4400512, 4111304, 3834278, 3585900, 3384289, 3243966, 3171636, 3164663, 3212719, 3301857, 3419146, 3555446]
35726C555446J49575J57797J58922J50068J29610R8274N8840J4810l0964p6537
35716D365841j19935j58265j88344k08519k19903k25711k29361k32886k36672
35707B546245k40030k41820k40735k35406k24523k06841j81139j46450j02854
35698G26447n2346J209N3286J00092J39057J68533J87618J96443J96146J88011
35688A904496J72436J48643J15423P2311K0688l5437q9463j33621j61551j70609
35678A843316j62298j40612j09658p2328l0730J2274N1980Q2154R6676R1514O6211
35667A728499K4440k6349p6262j15248j35908j35568j16434q3776m3391j16M1933
35656A061820P8219J03299J11912J01333P3496L5514k174k9263l8948k9539l936
$$ y = [3555446, 3705021, 3862818, 4021740, 4171808, 4301418, 4399692, 4458532, 4473342, 4442378, 4365841, 4245906, 4087641, 3899297, 3690778, 3470875, 3245164, 3015803, 2782917, 2546245, 2306215, 2064395, 1823660, 1588254, 1363731, 1156890, 975751, 829301, 726447, 674101, 675310, 728596, 828688, 967745, 1136278, 1323896, 1520339, 1716485, 1904496, 2076932, 2225575, 2340998, 2413309, 2433997, 2398560, 2309097, 2175476, 2013925, 1843316, 1681018, 1540406, 1430748, 1358420, 1327690, 1339964, 1391944, 1474098, 1570774, 1662288, 1728499, 1752939, 1726590, 1650328, 1535080, 1399172, 1263604, 1147170, 1063394, 1020003, 1019887, 1061820, 1140039, 1243338, 1355250, 1456583, 1530079, 1565593, 1563419, 1534156, 1495208, 1465669, 1461733]
35645A461733L2014P0878J04373J24365J24853J04281O6317J8310l1636p6914
35635A998574j13067j37535j49578j50615j44302j35685j29566j28867j33818
35626G75541j42322j51116j57081j58078j53044j41355j22092r3999n6685j2214
35616d12445L4364P6421J08459J28573J39360J46671J56618J72187J91518K08936
35606I50662K17918K13940J95720J65047J26077Q4647M7228J9335L571j628j637
35595B020880l543j3393l4009o4075r8360j29166j48884j52674j39668j12077
35585A125031p3604k8837J6432N5566Q3027R6630R8077R1226P9471O4346M6205
35574A653570K6136P118o897j3554j4101j2864j4256j9631k6517l0621k8755k0260
$$ y = [1461733, 1493747, 1564625, 1668998, 1793363, 1918216, 2022497, 2088814, 2107124, 2075488, 1998574, 1885507, 1747972, 1598394, 1447779, 1303477, 1167792, 1038226, 909359, 775541, 633219, 482103, 325022, 166944, 13900, -127455, -249547, -343546, -400231, -412445, -378081, -301660, -193201, -64628, 74732, 221403, 378021, 550208, 741726, 950662, 1168580, 1382520, 1578240, 1743287, 1869364, 1954011, 2001239, 2020574, 2024145, 2022517, 2020880, 2017337, 2003944, 1969935, 1905860, 1807500, 1678334, 1529450, 1376776, 1237108, 1125031, 1051427, 1022590, 1039022, 1094588, 1177615, 1274245, 1372322, 1463548, 1543019, 1607365, 1653570, 1679706, 1686824, 1679927, 1666373, 1652272, 1639408, 1625152, 1605521, 1579004, 1548383, 1519628, 1499368]
35562A499368o378J1194L0859N0517O6740P4896P0325M9848J2660l9806j04480
35551A715743j76972k51562l21648l81313m27163m58780m77106m82166m72231
35542a733198m45073m00016l38869k65072j82016r2244J755R6351J86965K69889
35532b901528L43753M08780M64443N08093N35904N44962N34514N05734M60848
35523A405503M02510L33721K58184J80829J07814M5820J055k1529j9204P006N1125
35512B752834J02865J50357J83192J94214J80215J42484Q7216K4712l3136p6287
35502C708666r9341j02494r0367o9391m5281k1665j99J8377L3017M1881M3171
35491C416374L6927K6036J5075P610M041J568m004j5827l4057n5346p4412q6982
$$ y = [1499368, 1492990, 1504184, 1535043, 1585560, 1652300, 1727196, 1797521, 1847369, 1860029, 1820223, 1715743, 1538771, 1287209, 965561, 584248, 157085, -301695, -778801, -1260967, -1733198, -2178271, -2578287, -2917156, -3182228, -3364244, -3456488, -3454733, -3358382, -3171417, -2901528, -2557775, -2148995, -1684552, -1176459, -640555, -95593, 438921, 944655, 1405503, 1808013, 2141734, 2399918, 2580747, 2688561, 2734381, 2735436, 2713907, 2694703, 2701709, 2752834, 2855699, 3006056, 3189248, 3383462, 3563677, 3706161, 3793377, 3818089, 3784953, 3708666, 3609325, 3506831, 3416464, 3347073, 3301792, 3280127, 3279928, 3298305, 3331322, 3373203, 3416374, 3453301, 3479337, 3494412, 3502022, 3506063, 3507631, 3503627, 3487800, 3453743, 3398397, 3323985, 3237003]
35479C237003r2002r1394q7774q2420p5042o5153n3572m2767l5864l4979m0053
35468B535983m8841n7877o3652o3626n6934m4699k9617j5020m032N90l712j9062
35456B129501m6337q4338j29499j76309k18293k49633k67170k71768k67625k59528
35446A59001k49945k38121k21576j98334j68173j32769r5382o0213l1312j1389
35436a248213j433j235r989k6087m6369o5809p8307p8446o3417l4223M345M5105
35424a604078Q0834J06857J22637J31042J35474J36944J33687J23684J07714R0037
35414d35168P6121O9323O8920P0700O9456O1691M6816K6538L403k0418m3610o5424
35402g1652q4533r7888j01149r1384o9979m2757j6923K392J3381J6919J5845J4585
$$ y = [3237003, 3145001, 3053607, 2965833, 2883413, 2808371, 2743218, 2689646, 2646879, 2611015, 2576036, 2535983, 2487142, 2429265, 2365613, 2301987, 2245053, 2200354, 2170737, 2155717, 2151685, 2152275, 2148563, 2129501, 2083164, 1998826, 1869327, 1693018, 1474725, 1225092, 957922, 686154, 418529, 159001, -90944, -329065, -550641, -748975, -917148, -1049917, -1145299, -1205512, -1236824, -1248213, -1249646, -1250881, -1260870, -1286957, -1333326, -1399135, -1477442, -1555888, -1619305, -1653528, -1649183, -1604078, -1523244, -1416387, -1293750, -1162708, -1027234, -890290, -756603, -632919, -525205, -435168, -359047, -289724, -220804, -150104, -80648, -18957, 27859, 54397, 57800, 37382, -6228, -71652, -156185, -254073, -355222, -446606, -516585, -559342, -576265, -573873, -560492, -543573, -527728, -513143]
35390e13143J8007K9405M9037P4385J01712J27561J49349J65156J73244J71935
35380E46648J60242J38553J08524P2079L0681j4173n9997j03379j41351j72548
35370E65279j96777k13319k19951k14071j95327j67476j37559j12648r6357q7396
35360a075602q0847p1036n4232k9898l29L0605N8502P8821Q7120Q0146N7803K4933
35348h94014q829l1825l4887j5243K2211O6796J05836J28475J28292J04451O1404
35337c67333P469m7232r2887j21956j30885j21026r7805o8014l6576m980K7881
35326a053344O3556J02487J43956J86730K29304K69505L04322L30714L47070L54090
35316A278390L54160L49535L40714L25990L02340K66835K17994J56679Q6435J3085
$$ y = [-513143, -495136, -465731, -416694, -342309, -240597, -113036, 36313, 201469, 374713, 546648, 706890, 845443, 953967, 1026046, 1056727, 1042554, 982557, 879178, 737827, 565279, 368502, 155183, -64768, -278839, -474166, -641642, -779201, -891849, -988206, -1075602, -1156449, -1227485, -1281717, -1311615, -1311944, -1281339, -1222837, -1144016, -1056896, -976750, -918947, -894014, -902843, -934668, -969555, -984798, -962587, -895791, -789955, -661480, -533188, -428737, -367333, -359864, -407096, -499983, -621939, -752824, -873850, -971655, -1039669, -1076245, -1081225, -1053344, -989788, -887301, -743345, -556615, -327311, -57806, 246516, 577230, 924300, 1278390, 1632550, 1982085, 2322799, 2648789, 2951129, 3217964, 3435958, 3592637, 3679072, 3692157]
35306C692157n6399j15389j59120j85886j97628j99352j97281j96447j99121k04806
35296A980728k11417k16804k19760k20043k17304k09848j94796j70082j36753
35287A83921r9482o5015m0001k9266l4234n1471p2490q6189q2972n8088j2338
35276d47625M9435J20491J93736K62378L20039L60895L80526L77470L54445L17853
35266B289643K75188K31915J89889J48124J04936N9698J3436l1500p2075j05383
35256C103871j29421j43516j48276j45169j36180j23556j09642r6607q5991p8273
35246A907240p2698o7633o1356n2864m2477l2125k5115k5134l4796n4621q3202
35235A355219j18192j57066j97172k35684k70140k99384l23891l44660l61352
$$ y = [3692157, 3635758, 3520369, 3361249, 3175363, 2977735, 2778383, 2581102, 2384655, 2185534, 1980728, 1769311, 1552507, 1332747, 1112704, 895400, 685552, 490756, 320674, 183921, 84439, 19424, -20577, -49843, -84077, -135548, -208038, -294227, -377199, -435287, -447625, -398190, -277699, -83963, 178415, 498454, 859349, 1239875, 1617345, 1971790, 2289643, 2564831, 2796746, 2986635, 3134759, 3239695, 3299393, 3312829, 3281329, 3209254, 3103871, 2974450, 2830934, 2682658, 2537489, 2401309, 2277753, 2168111, 2071504, 1985513, 1907240, 1834542, 1766909, 1705553, 1652689, 1610212, 1578087, 1552972, 1527838, 1493042, 1438421, 1355219, 1237027, 1079961, 882789, 647105, 376965, 77581, -246310, -590970, -952322]
35226i52322l71342l70615l56078l27619k88640k44784k01444j61150j22300q0196
35216c476490k9865L1052J00865J74177K43433L01215L42637L66890L77111L78683
35206a190292L76661L73386L67397L54534L30866K95642K52090K05806J61987
35197A528077J23197Q8599N4789J7877k4315p1054j18778j62068j95351k15250
35187A025723k22702k23084k23846k31049k46987k69673k93811l12507l19323
35178a317259l10023k83338k40793j86004j23935o0001Q16N4327R7003J26088
35168b243119J40514J41922J34226J21542J06009Q7392O4636L7674Q166k0752
35158a421790m5095o0978o6150o1469n0929l9795l1742k6692k0608p549J6794
$$ y = [-952322, -1323664, -1694279, -2050357, -2377976, -2666616, -2911400, -3112844, -3273994, -3396294, -3476490, -3506355, -3475303, -3374438, -3200261, -2956828, -2655613, -2312976, -1946086, -1568975, -1190292, -813631, -440245, -72848, 281686, 612552, 908194, 1160284, 1366090, 1528077, 1651274, 1739873, 1794662, 1812539, 1788224, 1717170, 1598392, 1436324, 1240973, 1025723, 803021, 579937, 356091, 125042, -121945, -391618, -685429, -997936, -1317259, -1627282, -1910620, -2151413, -2337417, -2461352, -2521353, -2520537, -2466210, -2369207, -2243119, -2102605, -1960683, -1826457, -1704915, -1598906, -1511514, -1446878, -1409204, -1401038, -1421790, -1466885, -1527863, -1594013, -1655482, -1706411, -1746206, -1777948, -1804640, -1825248, -1832797, -1816003]
35147a816003N2134R3069J31308J58830J69945J61873J34676R1375L8079j6579
35137h01293o3102r3564j03716r3696o7477l1737N331L5709N3551N6555M5826
35126a057613K4667k526l1099n6983p7461r1250r7914r7651r1570q1616o9407
35115a730423n4808l6005j1502J7337M5488O6090P3849O7589N0467K8227O908
35104a476783r013j7965k1790k4863l1986m6318o8587r7214j28732j58323j81144
35093b262718j93993j96231j89263j75356j56954j36728j17550j01781r0259q1994
35083c702827p5202o8983o4202o2609o5063p0489p6364p9910p8830p1479n7055
35072d473013l5949r683J9696N0270Q0406J08661J33888J55508J73616J88764
$$ y = [-1816003, -1763869, -1670800, -1539492, -1380662, -1210717, -1048844, -914168, -822793, -784714, -801293, -864395, -957959, -1061675, -1155371, -1222848, -1254585, -1249254, -1213545, -1159994, -1103439, -1057613, -1032946, -1035472, -1066571, -1123554, -1201015, -1292265, -1390179, -1487830, -1579400, -1661016, -1730423, -1785231, -1821236, -1832738, -1815401, -1769913, -1703823, -1629974, -1562385, -1511918, -1483691, -1476783, -1485796, -1503761, -1525551, -1550414, -1582400, -1628718, -1697305, -1794519, -1923251, -2081574, -2262718, -2456711, -2652942, -2842205, -3017561, -3174515, -3311243, -3428793, -3530574, -3620833, -3702827, -3778029, -3847012, -3911214, -3973823, -4038886, -4109375, -4185739, -4265649, -4344479, -4415958, -4473013, -4508962, -4518645, -4498949, -4448679, -4368273, -4259612, -4125724, -3970216, -3796600, -3607836]
35062c607836K01761K13448K24443K34852K44351K52547K59216K64099K66765
35053a446354K66903K64967K62338K60750K61378K64295K68338K71302K70453
35044I44370K63689K50903K34541K18478K05832J97328J91130J83833J71586J51137
35034C012827J20950Q2181L8620m745m3882p7245j05833j31658j55689j76522
35024B559004j90823j94965j86616j65332j32407r0530m3402M880N0444R0096
35014A700349J21635J44078J57460J62043J57546J43250J19009Q6072M6940M473
35004B842855l8639p9461j13785j35831j39687j22207q5328l5927J7003O5750
34994B174743J05739J35046J52714J57439J47720J23301Q6594M2729k109m2937
$$ y = [-3607836, -3406075, -3192627, -2968184, -2733332, -2488981, -2236434, -1977218, -1713119, -1446354, -1179451, -914484, -652146, -391396, -130018, 134277, 402615, 673917, 944370, 1208059, 1458962, 1693503, 1911981, 2117813, 2315141, 2506271, 2690104, 2861690, 3012827, 3133777, 3215958, 3254578, 3249833, 3205951, 3128706, 3022873, 2891215, 2735526, 2559004, 2368181, 2173216, 1986600, 1821268, 1688861, 1598331, 1554929, 1559809, 1610253, 1700349, 1821984, 1966062, 2123522, 2285565, 2443111, 2586361, 2705370, 2791442, 2838382, 2842855, 2804216, 2724755, 2610970, 2475139, 2335452, 2213245, 2127917, 2091990, 2108993, 2174743, 2280482, 2415528, 2568242, 2725681, 2873401, 2996702, 3083296, 3126025, 3123916, 3080979]
34984C080979p7501j06321j31621j55870j80753k06752k33160k58130k78904k92678
34974A159289k97920k95159k86357k73584k58245k41436k24416k08186j92515
34965a118529j75867j56858j35924j15452r8021q4441p3188o1329m5858k4811
34955b090278J613L0108N4375O6990O2354L9282K068m0304p6685r7253r6392p3545
34943b217667l1835K3918Q8157J54346K14884K62339K91426L00261K90012K63616
34933c60543K24787J77585J26038P3474K2041k7015p2494j12668j45586j70045
34923b64426j86240j95293j97814j92631j76765j46841j01117m1044K8475J00399
34913a373297J67631K24553K67158K92656K99802K89845K66762K35922K02307
$$ y = [3080979, 3003478, 2897157, 2765536, 2609666, 2428913, 2222161, 1989001, 1730871, 1451967, 1159289, 861369, 566210, 279853, 6269, -251976, -493412, -717828, -926014, -1118529, -1294396, -1451254, -1587178, -1702630, -1800651, -1885092, -1958280, -2019609, -2065467, -2090278, -2088665, -2058557, -2004182, -1937192, -1874838, -1835556, -1833488, -1873792, -1950477, -2047730, -2144122, -2217667, -2249502, -2225584, -2137427, -1983081, -1768197, -1505858, -1214432, -914171, -624159, -360543, -135756, 41829, 167867, 241341, 263382, 236367, 163873, 51205, -94381, -264426, -450666, -645959, -843773, -1036404, -1213169, -1360010, -1461127, -1502171, -1473696, -1373297, -1205666, -981113, -713955, -421299, -121497, 168348, 435110, 671032, 873339]
34904H73339J69491J39547J13366R1114P2688N7592M4043K8607P813j9098m8837
34893A529665p5808r5338j05648j07349j01512q8103o5957l4170O021N0339R2547
34882A004687J27008J51080J65575J73121J75696J73209J63866J45817J18915
34873B398974Q5992N3102K8166J7794K3592M0665N9832P2259P3291O3100M4556
34862B961323K0574p260l8576p3583j12526j55162k00054k44122k83026l12557
34852A555031l30280l36486l34080l27470l20731l15734l10863l01119k79934
34843a301666k42214j87283j20056m9462J4810O5054R6543J07385R8631P4811
34833a443447M3710J4688l705n661J0897M4046Q8315J36165J80429K16522K43250
$$ y = [873339, 1042830, 1182377, 1295743, 1386857, 1459545, 1517137, 1561180, 1589787, 1597600, 1578502, 1529665, 1453857, 1358519, 1252871, 1145522, 1044010, 955907, 889950, 855780, 861801, 912140, 1004687, 1131695, 1282775, 1448350, 1621471, 1797167, 1970376, 2134242, 2280059, 2398974, 2484966, 2538068, 2566234, 2584028, 2607620, 2648285, 2708117, 2780376, 2853667, 2916767, 2961323, 2981897, 2974637, 2936061, 2862478, 2749952, 2594790, 2394736, 2150614, 1867588, 1555031, 1224751, 888265, 554185, 226715, -94016, -409750, -720613, -1021732, -1301666, -1543880, -1731163, -1851219, -1900681, -1885871, -1820817, -1724274, -1616889, -1518258, -1443447, -1399737, -1385049, -1388754, -1394415, -1383518, -1339472, -1251157, -1114992, -934563, -718041, -474791]
34822d74791K62010K75228K85014K92409K97071K97460K91560K78073K57396K31611
34812B293041K03322J73936J42672J06981O4228J3598m2715r9450j49211j84060
34802B522342j97422j85762j49747r4762l0688K9529P2974R0776Q1219N0082P910
34791B196451l4168o7970q9954j01109j05580j08541j13866j22640j33273j42982
34781A176368j49360j51119j48043j40714j30231j17899j05197r3983q6536q4845
34771c1559q9726j00710j16685j36132j56451j73571j83020j81921j70181j49924
34761a489880j23905r4139o1412k5774J2334N0947Q6306J13824J29820J32948
34751a268931J24608J08273Q8127O7695M8962L2389J7582M197p621j7390k4681
$$ y = [-474791, -212781, 62447, 347461, 639870, 936941, 1234401, 1525961, 1804034, 2061430, 2293041, 2496363, 2670299, 2812971, 2919952, 2984180, 2997778, 2955063, 2855613, 2706402, 2522342, 2324920, 2139158, 1989411, 1894649, 1863961, 1893490, 1966464, 2057240, 2138459, 2188541, 2196451, 2162283, 2094313, 2004359, 1903250, 1797670, 1689129, 1575263, 1452623, 1319350, 1176368, 1027008, 875889, 727846, 587132, 456901, 339002, 233805, 139822, 53286, -31559, -121285, -221995, -338680, -474812, -631263, -804834, -987854, -1169775, -1339956, -1489880, -1613785, -1707924, -1769336, -1795110, -1782776, -1731829, -1645523, -1531699, -1401879, -1268931, -1144323, -1036050, -947923, -880228, -831266, -798877, -781295, -777098, -784719, -802109, -826790]
34740h26790k9292l1396l1938l3009l7277m6334n9162p2017p9793p7810o3409
34729a388227l7160l266L1643O1225Q2138R4943J02814J09108J15470J21368J25018
34718e84926J24780J20046J11284R9514Q5645O9908N1680K9951M415k3488n0209
34707C8600p0925q1546q1135p3267o4912o3232p2398r2325j19495j48468j73018
34696a002121j86834j84323j62004j20273o4538m270N0378R2583J20758J37147
34686a323497J44686J44569J35887J16857Q6391M5089m577n8604j11948j59186
34676i84333j95508k18064k27070k25882k19533k12163k04621j93990j75693j46968
34666c003825j09224o7841k9912j578J3830J6582J0155k20r527j4387j3178n218
$$ y = [-826790, -856082, -887478, -919416, -952425, -989702, -1036036, -1095198, -1167215, -1247008, -1324818, -1388227, -1425387, -1428653, -1397010, -1335785, -1253647, -1158704, -1055890, -946782, -831312, -709944, -584926, -460146, -340100, -228816, -129302, -43657, 26251, 77931, 107882, 112297, 88809, 38600, -32325, -113871, -195006, -268273, -333185, -396417, -468815, -561140, -680635, -829103, -1002121, -1188955, -1373278, -1535282, -1655555, -1720093, -1724363, -1673985, -1581402, -1460644, -1323497, -1178811, -1034242, -898355, -781498, -695107, -650018, -654595, -713199, -825147, -984333, -1179841, -1397905, -1624975, -1850857, -2070390, -2282553, -2487174, -2681164, -2856857, -3003825, -3113049, -3180890, -3210802, -3212380, -3198550, -3181968, -3171813, -3172033, -3181560, -3195947, -3209125, -3214343]
34654c214343J0108L3547O5301J03731J44293J79709K01870K04739J86561J50278
34644a934206J02398N1350N916k6532m1841m0115k5040j871K4652N1360P6578
34633a757351R9271J17938J30040J32731J24616J07003Q3402N7696L2640R584
34623h62430j1134l0001m8481o8731r2473j19216j44869j61889j61630j37898
34613a838752q9700k1599N8108J40114K16472K82035L34741L74547M01575M14648
34603B72189M11369L89866L50952K98923K40176J80625J23938P1555K3630k0505
34593B342718o2298j03194j42924j78297k04013k15152k09557j88707j56909j19552
34583G62115q1127m3826p235L0674P1583J14894J57006J92620K17441K30270K32937
$$ y = [-3214343, -3204235, -3170688, -3105387, -3001656, -2857363, -2677654, -2475784, -2271045, -2084484, -1934206, -1831808, -1780458, -1774542, -1801074, -1842915, -1883030, -1908070, -1909941, -1885289, -1833929, -1757351, -1658080, -1540142, -1410102, -1277371, -1152755, -1045752, -962350, -904654, -872014, -862430, -873564, -903565, -952046, -1020777, -1113250, -1232466, -1377335, -1539224, -1700854, -1838752, -1928452, -1950051, -1891943, -1751829, -1535357, -1253322, -918581, -544034, -142459, 272189, 683558, 1073424, 1424376, 1723299, 1963475, 2144100, 2268038, 2339593, 2363223, 2342718, 2280420, 2177226, 2034302, 1856005, 1651992, 1436840, 1227283, 1038576, 881667, 762115, 680988, 637162, 629927, 660601, 732184, 847078, 1004084, 1196704, 1414145, 1644415, 1877352]
34572A877352K28412K18776K04313J83747J55362J18791P6790L5529K528j6855
34562C084745k2131j7852j1207q480j2326k1291l1564l9525m3507m4123m3674
34551B789065m5233n1574o4172q2818j06257j33569j65102k01805k42936k83741
34541A411858l15276l27336l13119k72893k14416j49893r1106m5195j2917J0053
34531c20240K9963N1886P8006J07548J37859J66092J90731K12163K31722K49739
34521A135469K64035K70149K63282K40615K02438J51747R2982L0848l0484q7624
34511B533457j37757j78367k07554k24852k31475k29239k18982k00141j72006
34502G33084j35648r5236n8089l2981k6715m0520o8913j02214j30977j49303j55651
$$ y = [1877352, 2105764, 2324540, 2528853, 2712600, 2867962, 2986753, 3063543, 3099072, 3101600, 3084745, 3062614, 3044762, 3033555, 3025075, 3012749, 2991458, 2959894, 2920369, 2876862, 2832739, 2789065, 2743832, 2692258, 2628086, 2545268, 2439011, 2305442, 2140340, 1938535, 1695599, 1411858, 1096582, 769246, 456127, 183234, -31182, -181075, -272181, -317376, -330293, -320240, -290277, -238391, -160385, -52837, 85022, 251114, 441845, 654008, 885730, 1135469, 1399504, 1669653, 1932935, 2173550, 2375988, 2527735, 2620717, 2651565, 2621081, 2533457, 2395700, 2217333, 2009779, 1784927, 1553452, 1324213, 1105231, 905090, 733084, 597436, 502200, 444111, 411130, 384415, 343895, 274982, 172768, 41791, -107512, -263163]
34491b63163j51816j41132j26520j09196q8872o5341l9995j5809M192J8795K9416
34480i49441L9370N1984O8727Q8369J07412J21329J26085J19690J03256Q1007
34470d2212N8841M2109L3507L2035L3541L2581K4670P585j8547n1632q7770j21585
34458e6877j47647j62913j68530j69277j70585j74987j80352j80725j68831j38833
34448a719557q8799k2623M9629J14300J59177J78211J72917J50121J18297Q4946
34438h03381N5666L3984K1002J5011J1960P313j479j3445k4565k9730k4796p784
34426g60244K0612N6873R5323J30153J58211J80566K01181K23345K46650K66823
34416H19493K78161K76295K59562K29141J88697J43770J00469O3684L5497J4649
$$ y = [-263163, -414979, -556111, -682631, -791827, -880699, -946040, -986035, -1001844, -997652, -978857, -949441, -910071, -858087, -789360, -700991, -593579, -472250, -346165, -226475, -123219, -42212, 16629, 58738, 92245, 124280, 157821, 190402, 215072, 222657, 204110, 152478, 64708, -56877, -204524, -367437, -535967, -705244, -875829, -1050816, -1231168, -1411893, -1580724, -1719557, -1808356, -1830979, -1781350, -1667050, -1507873, -1329662, -1156745, -1006624, -888327, -803381, -747715, -713731, -692729, -677718, -665758, -658445, -659924, -673369, -697934, -727664, -752460, -760244, -739632, -682759, -587436, -457283, -299072, -118506, 82675, 306020, 552670, 819493, 1097654, 1373949, 1633511, 1862652, 2051349, 2195119, 2295588, 2359272, 2394769, 2409418]
34406B409418k707k1170m4001p1801j02537j32512j57365j72908j75966j65303
34396A363148j42068j09248p0465k8908J2912N2704Q7895J15670J33547J39957
34386A555144J34691J19465R8374P7345O2075N5571N7033O2692O7511O6662N6612
34375B413175L6097O708k7495o1263q9875j10640j23640j31123j35777j38960
34365A637207j39974j36417j24998j02740o8797k6240J7814N4508P6741Q1655
34355A268759P0891M9146K2121n488l1608n7357q5982j20382j60552k02600k39953
34344E06995k66063k76993k72547k55624k30639k02158j74457j51527j36669j31319
34334a591001j34044j40854j47010j49173j46492j39936j30380j16797r5963o4310
$$ y = [2409418, 2406711, 2385541, 2341540, 2269739, 2167202, 2034690, 1877325, 1704417, 1528451, 1363148, 1221080, 1111832, 1041367, 1012459, 1025371, 1078075, 1165970, 1281640, 1415187, 1555144, 1689835, 1809300, 1907674, 1985019, 2047094, 2102665, 2159698, 2222390, 2289901, 2356563, 2413175, 2449272, 2455980, 2428485, 2367222, 2277347, 2166707, 2043067, 1911944, 1776167, 1637207, 1497233, 1360816, 1235818, 1133078, 1064281, 1038041, 1055855, 1110363, 1187104, 1268759, 1339650, 1388796, 1410917, 1405429, 1373821, 1316464, 1230482, 1110100, 949548, 746948, 506995, 240932, -36061, -308608, -564232, -794871, -997029, -1171486, -1323013, -1459682, -1591001, -1725045, -1865899, -2012909, -2162082, -2308574, -2448510, -2578890, -2695687, -2791650, -2855960]
34324b855960k0718L1746Q6567J36113J73957J96283K02744J96813J84804J73160
34314a494491J65417J61073J57243J51451J43331J34221J25449J16826J06323
34305b33157R1194O9866M3391J5350j0044l0280m5553n7628o7784p5773q0381
34294c80799q0262p3775n8521l2288M498M7097Q7747J19401J39221J49499J55878
34283G7696J64258J78055J97168K18990K40684K61001K80251K98359L12518L16379
34273B545359L01941K63372K00388J19079K9826n6145j29847j86286k24697k47461
34263B615529k58242k60446k56817k50022k43175k39435k40673k46425k53938
34254C66356k59323k58695k48806k27545j94687j52111j02610m7918J1993P7418
$$ y = [-2855960, -2876678, -2844932, -2758365, -2622252, -2448295, -2252012, -2049268, -1852455, -1667651, -1494491, -1329074, -1168001, -1010758, -859307, -715976, -581755, -456306, -339480, -233157, -141963, -72097, -28706, -13356, -23400, -53680, -99233, -156861, -224645, -300418, -380799, -461061, -534836, -593357, -625645, -621147, -574050, -486303, -366902, -227681, -78182, 77696, 241954, 420009, 617177, 836167, 1076851, 1337852, 1618103, 1916462, 2228980, 2545359, 2847300, 3110672, 3311060, 3430139, 3459965, 3403820, 3273973, 3087687, 2862990, 2615529, 2357287, 2096841, 1840024, 1590002, 1346827, 1107392, 866719, 620294, 366356, 107033, -151662, -400468, -628013, -822700, -974811, -1077421, -1125339, -1113346, -1035928]
34244a035928J46574K14718K75433L23071L54823L71439L76152L72274L60885
34235A759441L40162L06662K57661J93249J17399L7507l7283r8162j38438j54973
34225B583225j49497j28737j02210p8185o0647m9292m1841l5995k9662k0415n665
34214A881079J6052M3551P2399R5843J07003J01351P8296M1197l885n0017r1007
34203B291862j22422j42101j50430j50358j46756j44843j48347j58507j74256
34194I53842j93003k11360k25817k33642k33725k26699k14146j97501j77417j53806
34184a113274j26334r4999o0479k4151J2244M7064P9051J07269J30699J47863
34174h95047J56901J56465J47263J33275J21513J19884J34067J65164K09334K59313
$$ y = [-1035928, -889354, -674636, -399203, -76132, 278691, 650130, 1026282, 1398556, 1759441, 2099603, 2406265, 2663926, 2857175, 2974574, 3012081, 2974798, 2876636, 2738198, 2583225, 2433728, 2304991, 2202781, 2124596, 2063949, 2014657, 1972816, 1936821, 1907159, 1886744, 1881079, 1897131, 1940682, 2013081, 2108924, 2215927, 2317278, 2395574, 2436771, 2432886, 2382869, 2291862, 2169440, 2027339, 1876909, 1726551, 1579795, 1434952, 1286605, 1128098, 953842, 760839, 549479, 323662, 90020, -143705, -370404, -584550, -782051, -959468, -1113274, -1239608, -1334607, -1395086, -1419237, -1406993, -1359929, -1280878, -1173609, -1042910, -895047, -738146, -581681, -434418, -301143, -179630, -59746, 74321, 239485, 448819, 708132]
34164G08132L06753L44193L66117L69310L53035L19138K71850K16762J59468J04705
34154C519463N6552J8747n949j7294j8641j6449j8479l1630o0044j03643j57403
34143C165230k11994k56084k79735k77624k50495k04053j46015q3434k1878L3775
34133A467693P8843J09665J24966J26232J16631R9535P7701N3307K8294M495j6507
34122B270855l3538m5726n2156n1665m3318k7495o766J4599L2614M5565N4057
34111B157026N8824N8382M9119K8066l959m1536p6631j01747j12202j06815q7490
34100A821037n8623k6439K335K2779L4053L9477M3778M9381N4881N6531N0891
34089B090081L6214J2427j9045n4973r0258j18961j35947j38014j24045r4750
$$ y = [708132, 1014885, 1359078, 1725195, 2094505, 2447540, 2766678, 3038528, 3255290, 3414758, 3519463, 3576015, 3594762, 3588813, 3571519, 3552878, 3536429, 3517950, 3486320, 3426276, 3322633, 3165230, 2953236, 2697152, 2417417, 2139793, 1889298, 1685245, 1539230, 1455796, 1433918, 1467693, 1546536, 1656201, 1781167, 1907399, 2024030, 2123565, 2201266, 2254573, 2282867, 2287362, 2270855, 2237317, 2191591, 2139435, 2087770, 2044452, 2016957, 2010191, 2024790, 2057404, 2102969, 2157026, 2215850, 2274232, 2323351, 2351417, 2347458, 2305922, 2229291, 2127544, 2015342, 1908527, 1821037, 1762414, 1735975, 1738310, 1761089, 1795142, 1834619, 1878397, 1927778, 1982659, 2039190, 2090081, 2126295, 2138722, 2119677, 2064704, 1974446, 1855485, 1719538, 1581524, 1457479, 1362729]
34079A362729n2680k375N0044R8100J36553J62671J76758J81631J81170J78643
34069B473244J75953J74122J74144J76810J81498J85288J83676J72788J51820
34060D049343J24109R5856P2912N7802M9218M4395M2203M4468N4808P6381J09893
34049D821388J52412J97213K35152K57573K59605K41844K09405J69225J27617
34040F671434Q9330N7546L3774J7489O323k730j1803k1341l0214l6388l7942l4194
34028F701284k6129j5598l843R064K3340L8356N2874O6531Q0852R8489J21346
34017G146566J49280J80400K12354K43450K73163L02224L32687L67715M10857
34008I618696M65077N32150O12723P06752Q13674R32172J059873J193314J328224
$$ y = [1362729, 1310049, 1307674, 1357718, 1455818, 1592371, 1755042, 1931800, 2113431, 2294601, 2473244, 2649197, 2823319, 2997463, 3174273, 3355771, 3541059, 3724735, 3897523, 4049343, 4173452, 4269308, 4342220, 4400022, 4449240, 4493635, 4535838, 4580306, 4635114, 4711495, 4821388, 4973800, 5171013, 5406165, 5663738, 5923343, 6165187, 6374592, 6543817, 6671434, 6760764, 6818310, 6852084, 6869573, 6875896, 6873166, 6861363, 6840022, 6809808, 6773420, 6735478, 6701284, 6675155, 6659557, 6655714, 6664778, 6688118, 6726474, 6779348, 6845879, 6926731, 7025220, 7146566, 7295846, 7476246, 7688600, 7932050, 8205213, 8507437, 8840124, 9207839, 9618696, 10083773, 10615923, 11228646, 11935398, 12749072, 13681244, 14741117, 15934431, 17262655]
33999A7262655J460054J584876J700675J808487J912380K018390K133470K265248
33991C2146235K422153K612961K845748L127085L461773L852744M300563M802519
33983E9571781N351272N933246O526902P100823P610933P997140Q181184Q067741
33975A16341022P550865O530405M944825K817707K94835k362110m839453o866027
33967A24412069q286439r078224r318567r132753q652368p992321p243132o472036
33959E8236229n727160n040613m429811l899136l443643l053640k718534k429393
33951B7494299k180209j967555j788647j639130j512117j398889j290887j182199
33943A4534666j071483r61881q58788p66877o88222o22176n66390n18083m75018
$$ y = [17262655, 18722709, 20307585, 22008260, 23816747, 25729127, 27747517, 29880987, 32146235, 34568388, 37181349, 40027097, 43154182, 46615955, 50468699, 54769262, 59571781, 64923053, 70856299, 77383201, 84484024, 92094957, 100092097, 108273281, 116341022, 123891887, 130422292, 135367117, 138184824, 138479659, 136117549, 131278096, 124412069, 116125630, 107047406, 97728839, 88596086, 79943718, 71951397, 64708265, 58236229, 52509069, 47468456, 43038645, 39139509, 35695866, 32642226, 29923692, 27494299, 25314090, 23346535, 21557888, 19918758, 18406641, 17007752, 15716865, 14534666, 13463183, 12501302, 11642514, 10875637, 10187415, 9565239, 8998849, 8480766, 8005748]
33934H005748m35764l99401l65141l32120k99213k64780k27006j85067j40417
33925E356839r6763n8413k8213o663P398J5527J9028J8790J4871N646j1974m0416
33913E195657p8645j21597j62805j98010k26742k50911k72096k89755l01361l04211
33903B989524k97381k82335k61668k37302k09803j79166j45997j12041p9885n2053
33893A131893k9806j2316L022J9186L8092O0051Q3957J07404J26663J37086J34541
33882A799773J17347Q7639N1016J4634j5224l4860m3888m5168m3870m5482n3427
33871A788490o7772q5660j02699j14046j15236j03203p7349l9880M676N0372R1043
33860A228736J22042J41751J51376J52851J46734J32086J08153P6005L8810Q56
$$ y = [8005748, 7569984, 7170583, 6805442, 6473322, 6174109, 5909329, 5682323, 5497256, 5356839, 5260076, 5201663, 5173450, 5166787, 5174185, 5189712, 5208740, 5227530, 5242401, 5248047, 5236073, 5195657, 5117012, 4995415, 4832610, 4634600, 4407858, 4156947, 3884851, 3595096, 3293735, 2989524, 2692143, 2409808, 2148140, 1910838, 1701035, 1521869, 1375872, 1263831, 1183946, 1131893, 1102087, 1089771, 1092793, 1111979, 1150071, 1210122, 1294079, 1401483, 1528146, 1665232, 1799773, 1917120, 2004759, 2055775, 2070409, 2055185, 2020325, 1976437, 1931269, 1887399, 1841917, 1788490, 1720718, 1635058, 1532359, 1418313, 1303077, 1199874, 1122525, 1082645, 1087321, 1137693, 1228736, 1350778, 1492529, 1643905, 1796756, 1943490, 2075576, 2183729, 2259734, 2298544, 2299400]
33850B299400l3931o3216q6557j04453j17047j23822j24652j20820j14550j07311
33840A303041r8540q5862o6611l9363m705L4845P5357J12221J41223J59776J67493
33829A698875J65502J54780J34980J04649O2633R662n0591j11401j64151k00742
33819A804196k16219k10359j87646j56033j24807j01928r1402r2013r8077j01791
33809D23921r5880p5712m0564O075N7132J03390J35589J46763J34134R9404M7122
33798I41374j7589r0219j66250k40071l04836l53633l80981l83951l62815l21303
33788a680274k66109k05462j47245r7632o0637l8136k9671l2110m0074m7609n0420
33777b695379m7128l8775k7252j4190j001J0507J7969J9178J3159R49j4464k8998
$$ y = [2299400, 2265469, 2202253, 2115696, 2011243, 1894196, 1770374, 1645722, 1524902, 1410352, 1303041, 1204501, 1118639, 1052028, 1012665, 1007960, 1042805, 1118162, 1230383, 1371606, 1531382, 1698875, 1864377, 2019157, 2154137, 2258786, 2321419, 2331081, 2280490, 2169089, 2004938, 1804196, 1587977, 1377618, 1189972, 1033939, 909132, 807204, 715802, 623789, 525712, 423921, 328041, 252329, 211765, 217840, 274972, 378362, 513951, 660714, 794848, 894252, 941374, 923785, 833566, 667316, 427245, 122409, -231224, -612205, -996156, -1358971, -1680274, -1946383, -2151845, -2299090, -2396722, -2457359, -2495495, -2525166, -2557276, -2597350, -2644959, -2695379, -2742507, -2781282, -2808534, -2822724, -2823725, -2813218, -2795249, -2776071, -2762912, -2761963, -2776427, -2805425]
33765b805425l8742m0778l3102j4052J7679O2124J16958J77145K35461K83395
33755b039337L12435L16016K91712K42559J76541J04661L8447j2417m1962m8736
33745f60081l5179o100L2636P4608J13030J41491J55429J53727J39373J18567
33735B27501R8331Q3727P6259P4241P4838P6189P8410Q2920R0733J00914J10322
33724A174385J14854J11344R8693P7780N0726K0447r669l6734o0016q1850j06296
33713A353664j35960j69292k00441k21829k27537k15722j89205j54416j19144
33704b79882q9813o9241n6090m6405l6435k4784j2503j338Q145J6977K6679L7737
33692e26953M8691N6147N5689M3589J8776j6054n5060r1245j18382j31793j28256
$$ y = [-2805425, -2844167, -2884945, -2918047, -2932099, -2914420, -2852296, -2735338, -2558193, -2322732, -2039337, -1726902, -1410886, -1119174, -876615, -700074, -595413, -556966, -569383, -611345, -660081, -695260, -701360, -668724, -594116, -481086, -339595, -184166, -30439, 108934, 227501, 325832, 409559, 485818, 560059, 634897, 711086, 789496, 872416, 963149, 1064063, 1174385, 1289239, 1400583, 1499276, 1577056, 1627782, 1648229, 1638560, 1601826, 1541810, 1459960, 1353664, 1217704, 1048412, 847971, 626142, 398605, 182883, -6322, -160738, -279882, -369695, -438936, -495026, -541431, -577866, -602650, -615153, -616491, -608346, -591369, -564690, -526953, -478262, -422115, -366426, -322837, -304061, -320115, -375175, -466420, -584802, -716595, -844851]
33681h44851j06222o6825j4955M0993R1108J26838J43419J40931J23803R8979
33671b66782P3456N2253L7698K9791K6763K5398K1661J1997n416l0388o1367r6046
33659a80982j31413j63762j89388k05717k12001k09161j98980j83036j61873j34865
33649a971178j01213o1659j9628J9281M9256O6247O8623N6517L0916o624n3613
33638a923075j06090j58312k02950k32163k39670k22893j83769j27643o1104R687
33628c447982P9407J43101J95893K33597K53862K56845K44434K18776J81805J36580
33618a503682Q8715M5539J2945p412j7959k2521k3790k2797j9882j5523j0194
33607a496561l713M923J6886L2292M9313O4463P4163P6611P2529O4281N4235M3631
$$ y = [-844851, -951073, -1017898, -1032853, -991860, -900752, -773914, -630495, -489564, -365761, -266782, -193326, -141073, -103375, -73584, -46821, -21423, 238, 12235, 6819, -23569, -84936, -180982, -312395, -476157, -665545, -871262, -1083263, -1292424, -1491404, -1674440, -1836313, -1971178, -2072391, -2134050, -2153678, -2134397, -2085141, -2018894, -1950271, -1893754, -1862838, -1869462, -1923075, -2029165, -2187477, -2390427, -2622590, -2862260, -3085153, -3268922, -3396565, -3457669, -3447982, -3368575, -3225474, -3029581, -2795984, -2542122, -2285277, -2040843, -1822067, -1640262, -1503682, -1414967, -1369428, -1356483, -1363895, -1381854, -1404375, -1428165, -1450962, -1470844, -1486367, -1496561, -1500274, -1495351, -1478465, -1446173, -1396860, -1332397, -1258234, -1181623, -1109094, -1044813, -990578, -946947]
33595i46947L2531K0362O567q882k5217m1009n4593o4479o9429o8467o1014m7115
33583a327692k7636m624J8281L6179M4568M1653K9598J3836R40l644K792J9428
33571a156321M2225O5512Q4361R6556J02952J05974J07277J06320J00817Q8606
33561b55721O9336M4958J9139l807j9887k6068k0428k218K7774O6841J10660J54364
33549A64943J93324K23209K40036K40956K25202J94015J49840R5801L5973k4383
33539A738916p9119j21987j47923j55048j46316j28912j10911r7317q8288q0219
33529E82876o8294m8815k0489J5772N8104J04784J54017K02889K46918K80825
33519A508587K99665K99425K77283K32336J66762Q6687J730p7162j41048j85909
$$ y = [-946947, -914416, -894054, -887487, -896369, -921586, -962595, -1017188, -1081667, -1151096, -1219563, -1280577, -1327692, -1355328, -1359952, -1341671, -1305492, -1260924, -1219271, -1189673, -1175837, -1174897, -1178541, -1175749, -1156321, -1114096, -1048584, -964223, -867667, -764715, -658741, -551464, -445144, -344327, -255721, -186385, -141427, -122288, -126095, -145982, -172050, -192478, -194696, -166922, -100081, 10579, 164943, 358267, 581476, 821512, 1062468, 1287670, 1481685, 1631525, 1727326, 1763299, 1738916, 1659797, 1537810, 1389887, 1234839, 1088523, 959611, 848700, 751383, 663095, 582876, 514582, 465767, 445278, 461050, 519154, 623938, 777955, 980844, 1227762, 1508587, 1808252, 2107677, 2384960, 2617296, 2784058, 2870745, 2872475, 2795313, 2654265, 2468356]
33509B468356k13313k28422k36640k41031k41586k36204k22588k00078j70559
33500D77935j37861j05949p7016n0551k4012N247L7667P0093R6281J09300J04655
33489E05789Q2296M6494L757l9562p8644j10321j32723j45116j47718j41101j25600
33478b82449j01579p0457l5261J14L2223N8424P6043Q1663P2108M6792R468l2439
33466a45350p0891j00548j19869j29391j29072j17389r2939n6718j2715L3629
33456i41253P7490J15491J45072J63505J67751J55769J28568R1545N3670K4434
33446A82042J0061J1241K3481L9595N2607N7452N1310L3569O239k5751n5569p6910
$$ y = [2468356, 2255043, 2026621, 1789981, 1548950, 1307364, 1071160, 848572, 648494, 477935, 340074, 234125, 157109, 106558, 82546, 87793, 125460, 195553, 291834, 401134, 505789, 588085, 634579, 638336, 598774, 520130, 409809, 277086, 131970, -15748, -156849, -282449, -384028, -454485, -489746, -489632, -457409, -398985, -322942, -241279, -169171, -122379, -112911, -145350, -216241, -316789, -436658, -566049, -695121, -812510, -905449, -962167, -974882, -941253, -863763, -748272, -603200, -439695, -271944, -116175, 12393, 103938, 157608, 182042, 192103, 203344, 226825, 266420, 319027, 376479, 427789, 461358, 467597, 441846, 386277, 309367]
$$ [...]
##END NTUPLES=NMR SPECTRUM
##END=
