##TITLE=31Pdec_ADP1502
 CDcl3, 24 sc
 15.2.2019
##JCAMPDX= 6.0         $$ Bruker NMR JCAMP-DX V2.0
##DATA TYPE= NMR SPECTRUM
##DATA CLASS= NTUPLES
##ORIGIN= UXNMR, Bruker Analytische Messtechnik GmbH
##OWNER= root
$$ XWIN-NMR		Version 3.5
$$ Fri Feb 15 16:23:01 2019 Russian Standard Time (UT+4h)  she@DPX200
##.OBSERVE FREQUENCY= 81.013821
##.OBSERVE NUCLEUS= ^31P
##.ACQUISITION MODE= SIMULTANEOUS
##.ACQUISITION SCHEME= undefined
##.AVERAGES= 24
##.DIGITISER RES= 17
##SPECTROMETER/DATA SYSTEM= spect
##.PULSE SEQUENCE= zgpg30
##.SOLVENT NAME= CDCl3
##.SHIFT REFERENCE= (INTERNAL, CDCl3, 0, 182.463)
##AUDIT TRAIL= $$ (NUMBER, WHEN, WHO, WHERE, WHAT)
$$ ##TITLE= Audit trail, XWIN-NMR		Version 3.5
$$ ##JCAMPDX= 5.01
$$ ##ORIGIN= Bruker BioSpin GmbH
$$ ##OWNER= she
$$ F:/spectra/data/she/nmr/P31/1/pdata/1/auditp.txt
$$ ##AUDIT TRAIL=  $$ (NUMBER, WHEN, WHO, WHERE, WHAT)
(   1,<2019-02-15 16:21:50.32 +0400>,<she>,<DPX200>,
      <created by zg, POWCHK disabled, PULCHK disabled
       configuration hash MD5:
       00 E9 B6 7A A2 85 ED C7 34 08 36 98 17 FE 4E 26
       data hash MD5: 32K
       07 25 B5 23 7A F3 1D B8 8A 30 7A F8 BB 4B CB 19>)
(   2,<2019-02-15 16:22:15.48 +0400>,<she>,<DPX200>,
      <Start of raw data processing
       efp BC_mod = 2 LB = 1 FT_mod = 6 PKNL = 1 PHC0 = -1454.128 PHC1 = 22.79891 SI = 64K 
       data hash MD5: 64K
       20 DB 02 DD 34 3B 64 BF 78 4E D0 27 C0 BD B5 15>)
(   3,<2019-02-15 16:22:33.50 +0400>,<she>,<DPX200>,
      <pk PHC0 = -8.185739 PHC1 = 52 
       data hash MD5: 64K
       41 F2 48 B4 BD CB AB 8A 35 45 E8 93 56 8E 69 8F>)
(   4,<2019-02-15 16:22:38.32 +0400>,<she>,<DPX200>,
      <abs ABSG = 5 
       data hash MD5: 64K
       D9 46 23 27 24 F4 BA 9A 1B 34 F8 66 5B 01 52 5B>)
$$ ##END=
$$ 
$$ hash MD5
$$ 09 ED DE 3A 4B 99 9A 33 C9 41 3F D1 30 19 80 0B
##$RELAX= 
##$RELAX= 
##$RELAX= 
##$RELAX= 
##$RELAX= 
##$RELAX= 
##$RELAX= 
##$RELAX= 
$$ Bruker specific parameters
$$ --------------------------
##$DU= <F:/spectra>
##$EXPNO= 1
##$NAME= <P31>
##$PROCNO= 1
##$TYPE= <nmr>
##$USER= <she>
##$AMP= (0..31)
100 100 100 100 100 100 100 100 100 100 100 100 100 100 100 100 100 100 
100 100 100 100 100 100 100 100 100 100 100 100 100 100 
##$AQSEQ= 0
##$AQ_mod= 1
##$AUNM= <au_zg>
##$AUTOPOS= <>
##$BF1= 81.014009
##$BF2= 200.13
##$BF3= 200.13
##$BF4= 200.13
##$BF5= 200.13
##$BF6= 200.13
##$BF7= 200.13
##$BF8= 200.13
##$BYTORDA= 1
##$CFDGTYP= 0
##$CFRGTYP= 5
##$CHEMSTR= <none>
##$CNST= (0..31)
1 1 145 1 1 1 1 1 1 1 1 1 1 1 1 1 1 1 1 1 1 1 1 1 1 1 1 1 1 1 1 1 
##$CPDPRG= <waltz16>
##$CPDPRG1= <>
##$CPDPRG2= <waltz16>
##$CPDPRG3= <>
##$CPDPRG4= <mlev>
##$CPDPRG5= <mlev>
##$CPDPRG6= <mlev>
##$CPDPRG7= <mlev>
##$CPDPRG8= <mlev>
##$CPDPRGB= <>
##$CPDPRGT= <>
##$D= (0..31)
0 1 0 0 0 0 0 0 0 0 0 0.03 2e-05 3e-06 0 0 0 0 0 0 0 0 0 0 0 0 0 0 0 0 
0 0 
##$DATE= 1550233309
##$DBL= (0..7)
120 120 120 11 120 120 24 19 
##$DBP= (0..7)
150 150 150 150 150 150 150 150 
##$DBP07= 0
##$DBPNAM0= <>
##$DBPNAM1= <>
##$DBPNAM2= <>
$$ [...]
##$SUBNAM3= <"">
##$SUBNAM4= <"">
##$SUBNAM5= <"">
##$SUBNAM6= <"">
##$SUBNAM7= <"">
##$SUBNAM8= <"">
##$SUBNAM9= <"">
##$SW= 369.568048894756
##$SWIBOX= (0..15)
0 1 3 0 0 0 0 0 0 0 0 0 0 0 0 0 
##$SW_h= 29940.119760479
##$TD= 32768
##$TD0= 1
##$TE= 0
##$TE2= 300
##$TE3= 300
##$TEG= 300
##$TL= (0..7)
0 120 53 12 22 120 120 120 
##$TP= (0..7)
150 150 150 150 150 150 150 150 
##$TP07= 0
##$TPNAME0= <>
##$TPNAME1= <>
##$TPNAME2= <>
##$TPNAME3= <>
##$TPNAME4= <>
##$TPNAME5= <>
##$TPNAME6= <>
##$TPNAME7= <>
##$TPOAL= (0..7)
0.5 0.5 0.5 0.5 0.5 0.5 0.5 0.5 
##$TPOFFS= (0..7)
0 0 0 0 0 0 0 0 
##$TUNHIN= 0
##$TUNHOUT= 0
##$TUNXOUT= 0
##$USERA1= <user>
##$USERA2= <user>
##$USERA3= <user>
##$USERA4= <user>
##$USERA5= <user>
##$V9= 5
##$VALIST= <valist>
##$VCLIST= <CCCCCCCCCCCCCCC>
##$VD= 0
##$VDLIST= <DDDDDDDDDDDDDDD>
##$VPLIST= <PPPPPPPPPPPPPPP>
##$VTLIST= <TTTTTTTTTTTTTTT>
##$WBST= 1024
##$WBSW= 4
##$XGAIN= (0..3)
0 0 0 0 
##$XL= 0
##$YL= 0
##$YMAX_a= 9188
##$YMIN_a= -11124
##$ZGOPTNS= <>
##$ZL1= 120
##$ZL2= 120
##$ZL3= 120
##$ZL4= 120
##$ABSF1= 182.463
##$ABSF2= -187.1042
##$ABSG= 5
##$ABSL= 3
##$ALPHA= 0
##$AQORDER= 0
##$ASSFAC= 0
##$ASSFACI= 0
##$ASSFACX= 0
##$ASSWID= 0
##$AUNMP= <proc_1d>
##$AZFE= 0.1
##$AZFW= 0.5
##$BCFW= 0
##$BC_mod= 2
##$BYTORDP= 0
##$COROFFS= 0
##$CY= -3
##$DATMOD= 1
##$DC= 0
##$DFILT= <>
##$DTYPP= 0
##$F1P= 0
##$F2P= 0
##$FCOR= 1
##$FTSIZE= 65536
##$FT_mod= 6
##$GAMMA= 0
##$GB= 0
##$INTBC= 1
##$INTSCL= 5.30512e-09
##$ISEN= 30
##$LB= 1
##$LEV0= 0
##$LPBIN= 0
##$MAXI= 10000
##$MC2= 0
##$MEAN= 0
##$ME_mod= 0
##$MI= 50
##$NCOEF= 0
##$NC_proc= -6
##$NLEV= 6
##$NOISF1= 182.463
##$NOISF2= 159.3651
##$NSP= 0
##$NTH_PI= 0
##$NZP= 0
##$OFFSET= 182.463
##$PC= 4
##$PHC0= -1462.314
##$PHC1= 74.79891
##$PH_mod= 1
##$PKNL= yes
##$PPARMOD= 0
##$PSCAL= 0
##$PSIGN= 0
##$REVERSE= no
##$SF= 81.0140089999434
##$SI= 65536
##$SIGF1= 159.3651
##$SIGF2= -187.1042
##$SINO= 113.3802
##$SIOLD= 16384
##$SREGLST= <1H.CDCl3>
##$SSB= 0
##$STSI= 65536
##$STSR= 0
##$SW_p= 29940.119760479
##$SYMM= 0
##$S_DEV= 0
##$TDeff= 32768
##$TDoff= 0
##$TI= <>
##$TILT= no
##$TM1= 0
##$TM2= 0
##$TOPLEV= 0
##$USERP1= <user>
##$USERP2= <user>
##$USERP3= <user>
##$USERP4= <user>
##$USERP5= <user>
##$WDW= 1
##$XDIM= 65536
##$YMAX_p= 374299842
##$YMIN_p= -47414291
$$ End of Bruker specific parameters
$$ ---------------------------------
##NTUPLES= NMR SPECTRUM
##VAR_NAME=  FREQUENCY,     SPECTRUM/REAL,   SPECTRUM/IMAG
##SYMBOL=    X,             R,               I
##VAR_TYPE=  INDEPENDENT,   DEPENDENT,       DEPENDENT
##VAR_FORM=  AFFN,          ASDF,            ASDF
##VAR_DIM=   65536,         65536,           65536
##UNITS=     HZ,            ARBITRARY UNITS, ARBITRARY UNITS
##FACTOR=    0.456856943014862, 1,           1
##FIRST=     14782.0589164792, 0,            0
##LAST=      -15158.0608439998, 0,           0
##MIN=       -15158.0608439998, -47414291,   0
##MAX=       14782.0589164792, 374299842,    0
$$ Real data points
##PAGE= N=1
##DATA TABLE= (X++(R..R)), XYDATA
$$ [...]
42554B1300534J481377J164535J489832K007531J772813J086175J110594J865669
42546C3279060K186785J775037J604759J936473J657237L11713q09542o31956
42538D1309566l5549m42959j627666k139125j325156Q8101J056407J093601M17838
42529C8395058k20243j97070J44204j99481j461698k629939k766184k159533j759313
42520B7145801k031554k689754k990593k142021j52677J600909J560982p3821
42512B0227272j582658k025955k053666k159286j749317p08885k74534j118023
42504H554948j926068j380952m08914o77654j684397j420451L17998J402872N32077
42495C309459r45266j222026n66496l98345p99778n13384P89743J712070J057214
$$ y = [21300534, 22781911, 23946446, 25436278, 27443809, 29216622, 30302797, 31413391, 33279060, 35465845, 37240882, 38845641, 40782114, 42439351, 42751064, 41941522, 41309566, 41274017, 40831058, 39203392, 37064267, 35739111, 35827212, 36883619, 37977220, 38395058, 38174815, 37977745, 38121949, 37922468, 36460770, 33830831, 31064647, 28905114, 27145801, 25114247, 22424493, 19433900, 17291879, 17139202, 18740111, 20301093, 20227272, 18644614, 16618659, 14564993, 12405707, 10656390, 9947505, 9672971, 8554948, 6628880, 5247928, 4839014, 4161360, 2476963, 1056512, 1374510, 2777382, 3309459, 2364193, 1142167, 575671, 177326, -622452, -1135836, -346093, 1365977, 2423191]
42486B423191m77808j284850q59150O075N57853O25320J57833n76888m99630J098398
42476A170344K802639K314824n6911j239190J87417J648991N05042j785659k050456
42467C497041l37652O96501L31319K33468P27414K30157j283519j742762o66780
42458A685187o4470o24596l67548J429141K276877N02986j712881j736316l82834
42449A005546J37675p3667K47060N53424l38933j443456r01815P52966J284199
42440A222999J49909j080668j240707n13278O05149J510445J292166m8975r73811
42431I23229m94160J91509k69577j061739p63801J64578N47933P79966J675129
42422A693067K331531J532800Q3087o19099r93948j790671j799533n164J552472
$$ y = [2423191, 1945383, 660533, -198617, -192542, 365311, 990631, 1148464, 571576, 71946, 1170344, 3972983, 6287807, 6230896, 4991706, 5179123, 6828114, 7333156, 5547497, 3497041, 3159389, 3855890, 4187209, 4420677, 5148091, 5378248, 4094729, 2351967, 1685187, 1620717, 996121, 628573, 2057714, 4334591, 4837577, 3124696, 1388380, 1005546, 1143221, 1069554, 1316614, 1870038, 1531105, 87649, -814166, -61200, 1222999, 1372908, 292240, -948467, -1461745, -856596, 653849, 1946015, 1897040, 923229, 429069, 620578, 351001, -710738, -1474539, -1309961, -762028, 17938, 1693067, 4024598, 5557398, 5640485, 5021386, 4027438, 2236767, 437234, 432070, 1984542]
42413A984542M96585j639141j616389J84748P52042q9920K54421J875018J917107
42404D119013j21638j280981k90678N41297j50880n93415K77390P92235P9039
42395C371382k61044K38592m01398k345670k528270O5363J881284N45620r87048
42386d21189L05972J999860N03987k320086k047606Q61327J919727J8946j233556
42377d12618K21174J886577J067334j293231k549095j720279K04074J669106J612452
42368F85494L29075o37417m30982n3472m19501n10318O82414J725418P56853j100144
42358A027420j207130L06640P78630o06246j751567j321420n20609l84050R04
42349c677428J254097J916105O01762j495698j925451j47191J885324K154058
$$ y = [1984542, 2481127, 841986, -774403, -589655, 162387, 72467, 326888, 2201906, 4119013, 3997375, 2716394, 2425716, 2967013, 2816133, 2222718, 2500108, 3292343, 3371382, 3110338, 3348930, 2947532, 601862, -1926408, -1861045, 20239, 565859, -421189, -115217, 1884643, 2388630, 68544, -1979062, -1117735, 801992, 820938, -412618, -191444, 1695133, 2762467, 1469236, -1079859, -2800138, -2596064, -926958, 685494, 1014569, 377152, -53830, -107302, -526803, -1037121, -354707, 1370711, 2127564, 1027420, -179710, 126930, 905560, 299314, -1452253, -2773673, -3294282, -3678332, -3677428, -2423331, -507226, 94536, -1401162, -3326613, -3473804, -1588480, 565578]
42341E65578P97673l48726k29855M1654r60231k275885j565991R69919K153400
42332h52464N12813j190102k37997J690640J423110m62018r55434J24491K41972
42323B95011j001890j222741L27459J523505J174928N45778L22985m54878j513680
42314c523r25804J159503J845500J19847j260163l99627O41473k09839j270461
42305c03094l28692J095827K63011j934913k259460j58329J811039J997937J171152
42296A354478L46292k82541l57335M33828J194341P53264m22348r58882q09999
42287A251098r58251j343669j056277l04115k11259p69446q53826k00197M38159
42278d007783R86920J988832K870492K329550P22333L6061R06323J529524L74240
$$ y = [565578, 1363251, 1014525, 784670, 826324, -133907, -2409792, -3975783, -3005864, -852464, -339651, -1529753, -1767750, -77110, 1346000, 883982, -71452, 53039, 295011, -706879, -1929620, -1602161, -78656, 1096272, 1642050, 1965035, 1510157, -3523, -929327, 230176, 2075676, 2195523, 935360, 535733, 1177206, 967367, -303094, -631786, 464041, 727052, -1207861, -3467321, -3625650, -1814611, 183326, 1354478, 1700770, 1418229, 1060894, 1494722, 2689063, 3442327, 3019979, 2061097, 1251098, 292847, -1050822, -2107099, -2411214, -2622473, -3391919, -4245745, -4445942, -4007783, -3020863, -1032031, 1838461, 4168011, 4890344, 4926405, 5832728, 7362252, 7736492]
42269G736492j625460k563801j989552q86961k22861l53562j065576j504992p86639
42260c262912P74320J761073J417658M95274o6052k97979m44156j10743Q52421
42251A118904J437549O35750q94511j459446n52146N45820N26029l99960j036881
42242g8892p02906K10721Q16835N04864o00089j581313j354012J89785J766320
42233h28687J960310Q76758j14310l29879n01682j120808j234467j0467J419776
42224A16544J283249j41169r48669n87776l98114r28248r68888r4298J17603j107623
42214c657389j782768j03566K254122K310691K73040q57045J94702J539422J446800
42205A618009N74063P1125l77260j324272j919764r95507R77353K239155J787550
$$ y = [7736492, 6111032, 3547231, 1557679, 670718, 447857, 94295, -971281, -2476273, -3262912, -2488592, -727519, 690139, 1185413, 1119361, 821382, 377226, 266483, 1118904, 2556453, 3192203, 2297692, 838246, 286100, 831920, 1357949, 957989, -78892, -781798, -571077, 245758, 750622, 150533, -1430780, -2784792, -2595007, -828687, 1131623, 2008381, 1894071, 1564192, 1062510, -58298, -1292765, -1303232, 116544, 1399793, 1258624, 309955, -277821, -675935, -1604183, -2573071, -2667369, -2549766, -3657389, -5440157, -5543723, -3289601, -978910, -705870, -1562915, -1368213, 171209, 1618009, 2192072, 2263197, 1885937, 561665, -1358099, -2353606, -1376253, 862902, 2650452]
42196B650452L33359o74170n88399j12077k47653p43862k97953J265577K103260
42187C688534Q06253j210668j503457j72318M60079m31247j129303m65635L69063
42178D11301Q9758n99851m79609K31860P32416J083856J454945J140043k37120
42169C827599j538692j524775o21735k3835J09405K76055L27960m9334l11605
42160D71043M4266K36641o36502j776321j630330k69305P73115Q06238N86726
42151a394429P03045Q04310N10344r1031q13292j235741n97056R74732J732074
42142E92956M01996j547426j696731l37164L2565j139557j555015o101J542436
42133c712041J243203L01702O27008J483950R03531q03003j451920l81792P97498
$$ y = [2650452, 2983811, 2309641, 1721242, 1609165, 1361512, 617650, 319697, 1585274, 3688534, 4494787, 3284119, 1780662, 1608344, 2068423, 1637176, 507873, 42238, 411301, 501059, -98792, -578401, -346541, 385875, 1469731, 2924676, 4064719, 3827599, 2288907, 764132, 142397, 118562, 227967, 504022, 831982, 782648, 471043, 515309, 751950, 115448, -1660873, -3291203, -3560508, -2787393, -1981155, -1394429, -691384, 112926, 623270, 532239, -281053, -1516794, -2113850, -1139118, 592956, 994952, -552474, -2249205, -2586369, -2553804, -3693361, -5248376, -5254477, -3712041, -2468838, -2167136, -1540128, -56178, 847353, 44350, -1407570, -1789362, -991864]
42124i91864P50753j70375j119665j692228j477881j81193J447611K013360J171496
42115b49986l0531o60043p43342n11336K7878M68472J08276q33401j107391j55707
42105c687111R24433Q49688j12274o76497l40888J99253K68086M4534j730N2098
42095b480408k03595n81788j86531J324068K728585K351002K55796j604715j809817
42086b07403j030606n40903l17316K66180Q68295Q04085N07425P21575Q26139
42077A897471j52204j314106q83134O93703J073883k72797j227460n61975K95360
42068d51259J15293j33519L38005L23258q44558j348498J15269J578433Q31540
42059E23964p22355m49722R01808O48126q80741q84275Q09446J359763m2798q14149
$$ y = [-991864, -241111, -411486, -1531151, -3223379, -4701260, -4882453, -3434842, -1421482, -249986, -280517, -940560, -1683902, -2195238, -2167360, -1698888, -1590612, -2424013, -3531404, -3687111, -2762678, -1912990, -2025264, -2701761, -3042649, -2843396, -2575310, -2530776, -2532506, -2480408, -2684003, -3265791, -3452322, -2128254, 600331, 2951333, 3207129, 1602414, -207403, -1238009, -1778912, -2096228, -1830048, -961753, -157668, 349757, 1071332, 1897471, 1745267, 431161, -451973, 241730, 1315613, 1042816, -184644, -746619, -451259, -335966, -469485, -131480, 191778, -652780, -2001278, -1886009, -307576, 523964, -198391, -648113, 253695, 901821, 21080, -863195, -53749, 1306014, 1263216, 449067]
42049D49067L88317J482951Q50947j00565k8150m7078r71557j200803K35021J273441
42039B331591J62051j242887m95055J213594J097675n39900j069319L4501Q29677
42030B321928M59913J7071L0014k03237p99791j118932j232257j485897j146488
42021c157676K58246J083780j93661j688069l88347K686323L402944P96321j541981
42012A257880j222578j84171m75629q09695K65848J142568Q6284j277836o28469
42003a845798R69555R34907m37045p76284K29086P65483L27342Q3251J26483n75985
41993a99005j488241q01129J153591J698964q9435j705529r08270J132800J942741
41984G36487J223053N00359N24547P21385N46409j4112q47707j547243j309572
$$ y = [449067, 837384, 2320335, 3171282, 3070717, 3042567, 2995489, 2023932, 823129, 1058150, 2331591, 2493642, 1250755, 755700, 1969294, 3066969, 2527069, 1457750, 1492251, 2321928, 2781841, 2798912, 2828926, 2625689, 1825898, 706966, -525291, -2011188, -3157676, -2899430, -1815650, -2009311, -3697380, -4085727, -1399404, 2003540, 2799861, 1257880, 35302, -148869, -624498, -1434193, -1168345, -25777, 60507, -1217329, -1845798, -876243, 58664, -378381, -1154665, -925579, -160096, 167246, 250497, 376980, -199005, -1687246, -2488375, -1334784, 364180, 274745, -1430784, -2339054, -1206254, 736487, 1959540, 2459899, 2984446, 3705831, 4252240, 4238128, 3390421, 1843178, 533606]
41975E33606J3537J227524J134473J34818n10154n84945q54800j298837q89595
41966a094373N13503J439484Q53865j26738J57967J222244R78976j006557k540951
41957C97420j849436r9537M91709l3578J62944J447028K069822J052809l15266
41948C323915o67290m94775p75246j164410r37764n26764o13889o84498n4515
41939b595236N30702O9033o23842L2202J621954K072118P62479o48780p87290
41930D33340j31074M25241Q24172J010387M61372o05697r63899k04472M44721
41921A694091N9408m58914R4892J231087J504061N10548r31017j965789k103727
41912c65360j103747N06895J346092O37730o47700r94810k31518O40108R62172
$$ y = [533606, 547143, 1774667, 2909140, 3043958, 2533804, 1948859, 1094059, -204778, -1094373, -580870, 858614, 1712479, 1585741, 1743708, 2965952, 3944928, 2938371, 397420, -1452016, -1551553, -1059844, -1093422, -930478, 516550, 2586372, 3639181, 3323915, 2656625, 2161850, 1386604, 222194, -715570, -1242334, -1856223, -2540721, -2595236, -2064534, -1995501, -2619343, -2587141, -965187, 1106931, 1869410, 1220630, 433340, 302266, 727507, 1551679, 2562066, 3023438, 2417741, 1453842, 1249370, 1694091, 1753499, 1294585, 1389477, 2620564, 4124625, 4635173, 3704156, 1738367, -365360, -1469107, -962212, 383880, 1021610, 373910, -620900, -852418, -212310, 749862]
41903G49862P76704J33807q23966j320152n79750R74917J971299J545743L0391
41894C458855j555617k152502j250382M57548J443564J035866J59897k70143p08543
41885F18543j617594j905171n24740J181440R78880p58100j476420m28372M38925
41876c492609J27584K24703J566258K093742K43449j863046j440983M49040O53003
41867a438859q64604j173856M56806J345810J68786o72400P33254K321155J439834
41858B315926n89356n54253J342003J811123j22631j550739l83560J375992Q56953
41849D501458j308992k128086o30909J186828J519269P72210P0016n32230j403883
41840B045681k036777j636296n98454k22462q34505j171204j49933J467541K051611
$$ y = [749862, 1526566, 1660373, 836407, -483745, -1063495, -88578, 1882721, 3428464, 3458855, 1903238, -249264, -1499646, -1042098, 401466, 1437332, 1597229, 1327086, 618543, -999051, -2904222, -3428962, -2247522, -1268642, -2026742, -3503162, -3931534, -3492609, -3365025, -3140322, -1574064, 519678, 763127, -1099919, -2540902, -2091862, -1438859, -2303463, -3477319, -3020513, -1674703, -1505917, -2178317, -1445063, 876092, 2315926, 1726570, 1172317, 2514320, 4325443, 4202812, 2652073, 2268513, 3644505, 4501458, 3192466, 1064380, 433471, 1620299, 3139568, 3911778, 3981794, 3449564, 2045681, 8904, -1627392, -2225846, -2448308, -3282813, -4454017, -4603950, -3136409, -1084798]
41831a084798J372583P12790N94839j68179k219471l701678k337772R74491K719882
41822c137313J303110r16382j112800K50032P81551l4419n63516m404N98459M95540
41812b340142L61877O43202N31273l78435q29993L36930K110011K433433R57429
41803C825585o68820j091996o19640j86362o5726n1617j27459l42605m35252j53511
41793H2597J85843n1738r06650j503844r65476M07175J230611N54616r38267j594155
41783c499288n68269J372299K722127K524305R10710j061420k056138j533622
41775a189296l64866J16484k48627m17023J30477N89933K74375r7243M91332J564766
41765H50312J627722K63396j273656j688498j068258m34164m47538q24437p25441
$$ y = [-1084798, 287785, 1000575, 1595414, 1427235, -792236, -4493914, -6831686, -5857195, -3137313, -1834203, -2750585, -3863385, -3613353, -2831802, -2866221, -3429737, -3434141, -2835682, -2340142, -1978265, -1335063, -803790, -1182225, -2012218, -1675288, 434723, 2868156, 3825585, 3156765, 2064769, 1445129, 1258767, 1193041, 1141424, 1013965, 671360, 236108, 82597, 268440, 216702, -689948, -2193792, -3159268, -2752093, -1521482, -966866, -1905133, -3499288, -4067557, -2695258, 26869, 2551174, 3461884, 2400464, 344326, -1189296, -1554162, -1437678, -1686305, -2103328, -1972851, -1382918, -1108543, -1205786, -714454, 850312, 2478034, 2741430, 1467774, -220724, -1288982, -1723146, -2170684, -2995121, -3720562]
41756c720562L41561J768795K185839R95153o22458q65941N47450K030306K000409
41747D660552N26863j050951j596360j011266m8471L88690J8401n30460l99683
41738I57315M24439R87252M76175p57216j491178r16355M52174J208360N19401
41729A860367q91372j508943p73468L94240R15614P53679M53015K09423K0713
41720A433268J28439N29274N94119K9661l42165K21881R74631P06434k85333p30201
41710C260008n57829q01751j409948j124200J32650P91945K62474k4032P38591
41701A267908J083896j30839j315269m70125J387484J549863k88824j658525r32915
41692D92654P87154J623747R78148o47220k299205k737528j405407M58783J032687
$$ y = [-3720562, -3379001, -1610206, 575633, 1570786, 948328, 82387, 629837, 2660143, 4660552, 5187415, 4136464, 2540104, 1528838, 1480367, 1869057, 1887458, 1356998, 957315, 1381754, 2369006, 2845181, 2087965, 596787, -319568, 132606, 1340966, 1860367, 968995, -539948, -1313416, -919176, -3562, 750117, 1203132, 1412555, 1433268, 1561707, 2090981, 2685100, 2714761, 2372596, 2594477, 3569108, 4275542, 3990209, 3260008, 2702179, 1900428, 490480, -633720, -501070, 290875, 553349, 529317, 1267908, 2351804, 2220965, 905696, 435571, 1823055, 3372918, 3084094, 1425569, 492654, 1279808, 2903555, 3881703, 3234483, 935278, -1802250, -3207657, -2748874, -1716187]
41683a716187L84659K10795R58103J127098J5938q95654m70184L9662q36305j982647
41673c164722j178281J302935K700277J444686q80194j738176n99924R41693J309387
41664A37681N47598o4257K98352R21990M84815j028717k130288j839462r35759
41655c608047n12895k86027M96361J262359Q29396m30580q41945N7309Q72880
41646b161189O11952J7949k784K15320K08375M92844J303020J471354K09766r47147
41636A419460O523K211894K693594O02590j520701j480114l28706j87420r38409
41627B478711j033611m19530l79437r31964o98874M70798R02272j95735j286506
41618a093876q32366M29725Q14751J52517m37674m10582r5269K67724N48372L20144
$$ y = [-1716187, -1331528, -1120733, -162630, 964468, 980406, 84752, -385432, -345770, -1182075, -3164722, -4343003, -3040068, -339791, 1104895, 224701, -1513475, -2113399, -1171706, 137681, 685279, 621022, 919374, 1841364, 2326179, 1297462, -832826, -2672288, -3608047, -4120942, -4406969, -3910608, -2648249, -1818853, -2249433, -3091378, -3034069, -2161189, -1549237, -1531288, -1534072, -1318752, -1110377, -617533, 685487, 2156841, 2366607, 1419460, 1425983, 3637877, 6331471, 6934061, 5413360, 3933246, 3604540, 3417120, 2478711, 1445100, 1025570, 646133, -285831, -984705, -513907, 388365, 192630, -1093876, -1926242, -1496517, -681766, -529249, -966923, -1377505, -1472774, -1205050, -656678, -336534]
41608c36534l71395m23844Q02468J969906J364781m10940j173933m17253J86961
41599A190217k72927o65438j55467K58018k82126p60896k7974J140472J331757
41590A755636P58286N82095Q37888P02839J79512j73768o70081j879795k911077
41581h18465k185879K4604J611165J449354N85595K25257J87417K3757J01063
41572A203868N48879M19806q39423k006112j564087n3724M85908o14620j649459
41563d068964q79200J042920J876566P66753n56342m3530J810307K405891M29524
41554B783925k298197l049603j401032P94833J982200K100885J518689L34373
41546B766073r83937j578360j303777q30462l36311O80207J827826J555382n10065
$$ y = [-336534, -707929, -1131773, -329305, 1640601, 3005382, 2594442, 1420509, 1003256, 1190217, 917290, 251852, 96385, 354403, 72277, -688619, -716593, 423879, 1755636, 2513922, 3096017, 3933905, 4636744, 4816256, 4642488, 3972407, 2092612, -818465, -3004344, -2979740, -1368575, 80779, 666374, 891631, 1079048, 1102805, 1203868, 1752747, 2172553, 1333130, -672982, -2237069, -2290793, -1804885, -2419505, -4068964, -4948164, -3905244, -2028678, -1261925, -1818267, -1861797, -51490, 2354401, 2783925, 485728, -2563875, -3964907, -3170074, -1187874, 913011, 2431700, 2766073, 1782136, 203776, -1100001, -1930463, -2266774, -1586567, 241259, 1796641, 1286576]
41537A286576k243874j544450O33577J466871J70533j072335l76255J308533J862392
41528A491568J023780L53775O34088Q38713M4907r32071q11035N0336J92841n70201
41518B316701q92156k66128M1770p00712j113872M3811J429274J007629n14482
41509A351835o37636Q69482J572159L57566r21219p49151k94457q85608j433217
41500g70246m84323Q88645O71051p18049j057792K11903J393200J230080K42559
41491A607028o68622j205551j094082q1575J166192J438852N91707j87570Q9100
41482A655479J180962K055461J645058m41373l056635l910012k006976P89274
41474b088762J911036J240336O04756P27661O60913N3791j58989L75692P77409
$$ y = [1286576, -957298, -2501748, -1868171, -401300, -230767, -1303102, -1679357, -370824, 1491568, 2515348, 2869123, 3503211, 4341924, 4386831, 3454760, 2643725, 2694061, 2886902, 2316701, 1424545, 1158417, 1200187, 499475, -614397, -570586, 858688, 1866317, 1351835, 714199, 1583681, 3155840, 3513406, 2592187, 1843036, 1548579, 662971, -770246, -1254569, -365924, 305127, -412922, -1470714, -1258811, 134389, 1364469, 1607028, 938406, -267145, -1361227, -1442802, -276610, 1162242, 1753949, 1566379, 1655479, 2836441, 4891902, 6536960, 6095587, 3038952, -871060, -2878036, -2088762, -177726, 1062610, 1667366, 2395027, 3055940, 3109731, 2950742, 3326434, 4103843]
41465D103843N57400J65977l86402j557937k532087j605120Q78424K135213P19651
41456B478962j247146j140711N53064J436916O91839m85824j026167q37237j66828
41447B56868L81181j70167j728744k356620n45751K223355K920336Q32270j592322
41438B20406j906680l17512J158868J130156n8442j046850r39582j93565Q6889
41429a866312k80028l78270J96920O18819L46050J65764O66488Q24925l85657
41420i1301j846008j517485O05196K441487K507775J125629p72290k353897k548487
41411b449381q55641J296510J724860L54360p37761m57332K21l72025n76762M77478
41401a595473J822250J754328L42375q25093p69197J67900J161918J421370M71234
$$ y = [4103843, 4661243, 4827220, 4440818, 2882881, 350794, -1254326, -375902, 1759311, 2478962, 1231816, 91105, 644169, 2081085, 2772924, 2287100, 1260933, 423696, 256868, 638049, 467882, -1260862, -3617482, -4163233, -1939878, 980458, 1812728, 220406, -1686274, -2003786, -844918, 285238, 226796, -820054, -1759636, -1953201, -1866312, -2146340, -2524610, -2327690, -1708871, -1362821, -1197057, -530569, 294356, -91301, -1937309, -3454794, -2849598, -408111, 2099664, 3225293, 2453003, 99106, -2449381, -3305022, -2008512, -283652, 70708, -667053, -1124385, -1124164, -1496189, -2072951, -1595473, 226777, 1981105, 2323480, 1498387, 729190, 897090, 2059008, 3480378, 3951612]
41392C951612j063953j608783o26099K95409l50409j448548p26251J584257K670911
41383B678146J126893j003695j219535L8581N44515k50136q27788l39472K01617
41374I49126j37717o69399l80101L63672N40890J97215K04067O34290O41895k6144
41364B317794n96428o23048o46446r66006q10944L63903J511333J078168p82804
41355H45522k135382j527817M06870J854426J779296O61002l81170p46539n73585
41346A82623j48530L87839O23885j35249j747916k614142j347430J032354J942318
41337a824248N65043j069555r39123M53587J368959J293893Q27902K32817m01483
41328E07792m12739M46246R84660J27282j174577j297180n79434o29257j417058
$$ y = [3951612, 2887659, 1278876, 652777, 948186, 597777, -850771, -1577022, 7235, 2678146, 3805039, 2801344, 1581809, 1620390, 2164905, 1914769, 1086981, 747509, 949126, 811409, 142010, -238091, 125581, 666471, 863686, 1067753, 1702043, 2343938, 2317794, 1721366, 1098318, 451872, -514134, -1325078, -961175, 550158, 1628326, 845522, -1289860, -2817677, -2410807, -556381, 1222915, 1883917, 1502747, 756208, 182623, 34093, 421932, 1045817, 910568, -837348, -3451490, -4798920, -3766566, -1824248, -1259205, -2328760, -3267883, -2814296, -1445337, -151444, 676458, 909275, 507792, 95053, 541299, 1525959, 1653241, 478664, -818516, -1397950, -2027207, -3444265]
41319c444265j286290J30765J223526J010768M39783N29544R87509J220770J090845
41310A902955K76217j368833k527533j556225O45227J238309l41778j370171k12036
41301c313868J069163L73579q25616j82611J349045J206301l45575q31596R8942
41292a402236L32255p62634j254193j13632J034432O64455m01693o85443j69312
41283b758001M68676J164925J726945J115959j008371k863136k234418N86076
41275c801345K778728K150076m24606k107668j312160P25282J733911J184254
41267I26472M40937L84173K83062m62480r52618l55190L77123k5029q41228m09551
41257f34329J027199J561570O03180m05510m74202l04697n32013n60450L8400
$$ y = [-3444265, -4730555, -4599790, -3376264, -2365496, -1925713, -1396169, -408660, 812110, 1902955, 2179172, 810339, -1717194, -3273419, -2628192, -1389883, -1731661, -3101832, -3313868, -2244705, -1871126, -2696742, -2879353, -1530308, -324007, -669582, -1501178, -1402236, -1069981, -1832615, -3086808, -3200440, -2166008, -1501553, -1903246, -2588689, -2758001, -2289325, -1124400, 602545, 1718504, 710133, -2153003, -4387421, -3801345, -1022617, 1127459, 702853, -1404815, -2716975, -1991693, -257782, 926472, 1367409, 1751582, 2034644, 1572164, 619546, 264356, 641479, 616450, -224778, -634329, 392870, 1954440, 2557620, 2152110, 1677908, 1373211, 841198, 280748, 319148]
41248C19148N21774K92577n5916R7259K92172j14868q73219j352671j292336n91766
41238b757846O25942J396875O82778p41965p02597J252998K715004J606490q58978
41229C218701j916269r27710K85392K08061p40140j163512k89488J246245J774528
41220A695808L41537j658533j755980K31593J696627R44766m99892o93621l24742
41211b2437q17271j247797n4632J478816Q43533j185217j296051R45903K146386
41202G91233N08829j335630p06319J007171J047758k68012o36096K65860P34677
41193A409471J24878n99820r90167j483903j781109r20219Q70026K076250J818894
41184E24301N37109j055143k246190j953328N7014J776750R52264j404606j895552
$$ y = [319148, 840922, 1133499, 1077583, 1174842, 1467014, 1352146, 478927, -873744, -2166080, -2757846, -2131904, -735029, -52251, -794216, -1496813, -243815, 2471189, 4077679, 3218701, 1302432, 374722, 660114, 868175, 128035, -1035477, -1324965, -78720, 1695808, 2037345, 378812, -1377168, -1145575, 551052, 1495818, 995926, 302305, -22437, -839708, -2087505, -2142137, -663321, 180212, -1005005, -2301056, -1355153, 791233, 1300062, -35568, -741887, 265284, 1313042, 1045030, 408934, 674794, 1409471, 1534349, 934529, -55638, -1539541, -3320650, -4240869, -3370843, -1294593, 524301, 1061410, 6267, -2239923, -4193251, -4136237, -2359487, -1407223, -2811829, -4707381]
41175d707381L36773K173941J213083p14842p23164O70951R93974J70351K09640
41166c76674J206025J036386o70106j459846k1545J549968J087684l42710n08590
41157A500592M04314N97404j84819p30531q01340j027373q45676P75691K563418
41148B251680J774438j466064l414097j696622J343187K161548P96331k62191
41140A488210l54176q18602j648840j194077N46158J241076j73351j608189r23158
41131c444949R90546J851362J228866L68796j18307m87153m80337L03834R51382
41122A164040J07971j550149j618710O46495K884858K593559L18884j342616j154334
41113B049998l13852l73627j309110j926299j434713j80132R04126J256987J058527
$$ y = [-4707381, -4370608, -2196667, -983584, -1698426, -2421590, -1750639, -756665, -586314, -376674, 829351, 1865737, 1195631, -264215, -285760, 1264208, 2351892, 2009182, 1500592, 1904906, 2502310, 2317491, 1586960, 785620, -241753, -1087429, -311738, 2251680, 4026118, 2560054, -854043, -2550665, -1207478, 954070, 1750401, 1488210, 1134034, 315432, -1333408, -2527485, -1981327, -740251, -913602, -2521791, -3444949, -2454403, -603041, 625825, 994621, 876314, 389161, -91176, 212658, 1164040, 1272011, -278138, -1896848, -1250353, 1634505, 4228064, 4546948, 3204332, 2049998, 1736146, 1362519, 53409, -1872890, -3307603, -3487735, -2583609, -1326622, -268095]
41104b68095P15442K39439n08749j107275p85345M47630J540916J646573J001721
41095B922257J42313r46633k107500k254637o43434J496116K074164R16144n6661
41086A542129K65199O77048j12304j218332r58847M35999J134813L76864p26278
41077A416291j087953q86069n50671J37916J184159J653867Q59149l29369m63659
41068A933661L96611O84199l92424j576254j254317K26221R65165J41565q73624
41059B50803n38344O62576J050605K43797n10366m30862j77726l03289j67416
41050G9778O75332J230828N07232o98106r34693l68684k70394o63902l71130O45123
41040a68616R72281J63291m65577j57261L4977o42741j071887k34454Q00000O19746
$$ y = [-268095, 447347, 686786, 178037, -929238, -1714583, -1266953, 273963, 1920536, 2922257, 3064570, 2117937, 10437, -2244200, -2887634, -1391518, 682646, 1598790, 1542129, 1807328, 2484376, 2372072, 1153740, 194893, 630892, 1765705, 2142569, 1416291, 328338, -557731, -1108402, -970486, 213673, 1867540, 2726689, 2397320, 1933661, 2330272, 3014471, 2622047, 1045793, -208524, 17697, 982862, 1124427, 250803, -287541, 375035, 1425640, 1669437, 1159071, 728209, 550483, 247194, 79778, 755110, 1985938, 2493170, 1795064, 860371, 491687, 221293, -442609, -813739, -168616, 803665, 966956, 501379, 344118, 379095, -263646, -1335533, -1569987, -769987, -150241]
41030a50241p8125J72648P96730J14567j348723j144749J139428K677875J267556
41021C446966j526742k586031j284570L14907N62708j43924o90571p55613n52873
41012c215743K291J124721K393503K769821J687143o3472j006549o79301j29278
41003B883136l27180p38899l51037L88645K5444j480461k283371j206579N17907
40994b572395J026730L42218q3477L32696P98498O69191K09836j85068m13728
40985A24501j52226R71251K262603K054804k42317k782671k982186n42752K024481
40976G35488K208540K92536j229437q23779L08665O2853j598897k526679j254103
40967c824813J090467K335134J889633Q71488J37191n46780j319444j449000l98711
$$ y = [-150241, -228366, -55718, 741012, 855579, -493144, -1637893, -498465, 2179410, 3446966, 1920224, -665807, -1950377, -1635470, -1072762, -1216686, -1907257, -2662870, -3215743, -3213452, -2088731, 304772, 3074593, 4761736, 4698264, 3691715, 3012414, 2883136, 2555956, 1817057, 1466020, 1854665, 1880109, 399648, -1883723, -3090302, -2572395, -1545665, -1203447, -1286924, -954228, -155730, 513461, 723297, 538229, 124501, -27725, 943526, 3206129, 5260933, 5018616, 2235945, -746241, -1288993, 735488, 2944028, 3236564, 2007127, 1183348, 1492013, 1554866, -44031, -2570710, -3824813, -2734346, -399212, 1490421, 2361909, 2499100, 1952320, 632876, -816124, -1214835]
40958a214835J058369J598070R67182J79171Q9931L35419k6456j108071j909488
40949c0708j589379o13958j12795k47802m7135Q82579J446973O93962m15808j75485
40939b09556J237290J824932O91644o15752m24289O98792J027143K15150n79796
40930C865558o43427m23768l67079k17545K72304P79597Q66314M59507k61656
40921D329805j012001j433393j408973j219957r75999k76415Q95947J450777M36629
40912G86420j290516j927902j159563k99536O1977Q25000K255876K881522J616488
40903C749766m30883j555604j639266j391849o78462O51933J313497R8014j714671
40894a597525j697121J26985J286251O54294j12704L61314R45675J77854j138844
$$ y = [-1214835, -156466, 1441604, 2408786, 2587957, 2677888, 3013307, 2986851, 1878780, -30708, -1620087, -2234045, -2346840, -2594642, -2641777, -1759198, -312225, 381737, -34071, -209556, 1027734, 2852666, 3544310, 2928558, 2504269, 3203061, 4230204, 4445354, 3865558, 3222131, 2798363, 2431284, 2213739, 2486043, 3265640, 4131954, 4591461, 4329805, 3317804, 1884411, 475438, -744519, -1720518, -1996933, -1100986, 349791, 786420, -504096, -2431998, -3591561, -3891097, -3829120, -3004120, -748244, 2133278, 3749766, 3318883, 1763279, 124013, -1267836, -1946298, -1294365, 19132, 117146, -1597525, -3294646, -3167661, -1881410, -1227116, -1339820, -978506, -32831, 145023, -993821]
40885i93821j217528j6911R44092P81073j32574j132781j578580p78085J067996
40876c057119K303463J571277j70112p76986J19777Q08844K40723n54760l94752
40867I0355J31877k55065j398116j868464r46009O04947J729810K154227K020812
40858B264374J276194N8993q09500o40166q5602m84810j705546j862964j01647
40849b090674J525253O44494j675381k044384K69103K037319Q09129j436384j309693
40840c271218J105765K840312K415985J000592l09507j605951k413577j482921
40832a720520Q25317K138837J182385m71035r04361m89441o57908j418704j681235
40823c196665j111622j55571J082226K504995L095139J861705m04581j645105
$$ y = [-993821, -2211349, -2228260, -1284168, -503095, -635669, -1768450, -3347030, -4125115, -3057119, -753656, 817621, 647509, -129477, -9700, 799144, 1039867, 485107, 90355, 222232, -32833, -1430949, -3299413, -4245422, -3640475, -1910665, 243562, 2264374, 3540568, 3599561, 2790061, 2149895, 2064293, 1579483, -126063, -1989027, -2090674, -565421, 79073, -1596308, -3640692, -3371589, -1334270, -525141, -1961525, -3271218, -2165453, 674859, 3090844, 4091436, 3781929, 2175978, -237599, -1720520, -895203, 1243634, 2426019, 1954984, 1050623, 561182, -96726, -1515430, -3196665, -4308287, -4463858, -3381632, -876637, 2218502, 4080207, 3675626, 2030521]
40815B030521r48029M90679R34477q2575j551413k033061r53763P45329J480046
40806A12211Q32090n5761k35489j54870l61614j70711R87343J827606P20043j494388
40796B006460k295222j142024j83806q00433j611273j018516K27385O02843M06458
40787c808128Q54496J641210J485760N27123O2421J08883o00391j956391k009951
40778c694968k7549J870809J476096m49915j403446n73388N18128M54216m04602
40769b234619p75105k4101J285241J914276J107734m37515j188446p11244j90883
40760a254662m21354m40365O33625J583615P90876q56321j080735Q0763L51518
40751f13040p57875r16706R65998K482829J426146o10751p80084O14846J013212
$$ y = [2030521, 1082492, 1573171, 2507648, 2425073, 873660, -1159401, -2113164, -1367835, 112211, 944301, 888540, 653051, 498181, 136567, -34144, 953199, 2780805, 3500848, 2006460, -288762, -1430786, -1614592, -2415025, -4026298, -5044814, -4817429, -4214586, -3808128, -2953632, -1312422, 173338, 700461, 762882, 871765, 271374, -1685017, -3694968, -3722517, -1851708, -375612, -825527, -2228973, -2802361, -2284233, -1830017, -2234619, -3009724, -3033825, -1748584, 165692, 1273426, 835911, -352535, -1063779, -1254662, -1676016, -2116381, -1482756, 100859, 891735, 35414, -1045321, -964558, -613040, -1370915, -2287621, -1321623, 1161206, 2587352, 1976601, 1196517, 1811363, 2824575]
40742B824575j92758j164309q82447k91603j90741k38326j89541j74804K53196
40733b46758J423357K054719O58122j618031k015096k92984P95181k29227j549081
40724a019798j358577n05462k75418n541J101030J858175J036301k26225k29202
40715C75283M26335Q1782j008417j313089p43522l67311j14306P87609J573037
40706c02599O97021j264222j943334o45980P67654Q38737K11893j36596l15859
40697b093285m19535J41380J302940J882048J258339J58371p90210j684361j957191
40688b201504l82831K393441L333790Q24612k474830k721954O8029K251629J472923
40679B563305p83774j809589j007811J87995N43050J79815n0234L21873Q87936
$$ y = [2824575, 2631817, 1467508, 585061, 293458, 102717, -135609, -325150, -499954, -246758, 1176599, 3231318, 3889440, 2271409, 256313, -36671, 758510, 529283, -1019798, -2378375, -2883837, -3159255, -3164796, -2063766, -205591, 830710, 604485, 375283, 801618, 883400, -125017, -1438106, -2181628, -2548939, -2663245, -1875636, -302599, 394422, -869800, -2813134, -3459114, -2691460, -1852723, -1640830, -1777426, -2093285, -2512820, -2371440, -1068500, 813548, 2071887, 2230258, 1440048, -244313, -2201504, -2584335, -190894, 3142896, 3967508, 1492678, -1229276, -1161247, 1090382, 2563305, 1779531, -30058, -1037869, -849874, -306824, -127009, -177243, 144630, 1032566]
40670A032566Q35467m4399j016886j317463j076325q43847n20164M52891J862248
40661f35912K540249J755035J94129q68914r81484o41660l44476p9885K60724
40652A197806N04355M37578J59725j5480Q4746L13563L04175j84050q28149q37851
40642A136418M0049P73616J57412j218923j330707L10300J453083K72805j542010
40633E2043j100781J028072J395306q95489k561744j232911Q99413P91013o54320
40624b279398n36027J093661J738522R60007P04322J306456Q26576j027494j753150
40615A033475j18590J575932J004093q53719j753504j506444j235889j003355
40607b858001l12183K61649j627l36733L01577J188217Q43263n08873j293354
$$ y = [1032566, 1868033, 1823634, 806748, -510715, -1587040, -2430887, -2951051, -2498160, -635912, 1904337, 3659372, 3853501, 2984587, 2003103, 1361443, 1016967, 937082, 1197806, 1702161, 2139739, 2299464, 2283984, 2368730, 2682293, 2986468, 2802418, 1974269, 1136418, 1176467, 1950083, 2107495, 888572, -442135, -131835, 1321248, 1594053, 52043, -1048738, -20666, 1374640, 479151, -2082593, -3315504, -2416091, -1625078, -2279398, -2815425, -1721764, 16758, 976765, 1681087, 2987543, 3814119, 2786625, 1033475, 914885, 2490817, 3494910, 2641191, 887687, -618757, -1854646, -2858001, -3170184, -2908535, -2910162, -3246895, -2945318, -1757101, -913838, -1422711, -2716065]
40598b716065r57564k98901K10425P47816J028188N17540l01265l76568K22564
40589a923830M81284K39208L06359P38505O11294j80336m79453K03342P66339
40580G62712L31630k92805l9690N19770M6558j273109j700317l61662J402321
40571f04592J719020O00131j66940N36984J711663J702381M27806p63097j112959
40562D050397j147505j282127j057222l01625J47433k46592o80638k80226M60910
40553c37195O12087L60415L62227K90488m54640j165972p23864K23575o7952j479840
40543b380671j791825l1663J844742J740061L16653l52907J02885L32046j88011
40534d08690l73767M92147J451131J242164J40523m52610L0265O14987K51255
$$ y = [-2716065, -3673629, -3972530, -3762105, -3014289, -1986101, -1468561, -1769826, -2146394, -1923830, -1442546, -1203338, -896979, -158474, 452820, 272484, -206969, -3627, 762712, 1094342, 801537, 761847, 1281617, 1328175, 55066, -1645251, -2006913, -604592, 1114428, 1714559, 1547619, 2084603, 3796266, 5498647, 5926453, 5163356, 4050397, 2902892, 1620765, 563543, 261918, 409351, 162759, -517879, -798105, -337195, 274892, 635307, 997534, 1288022, 833382, -332590, -1056454, -832879, -900831, -2380671, -4172496, -4204159, -2359417, -619356, -302703, -655610, -552725, -220679, -408690, -782457, -290310, 1160821, 2402985, 2543508, 2090898, 2121163, 2736150, 2987405]
40525B987405o47868p77299J59209R49518N36950n57751j057532o15605N1636
40516A028663L00653j2323r12076k082777k390619q33622J738632K938895J507633
40507A283059j056936k179529j020606R84512K003387J560258N30809n5474j8106
40498B031374K3866m24454j036745j082511l98773L97774O43763K59046l21628
40489I1712n32544p1703P28708J035573M49684l15856k47368N23956P61877j98419
40479B225620j401774j308608L78882K247295K524187Q55283j294088k175447
40471B051350j643834j047833j190590j266149l52018R66912J487390J223538
40463B28766J083191J132708O20021m02421r53474p38282m78742m33831p7745
$$ y = [2987405, 2339537, 1562238, 1721447, 2670965, 3207915, 2650164, 1592632, 977027, 1028663, 1329316, 1316993, 404917, -1677860, -4068479, -4902101, -3163469, -224574, 1283059, 226123, -1953406, -2974012, -1989500, 13887, 1574145, 2104954, 2049480, 2031374, 2055240, 1630786, 594041, -488470, -887243, -489469, 154294, 413340, 91712, -440832, -512535, 216173, 1251746, 1701430, 1385574, 1138206, 1662162, 2424039, 2225620, 823846, -484762, -105880, 2141415, 4665602, 5520885, 4226797, 2051350, 407516, -640317, -1830907, -3097056, -3449074, -2482162, -994772, 228766, 1311957, 2444665, 3064686, 2662265, 1708791, 970509, 491767, 57936, -19809]
40454a9809M13551J7524j125183j274802K21446J406116M65173j257008j011361
40445b164353J252245K732002J784358K9411k96282N42880O05818o98555j906896
40436A880628j726508o93401r7044j00432J51705Q56018J067789J90448r63021
40427E66182j246752o41537J35577Q30789J421679J242041k43897j968209k102634
40418b006761n73497P32138O35486L4131L7603L29085L14178L99791Q77156Q48311
40408A627621k26106j007426o9861J541744J461544n81905k328676k041292m02123
40399b026480R01111J102364M90867k33962l42400L07843Q58857N20070n3435
40390A524835L40700J227121P62106j292407k620824j425782R16682J644686J48623
$$ y = [-19809, 393742, 411266, -713917, -1988719, -1767273, -361157, 104016, -1152992, -2164353, -912108, 1819894, 3604252, 3633663, 3337381, 3880261, 4486079, 3787524, 1880628, 154120, -539281, -636325, -736757, -585052, 270966, 1338755, 1529203, 566182, -680570, -1322107, -1186530, -355741, 1065938, 2307979, 2064082, 95873, -2006761, -2580258, -1848120, -1212634, -1178503, -1140900, -811815, -497637, -97846, 779310, 1627621, 1401515, 394089, 324228, 1865972, 3327516, 2745611, 416935, -1624357, -2026480, -1125369, -23005, 467862, 233900, -108500, 199343, 1058200, 1578270, 1524835, 1865535, 3092656, 3854762, 2562355, -58469, -1484251, -567569, 1077117, 1225740]
40381A225740j694329k146622j156220M24779J755114K094869J222718L1528k67386
40372A490191K39942K97361n66349j315567j074305l31228K57027J034585K122387
40363B154044K171150J88540k023934j596336J094368K331775K85144k112018
40355B492733j480836Q20184Q08690j818869l060849p06763K333055K460732M54175
40346B302252m33891L32420L85884j092765j881569l84062J725564K012516P36673
40337C703022m9581J19735k40969j660064k510415j534678L0122K70044m80223
40328b353007l38430Q96194J310292N3733j134390p02305K42814j7499p39808
40319b782406P419J817642K294591Q39907m51448j57464N61077L09168l81110
$$ y = [1225740, -468589, -2615211, -3771431, -3346652, -1591538, 503331, 1726049, 1757577, 1490191, 1730133, 2027494, 1461145, 145578, -928727, -1259955, -1002928, 31657, 2154044, 4325194, 4513734, 2489800, 893464, 1987832, 4319607, 4604751, 2492733, 1011897, 1832081, 2640771, 821902, -2238947, -2945710, -612655, 1848077, 2302252, 1868361, 2200781, 2586665, 1493900, -387669, -771731, 953833, 2966349, 3703022, 3653441, 3773176, 3532207, 1872143, -638272, -2172950, -2142828, -1872784, -2353007, -2691437, -1795243, -484951, -431218, -1565608, -2267913, -2025099, -2042598, -2782406, -2774987, -957345, 1337246, 2177153, 1725705, 1568241, 2129318, 2438486, 2057376]
40310B057376m55718j77704k46828m86600o07601r53543j385746q69671O38749
40301b487286J460485P40848Q9329R59935K006219J193517p72021j541524p23135
40292I26367P2640J36914J53958K44387p789J05278J458881K630500J219101k081944
40282D858293l603697j702459J001023J520107K19856q00191q79940n84051K340
40273C1281Q66952J092347M142j444264j795150r47512J63669R64258J294087
40264B29810R07802J1952m48723n9592K73819k17358q10051n53664k4008l80708
40254a070721j246627j059540O20876K470694L092408K288466O42699j117183
40246D621072k146027j797871l91850Q05364P59134k82570j051301n83520O74176
$$ y = [2057376, 1601658, 1423954, 1177126, 690526, 82925, -870618, -2256364, -3126035, -2487286, -1026801, -285953, -196624, 763311, 2769530, 3963047, 3191026, 1649502, 926367, 999007, 1135921, 1289879, 1534266, 1526477, 1631755, 3090636, 5721136, 6940237, 4858293, 1254596, -447863, 553160, 2073267, 2293123, 1492932, 612992, 28941, 31281, 898233, 1990580, 1994722, 550458, -1244692, -2192204, -2028535, -1064277, 229810, 1137612, 1149564, 700841, 641249, 915068, 697710, -112341, -666005, -690013, -1070721, -2317348, -3376888, -2756012, -285318, 2807090, 5095556, 5738255, 4621072, 2475045, 677174, 285324, 1090688, 1849822, 1567252, 515951, -67569, 606607]
40237F06607J227362K68260j173485j387612j65984R74330Q31942j07180o44598
40228D29642l83980J83013M49745J43740m67578o08858J68678J143463J208651
40219B266516M61542n5628j76118p40216j679490j655359k78046R56403R11877
40210A1481M53879O70312R32632K28941p74767o87715L74476J035376N84745n49649
40200B279711j621982j835409o73780R82008J194354l68333j463033m62558J040322
40191i28700Q26884k95303p2549J164211J205462Q5777N8533J372882J559876
40182D977073k91664j832706j361096m56622r21283j696310j042976L08675O68026
40173a648883M70185J227205K388122J931332j95861j656126j019824M61649R47815
$$ y = [606607, 1833969, 2102229, 928744, -458868, -624852, 349478, 1181420, 1074240, 429642, 45662, 228675, 678420, 822160, 354582, -254276, -85598, 1057865, 2266516, 2728058, 2672430, 2496312, 1756096, 76606, -1578753, -1856799, -900396, 11481, 465360, 1135672, 2068304, 2297245, 1522478, 834763, 1209239, 2244615, 2829360, 2279711, 657729, -1177680, -1851460, -869452, 324902, -43431, -1506464, -1969022, -928700, -101816, -397119, -469668, 694543, 1900005, 1985782, 2044315, 3417197, 4977073, 4685409, 2852703, 1491607, 1034985, 113702, -1582608, -2625584, -2316909, -1648883, -1178698, 48507, 2436629, 4367961, 4172100, 2515974, 1496150, 1957799, 2905614]
40164B905614L59110j57718j06663q0019o46876j410237j349059j17373J200992
40155E97771J172715q4005q92078l16938M70906n791j201765j340748j55085P05041
40145a049977K41706l34332N10163K111561K265326K91251j772234j680057O6786
40136F50193R07230k46598j508984p43400J359403K290299J222087j63750l56231
40127C410249J73541L70196K69611L28978K91125j40721m03472l5738K10605m83996
40117C990378j314620p64240R92421K027767J170118o07633j617548j299574k69416
40108B307653O36333Q97764M90151o7698k33480j70328m75478j108875j267792
40099A008250n71641K98549N26087J55309k51357m23974l82026j08140K29329
$$ y = [2905614, 3264724, 3107006, 3000343, 2920324, 2273448, 863211, -485848, -603221, 597771, 1770486, 1686481, 794403, 477465, 948371, 942580, -259185, -1599933, -1755018, -1049977, -808271, -1142603, -632440, 1479121, 3744447, 4035698, 2263464, 583407, 650193, 1557423, 1310825, -198159, -941559, 417844, 2708143, 3930230, 3766480, 3410249, 3583790, 3953986, 4223597, 4552575, 4843700, 4702979, 4299507, 4263769, 4474374, 3990378, 2675758, 1911518, 2903939, 4931706, 6101824, 5494191, 3876643, 2577069, 2307653, 2943986, 3841750, 4331901, 4264203, 4030723, 3860395, 3384917, 2276042, 1008250, 436609, 735158, 1261245, 1416554, 1165197, 741223, 359197, 251057, 480386]
40090D80386J50318m27706p24938p0776R25730J044667K37182k18000M15656J217297
40080C029816R18443l79020j537651j953497j908015j569616o40442P68547J692960
40071a578475J278433j40032j327437j398777n73373K20213L74136K44202O30955
40062b270155J519623J762529N44283j188576j645589m91929P75740R68604O19496
40053E94026O76147Q27520J66785j088272j672701r31074M60015J423344J521805
40044A977595J063916N86572K29751m29034j543061k102555q96013J340205K127899
40035B355275N19545j243349q31937O76199N23622j311875k062935n46366J119842
40026h01979J019740K44990O63626J723918J489363j37823j254044q08452L7766
$$ y = [480386, 630704, 202998, -521940, -592716, 333014, 1377681, 1614863, 1396863, 1812519, 3029816, 3948259, 3569239, 2031588, 78091, -1829924, -3399540, -4039982, -3271435, -1578475, -300042, -440074, -1767511, -3166288, -3739661, -3519448, -3145312, -2901110, -2270155, -750532, 1011997, 1556280, 367704, -1277885, -1769814, -994074, -25470, 594026, 1270173, 2097693, 2264478, 1176206, -496495, -1427569, -967554, 455790, 1977595, 3041511, 3628083, 3857834, 3428800, 1885739, -216816, -1112829, 227376, 2355275, 2874820, 1631471, 799534, 1475733, 1999355, 687480, -1375455, -1921821, -801979, 217761, 462751, 1126377, 2850295, 4339658, 4201835, 2947791, 2139339, 2177105]
40017B177105k52996j493138k115975j189937M60873J273377Q22436J74864K36227
40008I2836N03997J36880m70514l48383K65122K27258n50841r39682m82978M7239
39998a519066K29895N95922J258825J477198J084654Q30200P69237j6501j417289
39989C293075j809796n32856Q72055R89884M17060J66121j2178l58973m7263R80483
39979C957612J028655n72432j643304m41642J106205L15667j701492j748176K31538
39970E32631J267213L05844n94853j61423M99821P18226J291428J878819P06443
39961F444149j879021k755372n73941J950877K178595J175303R73435Q67188o76485
39952G704728k469044k220420m84499J70041o87947r74516K86532J642279J758807
$$ y = [2177105, 1924109, 430971, -1685004, -2874941, -2414068, -1140691, -318255, -143391, 92836, 596833, 733713, 263199, -85184, 179938, 407196, -143645, -1083327, -1566305, -1519066, -1289171, -693249, 565576, 2042774, 3127428, 3957628, 4726865, 4710364, 3293075, 1483279, 950423, 1822478, 2812362, 3229422, 3395543, 3383365, 3024392, 2977129, 3957612, 4986267, 4413835, 2770531, 2328889, 3435094, 3750761, 2049269, 301093, 532631, 1799844, 2105688, 1510835, 1349412, 1849233, 2567459, 3858887, 5737706, 6444149, 4565128, 1809756, 1235815, 3186692, 5365287, 6540590, 7514025, 8381213, 7704728, 5235684, 3015264, 2530765, 2700806, 2012859, 1038343, 1324875, 2967154, 4725961]
39943D725961J005394P4882r84738j811082j534765k31623P95365P77322L69051
39934C185767L49680O06199Q58902J221318J481560R54419k49033q31374p3118
39925G504320Q29588K48908j507333k397604j210984R10167J793125O13161j358358
39916E424990k162843j042034R91258K164244J443056o49869k384961k202830
39908A581011k29768J647467J748215N68988N5049Q91166J612954Q91665m53087
39899H313660p31886J78989R55644Q68250L51792j90590p20828p42366L24756
39890H607421J673922J588978L5343p47651O86906K676143K721220J134712N25528
39881A8902522J969394L690519L905751L164742K953680L413310L727187L818742
$$ y = [4725961, 5731355, 5806237, 4821499, 3010417, 1475652, 1244029, 2039394, 2816716, 3185767, 3535447, 4141646, 5000548, 6221866, 7703426, 8657845, 8408812, 7577438, 7504320, 8333908, 8582816, 7075483, 4677879, 3466895, 4377062, 6170187, 6783348, 5424990, 3262147, 2220113, 3211371, 5375615, 6818671, 6168802, 3783841, 1581011, 1351243, 2998710, 4746925, 5315913, 5370962, 6262128, 7875082, 8766747, 8313660, 7581774, 7760763, 8716407, 9584657, 9936449, 9745859, 9025031, 8282665, 8607421, 10281343, 11870321, 11905664, 11158013, 11844919, 14521062, 17242282, 18376994, 18902522, 20871916, 24562435, 28468186, 31632928, 34586608, 37999918, 41727105, 45545847]
39873D5545847M267316N112923O100026P668172J0181704J2390034J2421043J0597684
39865A14284749R597311J1238125J4723052J8802068K3772644K9886243L5366806
39858B57670998L7800037L6084035K9001277J3743495j0318903l6545083n3770718
39851B73665138n6051329m7510040l6380598k6910278j8935299j2461582q842811
39844F6573201q089505q207679p681135o647342n450511l935345k545268k359261
39836B1657155l329098l813331k638563o71345L41306j97258j382692j927846
39828H038328j240823J38122R02540K07031j305381k099039j416051O1437J134379
39819D420543J123081O4420j424128k344084j964906n37385R01442J478738J097641
$$ y = [45545847, 49813163, 54926086, 61026112, 68694284, 78875988, 91266022, 103687065, 114284749, 123882060, 135120185, 149843237, 168645305, 192417949, 222304192, 257670998, 295471035, 331555070, 360556347, 374299842, 363980939, 327435856, 273665138, 217613809, 170103769, 133723171, 106812893, 87877594, 75416012, 66573201, 58483696, 50276017, 42594882, 35947540, 30497029, 26561684, 24016416, 21657155, 18328057, 14514726, 11876163, 11204818, 11546124, 11348866, 9966174, 8038328, 6797505, 6935627, 7838167, 8045198, 6739817, 4640778, 3224727, 3286164, 4420543, 5543624, 5608044, 4183916, 1839832, -125074, -662459, 238983, 1717721, 2815362]
39810B815362L50587P0537N90203J162337O69423p50666j601883j078119j53082
39801B074699J93761N14769J321256J406685j97266j747852r41839J133223J301503
39792E058939n76945j321300R4256O61250j284553k585761k76086K899278K103830
39783D772908k068501m155403j705092J611248J773704k36660q50579P43766K115601
39774B000992J415622l95929j128689J5896J709141K052135P13957p70152j071288
39765D541685p44781r76121j378804o03032J094269J737887M82793j095397j278100
39756A780399l36688M80157Q07714R73232R73312P10111M64800K59422m11265
39747E701194j390872j464866k27815P55523Q6731j123797q34928O37498J006160
$$ y = [2815362, 3165949, 3236486, 3826689, 4989026, 5658449, 4907783, 3305900, 2227781, 2074699, 2268460, 2783229, 4104485, 5511170, 5313904, 3566052, 2624213, 3757436, 5058939, 4481994, 3160694, 3254950, 3916200, 2631647, 45886, -230200, 2669078, 4772908, 2704407, -1450996, -3156088, -1544840, 228864, -7796, -858375, -114609, 2000992, 3416614, 3020685, 1891996, 1907892, 3617033, 5669168, 6383125, 5612973, 4541685, 3796904, 2820783, 1441979, 838947, 1933216, 3671103, 4153896, 3058499, 1780399, 1443711, 1923868, 2731582, 3704814, 4678126, 5388237, 5853037, 6112459, 5701194, 4310322, 2845456, 2617641, 3373164, 3459895, 2336098, 1501170, 2138668, 3144828]
39738C144828l79995j460514n83313J146194J679699P93869k35246p60250j111664
39729B233608j254621n76734P61376J405496M34352j164582j498805k29144Q10477
39720I21423j1394j747798j967438j51172J402445P33908j012398j306905J64529
39711b974800J372253J105168L60552K92107N47087L98244O5968n1647k69648
39702H45284p04241n34936O55519J695077J262284j39735r35247p17693m65550
39693I60762q45641j513991j895017j584382k77587J601859K599149J813028L80755
39684A238935n1388J25690o71914k092096j938065J89760J801288J179769r0313
39675c08334J13255J090164Q62975l30798n92045L02038O43029j90075q03505
$$ y = [3144828, 2764833, 1304319, 721006, 1867200, 3546899, 4340768, 4105522, 3345272, 2233608, 978987, 402253, 1163629, 2569125, 3003477, 1838895, 340090, 110946, 921423, 910029, -837769, -2805207, -2956379, -1553934, -820026, -1832424, -3139329, -2974800, -1602547, -497379, -136827, 155280, 702367, 1100611, 1166579, 1114932, 845284, 141043, -393893, 261626, 1956703, 3218987, 3079252, 2144005, 1426312, 960762, 115121, -1398870, -3293887, -4878269, -5155856, -3553997, -954848, 858180, 1238935, 1187547, 1313237, 641323, -1450773, -3388838, -3199078, -1397790, -218021, -308334, -195079, 895085, 1758060, 1427262, 835217, 1137255, 1780284, 1590209, 786704]
39666G86704l31292J51073l63206j035277o10871M82221P81533K1449m70501L40077
39656b48090J697211J882455L82516j256377j221497J55944Q14777N7643k39321
39647B025261J321665K829143J485519j819234l124129r55484J453336P68153
39639C984230j932475l165886j872738L2108R19024R17258N28266o0851k20419
39630h71483O98530J930024J912563O34252k34453N6046K74139n42943j403320
39621B453355j044776J1236M53357K71586L75668P33236M33120n86682j287793
39612A812307j110633o20667l79888k54378j27626k42240m06590P3755J022444
39603b33516J002891o66242k336122j879457K44660J372240K84295j092880m43271
$$ y = [786704, 455412, 606485, 243279, -791998, -1402869, -920648, -139115, -117666, -588167, -248090, 1449121, 3331576, 3714092, 2457715, 1236218, 1392162, 2206939, 2264582, 2025261, 3346926, 6176069, 7661588, 5842354, 2718225, 1762741, 3216077, 3984230, 2051755, -1114131, -2986869, -2954761, -2035737, -1118479, -590213, -651064, -871483, -172953, 1757071, 3669634, 4303886, 4069433, 4125479, 4399618, 3856675, 2453355, 1408579, 1419815, 1873172, 2144758, 2520426, 3253662, 3686782, 3100100, 1812307, 701674, 81007, -298881, -553259, -680885, -923125, -1329715, -1255960, -233516, 769375, 103133, -2232989, -4112446, -3867786, -2495546, -2211251, -3304131, -3747402]
39594c747402J745631L017401K226759N31474o30992j061383j067356n76145L45244
39585G83231J025474R90657N89475K37317k56431r63384j228918o73194j04652
39576C99575l80159r46495p43715o9302p2772o69947o49857J02847L23677l01314
39566c007462m33794M83332J010532K03797m91859L85633J623140J291574K30657
39557A295550Q04275K662843K803447K59311k184012k101500p21868m24967j047684
39548A345395q69788J55565N76658J46840N9742O39890Q38651K43030j83444J60656
39538C113195N06563Q4751o45188q17462l65992J88474M93265M18754q0152p51242
39528B144966j134369j094785q45776m35941J73331N84342L71711M4691N65944
$$ y = [-3747402, -2001771, 1015630, 3242389, 3773863, 3142871, 2081488, 1014132, 437987, 783231, 1808705, 2799362, 3388837, 3626154, 3369723, 2406339, 1177421, 504227, 399575, 19416, -927079, -1670794, -1740096, -1812868, -2482815, -3132672, -3029825, -2706148, -3007462, -3441256, -2957924, -1947392, -1743595, -2235454, -1849821, -226681, 1064893, 1295550, 2099825, 4762668, 7566115, 7825426, 5641414, 3539914, 2818046, 2393079, 1345395, 475607, 631172, 1207830, 1354670, 1414412, 2054302, 2892953, 3135983, 2952539, 3113195, 3619758, 3704509, 3059321, 2241859, 1875867, 2064341, 2557606, 2976360, 2896208, 2144966, 1010597, -84188, -929964, -1365905, -1192574, -608232, -236521, -191830, 374114]
39519C74114J690147J921768O15985r62127j353898p08911q6509J41369K55941
39510A887879L06010K53725M31438R19956J028360L37823l22409m632P93431Q82727
39500F514308K48988j45261r2097k34791n93018n21252j72652l93704r13207l57205
39490C340109J349220K328137J465290J72845J22011O80591L69949k95370K94988
39481I827770J627039J307110j082723k775432j665249N70725J010820j68868
39473H651192k31007J624916K820748J241732j505617k294658p53735O23620K86080
39464A0463271n06071j37642P83611N68803q70428j994123j929918j380095j128825
39455C868583q93716j86881N78161N85123k12612j036083j197921o50281J90783
$$ y = [374114, 2064261, 3986029, 4602014, 3639887, 2285989, 1577078, 1490569, 1631938, 1887879, 2193889, 2447614, 2879052, 3799008, 4827368, 5165191, 4842782, 4838150, 5631581, 6514308, 6763296, 6618035, 6525938, 6291147, 5698129, 5176877, 5004225, 4610521, 3697314, 3340109, 4689329, 7017466, 8482756, 8655601, 8777612, 9458203, 9828152, 9532782, 9827770, 11454809, 12761919, 11679196, 8903764, 7238515, 7809240, 8820060, 8651192, 8420185, 10045101, 12865849, 14107581, 12601964, 10307306, 9553571, 10177191, 10463271, 9957200, 9819558, 10603169, 11171972, 10301544, 8307421, 6377503, 4997408, 3868583, 2974867, 2787986, 3366147, 3951270, 3738658, 2702575, 1504654, 854373, 1045156]
39446A045156P64885O51860n1911o66292n75395L3844L75436N9587m23248l74908
39436H39014K18121P41771P35247K66359l70460q56307p31571K80403J545603
39427B668180J788157O35252p33281j190614j178343j527665j570064k20483J437486
39418A08625J019851j305110k375645o35029J320368P70779p92192k07480K045363
39409e0470K564907N30208j097838l44857J034170P42820p78037j752371j677156
39400h28624j026284k0200R41744J066559N08938M43156Q94365L86065j160754
39391A204965j479470L79210J763900K18110k415444k622013m85603R49407P02649
39382a784289O84450J597722J578167k38802j810760j238969N13299J379189R69415
$$ y = [1045156, 1810041, 2461901, 2409990, 1743698, 1168303, 1202147, 1577583, 1637170, 1213922, 839014, 1057135, 1798906, 2534153, 2800512, 2430052, 1573745, 842174, 1122577, 2668180, 4456337, 5091589, 4358308, 3167694, 1989351, 461686, -1108378, -1328861, 108625, 1128476, -176634, -2552279, -3187308, -1866940, -1096161, -1888353, -2095833, -50470, 2514437, 3044645, 1946807, 1601950, 2636120, 3378940, 2600903, 848532, -828624, -1854908, -1875108, -933364, 133195, 642133, 1085289, 1979654, 2365719, 1204965, -274505, 104705, 1868605, 2086715, -328729, -2950742, -3436345, -2486938, -1784289, -1099839, 497883, 2076050, 1837248, 26488, -1212481, -699182, 680007, 1649422]
39373A649422K90584m235M3067J35768k10545j108357j531319m20045J237226
39364H1566J183513p31297j914721p22946J143089J318015J55716l06583M74378
39355F80730J248280J102763K60796p84769j593722j630688q72717j20132J08805
39346a600654K52997N25366K22297p12553q29232N65674J652053O38165j109662
39337c95549r76089O74478J099559k36419q96059J94706R04865k18239j188859
39328a037606P0346J914887J323632j277454k482211q16048J470475J832531M85133
39319A483685p08942p52322N5668J086890J764056J541191L20775j252707k253341
39310A284953k102727q17422Q86013J777795J126375k69707p28623K94916J415481
$$ y = [1649422, 1940006, 1935771, 1978838, 2114606, 1904061, 795704, -735615, -1155660, 81566, 1265079, 533782, -1380939, -2103885, -960796, 357219, 512935, 206352, 680730, 1929010, 3031773, 3292569, 2507800, 914078, -716610, -1589327, -1709459, -1600654, -1347657, -822291, -599994, -1312547, -2141779, -1576105, 75948, 714113, -395549, -1371638, -697160, 402399, 165980, -730079, -535373, 369492, 151253, -1037606, -967260, 947627, 2271259, 993805, -1488406, -2304454, -833979, 998552, 1483685, 774743, 22421, 78089, 1164979, 2929035, 4470226, 4791001, 3538294, 1284953, -817774, -1635196, -749183, 1028612, 2154987, 1885280, 1156657, 1451573, 2867054]
39301B867054R88470q55549k345521k030708k28335J407561J552751M58951m96481
39292A318193n33525l16535o59195r97125k35289J168881J490230L77388m31333
39283A181690J50451P23648k63765j712882j406535M29359J377934N33336l31917
39274F81319J90779J009388N01730r46362j668718r76599M39363J598114J774100
39265B603114O93963q93812j516662p01176K79550J94415m30505l88287K40113
39256H0713M77941K33150K76738O97258P16785O1974n93386o56683k21647L59302
39246A432145P49279N83607j12251o57185n71981l37639m97148n30427K93215
39237C51615J404501J557212O70661k49166p62490j159453j206878l74021O76990
$$ y = [2867054, 3855524, 2999975, 654454, -1376254, -1604589, -197028, 1355723, 1814674, 1318193, 784668, 468133, -191062, -1188187, -1423476, -254595, 1235635, 1613023, 1181690, 1332141, 2055789, 1792024, 79142, -1327393, -898034, 479900, 1013236, 681319, 872098, 1881486, 2383216, 1436854, -231864, -1208463, -769100, 829014, 2603114, 3297077, 2403265, 886603, 185427, 464977, 659392, 228887, -159400, 80713, 558654, 791804, 1068542, 1765800, 2482585, 2544559, 1951173, 1294490, 1072843, 1432145, 2181424, 2765031, 2652780, 1995595, 1423614, 1085975, 588827, 58400, 351615, 1756116, 3313328, 3983989, 3734823, 2972333, 1812880, 606002, 231981, 908971]
39228I08971N43214p01824j393350p88204m5073j07698k51557L78059J197217
39219b60245J192696M34292l25223o73077m93158J52615N47731k18739j785804
39210a428912k625423k054059q85969K31345J466021K316767J567665l06671q70691
39201b589927P37831K162654J461937J43609K69529P20634n53672k251692j434986
39192a334083J275295K166337J88957j566127r58590K10086j87111j118938o49312
39183a973486P16249J273895J007574R78469J097974O67555J75159M42149P00393
39174E085931l32345j889104j893469k69173O80985k84496j519983j101471L78002
39165a145123J020227M89499L4291K34608M29355L20014N06492J056623J064254
$$ y = [908971, 1452185, 750361, -642989, -1431193, -1476266, -1583964, -1835521, -1457462, -260245, 932451, 1366743, 1041520, 368443, -124715, 27900, 575631, 356892, -1428912, -4054335, -6108394, -6994363, -6763018, -5296997, -2980230, -1412565, -1719236, -2589927, -1852096, 310558, 1772495, 1916104, 2185633, 2906267, 2352595, 100903, -1334083, -58788, 2107549, 2296506, 730379, -228211, -18125, -205236, -1324174, -1973486, -1257237, 16658, 1024232, 2002701, 3100675, 3768230, 3943389, 4385538, 5085931, 4753586, 2864482, 971013, 701840, 1382825, 1098329, -421654, -1523125, -1145123, -124896, 364603, 398894, 633502, 1062857, 1382871, 1889363, 2945986, 4010240]
39156D010240L66846K60207J329508J862664J41622k554415l317765j646302J06747
39147E59352L86904J39114K75237n558j048156j232872M20878J996445J278307
39138B769651p84941j574361o73076K22030M37612P34364J015553L10854r42422
39129A515264j080454J02242J073483J116357R22169N51474o98129k103865j875433
39120d76892k85313K96427o75235q65587Q07678J969095O46460j319326j170003
39111a072696N50546J298248N03444l43248m62574k52661J48074O40437L91753
39102A401323p27302j014060N97535K134224J219340r34135j193529M49660Q99512
39093B832568r03079k348349j570623k75286n11260j274783n37148J175135J633994
$$ y = [4010240, 4377086, 4637293, 5966801, 7829465, 7971087, 5416672, 2098907, 452605, 559352, 946256, 1085370, 1360607, 1355049, 306893, -925979, -505101, 1491344, 2769651, 1984710, 410349, -262727, -40697, 396915, 1131279, 2146832, 2457686, 1515264, 434810, 537052, 1610535, 2726892, 3649061, 4200535, 3502406, 1398541, -476892, -762205, -465778, -1141013, -2006600, -1198922, 770173, 1416633, 97307, -1072696, -522150, 776098, 1279542, 936294, 473720, 221059, 369133, 1009570, 1401323, 674021, -340039, 257496, 2391720, 3611060, 2676925, 1483396, 1933056, 2832568, 1929489, -418860, -1989483, -2264769, -2776029, -4050812, -4587960, -3412825, -1778831]
39084a778831L99635p24532m58048M78941P81363J70534p32525j272480j108789
39075d244732k58636P64835J121482M37797n18252m47537Q08094J672018P28549
39066F3618j083122j443342Q8832J402313J032575K14041M56204Q68349n6123
39057A543345j376915j016980O32787J216529K99300j44650N66921N75389j094044
39048A201682k513017j743395L51578J742383J902024J335420J52448j228672
39040A200451j489299k86284O31720n5046r74188k96077J099378J069590j76070
39031G24175n78907J64059K87236p14858j155618j05972J140209J397496J241135
39022B398955J309695R46151j87786q75736j89335Q70427J058261Q60091J116930
$$ y = [-1778831, -1379196, -2103728, -2561776, -2082835, -1301472, -1130938, -1863463, -3135943, -4244732, -4503368, -3738533, -2617051, -2179254, -2697506, -3145043, -2336949, -664931, 63618, -1019504, -2462846, -2374014, -971701, 60874, 274915, 731119, 1599468, 1543345, 166430, -850550, -217763, 998766, 1298066, 1153416, 1720337, 2295726, 1201682, -1311335, -3054730, -2703152, -960769, 941255, 2276675, 2429123, 1200451, -288848, -575132, 56588, 1542, -972646, -1268723, -169345, 900245, 724175, 145268, 309327, 596563, -118295, -1273913, -1379885, -239676, 1157820, 2398955, 3708650, 4654801, 4467015, 3591279, 3401944, 4272371, 5330632, 6190723, 7307653]
39013G307653R41690q78173l171105l397065j270259P38114Q01209k30427p19548
39004A22089m48586j11843j0527j90445p33975j030214P4631K318276L334629
38995C324035J369145k051355l696425k488659l04008Q56849Q89928O14693L38889
38986a146908N8830q773J44722O1748m16063p00674l01434L55176M44673k01379
38976a710082q94564p96782K18023J243811J148713M7050n60062K30198J306388
38967B32693J197947L76931K75280O26821N407j196583j010975N04425Q76399
38958A888345n18926r57217R80392K385943N57139k107385j545105J410089K240927
38949D334202j67168k092694j024356R80144J248169K93620j61455k03511p26991
$$ y = [7307653, 8249343, 7371170, 4200065, 803000, -467259, 270855, 1072064, 841637, 122089, -326497, -438340, -448867, -639312, -1373287, -2403501, -2328870, -10594, 3324035, 4693180, 2641825, -1054600, -3543259, -3847267, -2990418, -2100490, -1485797, -1146908, -1088078, -1096851, -952129, -890381, -1306444, -2007118, -2308552, -1953376, -1508703, -1710082, -2604646, -3401428, -3183405, -1939594, -790881, -743831, -1303893, -1073695, 232693, 1430640, 1807571, 2082851, 2709672, 2715079, 1518496, 507521, 1011946, 1888345, 1369419, 412202, 1392594, 3778537, 4335676, 2228291, 683186, 2093275, 4334202, 4167034, 2074340, 1049984, 2030128, 3278297, 3571917, 3410462, 3206951, 2479960]
38940B479960j417441j571772j418617j195579l85873Q94973J303922K92149p95847
38931a814125p87150k27813K39928J135800K366018K239122J78322j428835m21628
38922A479639J553120J240813j386836l140724k082385M00868J981035J836407
38914A881937N48029q30338j394624j186630j181745j618587j214036O77236K318130
38905b000628J933701P22006J031007K242247J474478j569502l561181k231959
38897a959831N58503J753637R07608m50242j399011j790238j176681N23798J990595
38888a041862J751573J81813r49853o99417K69669Q96700P79546Q5516p58434
38879E15251j121538n16333P50829J522948Q25212q74987j806601q52836Q32233
$$ y = [2479960, 1062519, -509253, -1927870, -3123449, -3509322, -2614349, -1310427, -1018278, -1814125, -2601275, -2829088, -2589160, -1453360, 912658, 3151780, 3330102, 1901267, 1479639, 3032759, 4273572, 2886736, -253988, -2336373, -1935505, 45530, 1881937, 2429966, 1599628, 205004, -981626, -2163371, -3781958, -4995994, -4318758, -2000628, -66927, 655079, 1686086, 3928333, 5402811, 3833309, 272128, -1959831, -1401328, 352309, 1259917, 809675, -589336, -2379574, -3556255, -3032457, -1041862, 709711, 891524, -58329, -757746, -488077, 408623, 1188169, 1273685, 515251, -606287, -1122620, -371791, 1151157, 1976369, 1101382, -705219, -1558055, -725822]
38870g25822J104841k16822j038175j57567R22176O03083q6548N50680J545726
38861B501572O50416j581299k202757n04587Q58421J54258r47009n19355O34241
38852i56099R22186O68641Q64860J039198M67209k1560M25343O97390m90637j970011
38842A646520j677408r507Q41303L65468N0956M46132M30779l89462r10076o28319
38832A66386m01264n04947J5940J231752J534449J50612j239913q54689N48290
38823F46616J009211L95451K60847J046094J261200j43015j963901k206083p07733
38814d01313O61770M35491o15883o32246P56072J906486J387704k05528j306505
38805A986048j470986j387145j273566o02845N25333J009329K49562q64527j057855
$$ y = [-725822, 379019, 162197, -875978, -1033545, -111369, 491714, 405166, 955846, 2501572, 3151988, 1570689, -632068, -1136655, -278234, -123976, -1070985, -1590340, -956099, -33913, 634728, 1499588, 2538786, 3005995, 2984435, 3409778, 4107168, 3616531, 1646520, -30888, -40395, 800908, 1166376, 1217332, 1663464, 2094243, 1704781, 794705, 166386, -234878, -739825, -723885, 507867, 2042316, 2192928, 953015, 98326, 646616, 1655827, 2051278, 2312125, 3358219, 4619419, 4476404, 2512503, 306420, -401313, 260457, 695948, 80065, -552181, 203891, 2110377, 3498081, 3292553, 1986048, 515062, -872083, -2145649, -2748494, -2223161, -1213832, -964270, -1828797, -2886652]
38796b886652j61830R78634J577938J430668P85896J53743m1012P4752l3539n10699
38786A367899q43351o40085k79573m07015j024187j427101r83076J87471J260710
38777b788308J467321R10684M56761O07194Q41650N30987N3094J60788N16436
38768B756607O102j368960k109743j232487L32826J046991O79182J76549K45952
38759E33019Q08850J367616J272566J81449j123481j119705M09144J538316O29604
38750D497378j130506j261890L30875J231506K69616p80703k52464O46766j12767
38741C437811j920871k343578q56192N05564L56270l13308l09839j82191o95058
38732b321392q96234M68408K428262K646813P24282j102581r60734L89011R92216
$$ y = [-2886652, -3048482, -2069848, -491910, 938758, 1724654, 1878397, 1837385, 1912137, 1878598, 1367899, 524548, -115537, -395110, -802125, -1826312, -3253413, -4236489, -4049018, -2788308, -1320987, -410303, 46458, 653652, 1495302, 2026289, 2079383, 2240171, 2756607, 2762709, 1393749, -715994, -1948481, -1615655, -568664, 110518, 287067, 533019, 1341869, 2709485, 3982051, 4163500, 3040019, 1920314, 2329458, 3867774, 4497378, 3366872, 2104982, 2435857, 3667363, 3936979, 3156276, 2903812, 3550578, 3437811, 1516940, -826638, -1682830, -1177266, -820996, -1134304, -1444143, -1626334, -2321392, -3217626, -2749218, -320956, 2325857, 3050139, 1947558, 986824, 1375835, 2368051]
38723B368051L06908o13598r36267j011452j505735k190645j957336j70514K045727
38714c664861K480357M26876j909336j755390O26726K142773R75990j107774j428555
38705c213194J07345J537193J755538J229995M69245m48530j012750n98554K29132
38696E5420J62518q45734j328796m28752R09869J381235R60411N12620M96279
38687A875070O06877K81963o75877j611132j327684M17845K028614J736243j967
38678C329952j055332n65517J49118j04899p90826r41434n59217P6652J075428
38669F13925J977151J555041k57612j559608r66401K70469J62114j035628j509736
38660g50285q15164j87612k53653k86971J78600N81713M74622K31467L40396Q25851
$$ y = [2368051, 2674959, 2061361, 1125094, 113642, -1392093, -3582738, -5540074, -5710588, -3664861, -1184504, -757628, -2666964, -4422354, -3795628, -1652855, -676865, -1784639, -3213194, -3105849, -1568656, 186882, 1416877, 1886122, 1437592, 424842, -173712, 55420, 217938, -627796, -1956592, -2385344, -1475475, -94240, 866171, 1378791, 1875070, 2481947, 2763910, 2088033, 476901, -850783, -432938, 1595676, 3331919, 3329952, 2274620, 1709103, 1858221, 1753322, 962496, 21062, -538155, -461503, 613925, 2591076, 4146117, 3888505, 2328897, 1362496, 1632965, 1795079, 759451, -750285, -1565449, -1753061, -2006714, -2293685, -2115085, -1533372, -1058750, -827283, -486887, 338964]
38650C38964J377849J380660K30403j534356k141262q13854P53985P25465k0092
38641B97762M55908J407854L16309k420090l102032k14160K831669K503297J61901
38632B238418m25924J187531K017429N18147j459209j797961p68020J58980L60163
38623B029554P0965m31531q57189q70101n46291l29395l37903k97164j79122j91683
38613a939860j38757L56905R18752O55466m03224j043328n09001L98417N05224
38604a199406n9720j73444N58531J188531P05090n98473j467913j258921o24070
38595b929795l57637j00390R81912K444287K710629J337073j40784m51212m24921
38586C069162j240406j934160o86390J864949K900047J308877q25856j383407
$$ y = [338964, 1716813, 3097473, 3327876, 1793520, -347742, -1161596, -407611, 317854, 297762, 753670, 2161524, 2477833, 57743, -3044289, -3258449, -426780, 2076517, 2238418, 1812494, 3000025, 5017454, 5535601, 4076392, 2278431, 1510411, 1669391, 2029554, 2100519, 1668988, 811799, -58302, -604593, -933988, -1271891, -1569055, -1748177, -1939860, -2078617, -1721712, -802960, -147494, -550718, -1594046, -2103047, -1704630, -1199406, -1259126, -1432570, -874039, 314492, 1019582, 421109, -1046804, -2305725, -2929795, -3287432, -3387822, -2405910, 38377, 2749006, 4086079, 3945295, 3494083, 3069162, 1828756, -105404, -791794, 1073155, 3973202, 5282079, 4456223, 3072816]
38578C072816q37793n66146m11947K83878O36502n62869k243226j946694O24458
38569a951021K920504K856046J163819k34446p52609j013623j255250j113131
38561F20289n58553k9963K50821L83177L11291j44427q09479j216074j154358
38552b347276p59794q4479R56324K128761K812682K635065J911808J226514P65478
38543I245083L30563j38979m26426m42260l99620l97144j43460N72807J377448
38534I578012J727733J686036J706044J731738J334418R06430J596068L264862
38526B3531341L533071L69326m688116p555432o198947k807017p49108p36885
38518D698233j119779q65102n40656o53841o70252o8035P45452J085547Q56376
$$ y = [3072816, 2235023, 1668877, 1256930, 1540808, 2177310, 1614441, -628785, -2575479, -1951021, 969483, 3825529, 4989348, 4754902, 4002293, 2988670, 1733420, 620289, 61736, 31773, 282594, 665771, 977062, 832635, 23156, -1192918, -2347276, -3107070, -3191549, -2235225, -106464, 2706218, 5341283, 7253091, 8479605, 9245083, 9575646, 9436667, 9010241, 8567981, 8168361, 7771217, 7627757, 8200564, 9578012, 11305745, 12991781, 14697825, 16429563, 17763981, 18670411, 20266479, 23531341, 27064412, 27433738, 22745622, 15190190, 8991243, 6184226, 5435118, 4698233, 3578454, 2713352, 2172696, 1518855, 848603, 780568, 1526020, 2611567, 3467943]
38509C467943L94731J4817m4506K19625K90698l51409j255122j311869l69818
38500A055090L04512k60469j306983j368672j90309J140080J596174J029902r8617
38491A900708j101401j399024j060308p31836n82377P9084J437957K205706J188068
38482A936577p21115j513736p46808K46515O68166J028136J411836Q76432o75111
38473B510892j681604j051228J99822N06200j79721r04152j188571r50161o5719
38464b804242R22604Q79002k6978M4581J645211K403521L99489k374992k576955
38455a488759m21157R61079L84819m24831m86213o64866q20045M89899K528287
38446E8213K276794o44867k496787r54881J257037R50747m98848j27922J282172
$$ y = [3467943, 3862674, 3877491, 3832985, 4052610, 4343308, 3991899, 2736777, 1424908, 1055090, 1359602, 1099133, -207850, -1576522, -1766831, -626751, 969423, 1999325, 1900708, 799307, -599717, -1660025, -2391861, -2974238, -2895154, -1457197, 748509, 1936577, 1215462, -298274, -1045082, -798567, -130401, 897735, 2309571, 3186003, 2510892, 829288, -221940, -22118, 484082, 304361, -599791, -1788362, -2738523, -2804242, -1881638, -1002636, -1029614, -985033, 660178, 3063699, 3463188, 1088196, -1488759, -1909916, -948837, -564018, -988849, -1475062, -2139928, -2959973, -2470074, 58213, 2335007, 1690140, -806647, -1761528, -504491, 446256, -52592, -180514, 1101658]
38437A101658R05462q97699j309605j0933P27056L86215N74514J205322M19026
38428C101016j351001j331637P51670J764616L13771j086822o35998j62594j188828
38419A74193j759620j33244J529984N89411j472244j491741K54756J075178N50893
38410f82434M23575P64303P2531j220974j018807O67692J591269J064331N88171
38401B249657M85869n66871k077855j540450J090336K378457O83348j011828p22
38392A689941J608432N14611k108613k468587k63844J117387J64550q52202j56478
38383g54803P80033K17689q04457m54578O14794K89585j432017k058994n2386
38374c655134K887594L779489J854235p74900j741313q98766J31981K22849k48518
$$ y = [1101658, 2007120, 1109421, -200184, -211117, 515939, 902154, 1476668, 2681990, 3101016, 1750015, 418378, 1170048, 2934664, 3248435, 2161613, 1525615, 1363021, 174193, -1585427, -1718671, -188687, 400724, -1071520, -2563261, -2308505, -1233327, -682434, -258859, 505444, 577975, -642999, -1661806, -994114, 597155, 1661486, 2249657, 2735526, 2168655, 90800, -1449650, -359314, 2019143, 2702491, 1690663, 1689941, 3298373, 3812984, 1704371, -764216, -1028060, 89327, 253877, -598325, -754803, 25230, 242919, -561538, -1016116, -401322, -111737, -1543754, -3602748, -3655134, -767540, 3011949, 4866184, 4091284, 2349971, 1451205, 1583186, 1806035, 1557517]
38365A557517m58195k76674m2974R8872J57402N4391j54523k29994k47526o15743
38355a57447j198396j072174J76881J458460J341469n0121j151456r40551q2617
38346a675952Q8597p35235j453334q32863R01076K039796J348050k64493q71739
38337a456097j75590K63467l31890p09740J26474R75450L13895j068611j184021
38328c246663J13997J143881J081611O98829N35155K52511r0988P392Q8459p59736
38318a75552j682655n99544K252514L626327J536932j744760k763740j350309
38310i00787K2841J00733k80225m97757q97712j267068p22231M55959O92903m80041
38300c773385j362169l26421J882105L008582J890848m82918k170863k059365
$$ y = [1557517, 1099322, 822648, 779674, 878546, 1035948, 1090339, 935816, 705822, 458296, -157447, -1355843, -2428017, -2251136, -792676, 548793, 498672, -652784, -1593335, -1675952, -1587355, -2322590, -3775924, -4608787, -3707711, -1667915, -319865, -584358, -1456097, -1631687, -1368220, -1700110, -2409850, -2283376, -1307926, -994031, -2062642, -3246663, -3132666, -1988785, -907174, -208345, 326810, 579321, 488333, 495725, 584184, -175552, -1858207, -2457751, -205237, 3421090, 4958022, 3213262, 449522, -900787, -877946, -777213, -1057438, -1555195, -2452907, -3719975, -4442206, -3986247, -3293344, -3773385, -5135554, -5461975, -3579870, -571288, 1319560, 836642, -1334221, -3393586]
38292c393586o69393N36144P17206M10464M90910Q10439N71668k30636p18980
38283a475764m96398j10191N0707L26795Q34448Q76651j117j034091j097429j78057
38273b304446O71090O25443j81589j013477j142759l04534R79192J640214J067075
38264C6209j70115r31113p70599k69189j76373n76950r10016n21629P81582K402201
38254a105992L172224K321626M03514j097296j330329r16933q66761j066454o00271
38245a086672N41048J097542L09016q71505j134764o52992m69611n99242j74239
38236c041419O92575Q51204J96575J05047J088178J661135O63283p75741j005357
38227D35480k91588J53416L74972R21553R10756p01134k459608j743826J158480
$$ y = [-3393586, -4062979, -3526835, -2809629, -2399165, -1908255, -1097816, -526148, -756784, -1475764, -1972162, -2082353, -2031646, -1704851, -870403, 6248, 5131, -1028960, -2126389, -2304446, -1633356, -1007913, -1189502, -2202979, -3345738, -3650272, -2671080, -1030866, 36209, -133906, -1065019, -1835618, -2104807, -2281180, -2858130, -3768146, -4289775, -3508193, -1105992, 2066232, 4387858, 4791372, 3694076, 2363747, 1446814, 580053, -486401, -1086672, -545624, 551918, 860934, -10571, -1145335, -1798327, -2267938, -2867180, -3041419, -2348844, -1497640, -1301065, -1196018, -107840, 1553295, 2216578, 1440837, 435480, 143892, 297308, 672280, 1593833, 2504589, 1803455, -656153, -2399979, -1241499]
38218a241499K976085J994402J18464m83580k73910n01541p55315k30543K96335
38209A898898k49759j210668j241101l84914M46414J000844J198083L66088j340896
38200D82989k058275o98731R30113P09516l25595K22356J843213J816593j77368
38191B744811j480432p80360K00521Q8422j45926K69431K79342n23439m71060
38182A81310J190021K232698O45154j996165k748962j416641k8000N76715J114174
38173b49696J627010J389078O69796M01822L67661k68474r84685o02465L00405
38164B650452J676j329988j639689m01986M22607l07975r74277O2928J661652
38155A45400J597753j40443j502966j223906o7348N57109J89540m43372k74843
$$ y = [-1241499, 1734586, 3728988, 3847452, 3363872, 3089962, 2588421, 1833106, 1602563, 1898898, 1649139, 438471, -802630, -1187544, -741130, 259714, 1457797, 1823885, 482989, -1575286, -2274017, -1343904, -634388, -959983, -737627, 1105586, 2922179, 2744811, 1264379, 484019, 684540, 772962, 627036, 896467, 1175809, 652370, 181310, 1371331, 3604029, 4249183, 2253018, -495944, -1912585, -1940585, -1363870, -249696, 1377314, 2766392, 3436188, 3838010, 4205671, 3937197, 2952512, 2350047, 2650452, 2652128, 1322140, -317549, -719535, -296928, -604903, -1579180, -1516252, 145400, 1743153, 1602710, 99744, -1124162, -1191510, -634401, -444861, -888233, -1163076]
38146a163076Q50600J693084J030143m23087o66910O68660J537213M80973j059009
38137B948591r01869N45211R99203k21989j411381j191146k44167J36025j76182
38128D82296m83256m07517o2717K45809R8096o34777j248103q32413L45565R93131
38118a503886O16310J48608K74672L10498l81358r82888n04660L53842J88119
38109a480743p12434o70400O71699J684371J246879L04800R2618K09808l02820
38100A043778j021701p77806L05944Q89237L77224m83219r84874j219412j267421
38091c138250p84696J77731Q67003Q28712M94839L74375L44178J35958j21680
38082h21830k27873j90962N4585N22349O31632k29114j352949j204338J77059
$$ y = [-1163076, -312476, 1380608, 2410751, 1987664, 1320754, 1989414, 3526627, 4007600, 2948591, 2046722, 2591933, 3591136, 3369147, 1957766, 766620, 522453, 658478, 482296, -960, -408477, -471194, -225385, -127289, -762066, -2010169, -2842582, -2497017, -1503886, -887576, -738968, -464296, -153798, -535156, -1518044, -2022704, -1668862, -1480743, -2193177, -2863577, -2191878, -507507, 739372, 1044172, 1136790, 1346598, 1043778, 22077, -755729, -449785, 439452, 816676, 333457, -651417, -1870829, -3138250, -3922946, -3745215, -2878212, -2049500, -1554661, -1180286, -836108, -700150, -821830, -1049703, -1240665, -1186080, -663731, -32099, -261213, -1614162, -2818500, -2641441]
38073b641441P16214p13876k257002j555892Q49705K466165K395496J812738J296111
38064B368218R3944j648309k238238r59909N47925N76075l96029q74071n63501
38055c093895j57831R7495K97928O5699q08934j378839n07060J343445K404232
38046a737760J696496l036j240358j188400K2505J493115K029059J075291o81135
38037A465777j987606k213633j560527m46195P21180J376083J103612J91849n25352
38028a874812l94725O35796J982036K533776J369901j019183k691250k233325
38020a691786m93393M93369P6217m85480m3080R60845J400933J011435L97625
38011A626685k4833m27779r54732j212273p18056K06160M58942m55287j353134
$$ y = [-2641441, -1925227, -2639103, -4896105, -6451997, -5602292, -3136127, -740631, 1072107, 2368218, 2462162, 813853, -1424385, -2384294, -1836369, -1260294, -1656323, -2530394, -3093895, -3251726, -3154231, -2856303, -2790604, -3599538, -4978377, -5485437, -4141992, -1737760, -41264, -44300, -1284658, -2473058, -2450553, -957438, 1071621, 2146912, 1465777, -521829, -2735462, -4295989, -4742184, -4021004, -2644921, -1541309, -1349460, -1874812, -2269537, -1633741, 348295, 2882071, 4251972, 3232789, 541539, -1691786, -2185179, -1691810, -1615593, -2101073, -2144153, -1183308, 217625, 1229060, 1626685, 1601852, 1174073, 219341, -992932, -1710988, -1504828, -1045886, -1501173, -2854307]
38002b854307n80179J580911K794764J584035o48281j492625n99302L98449M21042
37993F04507j23287o80371j183616j225444k09849J210622J352440r6178j215219
37984a566395m03105J282146J559321L1135j411400j069892P02570K155314J971763
37975C251457M09940r69439q08977N35195J298117M33116j065644j507078o70816
37966I05871J72738J38970l00538l10865J24203L59771n986o89348r87959m11502
37956a004645P13332J281469M57338j181090j975558j014594O75178J281098M30475
37947c36997m41300j80291M56076Q7682r59413j016846K00467Q93238n188q83602
37937b186174J51245K096479K342438O09083p28926l72693K20171l30120j020360
$$ y = [-2854307, -3434486, -1853575, 941189, 2525224, 1876943, 384318, -214984, 183465, 604507, 481220, -199151, -1382767, -2608211, -2818060, -1607438, -254998, -351176, -1566395, -1969500, -687354, 871967, 903102, -508298, -1578190, -875620, 1279694, 3251457, 3661397, 2691958, 1882981, 2418176, 3716293, 4149409, 3083765, 1576687, 905871, 1078609, 1217579, 917041, 606176, 730379, 1090150, 1084164, 394816, -593143, -1004645, -291313, 990156, 1447494, 266404, -1709154, -2723748, -2048570, -767472, -336997, -778297, -958588, -502512, -414830, -1374243, -2391089, -2190622, -1297384, -1302572, -2186174, -2034929, 61550, 2403988, 3013071, 2284145, 1911452, 2131623, 1801503, 781143]
37928G81143m26249P52069R01497J24327j84873K50937L29070n14996j528483
37919D84442j735816q47860O72902J680482J077944o24012j335873j31446J100538
37910C41301L71171j135913q07768J076445J621135k6265j322033n30897N66333
37901A53509j72273j739613j800313l52827P70966R98383J266740J718007J365125
37892B207704N9655j017798j047801l85863L73079Q79930O45930m54624j299792
37883c9580o15990Q99914J145318l01351j336794m25272J010443O60375j261081
37874b64018k316084j175219Q67669J838244J322417L22040k49475k68362m6542
37865C0670P8511j06460n05007o69245k90584K52638K55349k70841m33608K59499
$$ y = [781143, 354894, 1106963, 2008460, 2132787, 1947914, 2198851, 2527921, 2012925, 484442, -1251374, -2099234, -1426332, 254150, 1332094, 708082, -627791, -759237, 341301, 712472, -423441, -1231209, -154764, 1466371, 1440106, 118073, -412824, 153509, -18764, -1758377, -3558690, -3911517, -3140551, -2142168, -875428, 842579, 2207704, 2267359, 1249561, 201760, -184103, 188976, 1068906, 1714836, 1260212, -39580, -655570, 244344, 1389662, 1088311, -248483, -673755, 336688, 997063, -264018, -2580102, -3755321, -2887652, -1049408, 273009, 595049, 345574, 77212, 30670, 109181, 2721, -502286, -1171531, -1462115, -1209477, -954128, -1224969, -1658577, -1399078]
37855a399078R84542P18221j07713j79231N24204N18204p45999j653961o89453
37846b030264J217289J991445J268495M05034J56121J3712l27471m96616m95446
37837A702299p01138p48516L4768R97135P15611n86877j090960k80862L06675
37828C48135n1490L1627J279110K030780J046146j45913J26433O74071l30218
37819E008681j827338j617094l53176m09505j548889j388857N8534K29322j166924
37810c015246j192979J141400K592832P59483j818231j448958J258003K769062
37802A045366J783901N4567q70728r67489m45039M07997M91842q37548k126833
37793a463964j451681O51160J822828J171959L814n38097o18304n00116j3828
$$ y = [-1399078, -414536, 303685, 195972, 16741, 540945, 1059149, 313150, -1340811, -2030264, -812975, 1178470, 2446965, 2851999, 3008120, 3021832, 2694361, 2197745, 1702299, 1001161, 252645, 287413, 1284548, 2000159, 1413282, 322322, 41460, 348135, 296645, 328272, 1607382, 3638162, 4684308, 4538395, 4664828, 5338899, 5008681, 3181343, 1564249, 1211073, 801568, -747321, -2136178, -2077644, -1848322, -3015246, -4208225, -3066825, -473993, 285490, -1532741, -2981699, -1723696, 1045366, 2829267, 2883834, 2013106, 1045617, 600578, 1008575, 1500417, 662869, -1463964, -2915645, -2264485, -441657, 730302, 734116, 196019, -422285, -922401, -936229]
37784i36229N86007P42202O33956P55785O87936k15388j235615j099576j16779
37775a97701L19257J09943K92432O75472j4891j463094j729693m59916L27175
37766b141016m23319j047451o7281J262057R86348n70312j560063j188110o7194
37757d816341J041537J573378J107107M9910m17450J09592O68859M75628j20729
37748c28509p29860j441040j659856l38030J731460K027378M6463j356746j77368
37739b226108J548177J159463k64608r3254J076241N76439j349171j727969M1008
37730a259782J158479J85473p61728J14988J399784J243159L94602L22673M03242
37721C200890o23074j851780j398519L21190Q65447o53925k181054j466919J047286
$$ y = [-936229, -350222, 391980, 1025936, 1781721, 2469657, 2254269, 1018654, -80922, -197701, 121556, 231499, 523931, 1199403, 1184512, -278582, -2008275, -2468191, -2141016, -2564335, -3611786, -3679067, -2417010, -1430662, -2000974, -3561037, -4749147, -4816341, -3774804, -2201426, -1094319, -1044409, -1461859, -1352267, -683408, -207780, -328509, -1058369, -2499409, -4159265, -4497295, -2765835, -738457, -691994, -2048740, -2226108, -677931, 481532, 216924, 123670, 1199911, 1776350, 427179, -1300790, -1259782, -101303, 84170, -677558, -562570, 837214, 2080373, 2474975, 2797648, 3200890, 2577816, 726036, -672483, -351293, 514154, -139771, -2320825, -3787744, -2740458]
37712b740458K880772K457834O55383n74691n39840j99948l86169o11626k09590
37703G31667K93389Q1401l11137K55254J381741J362893k49056j846643j995419
37694b95910j082800j61324N09325R42123O43567n37554j553970j240547J27932
37685b649158J174945J069511K36818l73920k76251J97848L25430j34147o10319
37676a039243n42676k10759k01748m31596m63348l97141m58758j16912J113704
37667b748477K280158J920994L25117p58475p54126q14775j420202j385657p4274
37658c429717J199836J128530L31959J29108N65950Q21543O04673J33801m06704
37649A078979o15731o7842O10837J16573j358270j807658k74518J457202J297877
$$ y = [-2740458, 140314, 2598148, 3253531, 2678840, 2139000, 1939052, 1552883, 941257, 731667, 1025056, 1106457, 795320, 1050574, 2432315, 3795208, 3546152, 1699509, -295910, -1378710, -1540034, -1030709, -88586, 554981, 17427, -1536543, -2777090, -2649158, -1474213, -404702, -167884, -541804, -818055, -620207, -294777, -428924, -1039243, -1581919, -1792678, -1994426, -2426022, -2889370, -3286511, -3745269, -3862181, -2748477, -468319, 1452675, 1777792, 1019317, 265191, -549584, -1969786, -3355443, -3429717, -2229881, -1101351, -769392, -640284, -74334, 747209, 1351882, 1485683, 1078979, 463248, 395406, 1006243, 1122816, -235454, -2043112, -2317630, -860428, 437449]
37640D37449l38762j489515j208504J00600J702103K581652J739211k41981j215723
37631B066530l36081O55353L78909N8026Q83437J291210m18869k557300k356797
37622c35582m90440J73399o27288p03157J98631J58856p86560m35621J109528
37613a738234R87251j219593k039259J86910K139446P76800j694886j455133R99945
37604c056753K217965J237432K0749m13855q05680j144791m89780Q49434J563393
37595b1886J585672J707686J391189l99206k494795k545858p77977K32390j79579
37586a502364P7877J652334K085961J1313k053562j479367L61893N51207o70440
37577i65148p82146N66270J254191M82863k44134j63711l85713j265092j286469
$$ y = [437449, 98687, -1390828, -2599332, -2498732, -796629, 1785023, 3524234, 3282253, 2066530, 1730449, 2385802, 2764711, 2822737, 3706174, 4997384, 4578515, 2021215, -335582, -826022, -652623, -1279911, -1983068, -1784437, -1625581, -2412141, -2847762, -1738234, -750983, -1970576, -4009835, -3822925, -1683479, -906679, -2601565, -4056698, -3056753, -838788, 398644, 419393, 5538, -800142, -1944933, -2434713, -1585279, -21886, 1563786, 3271472, 4662661, 4263455, 1768660, -777198, -1555175, -1322785, -1502364, -1424487, 227847, 2313808, 2325121, 271559, -1207808, -845915, -294708, -965148, -1747294, -1181024, 73167, 556030, 311896, 148185, -237528, -1502620, -2789089]
37568b789089K35335J593163J292878L26205K27448N55764J90558k98656K48279
37559A581885J138419Q00578m22491q26765l72966o65891j824086j945443l24679
37550b861439J198083J120219L43579J07330j03313r83599j531334o40642P95439
37541b555677J284016J068688J133711R96484k79060j691975j362034L91331J379002
37532C64486Q38414J01941q3833m96901j256953j071018M20704J555372J041000
37523A413212j79211n69477j04630L52790N06454L64704l38294j371644j661333
37514a587429p56669K75564M02279J37058M65309J146105J248174P03327J96304
37505B230022n235j25040k00997j91184l78984r54342j561061j785396j595632
$$ y = [-2789089, -2553754, -960591, 332287, 658492, 885940, 1441704, 1632262, 1333606, 1581885, 2720304, 3520882, 3098391, 2271626, 1898660, 1232769, -591317, -2536760, -2861439, -1663356, -543137, -199558, -92228, -195541, -1179140, -2710474, -3351116, -2555677, -1271661, -202973, 930738, 1927222, 1648162, -43813, -1405847, -1014516, 364486, 1202900, 1304841, 1221008, 724107, -532846, -1603864, -1183160, 372212, 1413212, 1234001, 664524, 559894, 912684, 1419138, 1783842, 1445548, 73904, -1587429, -2344098, -2068534, -1666255, -1529197, -1063888, 82217, 1330391, 2033718, 2230022, 2224787, 2099747, 1898750, 1707566, 1328582, 374240, -1186821, -2972217, -4567849]
37496d567849r16242M51107K002885K578368J876234R74863O81419M84586m4663
37487C520708j41624O52936J125079P5663j558899j921873q87141J07175K79436
37478A251460m9178o56131j350475j207016K69795J592881R34467q66488j168814
37469a249499M65929J532269N00448q70737m08990J210392J733893N47904j035411
37460B426198j870766j850164j218679l52942Q1902j84129m80407k22665j6144
37451c687796o60228j455561q60665J130507K591122K117850O43422K8012N36577
37442C83240P33575k69421j479238j371156N7687J313060J298495M39208k03937
37433I01513k22357J07732M37348M20278k85593j374530j694949n76918R38976
$$ y = [-4567849, -5484091, -5032984, -3030099, -451731, 1424503, 2399366, 3080785, 3565371, 3520708, 3379084, 4032020, 5157099, 5232762, 3673863, 1751990, 864849, 972024, 1251460, 1202282, 546151, -804324, -2011340, -1741545, -148664, 785803, -80685, -1249499, -783570, 748699, 1249147, 378410, -30580, 1179812, 2913705, 3461609, 2426198, 555432, -1294732, -2513411, -2866353, -2784451, -2968580, -3448987, -3671652, -3687796, -4348024, -5803585, -6664250, -5533743, -2942621, -824771, -181349, -153337, 383240, 1116815, 847394, -631844, -2003000, -1945313, -632253, 666242, 1105450, 901513, 679156, 786888, 1224236, 1644514, 1358921, -15609, -1710558, -2287476, -1348500]
37424a348500J211677K24810m03746K54695J257729J321393M68635m65394j074024
37415A447275j353526j136951m16180K08059J78643k05429k58143J36689O32808
37406g66755J072369J312478Q20021o23674k046162k167401j171255n15410p48448
37397d834237o82659O01447J944135J451299p69107k407904j647571P73017K504038
37388c067542K055991M2097j613382j415619M00443K021241J779433o6437j599234
37379a463009j439514j40625R27093J353754J566737J490275N41475j025108j919072
37370a07994j379486j09669P88102J052906R41388M52218l52951q12073l40293
37361A32148O07094J022176O33926k733n43609j130876j580358j192151J94933
$$ y = [-1348500, -136823, 87987, -315759, -61064, 1196665, 2518058, 2986693, 2521299, 1447275, 93749, -1043202, -1459382, -1251323, -1072680, -1278109, -1536252, -1399563, -766755, 305614, 1618092, 2438113, 1814439, -231723, -2399124, -3570379, -4085789, -4834237, -5516896, -4915449, -2971314, -1520015, -2289122, -4697026, -6344597, -5571580, -3067542, -1011551, -969454, -2582836, -3998455, -3598012, -1576771, 202662, 136225, -1463009, -2902523, -3043148, -2116055, -762301, 804436, 2294711, 2836186, 1811078, -107994, -1487480, -1597149, -809047, 243859, 1185247, 1637465, 1284514, 472441, 132148, 739242, 1761418, 2395344, 2392611, 1849002, 718126, -862232, -2054383, -1859450]
37352a859450J577956J808443R55636J23588J6182K20462M4456m27538n60019
37343A899716k14482J8584k88067q32419j158701j253029j173902o66051K53339
37334c415012Q51289N99941Q2311P9303K36590j94106p02550j26937J203967J634379
37324B49175O99595k58467m18502n50402j015810o81296R24356K159553J561297
37315B669499Q3103o42222q46413j508058k008788j194838J55927L52864l13564
37306c252490j47758Q34209R22586j53696o81521O5972P41324M67686J94628N94226
37296d14834P01253j64336r14322m58250M84350O20352m7437p36569j187059j356856
37286c473708q43113K78071R33469M74580j45400L30499J619450K335696J786278
$$ y = [-1859450, -281494, 1526949, 2482585, 2606173, 2622355, 2842817, 2887273, 2459735, 1899716, 1685234, 1703818, 1415751, 583332, -575369, -1828398, -3002300, -3668351, -3415012, -2563723, -1963782, -1881471, -1802168, -1565578, -1759684, -2462234, -2589171, -1385204, 249175, 948770, 690303, 271801, -278601, -1294411, -1975707, -1051351, 1108202, 2669499, 2752602, 2110380, 1263967, -244091, -2252879, -3447717, -3291790, -2938926, -3252490, -3400248, -2566039, -1643453, -1797149, -2478670, -2412698, -1671374, -1203688, -1009060, -414834, 286419, 122083, -792239, -1250489, -766139, -145787, -193224, -929793, -2116852, -3473708, -4316821, -4038750, -3105281, -2630701, -2776101, -2445602, -826152, 1509544, 3295822]
37277C295822M93442o83304j273268j356401j420238j727012j745678q32211N73724
37268d675124J358463J311911J149896J001835L48838m41301l14235L80486K8151
37259A48920j364636j711653m09635J34344j549972k847193o49006L462542M872241
37250H5952K235432r65746j392732L28346J531310J070704k12088j148195j226546
37241C06437o69343k03221k72322l45531K94337J151222R57515l70372j369094
37232e20372j010193j6939L63961N3673j16133K12544N71343N11983K01631R2158
37222C43656L21866O13444O52685L78420j11705o64342r11213m01320O64006J206643
37212B092140M68327q51123j457658j159890o95654k25519N93274J222399P02190
$$ y = [3295822, 3789264, 3105960, 1832692, 476291, -943947, -2670959, -4416637, -5248848, -4675124, -3316661, -2004750, -854854, 146981, 495819, 54518, -259717, 120769, 148920, -1215716, -2927369, -3337004, -3202660, -4752632, -7599825, -8248831, -4786289, 85952, 2321384, 1355638, -37094, 291252, 1822562, 2893266, 2681178, 1532983, 306437, -362906, -566127, -838449, -1183980, -889643, 261579, 1219094, 848722, -520372, -1530565, -1547504, -1183543, -1129870, -1246003, -1033459, -462116, 49867, 251498, 343656, 665522, 1278966, 1931651, 2310071, 2198366, 1534024, 622811, 221491, 885497, 2092140, 2560467, 1709344, 251686, -908204, -1603858, -1829377, -1236103, -13704, 688486]
37203F88486l72036l25661O91555N18226j371741k422607q00767J539207J752711
37194a02627K96182l06386L93097O20759k47951q29021k16576Q22567J267507
37185A697551Q04221n06764k012676k289880p56897J019272J235676L79341M6551
37176c83605J50000m12596j096720m60099Q27155O66198p84456j132805J94748
37167b432180J024225L13033j43104Q49457J630981O25426r23399j133970m10543
37158f00074j57859k21708L04394R44400N20689p86570j680154j482604m81563
37149c641049P34919J361789P53732l93984l90877J000119J833182Q27469n76150
37140A509150n06443M48253N57348N576L70439J598180J809391K74540j337676
$$ y = [688486, 316450, -9211, 682344, 1200570, -171171, -2593778, -3394545, -1855338, -102627, 193555, -112831, 280266, 901025, 653074, -175947, -392523, 430044, 1697551, 2501772, 1995008, -17668, -2307548, -3064445, -2045173, -809497, -430156, -383605, -233605, -646201, -1742921, -2203020, -1375865, -709667, -1494123, -2626928, -2432180, -1407955, -1094922, -1238026, -388569, 1242412, 1867838, 944439, -189531, -600074, -757933, -979641, -675247, 269153, 789842, 3272, -1676882, -3159486, -3641049, -2906130, -1544341, -790609, -1184593, -1575470, -575351, 1257831, 2085300, 1509150, 1002707, 1450960, 2008308, 2013884, 2384323, 3982503, 5791894, 6066434, 4728758]
$$ [...]
##END NTUPLES=NMR SPECTRUM
##END=
