##TITLE=31Pdec_ADP0606A
 CDcl3, 24 sc
 6.6.2019
##JCAMPDX= 6.0         $$ Bruker NMR JCAMP-DX V2.0
##DATA TYPE= NMR SPECTRUM
##DATA CLASS= NTUPLES
##ORIGIN= UXNMR, Bruker Analytische Messtechnik GmbH
##OWNER= root
$$ XWIN-NMR		Version 3.5
$$ Thu Jun  6 16:08:43 2019 Russian Standard Time (UT+4h)  she@DPX200
##.OBSERVE FREQUENCY= 81.013821
##.OBSERVE NUCLEUS= ^31P
##.ACQUISITION MODE= SIMULTANEOUS
##.ACQUISITION SCHEME= undefined
##.AVERAGES= 24
##.DIGITISER RES= 17
##SPECTROMETER/DATA SYSTEM= spect
##.PULSE SEQUENCE= zgpg30
##.SOLVENT NAME= CDCl3
##.SHIFT REFERENCE= (INTERNAL, CDCl3, 0, 182.463)
##AUDIT TRAIL= $$ (NUMBER, WHEN, WHO, WHERE, WHAT)
$$ ##TITLE= Audit trail, XWIN-NMR		Version 3.5
$$ ##JCAMPDX= 5.01
$$ ##ORIGIN= Bruker BioSpin GmbH
$$ ##OWNER= she
$$ F:/spectra/data/she/nmr/P31/1/pdata/1/auditp.txt
$$ ##AUDIT TRAIL=  $$ (NUMBER, WHEN, WHO, WHERE, WHAT)
(   1,<2019-06-06 16:07:29.15 +0400>,<she>,<DPX200>,
      <created by zg, POWCHK disabled, PULCHK disabled
       configuration hash MD5:
       00 E9 B6 7A A2 85 ED C7 34 08 36 98 17 FE 4E 26
       data hash MD5: 32K
       7F 6F DA 61 5A 34 C0 8F 00 D4 FA FB C7 17 98 1C>)
(   2,<2019-06-06 16:07:32.39 +0400>,<she>,<DPX200>,
      <Start of raw data processing
       efp BC_mod = 2 LB = 1 FT_mod = 6 PKNL = 1 PHC0 = -2468.978 PHC1 = -325.0009 SI = 64K 
       data hash MD5: 64K
       C6 81 C7 1B 62 2F E9 D5 AE AA D1 07 69 A1 9D 36>)
(   3,<2019-06-06 16:07:47.25 +0400>,<she>,<DPX200>,
      <pk PHC0 = -23.26828 PHC1 = 0 
       data hash MD5: 64K
       7C B4 6E 5B 2F 26 4A 04 AC BA 0D 87 68 64 35 FA>)
(   4,<2019-06-06 16:08:09.70 +0400>,<she>,<DPX200>,
      <abs ABSG = 5 
       data hash MD5: 64K
       C8 D7 AD 52 FB 35 B7 E4 BC 5A D6 F0 DC 94 F2 8A>)
$$ ##END=
$$ 
$$ hash MD5
$$ 17 D1 F5 95 8B FA B2 F3 28 A0 8F 71 C0 CC 7A E2
##$RELAX= 
##$RELAX= 
##$RELAX= 
##$RELAX= 
##$RELAX= 
##$RELAX= 
##$RELAX= 
##$RELAX= 
$$ Bruker specific parameters
$$ --------------------------
##$DU= <F:/spectra>
##$EXPNO= 1
##$NAME= <P31>
##$PROCNO= 1
##$TYPE= <nmr>
##$USER= <she>
##$AMP= (0..31)
100 100 100 100 100 100 100 100 100 100 100 100 100 100 100 100 100 100 
100 100 100 100 100 100 100 100 100 100 100 100 100 100 
##$AQSEQ= 0
##$AQ_mod= 1
##$AUNM= <au_zg>
##$AUTOPOS= <>
##$BF1= 81.014009
##$BF2= 200.13
##$BF3= 200.13
##$BF4= 200.13
##$BF5= 200.13
##$BF6= 200.13
##$BF7= 200.13
##$BF8= 200.13
##$BYTORDA= 1
##$CFDGTYP= 0
##$CFRGTYP= 5
##$CHEMSTR= <none>
##$CNST= (0..31)
1 1 145 1 1 1 1 1 1 1 1 1 1 1 1 1 1 1 1 1 1 1 1 1 1 1 1 1 1 1 1 1 
##$CPDPRG= <waltz16>
##$CPDPRG1= <>
##$CPDPRG2= <waltz16>
##$CPDPRG3= <>
##$CPDPRG4= <mlev>
##$CPDPRG5= <mlev>
##$CPDPRG6= <mlev>
##$CPDPRG7= <mlev>
##$CPDPRG8= <mlev>
##$CPDPRGB= <>
##$CPDPRGT= <>
##$D= (0..31)
0 1 0 0 0 0 0 0 0 0 0 0.03 2e-05 3e-06 0 0 0 0 0 0 0 0 0 0 0 0 0 0 0 0 
0 0 
##$DATE= 1559822848
##$DBL= (0..7)
120 120 120 11 120 120 24 19 
##$DBP= (0..7)
150 150 150 150 150 150 150 150 
##$DBP07= 0
##$DBPNAM0= <>
##$DBPNAM1= <>
##$DBPNAM2= <>
$$ [...]
##$SUBNAM3= <"">
##$SUBNAM4= <"">
##$SUBNAM5= <"">
##$SUBNAM6= <"">
##$SUBNAM7= <"">
##$SUBNAM8= <"">
##$SUBNAM9= <"">
##$SW= 369.568048894756
##$SWIBOX= (0..15)
0 1 3 0 0 0 0 0 0 0 0 0 0 0 0 0 
##$SW_h= 29940.119760479
##$TD= 32768
##$TD0= 1
##$TE= 0
##$TE2= 300
##$TE3= 300
##$TEG= 300
##$TL= (0..7)
0 120 53 12 22 120 120 120 
##$TP= (0..7)
150 150 150 150 150 150 150 150 
##$TP07= 0
##$TPNAME0= <>
##$TPNAME1= <>
##$TPNAME2= <>
##$TPNAME3= <>
##$TPNAME4= <>
##$TPNAME5= <>
##$TPNAME6= <>
##$TPNAME7= <>
##$TPOAL= (0..7)
0.5 0.5 0.5 0.5 0.5 0.5 0.5 0.5 
##$TPOFFS= (0..7)
0 0 0 0 0 0 0 0 
##$TUNHIN= 0
##$TUNHOUT= 0
##$TUNXOUT= 0
##$USERA1= <user>
##$USERA2= <user>
##$USERA3= <user>
##$USERA4= <user>
##$USERA5= <user>
##$V9= 5
##$VALIST= <valist>
##$VCLIST= <CCCCCCCCCCCCCCC>
##$VD= 0
##$VDLIST= <DDDDDDDDDDDDDDD>
##$VPLIST= <PPPPPPPPPPPPPPP>
##$VTLIST= <TTTTTTTTTTTTTTT>
##$WBST= 1024
##$WBSW= 4
##$XGAIN= (0..3)
0 0 0 0 
##$XL= 0
##$YL= 0
##$YMAX_a= 304
##$YMIN_a= -669
##$ZGOPTNS= <>
##$ZL1= 120
##$ZL2= 120
##$ZL3= 120
##$ZL4= 120
##$ABSF1= 182.463
##$ABSF2= -187.1042
##$ABSG= 5
##$ABSL= 3
##$ALPHA= 0
##$AQORDER= 0
##$ASSFAC= 0
##$ASSFACI= 0
##$ASSFACX= 0
##$ASSWID= 0
##$AUNMP= <proc_1d>
##$AZFE= 0.1
##$AZFW= 0.5
##$BCFW= 0
##$BC_mod= 2
##$BYTORDP= 0
##$COROFFS= 0
##$CY= -3
##$DATMOD= 1
##$DC= 0
##$DFILT= <>
##$DTYPP= 0
##$F1P= 0
##$F2P= 0
##$FCOR= 1
##$FTSIZE= 65536
##$FT_mod= 6
##$GAMMA= 0
##$GB= 0
##$INTBC= 1
##$INTSCL= 5.30512e-09
##$ISEN= 30
##$LB= 1
##$LEV0= 0
##$LPBIN= 0
##$MAXI= 10000
##$MC2= 0
##$MEAN= 0
##$ME_mod= 0
##$MI= 50
##$NCOEF= 0
##$NC_proc= -12
##$NLEV= 6
##$NOISF1= 182.463
##$NOISF2= 159.3651
##$NSP= 0
##$NTH_PI= 0
##$NZP= 0
##$OFFSET= 182.463
##$PC= 4
##$PHC0= -2492.246
##$PHC1= -325.0009
##$PH_mod= 1
##$PKNL= yes
##$PPARMOD= 0
##$PSCAL= 0
##$PSIGN= 0
##$REVERSE= no
##$SF= 81.0140089999434
##$SI= 65536
##$SIGF1= 159.3651
##$SIGF2= -187.1042
##$SINO= 113.3802
##$SIOLD= 16384
##$SREGLST= <1H.CDCl3>
##$SSB= 0
##$STSI= 65536
##$STSR= 0
##$SW_p= 29940.119760479
##$SYMM= 0
##$S_DEV= 0
##$TDeff= 32768
##$TDoff= 0
##$TI= <>
##$TILT= no
##$TM1= 0
##$TM2= 0
##$TOPLEV= 0
##$USERP1= <user>
##$USERP2= <user>
##$USERP3= <user>
##$USERP4= <user>
##$USERP5= <user>
##$WDW= 1
##$XDIM= 65536
##$YMAX_p= 464729261
##$YMIN_p= -37126250
$$ End of Bruker specific parameters
$$ ---------------------------------
##NTUPLES= NMR SPECTRUM
##VAR_NAME=  FREQUENCY,     SPECTRUM/REAL,   SPECTRUM/IMAG
##SYMBOL=    X,             R,               I
##VAR_TYPE=  INDEPENDENT,   DEPENDENT,       DEPENDENT
##VAR_FORM=  AFFN,          ASDF,            ASDF
##VAR_DIM=   65536,         65536,           65536
##UNITS=     HZ,            ARBITRARY UNITS, ARBITRARY UNITS
##FACTOR=    0.456856943014862, 1,           1
##FIRST=     14782.0589164792, 0,            0
##LAST=      -15158.0608439998, 0,           0
##MIN=       -15158.0608439998, -37126250,   0
##MAX=       14782.0589164792, 464729261,    0
$$ Real data points
##PAGE= N=1
##DATA TABLE= (X++(R..R)), XYDATA
$$ [...]
$$ plain form
44154 -1825909 -1981344 -1398899 -513102 184542 388398 -80084 -972894 -1508422 -1279252
44145 -1279252 -1023519 -1656860 -2766420 -3113231 -2572829 -2362932 -3072490 -3662072 -3046666
44136 -3046666 -1703807 -885107 -917177 -1167550 -1215687 -1095836 -617477 503122 1686368
44127 1686368 1631831 -15707 -1770789 -1848197 -322767 1078383 1296182 1031494 1107160
44118 1107160 830774 -858225 -3180068 -3966017 -2474899 -441268 200989 -489977 -1282363
44109 -1282363 -1750503 -2329699 -2996129 -3090446 -2367391 -1375761 -786440 -876718 -1507817 -2107658
44099 -2107658 -1953713 -1025577 -269277 -441297 -1055159 -1130645 -605925 -230722 -358672 -660639
44089 -660639 -816498 -711612 -185260 612075 896413 211582 -534613 -66647 1323411
$$ packed form
44154a825909j55435N82445Q85797O97644K03856m68482q92810n35528K29170
44145a279252K55733o33341j109560l46811N40402K09897p09558n89582O15406
44136c046666J342859Q18700l2070k50373m8137J19851M78359J120599J183246
44127A686368n4537j647538j755082p7408J525430J401150K17799k64688P5666
44118A107160k76386j688999k321843p85949J491118K033631O42257o90966p92386
44109a282363m68140n79196o66430r4317P23055R91630N89321r0278o31099n99841
44099b107658J53945R28136P56300j72020o13862p5486N24720L75203j27950l01967
44089f60639j55859J04886N26352P97335K84338o84831p46195M67966J390058
$$ plain form
44080 1323411 1983657 1159053 -81637 -518743 -410329 -884446 -2276014 -3563063 -3332761
44071 -3332761 -1328875 849402 1125513 -545228 -1880345 -1314926 -231626 -624289 -1612018
44062 -1612018 -708171 1832561 2860249 1067566 -997967 -972061 -84950 -539147 -1683426
44053 -1683426 -1419173 14539 497035 -401895 -1015555 -632722 -435531 -1011215 -1153406
44044 -1153406 53878 1698173 2513231 2549729 2452332 2154727 1278088 109483 -685453
44035 -685453 -905218 -779728 -471148 -55332 321625 593136 826084 1013359 1122454 1272213
44025 1272213 1370165 749746 -1050242 -3182109 -4106386 -3490294 -2547763 -2209591 -2024855
44016 -2024855 -1445811 -1106307 -1764739 -2652466 -2131823 95651 2452755 3364784 2976583
$$ packed form
44080A323411O60246q24604j240690m37106J08414m74117j391568j287049K30302
44071c332761K003886K178277K76111j670741j335117N65419J083300l92663r87729
44062a612018R03847K540732J027688j792683k065533K5906Q87111m54197j144279
44053a683426K64253J433712M82496q98930o13660L82833J97191n75684j42191
44044a153406J207284J644295Q15058L6498r7397k97605q76639j168605p94936
44035f85453k19765J25490L08580M15816L76957K71511K32948J87275J09095J49759
44025A272213R7952o20419j799988k131867r24277O16092R42531L38172J84736
44016b024855N79044L39504o58432q87727N20643K227474K357104R12029l88201
$$ plain form
44007 2976583 2678103 3351653 4469667 4821526 3867240 2240280 958810 399160 300282
43998 300282 572168 1528479 3143044 4549953 4704718 3421152 1526633 101905 -282641
43989 -282641 258385 1248562 2258905 3007899 3181966 2514581 1286491 430227 666917
43980 666917 1665412 2489698 2721042 2613484 2307951 1622735 680072 56455 146802 913308
43970 913308 2225655 3680702 4098200 2325362 -1002136 -3524325 -3722089 -2644714 -2297647
43961 -2297647 -3037620 -3578256 -3100585 -2198508 -1756990 -1821533 -1804989 -1282544 -431667 62471
43951 62471 -347161 -1296595 -1712147 -1087157 -96928 441341 568871 529250 -116100 -1683420
43941 -1683420 -3249006 -3616459 -3106598 -3006518 -3342760 -2788849 -1083595 91110 -556185
$$ packed form
44007B976583k98480O73550J118014L51859r54286j626960j281470n59650r8878
43998C00282K71886R56311J614565J406909J54765j283566j894519j424728l84546
43989b82641N41026R90177J010343P48994J74067o67385j228090q56264K36690
43980F66917R98495Q24286K31344j07558l05533o85216r42663o23617R0347P66506
43970I13308J312347J455047M17498j772838l327498k522189j97764J077375L47067
43961b297647p39973n40636M77671R02077M41518o4543J6544N22445Q50877M94138
43951F2471m09632r49434m15552O24990R90229N38269J27530l9621o45350j567320
43941a683420j565586l67453N09861J00080l36242N53911J705254J174705o47295
$$ plain form
43932 -556185 -2086045 -2909080 -3096620 -3739522 -4723532 -4724348 -3309305 -1690291 -1142594 -1677024
43922 -1677024 -2542180 -3136898 -3075741 -2218544 -1191550 -1183180 -2526315 -3949026 -3931458 -2463772
43912 -2463772 -765283 358749 926425 788128 -439458 -2123108 -2626466 -1428407 -150445
43903 -150445 -315762 -1028517 -489141 826134 638011 -1423392 -2899313 -2169181 -899208
43894 -899208 -1265467 -2480177 -2233068 -494214 542713 -91428 -1124887 -1592363 -2147252
43885 -2147252 -3236343 -3949337 -3623547 -2973280 -2595387 -1782594 36781 1950590 2908690
43876 2908690 3293791 3774308 3610997 1773574 -916785 -2550539 -2784650 -2994943 -3718471
43867 -3718471 -3723442 -2243624 -641300 -696887 -2028591 -2404713 -509699 2443162 4081968
$$ packed form
43932e56185j529860q23035j87540o42902r84010q16J415043J619014N47697n34430
43922a677024q65156n94718O1157Q57197J026994Q370j343135j422711J7568J467686
43912b463772J698489J124032N67676j38297j227586j683650n03358J198059J277962
43903a50445j65317p12755N39376J315275j88123k061403j475921P30132J269973
43894h99208l66259j214710K47109J738854J036927o34141j033459m67476n54889
43885b147252j089091p12994L25790O50267L77893Q12793J819375J913809R58100
43876B908690L85101M80517j63311j837423k690359j633754k34111k10293p23528
43867c718471m971J479818J602324n5587j331704l76122J895014K952861J638806
$$ plain form
43858 4081968 3399887 1555498 322266 274389 824456 1547657 2540226 3461499 3374655
43849 3374655 2178237 1294184 1994372 3638260 4546165 4134856 3133327 2142841 1301159
43840 1301159 1130070 2146848 3430864 3133952 1036956 -766796 -617802 488290 596470
43831 596470 -285776 -532164 306606 805302 12523 -1006745 -754115 600289 1683249
43822 1683249 1881060 1784769 1933064 2189274 2460476 3015444 3686245 3646887 2628731 1604498
43812 1604498 1419084 1363859 195943 -1834142 -3238338 -3407388 -3077868 -2625640 -1500505
43803 -1500505 129740 785381 -280968 -1759575 -2156372 -1812987 -1724941 -1462766 73
43794 73 2110588 3262059 3199072 3116069 3402530 3016074 1355769 -723353 -2120236 -2496115
$$ packed form
43858D081968o82081j844389j233232m7877N50067P23201R92569R21273q6844
43849C374655j196418q84053P00188J643888R07905m11309j001529r90486q41682
43840A301159j71089J016778J284016k96912k096996j803752J48994J106092J08180
43831E96470q82246k46388Q38770M98696p92779j019268K52630J354404J082960
43822A683249J97811r6291J48295K56210K71202N54968O70801l9358j018156j024233
43812A604498j85414n5225j167916k030085j404196j69050L29520M52228J125135
43803a500505J630245O55641j066349j478607l96797L43385Q8046K62175J462839
43794G3K110515J151471o2987q3003K86461l86456j660305k079122j396883l75879
$$ plain form
43784 -2496115 -1886493 -556871 577205 657587 186975 358162 1044318 992576 136592
43775 136592 -136044 516481 604775 -585438 -1498656 -723160 701231 912454 -89539
43766 -89539 -941029 -1099826 -1004591 -831431 -518200 -383664 -469765 8372 1312380 2122145
43756 2122145 1255989 -327912 -831131 -271441 -144930 -903152 -1542305 -1469227 -1026773
43747 -1026773 -242955 1171863 2431983 2018356 -83917 -1860740 -1546669 532355 2630924
43738 2630924 3144968 1507934 -1277235 -2936558 -2029578 125443 952513 115639 -113073
43729 -113073 1655766 3874016 4389967 3282378 2143842 1732706 1713726 1918747 2440631
43720 2440631 2834816 2432411 1375412 494387 237336 371037 574108 662457 335104
$$ packed form
43784b496115O09622J329622J134076Q0382m70612J71187O86156n1742q55984
43775A36592k72636O52525Q8294j190213r13218P75496J424391K11223j001993
43766h9539q51490j58797R5235J73160L13231J34536q6101M78137J304008Q09765
43756B122145q66156j583901n03219N59690J26511p58222o39153P3078M42454
43747a026773P83818J414818J260120m13627k102273j776823L14071K079024K098569
43738B630924N14044j637034k785169j659323R06980K155021Q27070q36874k28712
43729a13073J768839K218250N15951j107589j138536m11136j8980K05021N21884
43720B440631L94185m02405j056999q81025k57051J33701K03071Q8349l27353
$$ plain form
43711 335104 -632154 -1853423 -2503556 -2239085 -1670368 -1656894 -2190700 -2284841 -1242634 175132
43701 175132 485850 -511234 -1316085 -823232 53850 -202104 -1400495 -2029861 -1544759
43692 -1544759 -847793 -593383 -417879 12533 483475 968596 1663812 2094173 1458197
43683 1458197 118854 -551181 -130381 367913 301412 231858 471073 316397 -557694 -1357585
43673 -1357585 -1567829 -1711614 -2002397 -1782083 -1172477 -1589707 -3410496 -4772581 -4195379
43664 -4195379 -2906970 -2861690 -3757679 -3899077 -2912850 -1622832 -162108 1644149 2685666
43655 2685666 1614255 -745798 -2037413 -1328567 323879 1994243 3606097 4620423
43647 4620423 4085631 2321767 816106 147119 -393651 -998370 -979114 -470033 -563577
$$ packed form
43711C35104r67258j221269o50133K64471N68717J3474n33806r4141J042207J417766
43701A75132L10718r97084q04851M92853Q77082k55954j198391o29366M85102
43692a544759O96966K54410J75504M30412M70942M85121O95216M30361o35976
43683A458197j339343o70035M20800M98294o6501o9554K39215j54676q74091p99891
43673a357585k10244j43785k90783K20314O09606m17230j820789j362085N77202
43664d195379J288409M5280q95989j41398R86227J290018J460724J806257J041517
43655B685666j071411k360053j291615P08846J652446J670364J611854J014326
43647D620423n34792j763864j505661o68987n40770o04719J9256N09081r3544
$$ plain form
43638 -563577 -1223127 -987477 431652 1106737 -378587 -2671193 -3456094 -2406838 -1035437
43629 -1035437 -448772 -533164 -869609 -1350921 -2025705 -2919616 -3806307 -3990011 -2939939
43620 -2939939 -1335928 -620385 -1173401 -1876093 -1893917 -1779009 -2134624 -2338221 -1644986
43611 -1644986 -678989 -558050 -1013314 -656646 929695 2436780 2445298 1112182 -186554
43602 -186554 -592913 -634493 -1172967 -1923336 -1828298 -970396 -942819 -2549341 -4273773 -4389096
43592 -4389096 -3621532 -3817164 -4613323 -3918956 -1737059 -750475 -2192918 -3667224 -2647931
43583 -2647931 -119961 1180920 623871 -242338 -389568 -97438 285721 607812 414865
43574 414865 -324861 -532765 546183 1858998 1965325 1269976 1204627 1776791 1751799 912183
$$ packed form
43638e63577o59550K35650J419129O75085j485324k292606p84901J049256J371401
43629a035437N86665q4392l36445m81312o74784q93911q86691j83704J050072
43620b939939J604011P15543n53016p02692j7824J14908l55615k03597O93235
43611a644986R65997J20939m55264L56668J586341J507085Q518j333116j298736
43602a86554m06359m1580n38474p50369R5038Q57902K7577j606522j724432j15323
43592d389096P67564j95632p96159O94367K181897R86584j442443j474306J019293
43583b647931K527970J300881n57049q66209j47230K92130L83159L22091j92947
43574D14865p39726k07904J078948J312815J06327o95349o5349N72164k4992q39616
$$ plain form
43564 912183 261999 98848 -298043 -988278 -1105387 -496495 -76265 -288896 -619648 -787584
43554 -787584 -995121 -913779 -4488 1025866 843340 -176009 -178740 1049368 1304529 -656813
43544 -656813 -2951243 -3283635 -2158506 -1554746 -1693672 -1250768 -52770 649436 523937
43535 523937 812792 2228031 3707519 3919100 2936777 1750946 884935 210372 -293325
43526 -293325 -269432 520212 1707759 2431545 2045364 811199 -336613 -944150 -1619714
43517 -1619714 -2978970 -4298985 -4057934 -1970902 287002 905199 8606 -707837 -140184
43508 -140184 1158262 2062897 2211669 1838699 940527 -572470 -2087379 -2499293 -1432689
43499 -1432689 286999 1578641 2042271 1807203 1065785 114526 -651409 -1181944 -1790251
$$ packed form
43564I12183o50184j63151l96891o90235j17109O08892M20230k12631l30752j67936
43554g87584k07537Q1342R09291J030354j82526j019349k731J228108K55161j961342
43544f56813k294430l32392J125129O03760j38926M42904J197998P02206j25499
43535E23937K88855J415239J479488K11581r82323j185831q66011o74563n03697
43526b93325K3893P89644J187547P23786l86181j234165j147812o07537o75564
43517a619714j359256j320015K41051K087032K257904O18197q96593p16443N67653
43508a40184J298446R04635J48772l72970q98172j512997j514909m11914J066604
43499a432689J719688J291642M63630k35068p41418r51259p65935n30535o08307
$$ plain form
43490 -1790251 -2443684 -2605575 -2133437 -1641796 -1496267 -1257968 -783125 -906199 -1985823
43481 -1985823 -2700931 -1770945 -206723 -41188 -1111205 -1174302 512239 1876282 1240569
43472 1240569 116 548129 2708781 3990898 2971120 907624 -112515 428483
43464 428483 1250887 879268 -789069 -2328869 -2179261 -241990 2055677 3221216 2860831
43455 2860831 1528927 119215 -492163 13902 845061 683811 -824720 -2683772 -3826793
43446 -3826793 -4098830 -3731695 -2714736 -1205637 144140 848493 1050545 961057 483946
43437 483946 -243733 -715287 -901271 -1421231 -2379936 -2905389 -2413218 -1420330 -506174 463863
43427 463863 1321244 1058482 -498259 -1579881 -546932 1685150 2846621 2377780 1668336
$$ packed form
43490a790251o53433j61891M72138M91641J45529K38299M74843j23074j079624
43481a985823p15108R29986J564222J65535j070017o3097J686541J364043o35713
43472A240569j240453N48013K160652J282117j019778k063496j020139N40998
43464D28483Q22404l71619j668337j539800J49608J937271K297667J165539l60385
43455B860831j331904j409712o11378N06065Q31159j61250j508531j859052j143021
43446c826793k72037L67135J016959J509099J349777P04353K02052q9488m77111
43437D83946p27679m71554j85984n19960r58705n25453M92171R92888R14156R70037
43427D63863Q57381k62762j556741j081622J032949K232082J161471m68841p09444
$$ plain form
43418 1668336 1586500 1496600 784860 -191941 -996943 -1724478 -2391252 -2709542 -2733746 -2909348
43408 -2909348 -3313771 -3520125 -3185812 -2201655 -635384 749489 631779 -1041379 -2103016
43399 -2103016 -643244 2111663 3293254 2390502 1487977 1541196 1110516 -447028 -1203334
43390 -1203334 358776 2706846 3497856 2858942 2466937 2654433 2585950 2431798 3099651
43381 3099651 4134065 3971397 2367795 842049 497255 881986 1211974 1299653 983802
43372 983802 8780 -1089764 -1207120 -257023 617154 892626 1431101 2651585 3308355
43363 3308355 2370167 1060834 1320759 2756276 3062969 1602098 522039 1401292 2588503
43354 2588503 1646667 -713753 -1482787 121658 1519162 881524 -34118 1137131 3415334
$$ packed form
43418A668336q1836q9900p11740r76801q05002p27535o66774l18290k4204j75602
43408b909348m04423k06354L34313R84157J566271J384873j17710j673158j061637
43399b103016J459772K754907J181591r02752r02525N3219m30680j557544p56306
43390a203334J562110K348070P91010o38914l92005J87496o8483j54152O67853
43381C099651J034414j62668j603602j525746l44794L84731L29988Q7679l15851
43372I83802r75022j098544j17356R50097Q74177K75472N38475J220484O56770
43363C308355r38188j309333K59925J435517L06693j460871j080059Q79253J187211
43354B588503r41836k360420p69034J604445J397504o37638r15642J171249K278203
$$ plain form
43345 3415334 3899118 2118215 335637 -153973 -285249 -490401 466273 2772469 4142630
43336 4142630 2879090 525360 -457882 -156729 -214039 -618944 -23362 1329251 1614947
43327 1614947 463385 -368579 140481 818048 504971 -114532 -33550 165302 -698014
43318 -698014 -2350893 -3284203 -2631007 -933783 682406 1477300 1546085 1746474 2762087
43309 2762087 3927782 3699344 1816397 142024 381795 1585855 1242254 -1205489 -3271908
43300 -3271908 -2461919 473061 2267082 958144 -1872417 -3037890 -1407573 1061514
43292 1061514 1875922 724265 -851367 -1761874 -2252462 -2621282 -2337680 -1064789 273548
43283 273548 400722 -587505 -1237484 -578888 651159 920037 -302501 -2006338 -2774522
$$ packed form
43345C415334M83784j780903j782578m89610j31276k05152R56674K306196J370161
43336D142630j263540k353730r83242L01153n7310m04905N95582J352613K85696
43327A614947j151562q31964N09060O77567l13077o19503Q0982J98852q63316
43318f98014j652879r33310O53196J697224J616189P94894O8785K00389J015613
43309B762087J165695k28438j882947j674373K39771J204060l43601k447743k066419
43300c271908Q09989K934980J794021j308938k830561j165473J630317K469087
43292A061514Q14408j151657j575632r10507m90588l68820K83602J272891J338337
43283B73548J27174r88227o49979O58596J230047K68878j222538j703837p68184
$$ plain form
43274 -2774522 -2093438 -472616 1320548 2708941 3188683 2475954 1049329 2802 -99883
43265 -99883 155190 13214 -272636 113396 1236719 2289744 2631608 2247450 1338316
43256 1338316 266703 -195972 472717 1550282 1685089 718212 -61629 218459 909570
43247 909570 1070438 770485 438986 -160335 -1322483 -2410386 -2518559 -1769951 -1009687
43238 -1009687 -468505 316393 1351693 1917783 1629014 1027714 787663 767683 207486
43229 207486 -1246268 -2877297 -3379174 -2157956 -53146 1593289 2447890 3143348 3868717
43220 3868717 4104091 3994926 4567062 5702296 5301050 2032556 -2000484 -3278795 -1263367
43211 -1263367 1092028 1298173 -42783 -1003795 -942467 -431675 21739 92566 -535144
$$ packed form
43274b774522O81084J620822J793164J388393M79742p12729j426625j046527j02685
43265i9883K55073j41976k85850L86032J123323J053025L41864l84158r09134
43256A338316j071613m62675O68689J077565J34807r66877p79841K80088O91111
43247I09570J60868k99953l31499n99321j162148j087903j08173P48608P60264
43238a009687N41182P84898J035300N66090k88769o01300k40051j9980n60197
43229B07486j453754j631029n01877J221218K104810J646435Q54601O95458P25369
43220C868717K35374j09165N72136J135234m01246l268494m033040j278311K015428
43211a263367K355395K06145j340956r61012O1328N10792M53414P0827o27710
$$ plain form
43202 -535144 -1467396 -1589490 -674224 -99694 -918757 -2102502 -1995299 -785074 13770
43193 13770 97318 653029 2075467 3108230 2777416 1762562 1089540 642309 -58971
43184 -58971 -522832 76481 1380306 2081851 1597240 658530 246805 635504 1511900 2378602
43174 2378602 2701386 2219245 1325371 778208 907154 1365531 1615592 1318275 418484
43165 418484 -626697 -889798 -3795 923140 420212 -1134731 -1575767 194876 2539839
43156 2539839 3263256 2520615 2207945 3000351 3547246 2593131 528702 -1414551 -2384028
43147 -2384028 -2067773 -754364 381349 69906 -1501673 -2768742 -2725761 -1834880 -778503
43138 -778503 386968 1296728 948912 -717112 -2197250 -2537826 -2821773 -4100331 -5078688
$$ packed form
43202e35144r32252j22094R15266N74530q19063j183745J07203J210225P98844
43193A3770Q3548N55711J422438J032763l30814j014854o73022m47231p01280
43184e8971m63861N99313J303825P01545m84611r38710m11725L88699Q76396Q66702
43174B378602L22784m82141q93874n47163J28946M58377K50061k97317q99791
43165D18484j045181k63101Q86003R26935n02928j554943m41036J770643K344963
43156B539839P23417p42641l12670P92406N46895r54115k064429j943253r69477
43147b384028L16255J313409J135713l11443j571579j267069M2981Q90881J056377
43138g78503J165471R09760l47816j666024j480138l40576k83947j278558r78357
$$ plain form
43129 -5078688 -3870983 -1309838 -228137 -1584950 -3503007 -4391154 -4819724 -5561828 -5838638
43120 -5838638 -4861695 -3637769 -3664304 -4678064 -5131141 -4431512 -3452122 -3005282 -2867638
43111 -2867638 -2380596 -1312502 -39840 719494 425903 -692694 -1696738 -1830849 -1187554
43102 -1187554 -352460 235314 358975 -75542 -835261 -1380462 -1450913 -1425401 -1864656 -2875278
43092 -2875278 -3998976 -4504624 -3910024 -2631595 -1891274 -2318431 -2915503 -2386989 -1260612
43083 -1260612 -1259762 -2468506 -2906945 -1635668 -456730 -1154091 -2574099 -2351931 -557401
43074 -557401 528449 -95518 -990104 -763903 153559 766314 997045 1170586 1216977 1199759
43064 1199759 1687658 2737503 3197351 1898763 -814665 -3401624 -4683744 -4571578 -3561529
$$ packed form
43129e078688J207705K561145J081701j356813j918057q88147m28570p42104k76810
43120e838638R76943J223926k6535j013760m53077O99629R79390M46840J37644
43111b867638M87042J068094J272662P59334k93591j118597j004044j34111O43295
43102a187554Q35094N87774J23661m34517p59719n45201p0451K5512m39255j010622
43092b875278j123698n05648N94600J278429P40321m27157n97072N28514J126377
43083a260612Q50j208744m38439J271277J178938o97361j420008K22168J794530
43074e57401J085850o23967q94586K26201R17462O12755K30731J73541M6391j7218
43064A199759M87899J049845M59848j298588k713428k586959j282120J12166J010049
$$ plain form
43055 -3561529 -2206936 -1114715 -899939 -1741810 -3016856 -3640393 -3030579 -1730963 -838671
43046 -838671 -813248 -1187898 -1431781 -1484703 -1280755 -570612 289698 237725 -978779 -1946218
43036 -1946218 -1360230 -84989 -91512 -1623839 -2904898 -2741399 -1974792 -1939290 -2735655
43027 -2735655 -3612765 -4005654 -3563157 -2093867 -220259 690228 33667 -1135689 -1379141
43018 -1379141 -552831 377950 689495 382247 -304365 -1145401 -1853563 -2302342 -2766942
43009 -2766942 -3565219 -4506646 -4937049 -4298167 -2626324 -691387 423286 245022 -597969
43000 -597969 -1181076 -1438700 -1957768 -2766370 -3131950 -2633589 -1640965 -605528 291418
42991 291418 656057 64960 -918650 -939274 370733 1699099 1770673 921843 269164 120846
$$ packed form
43055c561529J354593J092221K14776q41871j275046o23537O09814J299616Q92292
43046h38671K5423l74650k43883n2922K03948P10143Q60310n1973j216504r67439
43036a946218N85988J275241o523j532327j281059J63499P66607L5502p96365
43027b735655q77110l92889M42497J469290J873608R10487o56561j169356k43452
43018a379141Q26310R30781L11545l07248o86612q41036p08162m48779m64600
43009b766942p98277r41427m30403O38882J671843J934937J114673j78264q42991
43000e97969n83107k57624n19068q08602l65580M98361R92624J035437Q96946
42991B91418L64639n91097r83610k0624J310007J328366P1574q48830o52679j48318
$$ plain form
42981 120846 70211 34478 283431 794966 1290672 1603730 1534044 830115 -212583 -759543
42971 -759543 -591620 -569366 -1317190 -2162466 -2117676 -1223884 -126123 997962 2221088
42962 2221088 3226872 3770078 4149894 4393563 3760892 2072592 706796 1043066 2597070
42953 2597070 3915315 4526547 4608014 3648026 1346982 -785684 -934113 139016 -43875
42944 -43875 -1856470 -2972332 -2049765 -631238 -439153 -1024513 -1456016 -2297514 -4059186
42935 -4059186 -5259416 -4189857 -1687582 -60682 234536 793129 2247168 3080814 1991570
42926 1991570 -149805 -1604383 -1999645 -2245956 -2766733 -2885275 -2066768 -1001401 -902485
42917 -902485 -1940346 -2964793 -2967772 -2330539 -2186440 -2908101 -3802789 -4055170 -3326734 -1662434
$$ packed form
42981A20846n0635l5733K48953N11535M95706L13058o9686p03929j042698n46960
42971g59543J67923K2254p47824q45276M4790Q93792J097761J124085J223126
42962B221088J005784N43206L79816K43669o32671j688300j365796L36270J554004
42953B597070J318245O11232Q1467r59988k301044k132666j48429J073129j82891
42944d3875j812595j115862R22567J418527J92085n85360m31503q41498j761672
42935d059186j200230J069559K502275J626900K95218N58593J454039Q33646j089244
42926A991570k141375j454578l95262k46311n20777j18542Q18507J065367R8916
42917i02485j037861j024447k979O37233J44099p21661q94688k52381P28436J664300
$$ plain form
42907 -1662434 388492 1703327 1551424 573758 -159088 -908626 -2728702 -5069643 -5648296
42898 -5648296 -3469189 -446571 1098604 1262448 1574510 2371977 2805473 2645422 2282205
42889 2282205 1403421 -444567 -2115058 -1647066 839632 2781971 2399344 809518 55869
42880 55869 346694 463072 -23473 -362446 -102779 268623 190476 -348585 -1110176 -1804637
42870 -1804637 -1929641 -1140056 30164 501960 60534 -163918 833861 2385189 2745308
42861 2745308 1150018 -1296215 -2823421 -2613633 -1195545 208193 543964 -320492 -1375405
42852 -1375405 -1387312 -282941 819360 1129157 1027457 1016219 732301 -183963 -1049119
42843 -1049119 -1118291 -1023813 -1851499 -3097287 -3112314 -1642940 -347657 -372473 -854750 -500617
$$ packed form
42907a662434K050926J314835j51903r77666p32846p49538j820076k340941n78653
42898e648296K179107L022618J545175J63844L12062P97467M33496j60051l63217
42889B282205q78784j847988j670491M67992K486698J942339l82627j589826p53649
42880E5869K90825J16378m86545l38973K59667L71402p8147n39061p61591o94461
42870a804637j25004P89585J170220M71796m41426k24452R97779J551328L60119
42861B745308j595290k446233j527206K09788J418088J403738L35771q64456j054913
42852a375405j1907J104371J102301L09797j01700j1238k83918r16264q65156
42843a049119o9172R4478q27686j245788j5027J469374J295283k4816m82277L54133
$$ plain form
42833 -500617 577659 1371285 1323492 468371 -859941 -1842039 -1658011 -750113 -565849
42824 -565849 -1470704 -2157572 -1818990 -1381537 -1501242 -981175 1130609 3231152 3071787
42815 3071787 1150866 13267 587672 1381849 1209101 556890 -25860 -897358 -2067009
42806 -2067009 -2633548 -2208135 -1572785 -1294369 -915402 -141705 342936 -42043 -846525
42797 -846525 -1367419 -1500890 -1341011 -833062 -294186 -362152 -963857 -1271263 -1126003 -1451654
42787 -1451654 -2663304 -3745596 -3707432 -3027550 -2779176 -3092680 -3370572 -3348149 -3020960
42778 -3020960 -2090793 -464674 1071199 1643156 1614794 2272830 4095319 5928668 6146279
42769 6146279 4431281 2232607 1319790 1855972 2258177 1225380 -674170 -2046548 -2568690
$$ packed form
42833e00617J078276P93626m7793q55121j328312r82098J84028R07898J84264
42824e65849r04855o86868L38582M37453j19705N20067K111784K100543j59365
42815C071787j920921j137599N74405P94177j72748o52211n82750q71498j169651
42806b067009n66539M25413O35350K78416L78967P73697M84641l84979q04482
42797h46525n20894j33471J59879N07949N38876o7966o01705l07406J45260l25651
42787a451654j211650j082292L8164O79882K48374l13504k77892K2423L27189
42778c020960R30167J626119J535873N71957k8362O58036J822489J833349K17611
42769F146279j714998k198674r12817N36182M02205j032797j899550j372378n22142
$$ plain form
42760 -2568690 -2694636 -2085440 -75327 2353163 2981925 1271586 -826065 -1671183 -1906849
42751 -1906849 -2727896 -3833942 -4374314 -4537988 -4786077 -4657145 -3770391 -2980145 -3054451
42742 -3054451 -3151346 -2150450 -641319 39041 5393 362533 1138174 1390868 933536
42733 933536 296542 -592178 -1998814 -3084871 -2834443 -1960984 -1992209 -2684636 -2393316
42724 -2393316 -968926 -116771 -617661 -1308277 -1278767 -1039724 -938401 -461620 196849
42715 196849 -14617 -733839 -34523 2176008 2893143 47280 -4065749 -5655697 -4416264
42706 -4416264 -3232080 -3737616 -4662708 -4465798 -3393406 -2477371 -2048048 -1768899 -1169569
42697 -1169569 78368 1654587 2444096 1690507 77113 -1119847 -1515921 -1340988 -358163
$$ packed form
42760b568690j25946O09196K010113K428490O28762j710339k097651q45118k35666
42751a906849q21047j106046n40372j63674k48089J28932Q86754P90246p4306
42742c054451r6895J000896J509131O80360l3648L57140P75641K52694m57332
42733I33536o36994q88720j406636j086057K50428Q73459l1225o92427K91320
42724b393316J424390Q52155n00890o90616K9510K39043J01323M76781O58469
42715A96849k11466p19222O99316K210531P17135k845863m113029j589948J239433
42706d416264J184184n05536r25092J96910J072392R16035M29323K79149N99330
42697a169569J247937J576219P89509p53589j613394j196960l96074J74933R82825
$$ plain form
42688 -358163 1545329 3158523 3032123 1686022 1038264 1490372 1375895 -193774 -1758552
42679 -1758552 -1807287 -1155592 -1650767 -3462304 -5056343 -5319061 -4450936 -3083426 -1691986
42670 -1691986 -780202 -584054 -520067 185218 1222124 1445174 622173 9863 629740
42661 629740 1724007 1775116 631379 -395851 -486654 -259269 -399201 -426172 294187 1143195
42651 1143195 1146202 816125 1482750 2750571 2480468 40409 -2158574 -1700145 643776
42642 643776 2409495 2992932 3631183 4565138 4689625 4004138 3927275 4607851 4266843 2262667
42632 2262667 668964 1281063 2825636 2994235 1908660 1524715 2464622 3504312 3756661
42623 3756661 3433614 2641884 1261375 40851 83697 1037447 1378413 767823 539986
$$ packed form
42688c58163J903492J613194j26400j346101o47758M52108j14477j569669j564778
42679a758552m8735O51695m95175j811537j594039k62718Q68125J367510J391440
42670a691986R11784J96148O3987P05285J036906K23050q23001o12310O19877
42661F29740J094267N1109j143737j027230r0803K27385j39932k6971P20359Q49008
42651A143195L007l30077O66625J267821k70103k440059k198983M58429K343921
42642F43776J765719N83437O38251R33955J24487o85487p6863O80576l41008k004176
42632B262667j593703O12099J544573J68599j085575l83945R39907J039690K52349
42623C756661l23047p91730j380509j220524M2846R53750L40966o10590k27837
$$ plain form
42614 539986 1395470 2168286 1639182 268161 -753175 -1115436 -1166318 -952650 -405817
42605 -405817 166561 607455 1418432 2969471 4529166 4719925 2866510 -243559 -2652234
42596 -2652234 -2500216 128535 2639202 2321417 -449958 -2600654 -2269867 -873153 -565220
42587 -565220 -1255154 -1467127 -907160 -486655 -475694 -232585 513999 1392575 2171217 2767166
42577 2767166 2800541 2111641 1323316 981299 699580 98073 -219632 167791 246987 -957247
42567 -957247 -2402904 -2316247 -916370 47582 80369 216599 740707 808702 362587 232844
42557 232844 191245 -819632 -2259149 -2286751 -1033293 -927437 -2795985 -4299926 -3650701
42548 -3650701 -2316165 -2196861 -2478938 -1596750 -417642 -916881 -2973789 -4841705 -5774006
$$ packed form
42614E39986Q55484P72816n29104j371021j021336l62261n0882K13668N46833
42605d05817N72378M40894Q10977J551039J559695J90759j853415l110069k408675
42596b652234J52018K628751K510667l17785k771375k150696L30787J396714L07933
42587e65220o89934k11973N59967M20505J0961K43109P46584Q78576P78642N95949
42577B767166L3375o88900p88325l42017k81719o01507l17705L87423P9196j204234
42567i57247j445657Q6657J399877R63952L2787J36230N24108O7995m46115j29743
42557B32844m1599j010877j439517k7602J253458J05856j868548j503941O49225
42548c650701J334536J19304k82077Q82188J179108m99239k056908j867916r32301
$$ plain form
42539 -5774006 -6037520 -5364469 -3612713 -2077056 -1973838 -2435690 -2059955 -1391611 -1533970
42530 -1533970 -1442037 500158 2974104 3030685 687495 -1012635 -706246 -191325 -623278
42521 -623278 -582214 797553 1790679 940987 -485831 -770215 -388012 -499444 -624191
42512 -624191 148021 1119305 1211447 1053457 1814010 2840173 2466571 677793 -788062
42503 -788062 -718980 570986 2157830 3154929 2850048 1450943 376236 691915 1632366
42494 1632366 1746142 1050513 833875 1610286 2452262 2267901 848873 -1148371 -2510247
42485 -2510247 -2185262 -553034 525203 -127823 -1340532 -1180048 356131 1552095 1487668
42476 1487668 877630 505646 276223 17119 -50645 -12478 -423513 -1409720 -2380939 -2832386
$$ packed form
42539e774006k63514O73051J751756J535657J03218m61852L75735O68344j42359
42530a533970R1933J942195K473946N6581k343190j700130L06389N14921m31953
42521f23278M1064J379767R93126q49692j426818k84384L82203j11432j24747
42512f24191P72212R71284R2142j57990P60553J026163l73602j788778j465855
42503g88062O9082J289966J586844R97099l04881j399105j074707L15679R40451
42494A632366J13776o95629k16638P76411Q41976j84361j419028j997244j361876
42485b510247L24985J632228J078237o53026j212709J60484J536179J195964o4427
42476A487668o10038l71984k29423k59104o7764L8167m11035r86207r71219m51447
$$ plain form
42466 -2832386 -2688544 -1819117 -145383 1620922 2315640 1708362 701330 -122943 -1172974
42457 -1172974 -2585736 -3316308 -2453617 -883884 -534418 -1959679 -3573956 -3631445 -2322420
42448 -2322420 -1254083 -1169445 -1133468 -254825 737036 521715 -797846 -1908536 -2273358
42439 -2273358 -2521820 -2793415 -2290311 -1009367 -297430 -700574 -773611 569840 1831799
42430 1831799 912648 -1466581 -2351754 -417619 2512355 3980367 3494680 2304864 1701471
42421 1701471 1922300 2107728 1280718 -284302 -1256768 -1364359 -2141266 -4317762 -5774424
42412 -5774424 -4218549 -1062662 -5650 -1899450 -3771335 -3384941 -2023602 -1670925
42404 -1670925 -1942475 -1491494 -533817 -99318 -141807 -161139 -608206 -1930753 -3071194
$$ packed form
42466b832386J43842Q69427J673734J766305O94718o07278j007032q24273j050031
42457a172974j412762p30572Q62691J569733L49466j425261j614277n7489J309025
42448b322420J068337Q4638L5977Q78643R91861k15321j319561j110690l64822
42439b273358k48462k71595N03104J280944P11937m03144p3037J343451J261959
42430A831799r19151k379229q85173J934135K929974J468012m85687j189816o03393
42421A701471K20829J85428q27010j565020r72466j07591p76907k176496j456662
42412e774424J555875L155887J057012j893800j871885L86394J361339L52677
42404a670925k71550M50981R57677M34499m2489j9332m47067j322547j140441
$$ plain form
42395 -3071194 -2666496 -1260454 -767414 -1971783 -3800677 -4838089 -4480386 -2874435 -779474
42386 -779474 648765 781016 83916 -729938 -1548792 -2220298 -1925348 -310865 1357604
42377 1357604 1441357 47980 -1184390 -1179593 -285891 679374 1171571 882125 17278 -464721
42367 -464721 157524 1258513 1671787 1416848 1559247 2433993 3135535 2869331 1777670
42358 1777670 294631 -1299801 -2500570 -2782323 -2478612 -2502603 -2868378 -2466767 -760599
42349 -760599 1243739 2316977 2463341 2367866 2163604 1644756 1151466 1186881 1333158 540899
42339 540899 -1356548 -3187418 -3792014 -3257171 -2457317 -1858703 -1297022 -640513 -26220
42330 -26220 537974 1176704 1597821 1193917 92186 -512221 240776 1551790 1867603
$$ packed form
42395c071194M04698J406042M93040j204369j828894j037412L57703J605951K094961
42386g79474J428239J32251o97100q13854q18854o71506K94950J614483J668469
42377A357604Q3753j393377j232370M797Q93702R65265M92197k89446q64847m81999
42367d64721O22245J100989M13274k54939J42399Q74746P01542k66204j091661
42358A777670j483039j594432j200769k81753L03711k3991l65775M01611J706168
42349g60599K004338J073238J46364r5475k04262n18848m93290L5415J46277p92259
42339E40899j897447j830870o04596N34843P99854N98614N61681O56509O14293
42330b6220N64194O38730M21117m03904j101731o04407P52997J311014L15813
$$ plain form
42321 1867603 888042 -222595 -530288 -250987 84891 338911 392180 88083 -132889
42312 -132889 412380 1325213 1387687 622298 586424 1753182 2265223 769633 -1000866
42303 -1000866 -513502 1739438 3059668 2639904 2243739 2713787 2489471 537276 -1493546
42294 -1493546 -1545793 -71773 867397 429716 -513023 -1066160 -1154201 -912135 -286755 705819
42284 705819 1848487 2748343 2801425 1634519 -108340 -1067281 -732274 -103713 -284041
42275 -284041 -1060565 -1522584 -1465110 -1361062 -1328312 -938750 70026 1434612 2577568
42266 2577568 2876753 2099824 888496 276226 336778 4483 -1217160 -2213886 -1804216
42257 -1804216 -528501 316560 820032 2072969 3836691 4355023 2928299 1106856 449730
$$ packed form
42321A867603r79561j110637l07693K79301L35878K54020N3269l04097k20972
42312a32889N45269R12833O2474p65389l5874J166758N12041j495590j770499
42303a000866M87364K252940J320230m19764l96165M70048k24316j952195k030822
42294a493546n2247J474020R39170m37681r42739n53137q8041K42066O25380R92574
42284G05819J142668Q99856N3082j166906j742859r58941L35007O28561j80328
42275b84041p76524m62019N7474J04048L2750L89562J008776J364586J142956
42266B577568K99185p76929j211328o12270O0552l32295j221643r96726M09670
42257a804216J275715Q45061N03472J252937J763722N18332j426724j821443o57126
$$ plain form
42248 449730 399385 -354092 -1350276 -918459 914721 1800196 13349 -3136675 -4827392
42239 -4827392 -3989534 -2011886 -587885 -122579 -317214 -949902 -1435938 -779280 992207
42230 992207 2199029 1575324 315341 542521 2148838 3008376 2324295 1605731 1712125
42221 1712125 1228328 -772181 -2351347 -1250778 1533723 3142108 2961508 2691029 2683775
42212 2683775 1272314 -1718545 -3749924 -3299387 -2384916 -3388067 -5225377 -5066501 -2690463
42203 -2690463 -609522 -363673 -1116411 -1910083 -2947868 -4066620 -4001632 -2244242 -188562
42194 -188562 642506 440168 269141 424906 623545 898160 1196375 844740 -415772
42185 -415772 -1467472 -1104324 176329 899162 744043 614442 826032 748786 332222
$$ packed form
42248D49730n0345p53477r96184M31817J833180Q85475j786847l150024j690717
42239d827392Q37858J977648J424001M65306j94635o32688m86036O56658J771487
42230I92207J206822o23705j259983K27180J606317Q59538o84081p18564J06394
42221A712125m83797k000509j579166J100569K784501J608385j80600k70479p254
42212B683775j411461k990859k031379M50537R14471j003151j837310J58876K376038
42203b690463K080941K45849p52738p93672j037785j118752O4988J757390K055680
42194a88562Q31068k02338j71027J55765J98639K74615K98215l51635j260512
42185d15772j051700L63148J280653P22833j55119j29601K11590p7246m16564
$$ plain form
42176 332222 447582 1284868 1796269 1376346 858507 1030477 1265635 646938 -425981
42167 -425981 -905966 -782862 -909888 -1431534 -1521508 -763926 47589 -230355 -1783026 -3461206
42157 -3461206 -3645196 -1796036 745685 2022333 1625619 813405 323357 -614531 -2386504
42148 -2386504 -3586457 -2884352 -1175317 -191886 112626 825801 1449686 480516 -1502534
42139 -1502534 -1986367 -361232 886425 -37736 -1488069 -1050087 848464 1968533 1634253
42130 1634253 989021 631250 65825 -704279 -858210 -193456 491301 646092 509179
42121 509179 271526 -305696 -1262935 -2204188 -2765655 -2739631 -1959207 -777505 -287570 -1114216
42111 -1114216 -2334316 -2713157 -2644235 -3373024 -4414230 -3635986 -535515 2300288 2266881
$$ packed form
42176C32222J15360Q37286N11401m19923n17839J71970K35158o18697j072919
42167d25981m79985J23104j27026n21646q9974P57582Q11515k77944j552671j678180
42157c461206j83990J849160K541721J276648l96714q12214m90048r37888j771973
42148b386504j199953P02105J709035R83431L04512P13175O23885r69170j983050
42139a502534m83833J625135J247657r24161j450333M37982J898551J120069l34280
42130A634253o45232l57771n65425p70104j53931O64754O84757J54791j36913
42121E09179k37653n77222r57239r41253n61467K6024P80424J181702M89935q26646
42111a114216j220100l78841O8922p28789j041206P78244L100471K835803l3407
$$ plain form
42102 2266881 135214 -1080251 -30399 1693960 2128927 1409223 1144836 2163963 3649558
42093 3649558 4323140 3892355 3147163 2929186 3336071 3869353 3954161 3165198 1393841
42084 1393841 -772300 -2133608 -1921624 -689480 317474 564492 429865 137471 -633040
42075 -633040 -1795875 -2337609 -1400505 527476 2121488 2689554 2563003 2176068 1487611
42066 1487611 559031 97496 738537 1852627 1772615 -323603 -3114358 -4348036 -3262538
42057 -3262538 -1115236 687699 1987014 2969269 3029686 1728404 223859 214173 1471017
42048 1471017 1903690 488447 -1227485 -1367825 -344431 8536 -712470 -943558 481124
42039 481124 2662583 3882732 3715736 3122467 2815870 2445832 1596208 825261 1000149
$$ packed form
42102B266881k131667j215465J049852J724359M34967p19704k64387J019127J485595
42093C649558O73582m30785p45192k17977M06885N33282Q4808p88963j771357
42084A393841k166141j361308K11984J232144J006954K47018j34627k92394p70511
42075f33040j162835n41734R37104J927981J594012N68066j26551l86935o88457
42066A487611r28580m61535O41041J114090q0012k096218k790755j233678J085498
42057c262538K147302J802935J299315R82255O0417j301282j504545r686J256844
42048A471017M32673j415243j715932j40340J023394L52967p21006k31088J424682
42039D81124K181459J220149j66996n93269l06597l70038q49624p70947J74888
$$ plain form
42030 1000149 1869302 2182929 1463875 857120 1589351 3134763 3775436 2754591 977510
42021 977510 -394892 -1081952 -1179482 -498736 942784 2394655 3087622 3185483 3385861
42012 3385861 3730288 3460756 2174591 636068 71930 743033 1540502 1252487 95673
42003 95673 -519885 92015 904557 722142 48508 244893 1112111 879100 -1009771 -2650126
41993 -2650126 -2257719 -809357 -650520 -2124908 -3225643 -2538760 -1002501 -288069 -634416
41984 -634416 -1089373 -1186041 -1487982 -2617917 -4291577 -5363039 -4698916 -2216467 758307
41975 758307 2404029 1967959 366389 -881638 -1136492 -870854 -643483 -303875 567731
41966 567731 1691150 2065616 1173916 -111863 -374807 583959 1413465 905486 -552495
$$ packed form
42030A000149Q69153L13627p19054o06755P32231J545412O40673j020845j777081
42021I77510j372402o87060r7530O80746J441520J451871O92967R7861K00378
42012C385861L44427k69532j286165j538523n64138O71103P97469k88015j156814
42003I5673o15558O11900Q12542j82415o73634J96385Q67218k33011j888871j640355
41993b650126L92407J448362J58837j474388j100735O86883J536259P14432l46347
41984f34416m54957r6668l01941j129935j673660j071462O64123K482449K974774
41975G58307J645722m36070j601570j248027k54854K65638K27371L39608Q71606
41966E67731J123419L74466q91700j285779k62944R58766Q29506n07979j457981
$$ plain form
41957 -552495 -1716672 -2159959 -2380999 -2485207 -1816022 -186433 1394663 1840735 1325469
41948 1325469 888725 1046950 1458647 1812551 2325275 3197969 4105539 4509730 4168911
41939 4168911 3119187 1475762 -393166 -1693603 -1692465 -525103 737612 1044130 333285
41930 333285 -551171 -842885 -582247 -339107 -405087 -507349 -351062 -189133 -586323 -1643713
41920 -1643713 -2689116 -2828346 -1713697 189134 1878554 2392459 1511139 97365 -590408
41911 -590408 -210778 328856 173110 -252613 85388 1192613 1900570 1427988 357334
41902 357334 -174299 341735 1612448 2902595 3297955 2319059 706932 -36472 619457
41893 619457 1552308 1509014 603845 -321409 -1052248 -1827550 -2474605 -2765712 -3099760 -3683807
$$ packed form
41957e52495j164177m43287k21040j04208O69185J629589J581096M46072n15266
41948A325469m36744J58225M11697L53904N12724Q72694R07570M04191l40819
41939D168911j049724j643425j868928j300437J138J167362J262715L06518p10845
41930C33285q84456k91714K60638K43140o5980j02262J56287J61929l97190j057390
41920a643713j045403j39230J114649J902831J689420N13905q81320j413774o87773
41911e90408L79630N39634j55746m25723L38001J107225P07957m72582j070654
41902C57334n31633N16034J270713J290147L95360r78896j612127p43404O55929
41893F19457R32851m3294r05169r25254p30839p75302o47055k91107l34048n84047
$$ plain form
41883 -3683807 -3552925 -1826860 362922 874728 -407241 -1227575 -135117 1601259 2101956
41874 2101956 1486386 1144523 1375327 1143125 -199970 -2066011 -3397260 -3550506 -2593583
41865 -2593583 -1320034 -776320 -1275995 -2056327 -2196979 -1517177 -355606 893392 1652033
41856 1652033 1363797 461749 377945 1742291 3184835 2887689 879362 -1185564 -2162952
41847 -2162952 -2298503 -2211702 -2108530 -2048660 -2071038 -1908967 -1278539 -479196 -54924 51080
41837 51080 260361 404942 -69809 -914024 -1076000 -187582 794113 832300 40868 -693405
41827 -693405 -716140 131079 1664660 3314514 4358469 4619535 4578151 4470181 3739901
41818 3739901 1890681 -472147 -2082136 -2419135 -2142829 -2072624 -2228721 -2116694 -1580591
$$ packed form
41883c683807J30882J726065K189782N11806j281969q20334J092458J736376N00697
41874B101956o15570l41863K30804k32202j343095j866041j331249j53246R56923
41865b593583J273549N43714m99675p80332j40652O79802J161571J248998P58641
41856A652033k88236r02048q3804J364346J442544k97146k008327k064926r77388
41847b162952j35551Q6801J03172N9870k2378J62071O30428P99343M24272J06004
41837E1080K09281J44581m74751q44215j61976Q88418R81695L8187p91432p34273
41827f93405k2735Q47219J533581J649854J043955K61066m1384j07970p30280
41818C739901j849220k362828j609989l36999K76306P0205j56097J12027N36103
$$ plain form
41809 -1580591 -969565 -635745 -715078 -1328102 -2402175 -3190440 -2753993 -1395009 -785326
41800 -785326 -1796076 -2972672 -2503345 -1105740 -1051413 -2419291 -2674882 -697550 1188117
41791 1188117 766156 -604568 -349084 1078813 1117991 -542295 -1536995 -776461 22841
41782 22841 -551193 -1399590 -927704 616779 1975779 2535634 2125608 612359 -1215643
41773 -1215643 -1693886 -395889 910973 513550 -1117540 -2480341 -3115290 -3269778 -2663694
41764 -2663694 -1172075 87057 -22677 -863635 -941224 -151178 384304 312701 211839
41755 211839 -94691 -1586242 -4054908 -5621951 -4968116 -2978050 -1463425 -1086786 -1292234
41746 -1292234 -1666957 -2431450 -3581397 -4181266 -3016463 -97645 2790450 3644223 2438898
$$ packed form
41809a580591O11026L33820p9333o13024j074073p88265M36447J358984O09683
41800g85326j010750j176596M69327J397605N4327j367878k55591J977332J885667
41791A188117m21961j370724K55484J427897L9178j660286r94700P60534P99302
41782B2841n74034q48397M71886J544483J359000N59855m10026j513249j828002
41773a215643m78243J297997J306862l97423j631090j362801o34949j54488O06084
41764b663694J491619J259132j09734q40958p7589P90046N35482p1603j00862
41755B11839l06530j491551k468666j567043O53835J990066J514625L76639k05448
41746a292234l74723p64493j149947n99869J164803K918818K888095Q53773j205325
$$ plain form
41737 2438898 1097096 1004637 1442595 1102022 180157 -176720 123452 52992 -811418 -1782505
41727 -1782505 -2278566 -2399881 -2250384 -1809088 -1568542 -2149509 -3093474 -3196170 -2315257
41718 -2315257 -1662824 -1916544 -2265382 -1902774 -1270744 -1051177 -1016078 -806399 -876729 -1581613
41708 -1581613 -2118764 -1575611 -468937 -65189 -563636 -1079868 -1111479 -883937 -489760
41699 -489760 133182 508368 122575 -411310 53113 1346418 2008718 1377382 319120
41690 319120 -444441 -1246619 -2107701 -2065065 -925756 -197237 -826021 -1313425 76503
41681 76503 2247741 2657388 1258808 570069 1696313 2815868 2371933 1374533 1160232
41672 1160232 905666 -738435 -2982942 -3959422 -3586865 -3364093 -3759822 -3733364 -2753799
$$ packed form
41737B438898j341802r2459M37958l40573r21865l56877L00172p0460q64410r71087
41727a782505m96061j21315J49497M41296K40546n80967r43965j02696Q80913
41718b315257O52433k53720l48838L62608O32030K19567L5099K09679p0330p04884
41708a581613n37151N43153J106674M03748m98447n16232l1611K27542L94177
41699d89760O22942L75186l85793n33885M64423J293305O62300o31336j058262
41690C19120p63561q02178q61082M2636J139309P28519o28784m87404J389928
41681G6503K171238M09647j398580o88739J126244J119555m43935r97400k14301
41672A160232k54566j644101k244507r76480L72557K22772l95729K6458R79565
$$ plain form
41663 -2753799 -1567672 -803294 -244658 316500 720263 1003657 1173539 524792 -1440701
41654 -1440701 -3457157 -3452080 -1323902 759158 1224528 761137 638414 923488 1124534
41645 1124534 1197947 1041303 230342 -887959 -1072157 -38904 808360 454948 -214461
41636 -214461 -69052 451236 518992 630107 1465413 2079602 1124670 -737123 -1498928 -582500
41626 -582500 717694 1342705 1417892 1218047 774887 578339 1206814 2087441 1927775 567208
41616 567208 -791373 -1331569 -1407792 -1400103 -993006 18251 1142617 1763466 1624139 711358
41606 711358 -583984 -1258369 -508468 1245079 2810147 3431351 2903316 1218424 -791927
41597 -791927 -1333631 183847 1540506 296461 -2447625 -3294844 -1537556 -172752 -1281647
$$ packed form
41663b753799J186127P64378N58636N61158M03763K83394J69882o48747j965493
41654a440701k016456N077K128178K083060M65370m63391j22723K85074K01046
41645A124534P3413j56644q10961j118301j84198J033253Q47264l53412o69409
41636b14461J45409N20288O7756J11115Q35306O14189r54932j861793p61805R16428
41626e82500J300194O25011P5187j99845m43160j96548O28475Q80627j59666j360567
41616E67208j358581n40196p6223P689M07097J011257J124366O20849j39327r12781
41606G11358j295342o74385P49901J753547J565068O21204n28035j684892k010351
41597g91927n41704J517478J356659j244045k744086q47219J757288J364804j108895
$$ plain form
41588 -1281647 -3103853 -3072677 -1454206 -210443 -82759 -694818 -2029260 -3746684 -4186379
41579 -4186379 -2208700 615690 1617822 440646 -908467 -1070428 -609069 -375728 -369720
41570 -369720 -499303 -991058 -1602032 -1620166 -1097450 -1036225 -1851074 -2587080 -2308198 -1508254
41560 -1508254 -1333080 -1837858 -1937872 -1120571 -364841 -802024 -1943529 -2185428 -1151949
41551 -1151949 -437148 -1300583 -2602225 -2337651 -651955 353767 -233898 -973863 -461935
41542 -461935 833968 1922514 2876439 3939277 4409802 3812201 3171850 3689732 4864579
41533 4864579 5263910 4551868 3485157 2501948 1661502 1466190 2279800 3201029 2908593
41524 2908593 1525675 409278 188469 236457 65491 35805 543677 1521792 2836633
$$ packed form
41588a281647j822206L1176J618471J243763J27684o12059j334442j717424m39695
41579d186379J977679K824390J002132j177176j349113j61961M61359K33341O008
41570c69720j29583m91755o10974j8134N22716O1225q14849p36006K78882P99944
41560a508254J75174n04778j00014Q17301P55730m37183j141505k41899J033479
41551a151949P14801q63435j301642K64574J685696J005722n87665p39965N11928
41542d61935J295903J088546R53925J062838M70525n97601o40351N17882J174847
41533D864579L99331p12042j066711r83209q40446j95312Q13610R21229k92436
41524B908593j382918j116397k20809M7988j70966k9686N07872R78115J314841
$$ plain form
41515 2836633 4238054 4895255 4006910 2029138 394384 -143986 -62082 107106 551412
41506 551412 1514257 2664319 3517462 3936197 3934269 3461557 2650766 1950487 1786972 2186000
41496 2186000 2729483 2890802 2620570 2490509 2764592 2551530 927968 -1064635 -1091405
41487 -1091405 1142953 2849586 1709264 -924530 -2025123 -947689 501952 1242592
41479 1242592 1850903 2518426 2363632 1221860 299845 385896 761962 490470 -278992
41470 -278992 -743422 -314908 1218363 3604137 6010155 7591848 8108755 7561496 5884049
41461 5884049 3791218 2996115 4260584 5987002 6238401 5464638 5608531 7205337 9173146
41452 9173146 10853355 12351716 13465900 14260832 16024399 19551729 23351271 25911817
$$ packed form
41515B836633J401421O57201q88345j977772j634754n38370Q1904J69188M44306
41506E51412R62845J150062Q53143M18735j928m72712q10791p00279j63515L99028
41496B186000N43483J61319k70232j30061K74083k13062j623562j992603k6770
41487a091405K234358J706633j140322k633794j100593J077434J449641P40640
41479A242592O08311O67523j54794j141772r22015Q6051L76066k71492p69462
41470b78992m64430M28514J533271K385774K406018J581693N16907n47259j677447
41461E884049k092831p95103J264469J726418K51399p73763J43893J596806J967809
41452I173146J680209J498361J114184P94932J763567L527330L799542K560546
$$ plain form
41444 25911817 28627369 33586365 39679378 44463157 48791534 55429644 64160448 73421039
41436 73421039 86059647 107319828 137676258 175800228 228768146 306398291 397606175
41429 397606175 462900949 464729261 404357151 319477172 246703835 195578908 157537806
41422 157537806 126207127 101961180 85059792 73513712 65822848 60674047 55367973
41415 55367973 48129757 40563339 35015568 30985997 26538283 21655419 17756942 15170476
41407 15170476 13250822 11912410 11197225 10389928 9139283 8307909 8341382 8193861 7279400
41398 7279400 6873224 7893419 8870638 8048844 6132338 4962011 4719591 4492183 4391593
41389 4391593 4844183 4810638 3200273 1350230 1502721 3154488 3546426 1839771 212966
$$ packed form
41444B5911817K715552M958996O093013M783779M328377O638110Q730804R260591
41436G3421039J2638608K1260181L0356430L8123970N2967918P7630145R1207884
41429C97606175O5294774J828312o0372110q4879979p2773337n1124927l8041102
41422A57537806l1330679k4245947j6901388j1546080p690864n148801n306074
41415E5367973p238216p566418n547771m029571m447714m882864l898477k586466
41407A5170476j919654j338412p15185q07297j250645q31374L3473j47521r14461
41398G279400m06176J020195R77219q21794j916506j170327k42420k27408j00590
41389D391593M52590l3545j610365j850043J52491J651767L91938j706655j626805
$$ plain form
41380 212966 303559 1007304 802924 150063 170068 544032 355000 -24483 404571 1191583
41370 1191583 685754 -1445014 -3225939 -2561059 306106 3250273 4782017 5190022 5166076
41361 5166076 4439096 2608906 626119 150589 1434222 2942628 3343683 2929170 2726141
41352 2726141 3130371 3903605 4671866 4863069 3946164 2370947 1553047 2248559 3575116
41343 3575116 4281944 4322421 4456334 4935992 5403070 5605250 5468844 4890018 4108240 3810910
41333 3810910 4225920 4610478 4254018 3414591 2644654 1923346 1272652 1472686 3038608
41324 3038608 4932842 5413802 4013573 1867367 347574 112346 1105547 2600769 3481119
41315 3481119 3257131 2598883 2274552 2028893 1253573 271470 41583 852224 2018691
$$ packed form
41380B12966R0593P03745k04380o52861K0005L73964j89032l79483M29054P87012
41370A191583n05829k130768j780925O64880K867165K944167J531744M08005k3946
41361E166076p26980j830190j982787m75530J283633J508406M01055m14513k03029
41352B726141M04230P73234P68261J91203r16905j575217q17900O95512J326557
41343C575116P06828M0477J33913M79658M67078K02180j36406n78826p81778k97330
41333C810910M15010L84558l56460q39427p69937p21308o50694K00034J565922
41324C038608J894234M80960j400229k146206j519793k35228R93201J495222Q80350
41315C481119k23988o58248l24331k45659p75320r82103k29887Q10641J166467
$$ plain form
41306 2018691 2590895 1896810 13043 -1759566 -1765974 -75616 1319953 1254661 1038606
41297 1038606 2071960 3213419 2466119 279762 -1046804 -676546 258030 1025326 1818814
41288 1818814 2113124 1022225 -525310 -499284 862279 926910 -1258582 -3242560 -2758349
41279 -2758349 -788655 532205 1114277 2093823 3260791 3335395 2063721 439741 -638340
41270 -638340 -790697 58950 1270190 1643388 986768 643917 1466657 2324975 1853310
41261 1853310 619545 77932 246154 81583 -429125 -276075 706397 1500075 1430576
41252 1430576 842624 293943 74620 356719 877000 752793 -428044 -1714810 -2028426
41243 -2028426 -1825200 -2285844 -3237263 -3364277 -2418327 -1732788 -2278409 -3440559 -4098801
$$ packed form
41306B018691N72204o94085j883767j772609o408J690358J395569o5292k16055
41297A038606J033354J141459p47300k186357j326566L70258R34576P67296P93488
41288A818814K94310j090899j547535K6026J361563O4631k185492j983978M84211
41279b758349J969694J320860N82072R79546J166968P4604j271674j623980j078081
41270f38340j52357Q49647J211240L73198o56620l42851Q22740Q58318m71665
41261A853310j233765n41613J68222j64571n10708J53050R82472P93678o9499
41252A430576n87952n48681k19323K82099N20281j24207j180837j286766l13616
41243b028426K03226m60644r51419j27014R45950O85539n45621j162150o58242
$$ plain form
41234 -4098801 -3903237 -3084439 -1835378 -315888 1241862 2628515 3517118 3447584 2506191
41225 2506191 1648510 1553701 1535877 579654 -873682 -1366052 -505649 643178 1285804
41216 1285804 1753077 2419676 2958217 3046624 2820882 2275084 1124375 -422896 -1617080
41207 -1617080 -2132511 -2234504 -1892202 -796971 550088 1021390 595635 706274 2170303
41198 2170303 3781869 3761681 1870439 -523663 -1746077 -752306 2200322 5118475 5546441
41189 5546441 3258878 910729 1034298 3098873 4588213 4287647 3157085 2319849 1727088
41180 1727088 1092455 926427 1880863 3563979 4671826 4361953 3268502 2910440 3914261
41171 3914261 5039345 4486019 2163778 -20037 -363150 812701 1914090 1974819 1250881
$$ packed form
41234d098801J95564Q18798J249061J519490J557750J386653Q88603o9534r41393
41225B506191q57681r4809j7824r56223j453336m92370Q60403J148827O42626
41216A285804M67273O66599N38541Q8407k25742n45798j150709j547271j194184
41207a617080n15431j01993L42302J095231J347059M71302m25755J10639J464029
41198B170303J611566k0188j891242k394102j222414R93771K952628K918153M27966
41189E546441k287563k348149J23569K064575J489340l00566j130562q37236n92761
41180A727088o34633j66028R54436J683116J107847l09873j093451l58062J003821
41171C914261J125084n53326k322241k183815l43113J175851J101389O0729p23938
$$ plain form
41162 1250881 467776 145488 384009 797736 851714 522580 254221 89365 -489090 -1498519
41152 -1498519 -2018122 -1399393 -202781 760069 1592335 2648706 3371677 2921037 1623754
41143 1623754 675828 477301 239409 -670837 -1759696 -1909832 -389828 2519476 5448561
41134 5448561 6775400 6117314 4758091 4177978 4680962 5956669 8027260 10532204 11963189
41125 11963189 11301911 10070952 10952877 14291129 17724480 19657841 21273944 24269853
41117 24269853 28302676 32116465 36091382 42022678 50794034 61687754 73849078 86917101
41109 86917101 99570773 108432486 109717001 102444231 89678390 76058997 64066230
41102 64066230 53180356 42631690 33698505 28223319 25719258 23674736 20707866 17781787
$$ packed form
41162A250881p83105l22288K38521M13727N3978l29134k68359j64856n78455j009429
41152a498519n19603O18729J196612R62850Q32266J056371P22971m50640j297283
41143A623754r47926j98527k37892r10246j088859j50136J520004K909304K929085
41134E448561J326839o58086j359223n80113N02984J275707K070591K504944J430985
41125A1963189o61278j230959Q81925L338252L433351J933361J616103K995909
41117B4269853M032823L813789L974917N931296Q771356J0893720J2161324J3068023
41109H6917101J2653672Q861713J284515p272770j2765841j3619393j1992767
41102F4066230j0885874j0548666q933185n475186k504061k044522k966870k926079
$$ plain form
41094 17781787 15896956 14228201 11582931 8528752 6741367 6748542 7398767 7350420 6294547
41085 6294547 4827154 3701769 3199867 3017532 2892738 3161773 4087292 4876030 4519809
41076 4519809 3647910 3981351 5441272 5622566 3334685 909924 1072339 2831285 2966731
41067 2966731 992424 -118241 1525055 3978998 4324361 2363723 71160 -1293166
41059 -1293166 -1941961 -2183280 -1829868 -913801 59827 736375 1237347 1829697 2624061
41050 2624061 3531288 4243616 4374517 3849368 3065539 2537552 2478052 2706750 2773220 2266451
41040 2266451 1309847 610830 618630 842733 595429 216468 726958 2232011 3543809
41031 3543809 3638270 2731843 1660917 956371 827554 1269252 1783391 1705473 1163041 969541
$$ packed form
41094A7781787j884831j668755k645270l054179j787385P175O50225m8347j055873
41085F294547j467393j125385n01902j82335j24794K69035R25519P88738l56221
41076D519809q71899L33441J459921J81294k287881k424761J62415J758946J35446
41067B966731j974307j110665J643296K453943L45363j960638k292563j364326
41059a293166o48795k41319L53412R16067R73628O76548N00972N92350P94364
41050B624061R07227P12328J30901n25149p83829n27987n9500K28698O6470n06769
41040B266451r56604o99017P800K24103k47304l78961N10490J505053J311798
41031C543809R4461r06427j070926p04546j28817M41698N14139p7918n42432j93500
$$ plain form
41021 969541 1283145 1320153 786174 417751 435983 -216133 -1965541 -3157976 -2127154
41012 -2127154 75591 836928 -469119 -1898079 -1908698 -1131068 -766912 -847047 -834321
41003 -834321 -699579 -537319 -53606 760648 1220885 952884 615418 901172 1446430 1483558
40993 1483558 1055910 843561 1178058 1847942 2456204 2430842 1314030 -189931 -140380
40984 -140380 2455363 5658280 6166378 3188243 -296472 -751172 2092651 5258125 5968438
40975 5968438 4330514 2575325 2338131 3304026 4365146 5202076 6075280 6644378 6174464
40966 6174464 4934004 4138365 4050290 3378686 1414531 -436700 -581457 254055 160700
40957 160700 -898770 -1241927 -617922 -897207 -2873271 -4487827 -3674094 -1394477 -101755
$$ packed form
41021I69541L13604L7008n33979l68423J8232o52116j749408j192435J030822
41012b127154K202745P61337j306047j428960j0619P77630L64156q0135J2726
41003h34321J34742J62260M83713Q14254M60237k68001l37466K85754N45258L7128
40993A483558m27648k12349L34497O69884O08262k5362j116812j503961M9551
40984a40380K595743L202917N08098k978135l484715m54700K843823L165474P10313
40975E968438j637924j755189k37194R65895J061120Q36930Q73204N69098m69914
40966F174464j240460p95639q8075o71604j964155j851231j44757Q35512r3355
40957A60700j059470l43157O24005k79285j976064j614556Q13733K279617J292722
$$ plain form
40948 -101755 -272382 -428048 2000 -21666 -911560 -1478460 -887826 -120255 -520595 -1884263
40938 -1884263 -2989443 -3384344 -3634135 -4106503 -4463913 -4401096 -4169566 -4109739 -4058725 -3530425
40928 -3530425 -2407536 -1287473 -1022558 -1836391 -2985264 -3489859 -3135239 -2453191 -1784235
40919 -1784235 -888234 320562 1220938 1191783 555287 211916 454561 756322 744270 693869
40909 693869 803538 664443 30615 -389547 217812 1275823 1180436 -511258 -2166641
40900 -2166641 -2103572 -910106 -690569 -2193519 -3851577 -3961578 -2782245 -1793334 -1618918
40891 -1618918 -1598493 -1077489 -225991 411768 486596 -124709 -1301684 -2550055 -3282346
40882 -3282346 -3306959 -2747592 -1619916 -16966 1336251 1404949 -17344 -1951618 -3226532
$$ packed form
40948a01755j70627j55666M30048k3666q89894n66900N90634P67571m00340j363668
40938a884263j105180l94901k49791m72368l57410O2817K31530N9827N1014N28300
40928c530425J122889J120063K64915q13833j148873n04595L54620O82048O68956
40919a784235Q96001J208796R00376k9155o36496l43371K42645L01761j2052n0401
40909F93869J09669j39095o33828m20162O07359J058011r5387j691694j655383
40900b166641O3069J193466K19537j502950j658058j10001J179333R88911J74416
40891a618918K0425N21004Q51498O37759P4828o11305j176975j248371p32291
40882c282346k4613N59367J127676J602950J353217O8698j422293j934274j274914
$$ plain form
40873 -3226532 -3422048 -2716056 -1420073 -63550 578955 151949 -769013 -1262983 -1025420
40864 -1025420 -414920 221923 782831 1061147 718090 -211593 -1120400 -1366538 -868604
40855 -868604 -42641 678172 1077969 1069319 717609 414713 646134 1260009 1262485 -58368
40845 -58368 -1832582 -2165909 -326216 2233102 3482728 2866812 1207812 -679297 -2276286
40836 -2276286 -2814503 -1823467 -220630 407136 -178183 -706491 -467553 -221251 -568140
40827 -568140 -791362 -181153 662384 869925 620783 320917 -514846 -2189188 -3481287
40818 -3481287 -2988673 -1281960 -104222 171034 524794 1017533 630930 -401992 -330891
40809 -330891 1189706 1923937 210647 -2264799 -2595159 -515241 1709968 2672717 3129924
$$ packed form
40873c226532j95516P05992J295983J356523O42505m27006r20962m93970K37563
40864a025420O10500O36843N60908K78316l43057r29683r08807k46138M97934
40855h68604Q25963P20813L99797q650l51710l02896K31421O13875K476j320853
40845e8368j774214l33327J839693K559318J249626o15916j659000j887109j596989
40836b276286n38217R91036J602837O27766n85319n28308K38938K46302l46889
40827e68140k23222O10209Q43537K07541k49142k99866q35763j674342j292099
40818c481287M92614J706713J177738K75256L53760M92739l86603j032922P1101
40809c30891J520597P34231j713290k475446l30360K079918K225209R62749M57207
$$ plain form
40800 3129924 3904801 4327805 3464671 1654187 -44229 -1192922 -1985223 -2411201 -2214993
40791 -2214993 -1535128 -953188 -826385 -939088 -891330 -585774 -274283 -316678 -935795 -2011651
40781 -2011651 -3024503 -3372511 -2892802 -1973888 -1058794 -208433 666291 1362453 1560433
40772 1560433 1375505 1296432 1504721 1678174 1595539 1466374 1433989 1254262 843950 684571
40762 684571 1170858 1900720 2137927 1684889 783751 -456594 -1814718 -2470019 -1756909
40753 -1756909 -445072 -296905 -1942464 -3852086 -3923471 -1761517 974745 2293608 1686684
40744 1686684 311867 -476436 -600942 -987602 -1955025 -2681049 -2646971 -2682101 -3653559 -4827769
40734 -4827769 -4758769 -3375665 -1849374 -667282 619598 1780240 1784127 680779 -92344
$$ packed form
40800C129924P74877M23004q63134j810484j698416j148693p92301m25978J96208
40791b214993O79865N81940J26803j12703M7758L05556L11491m2395o19117j075856
40781b011651j012852l48008M79709R18914R15094Q50361Q74724O96162J97980
40772A560433j84928p9073K08289J73453q2635j29165l2385j79727m10312j59379
40762F84571M86287P29862K37207m53038r01138j240345j358124o55301P13110
40753a756909J311837J48167j645559j909622p1385K161954K736262J318863o06924
40744A686684j374817p88303j24506l86660r67423p26024L4078l5130r71458j174210
40734d827769O9000J383104J526291J182092J286880J160642L887j103348p73123
$$ plain form
40725 -92344 21785 -272764 -1827780 -3250353 -2780182 -917415 304493 27122 -803865
40716 -803865 -1065613 -416589 1131479 3355412 5409003 6138263 5108014 3083587 1591566
40707 1591566 1946805 4010102 5757907 5107312 2576863 912363 1427568 2229122 1226840
40698 1226840 -695717 -1357071 -857882 -1123834 -2508992 -3395069 -3179729 -3200417 -4113742
40689 -4113742 -4539271 -3313192 -1374749 -288793 -255252 -703087 -1649001 -3138938 -4158187
40680 -4158187 -3493514 -1427625 450370 1062957 745663 339133 -11642 -854944 -2349877
40671 -2349877 -3511338 -3049092 -1123123 458967 453632 -76692 727177 2755584 4011950
40662 4011950 3311696 1519815 22428 -660799 -520683 265248 836905 101883 -1762092
$$ packed form
40725i2344J14129k94549j555016j422573M70171J862767J221908k77371q30987
40716h03865k61748O49024J548068K223933K053591P29260j030249k024427j492021
40707A591566L55239K063297J747805o50595k530449j664500N15205Q01554j002282
40698A226840j922557o61354M99189k65952j385158q86077K15340k0688r13325
40689d113742m25529J226079J938443J085956L3541m47835r45914j489937j019249
40680d158187O64673K065889J877995O12587l17294m06530l50775q43302j494933
40671b349877j161461M62246J925969J582090n335n30324Q03869K028407J256366
40662D011950p00254j791881j497387o83227J40116P85931N71657p35022j863975
$$ plain form
40653 -1762092 -3329223 -3833820 -3863592 -3805204 -3075813 -1558891 -337456 -93089 -88407 316127
40643 316127 470645 -154728 -712449 -441821 -158719 -789848 -1529539 -1164185 -329898 -542601
40633 -542601 -1562673 -1747323 -856283 -527504 -1690404 -3227629 -3794848 -3614929 -3698392
40624 -3698392 -4210752 -4437635 -3976389 -3361223 -3436523 -4212400 -4611485 -3842754 -2820656
40615 -2820656 -3124308 -4398261 -4374052 -2266817 -390182 -886449 -2477335 -2613614 -1568685
40606 -1568685 -1677581 -3193544 -3945830 -3150927 -2493292 -2737515 -2221146 -41896 1851974
40597 1851974 1552163 86138 -562245 -611556 -1454078 -2734435 -2826010 -1579806 -425787
40588 -425787 -8340 335719 832622 878802 596292 1069508 2503827 3532300 3038964
$$ packed form
40653a762092j567131n04597k9772N8388P29391J516922J221435K44367M682M04534
40643C16127J54518o25373n57721K70628K83102o31129p39691L65354Q34287k12703
40633e42601j020072j84650Q91040L28779j162900j537225n67219J79919q3463
40624c698392n12360k26883M61246O15166p5300p75877l99085P68731J022098
40615b820656l03652j273953K4209K107235J876635m96267j590886j36279J044929
40606a568685j08896j515963p52286P94903O57635k44223N16369K179250J893870
40597A851974k99811j466025o48383m9311q42522j280357r1575J246204J154019
40588d25787M17447L44059M96903M6180k82510M73216J434319J028473m93336
$$ plain form
40579 3038964 1604926 412137 -428090 -1554626 -2850121 -3258710 -2280073 -1012663 -1103026
40570 -1103026 -2661470 -3856139 -3096818 -1123175 57036 63000 515385 2197761 3546423
40561 3546423 3091651 1952075 2171162 3489932 3770122 2253084 375686 -716146 -1509014
40552 -1509014 -2552296 -3349859 -3528575 -3523870 -3279568 -1819865 829707 2800590 2860776
40543 2860776 2442003 3468726 5145025 4951249 2405753 -278816 -1387972 -1561953 -1933941
40534 -1933941 -2239822 -1809942 -1064322 -756367 -628086 -68387 493480 115564 -1025784
40525 -1025784 -1722732 -1441581 -909793 -860093 -1130967 -1338061 -1608595 -2111390 -2460677 -2242466
40515 -2242466 -1779475 -1678384 -1749965 -1129075 341141 1531062 1392281 496432 398918
$$ packed form
40579C038964j434038j192789q40227j126536j295495m08589R78637J267410r0363
40570a103026j558444j194669P59321J973643J180211N964M52385J682376J348662
40561C546423m54772j139576K19087J318770K80190j517038j877398j091832p92868
40552a509014j043282p97563j78716M705K44302J459703K649572J970883O0186
40543B860776m18773J026723J676299j93776k545496k684569j109156j73981l71988
40534a933941l05881M29880P45620L07955J28281N59699N61867l77916j141348
40525a025784o96948K81151N31788M9700k70874k07094k70534n02795l49287K18211
40515b242466M62991J01091p1581O20890J470216J189921j38781q95849r7514
$$ plain form
40506 398918 1505034 2512894 2378299 1865774 2194913 2872120 2338672 605513 -445042
40497 -445042 165964 1053022 712194 -234088 -432820 -253268 -1015839 -2457240 -2974187
40488 -2974187 -2223131 -1522711 -1504330 -1286192 -484865 -196150 -1087988 -2081802 -1979059 -1091563
40478 -1091563 -217969 716137 1802527 2135525 1066175 -462614 -1264448 -1785622 -3122438
40469 -3122438 -4822577 -5315619 -4216515 -2680224 -1618645 -939572 -435155 -80452 529762
40460 529762 1786150 3065143 3233579 2162403 780766 -178272 -489720 64874 1217673
40451 1217673 1645050 391585 -1429008 -1955405 -1267736 -873760 -776503 589746 3260024
40442 3260024 5058350 4773976 3708575 3064734 2114402 333130 -900162 -586416 -185618
$$ packed form
40506C98918J106116J007860j34595n12525L29139O77207n33448j733159j050555
40497d45042O11006Q87058l40828r46282j98732J79552p62571j441401n16947
40488b974187P51056P00420J8381K18138Q01327K88715q91838r93814J02743Q87496
40478a091563Q73594R34106J086390L32998j069350j528789q01834n21174j336816
40469c122438j700139m93042J099104J536291J061579O79073N04417L54703O10214
40460E29762J256388J278993J68436j071176j381637r59038l11448N54594J152799
40451A217673M27377j253465j820593n26397O87669L93976R7257J366249K670278
40442C260024J798326k84374j065401o43841r50332j781272j233292L13746M00798
$$ plain form
40433 -185618 -1306837 -2870101 -2836233 -1533438 -846532 -961052 -429603 940680 1733626
40424 1733626 1480234 1350325 1954407 2338981 1662937 371591 -680855 -973244 -46095
40415 -46095 2028007 3680616 2960082 156710 -2045185 -1634486 675604 2910774 4019709
40406 4019709 3938733 2821748 1295759 618727 1468423 2937649 3459646 2465266 729426
40397 729426 -506763 -450436 678953 1684439 1506048 517554 95890 736741 1431179
40388 1431179 1238126 533857 107234 -114073 -589473 -1054716 -863398 -147891 266027
40379 266027 91674 -3380 583845 1439909 1568221 678609 -300022 -306274 378863 392561
40369 392561 -691426 -1435710 -489813 1207142 1523974 178476 -916917 -570189 99870
$$ packed form
40433a85618j121219j563264L3868J302795O86906j14520N31449J370283P92946
40424A733626k53392j29909O04082L84574o76044j291346j052446k92389R27149
40415d6095K074102J652609p20534k803372k201895M10699K310090K235170J108935
40406D019709q0976j116985j525989o77032Q49696J469226N21997r94380j735840
40397G29426j236189N6327J129389J005486j78391r88494m21664O40851O94438
40388A431179j93053p04269m26623k21307m75400m65243J91318P15507M13918
40379B66027j74353r5054N87225Q56064J28312q89612r78631o252O85137J3698
40369C92561j083987p44284R45897J696955L16832j345498j095393L46728O70059
$$ plain form
40360 99870 -247987 -975576 -593208 875615 1985036 1822236 776763 -273330 -605835
40351 -605835 126921 1386125 1812224 766915 -509804 -314984 1195743 2257968 2004000
40342 2004000 1458852 1752253 2504445 2638818 1974934 1215148 779154 397414 -242192
40333 -242192 -1006388 -1587520 -1960837 -2371854 -2885448 -3083366 -2423704 -990285 325054
40324 325054 603684 -234355 -1460137 -2204952 -1933861 -627071 1069367 2083445 1813960
40315 1813960 770843 -13214 -85469 260985 650685 850271 505888 -507357 -1351424
40306 -1351424 -737719 1313904 2912393 2250029 -208196 -2217392 -2285227 -985413 239791
40297 239791 730664 703299 444655 168543 331620 1260895 2443746 2879601 2287179 1345603
$$ packed form
40360I9870l47857p27589L82368J468823J109421j62800j045473j050093l32505
40351f05835P32756J259204M26099j045309j276719J94820J510727J062225k53968
40342B004000n45148K93401P52192J34373o63884p59786m35994l81740o39606
40333b42192p64196n81132l73317m11017n13594j97918O59662J433419J315339
40324C25054K78630q38039j225782p44815K71091J306790J696438J014078k69485
40315A813960j043117p84057p2255L46454L89700J99586l44383j013245q44067
40306a351424O13705K051623J598489o62364k458225k009196o7835J299814J225204
40297B39791M90873k7365k58644k76112J63077R29275J182851M35855n92422r41576
$$ plain form
40287 1345603 595104 -93768 -588302 -54450 1588012 2558928 1024440 -2207857 -4340429
40278 -4340429 -4121999 -3129304 -2910117 -2583490 -703079 1807982 2628729 1460063 375045
40269 375045 596528 942659 228777 -612785 -181901 953168 1207623 615878 628217 1483639
40259 1483639 1712851 607714 -617117 -928935 -1099894 -1985862 -2628583 -1860298 -804913
40250 -804913 -1537796 -3545149 -3917731 -1542175 1116742 1451015 13978 -1016191 -1012938
40241 -1012938 -714131 -132784 1163805 2352572 2103865 814406 103341 149783 -460885
40232 -460885 -2115626 -3471227 -3757300 -3719603 -3674395 -2780227 -1193421 -753721 -2078594
40223 -2078594 -2968353 -1571885 514265 464251 -1728839 -3741082 -4531306 -4970427 -5347682
$$ packed form
40287A345603p50499o88872m94534N33852J642462R70916j534488l232297k132572
40278d340429K18430R92695K19187L26627J880411K511061Q20747j168666j085018
40269C75045K21483L46131p13882q41562M30884J135069K54455n91745J2339Q55422
40259A483639K29212j105137j224831l11818j70959q85968o42721P68285J055385
40250h04913p32883k007353l72582K375556K658917L34273j437037j030169L253
40241a012938K98807N81347J296589J188767k48707j289459p11065M6442o10668
40232d60885j654741j355601k86073L7697M5208Q94168J586806M39700j324873
40223b078594q89759J396468K086150n0014k193090k012243p90224m39121l77255
$$ plain form
40214 -5347682 -4871596 -3785796 -3558868 -4372748 -4481910 -2904902 -1036659 -628500 -1536478
40205 -1536478 -2383127 -2286979 -1121681 803903 2455036 2523475 1134749 222412 1245015
40196 1245015 3289647 4376046 3928421 2930480 2190496 1555180 613179 -691558 -2023397
40187 -2023397 -2671125 -1968788 -319654 677714 -51644 -1559169 -1978221 -924868 127596
40178 127596 -133860 -1335955 -2118826 -1712630 -536731 362936 260746 -623923 -1374727
40169 -1374727 -1385187 -953793 -648963 -419265 156306 944956 1227384 619802 -470675
40160 -470675 -1375843 -1753364 -1643820 -1348934 -1246147 -1335715 -1052011 5643 1272461
40151 1272461 1788723 1554059 1528510 2081661 2272577 1180808 -700982 -2056954 -2283568
$$ packed form
40214e347682M76086J085800K26928q13880j09162J577008J868243M08159r07978
40205a536478q46649R6148J165298J925584J651133O8439j388726r12337J022603
40196A245015K044632J086399m47625r97941p39984o35316r42001j304737j331839
40187b023397o47728P02337J649134R97368p29358j507525m19052J053353J052464
40178A27596k61456j202095p82871M06196J175899Q99667j02190q84669p50804
40169a374727j0460M31394L04830K29698N75571P88650K82428o07582j090477
40160d70675r05168l77521J09544K94886J02787q9568K83704J057654J266818
40151A272461N16262k34664k5549N53151J90916j091769j881790j355972k26614
$$ plain form
40142 -2283568 -1781628 -1079110 -404418 57050 216617 341124 610505 504453 -611345
40133 -611345 -2292056 -3307143 -3344462 -3483183 -4500780 -5620251 -5687792 -4817744 -3878124
40124 -3878124 -2929618 -1423467 259451 788539 -355582 -2131614 -3260114 -3379381 -2590577
40115 -2590577 -935845 1010502 1941395 1133625 -537742 -1677291 -2023344 -2261539 -2603787
40106 -2603787 -2483248 -1559401 -237060 871802 1462905 1558647 1507596 1881422 2885401
40097 2885401 3938616 4250068 3685814 2718899 1803976 1225000 1170302 1380918 1112548
40088 1112548 108826 -815614 -939669 -857609 -1459539 -2158481 -1619340 -163120 270326
40079 270326 -972637 -2002725 -1001890 1134575 1971184 551748 -1916111 -3811661
$$ packed form
40142b283568N01940P02518O74692M61468J59567J24507K69381j06052j115798
40133f11345j680711j015087l7319j38721j017597j119471o7541Q70048R39620
40124c878124R48506J506151J682918N29088j144121j776032j128500j19267P88804
40115b590577J654732J946347R30893q07770j671367j139549l46053k38195l42248
40106b603787J20539R23847J322341J108862N91103R5742n1051L73826J003979
40097B885401J053215L11452n64254r66915r14923n78976n4698K10616k68370
40088A112548j003722r24440j24055Q2060o01930o98942N39141J456220M33446
40079B70326j242963j030088J000835K136465Q36609j419436k467859j895550
$$ plain form
40071 -3811661 -4337745 -3372110 -1386294 392585 806988 129742 -97981 1052154 2707350
40062 2707350 3274792 2328166 962223 431326 889512 1565385 1819652 1692723 1518737
40053 1518737 1414765 1300630 1117042 816281 407190 204345 647325 1544991 1938638
40044 1938638 1225938 27641 -676995 -868048 -1139702 -1405797 -1015879 -63698 549723
40035 549723 500039 416173 621122 573427 -12005 -496497 -332404 124913 381829 541698
40025 541698 683030 371415 -465476 -948254 -379148 631344 983600 525855 -91141
40016 -91141 -499004 -751313 -784068 -516701 -207678 -100338 -73716 -157493 -809837 -1989271
40006 -1989271 -2572298 -1621848 191990 1371106 1461170 1217378 1173120 1068594 705529
$$ packed form
40071c811661n26084R65635J985816J778879M14403o77246k27723J150135J655196
40062B707350N67442r46626j365943n30897M58186O75873K54267j26929j73986
40053A518737j03972j14135j83588l00761m09091k02845M42980Q97666L93647
40044A938638p12700j198297p04636j91053k71654k66095L89918R52181O13421
40035E49723m9684q3866K04949m7695n85432m84492J64093M57317K56916J59869
40025E41698J41332l11615q36891m82778N69106J010492L52256m57745o16996
40016i1141m07863k52309l2755K67367L09023J07340K6622q3777o52344j179434
40006a989271n83027R50450J813838J179116R0064k43792m4258j04526l63065
$$ plain form
39997 705529 502809 995495 2218599 3555631 3951029 2711389 550991 -725784 -237542
39988 -237542 834208 846375 -205116 -1109286 -1325710 -1277759 -1229976 -1153529 -1416988 -2296986
39978 -2296986 -2971856 -2352302 -865852 -48347 -319702 -608344 -374229 -440367 -1268569
39969 -1268569 -1853009 -1199795 164956 1035657 1043484 564428 -120480 -784679 -1017827 -799091
39959 -799091 -792176 -1368942 -1815105 -1216139 238495 1499829 1910388 1594636 852121 -182322
39949 -182322 -1309665 -2193737 -2601664 -2499966 -1966179 -1187692 -475362 -138410 -367181
39940 -367181 -1187078 -2340695 -3251414 -3363475 -2576569 -1229888 238651 1458035 2147072
39931 2147072 2210897 1673207 481930 -1157623 -2203191 -1449778 691570 2062225 1295968
$$ packed form
39997G05529k02720M92686J223104J337032L95398j239640k160398j276775M88242
39988b37542J071750J2167j051491r04170k16424M7951M7783P6447k63459q79998
39978b296986o74870O19554J486450Q17505k71355k88642K34115o6138q28202
39969a268569n84440O53214J364751Q70701P827m79056o84908o64199k33148K18736
39959g99091O915n76766m46163N98966J454634J261334M10559l15752p42515j034443
39949a82322j127343q84072m07927J01698N33787P78487P12330L36952k28771
39940c67181q19897j153617r10719j12061P86906J346681J468539J219384O89037
39931B147072O3825n37690j191277j639553j045568P53413K141348J370655p66257
$$ plain form
39922 1295968 -418007 -1236227 -1315447 -1902112 -2573234 -1659592 652377 1986640 1129482
39913 1129482 -330276 -607104 -134503 -188775 -639346 -510870 266949 1026880 1555571
39904 1555571 2004927 2246498 2255042 2509657 3193682 3679807 3582117 3554347 4230191 5145747
39894 5145747 5531890 5360511 4775141 3430019 1426806 2704 62177 722619 536174
39885 536174 -431847 -929173 -384814 703844 1729920 2158476 1286493 -883036 -2895204
39876 -2895204 -3240788 -2269074 -1582312 -1819985 -2213294 -2083914 -1563567 -925955 -299748
39867 -299748 27763 -17552 217706 1336169 2824607 3639532 3499293 2720355 1362836
39858 1362836 -333003 -1293908 -801543 132174 20885 -926870 -1450364 -1517984 -2049422
$$ packed form
39922A295968j713975q18220p9220n86665o71122R13642K311969J334263q57158
39913A129482j459758k76828M72601n4272m50571J28476P77819P59931N28691
39904A555571M49356K41571Q544K54615O84025M86125r7690k7770O75844R15556
39894E145747L86143j71379n85370j345122k003213j424102N9473O60442j86445
39885E36174r68021m97326N44359J088658J026076M28556q71983k169529k012168
39876b895204l45584R71714O86762k37673l93309J29380N20347O37612O26207
39867b99748L27511m5315K35258J118463J488438Q14925j40239p78938j357519
39858A362836j695839r60905M92365R33717j11289r47755n23494o7620n31438
$$ plain form
39849 -2049422 -2683893 -2059305 -438406 226861 -620733 -1179988 -234684 1031867 1325432
39840 1325432 1420517 2496069 3798829 3745772 2423077 1339468 1234913 1522067 1543939
39831 1543939 1200315 543845 -288674 -889121 -1014375 -996106 -1215439 -1521237 -1575327 -1275395
39821 -1275395 -482614 941114 2339499 2386332 793964 -823627 -712175 884359 2171037
39812 2171037 1974432 699171 -520526 -878930 -360551 254290 66889 -872452 -1552764
39803 -1552764 -1320141 -542908 385184 1750054 3510642 4532943 3909342 2408800 1500680
39794 1500680 1403954 1228585 662930 242900 44971 -607965 -1854626 -2691744 -2120985
39785 -2120985 -324024 1628890 2825904 3020993 2404778 1183309 -503446 -2198944
$$ packed form
39849b049422o34471O24588J620899O65267q47594n59255R45304J266551K93565
39840A325432R5085J075552J302760n3057j322695j083609j04555K87154K1872
39831A543939l43624o56470q32519o00447j25254J8269k19333l05798n4090K99932
39821a275395P92781J423728J398385M6833j592368j617591J11452J596534J286678
39812B171037j96605j275261j219697l58404N18379O14841j87401r39341o80312
39803a552764K32623P77233R28092J364870J760588J022301o23601j500542r08120
39794A500680r6726j75369n65655m20030j97929o52936j246661q37118N70759
39785b120985J796961J952914J197014J95089o16215j221469j686755j695498
$$ plain form
39777 -2198944 -2960254 -2178837 -618364 92353 -719348 -2125124 -2990640 -3096760 -2482681
39768 -2482681 -866082 1380570 2695603 1986127 185919 -939826 -939795 -546355 -131683
39759 -131683 337172 364224 -510010 -1492112 -1375772 -421036 74799 -92329 41969 589024
39749 589024 499423 -452628 -1157898 -1173949 -1509115 -2614862 -3213032 -2203641 -417986
39740 -417986 663039 801885 509755 -186053 -1169809 -1457566 -534427 263307 -638022
39731 -638022 -2474712 -2898923 -1250514 590405 947579 438297 601865 1598729 2290278
39722 2290278 2009111 1270501 842759 818952 757908 362565 -211953 -627593 -745656 -624053
39712 -624053 -241508 467646 1209502 1314952 431688 -985030 -2160064 -2735833 -2699663
$$ packed form
39777b198944p61310P81417J560473P10717q11701j405776q65516j06120O14079
39768b482681J616599K246652J315033p09476j800208j125745L1L93440M14672
39759a31683M68855K7052q74234r82102J16340R54736M95835j67128J34298N47055
39749E89024q9601r52051p05270j6051l35166j105747n98170J009391J785655
39740d17986J081025J38846k92130o95808r83756k87757R23139P97734r01329
39731f38022j836690m24211J648409J840919L57174n09282J63568R96864O91549
39722B290278k81167p38610m27742k3807o1044l95343n74518m15640j18063J21603
39712f24053L82545P09154P41856J05450q83264j416718j175034n75769L6170
$$ plain form
39703 -2699663 -1938519 -499101 867537 1212975 607754 136811 338325 360296 -671021
39694 -671021 -2009348 -2058136 -702052 268110 -476274 -1956984 -2272478 -1161448 -4851
39685 -4851 443929 888112 1779388 2251812 1644959 911979 1208346 1846243 1171520 -880990
39675 -880990 -2686222 -3332362 -3483182 -3571903 -2895757 -1328891 -346783 -1015966 -2094065
39666 -2094065 -1657462 98239 1269222 1067435 596734 796840 1196692 1172514 1126345
39657 1126345 1609204 2124074 1670021 111370 -1587658 -2310009 -1669877 -193970 1166366
39648 1166366 1879620 2179639 2349273 2039859 993596 45869 167771 554305 -694269
39639 -694269 -3413243 -4660957 -2518273 833094 1761618 19035 -1359814 -692411 350934
$$ packed form
39703b699663P61144J439418J366638L45438o05221m70943K01514K1971j031317
39694f71021j338327m8788J356084R70162p44384j480710l15494J111030J156597
39685d851M48780M44183Q91276M72424o06853p32980K96367O37897o74723k052510
39675h80990j805232o46140j50820q8721O76146J566866R82108o69183j078099
39666b094065M36603J755701J170983k01787m70701K00106L99852k4178m6169
39657A126345M82859N14870m54053j558651j699028p22351O40132J475907J360336
39648A166366P13254L00019J69634l09414j046263r47727J21902L86534j248574
39639f94269k718974j247714K142684L351367R28524j742583j378849O67403J043345
$$ plain form
39630 350934 -97507 -1352289 -1856834 -1689100 -1678219 -1449654 -326249 754734 345469
39621 345469 -914204 -906898 728092 1958598 1352095 -95519 -778425 -516849 62745
39612 62745 714627 1120488 576615 -664760 -935486 542343 1901570 884591 -1808753
39603 -1808753 -3309641 -2499247 -1208882 -1209060 -1810156 -1343783 283971 1696647 2018533
39594 2018533 1639611 1191571 609567 -549931 -2186011 -3338998 -2980211 -1152375 954748
39585 954748 2239068 2591873 2273307 1065633 -1112550 -3194854 -3719622 -2619839 -1291967
39576 -1291967 -760393 -683336 -341527 352450 1173487 2045143 2722310 2679152 1733307 313561
39566 313561 -1035439 -1858433 -1611134 -226961 1113956 958013 -431848 -1300318 -962296
$$ packed form
39630C50934m48441j254782n04545J67734J0881K28565J123405J080983m09265
39621C45469j259673P306J634990J230506o06503j447614o82906K61576N79594
39612F2745O51882M05861n43873j241375k70726J477829J359227j016979k693344
39603a808753j500888Q10394J290365j78o01096M66373J627754J412676L21886
39594B018533l78922m48040n82004j159498j636080j152987L58787J827836K107123
39585I54748J284320L52805l18566j207674k178183k082304n24768J099783J327872
39576a291967N31574P7057L41809O93977Q21037Q71656O77167m3158r45845j419746
39566C13561j349000q22994K47299J384173J340917j55943j389861q68470L38022
$$ plain form
39557 -962296 -681337 -1342322 -1877807 -1206111 -297241 -695783 -2031032 -2753609 -2588474
39548 -2588474 -2367901 -1938994 -393144 1581334 1751463 -505412 -2765044 -2338615 569510
39539 569510 3434476 4354331 3519911 2296802 1757399 2002743 2343184 2057949 1102992
39530 1102992 -15254 -962403 -1792386 -2464938 -2638905 -2121613 -1239984 -681160 -1082879
39521 -1082879 -2524382 -4108210 -4433163 -3047364 -1138707 -207860 -445464 -1108473 -1933372
39512 -1933372 -3084222 -4107428 -4295036 -3964698 -3989752 -4082862 -3112069 -1295548 -315093
39503 -315093 -696924 -865715 295872 1681323 1979046 1800298 2168711 2338131 1156273
39494 1156273 -447862 -655711 135171 -146070 -1657429 -2111599 -380183 1691876 2160811
$$ packed form
39557i62296K80959o60985n35485O71696R08870l98542j335249p22577J65135
39548b588474K20573M28907J545850J974478J70129k256875k259632M26429K908125
39539E69510K864966R19855q34420j223109n39403K45344L40441k85235r54957
39530A102992j118246r47149q29983o72552j73967N17292Q81629N58824m01719
39521a082879j441503j583828l24953J385799J908657R30847k37604o63009q24899
39512a933372j150850j023206j87608L30338k5054r3110R70793J816521R80455
39503c15093l81831j68791J161587J385451K97723j78748L68413J69420j181858
39494A156273j604135k07849P90882k81241j511359m54170J731416K072059M68935
$$ plain form
39485 2160811 1706409 1998133 2870207 2909470 1900680 863189 146192 -738185 -1498959
39476 -1498959 -1038121 577329 1611820 898703 -519664 -911082 -193235 342878 154904
39467 154904 13353 424901 717911 232656 -508244 -701717 -805042 -2062335 -4442232
39458 -4442232 -6046747 -5145330 -2299341 142315 502895 -723614 -1776055 -1590836 -680023
39449 -680023 -241493 -673303 -1181678 -884951 21451 594500 484567 346151 765023 1361971
39439 1361971 1341560 501489 -723853 -1851624 -2513373 -2363725 -1372915 -3575 1352105
39430 1352105 2789947 4209312 4665348 3329565 937529 -741408 -1002835 -833868 -1218238
39421 -1218238 -1836486 -1974836 -1803374 -1928794 -2260409 -2145333 -1290009 105741 1738960
$$ packed form
39485B160811m54402K91724Q72074L9263j008790j037491p16997q84377p60774
39476a498959M60838J615450J034491p13117j418367l91418P17847N36113j87974
39467A54904j41551M11548K93010m85255p40900j93473j03325j257293k379897
39458d442232j604515R01417K845989K441656L60580j226509j052441J85219R10813
39449f80023M38530m31810n08375K96727R06402N73049j09933j38416M18872N96948
39439A361971k0411q40071j225342j127771o61749J49648R90810J369340J355680
39430A352105J437842J419365M56036j335783k392036j678937k61427J68967l84370
39421a218238o18248j38350J71462j25420l31615J15076Q55324J395750J633219
$$ plain form
39412 1738960 3043463 3099112 1632848 -125787 -583644 239456 818388 283083 -548367
39403 -548367 -610645 -73886 214114 -7491 -425822 -853648 -1162040 -978311 -290347 -39791
39393 -39791 -1166336 -3088550 -4018680 -3006902 -1006671 338996 401917 -203951 -551164
39384 -551164 -147699 894259 2031861 2742204 2952530 2885896 2550593 1788531 828841
39375 828841 235813 165204 245345 351567 755298 1190706 695582 -926900 -2331171 -2316571
39365 -2316571 -1653069 -2003496 -3419196 -4297190 -3753712 -2603842 -1763298 -1117228 -519852
39356 -519852 -575600 -1560917 -2624187 -2995154 -3097067 -3496409 -3637907 -2802230 -1594671
39347 -1594671 -1146585 -1353886 -1312144 -1091627 -1455068 -1953825 -1157954 834689 1897135
$$ packed form
39412A738960J304503N5649j466264j758635m57857Q23100N78932n35305q31450
39403e48367o2278N36759K88000k21605m18331m27826l08392J83729O87964K50556
39393c9791j126545j922214r30130J011778K000231J345667O2921o05868l47213
39384e51164M03465J041958J137602P10343K10326o6634l35303p62062r59690
39375H28841n93028p0609Q0141J06222M03731M35408m95124j622482j404271J4600
39365b316571O63502l50427j415700q77994N43478J149870Q40544O46070N97376
39356e19852n5748r85317j063270l70967j01913l99342j41498Q35677J207559
39347a594671M48086k07301M1742K20517l63441m98757P95871J992643J062446
$$ plain form
39338 1897135 746425 -1146118 -1641542 -741381 30937 153885 412347 1056964 1247504
39329 1247504 504783 -493034 -917501 -721316 -269603 198693 448636 276425 -46433
39320 -46433 621 247278 -153515 -1369071 -2293855 -1924988 -687615 365941 1101745
39311 1101745 2029766 2809378 2278609 171058 -2258288 -3751900 -4270905 -4123156 -2851514
39302 -2851514 -115751 2813142 3790997 2231389 -157101 -1378192 -1090349 -179021 730350
39293 730350 1561643 2147690 2239966 2044000 2014501 2126841 1969056 1534117 1243478 1117406
39283 1117406 667232 -159311 -709478 -747538 -1057418 -2133228 -2867872 -1699083 1041107
39274 1041107 3105990 3020219 1785390 1247513 1616703 1679174 1030806 740918 1548697
$$ packed form
39338A897135j150710j892543m95424R00161P72318J22948K58462O44617J90540
39329A247504p42721r97817m24467J96185M51713M68296K49943j72211l22858
39320d6433M7054K46657m00793j215556r24784L68867J237373J053556P35804
39311A101745R28021P79612n30769k107551k429346j493612n19005J47749J271642
39302b851514K735763K928893R77855j559608k388490j221091K87843R11328R09371
39293G30350Q31293N86047R2276j95966k9499J12340j57785m34939k90639j26072
39283A117406m50174q26543n50167l8060l09880j075810p34644J168789K740190
39274A041107K064883q5771j234829n37877L69190O2471o48368k89888Q07779
$$ plain form
39265 1548697 2574572 2581265 1764550 1320923 1586563 1655283 911927 -3629 -168862 368703
39255 368703 837399 766369 211906 -667338 -1609166 -2032302 -1547933 -708362 -565113 -1289564
39245 -1289564 -1860420 -1482730 -749943 -784462 -1561600 -1878286 -1033263 199360 636020
39236 636020 156175 -482616 -925823 -1453548 -1916525 -1442799 191109 1628553 1352228
39227 1352228 -251068 -1297835 -905268 -164292 -247558 -700717 -521406 -98202 -784595
39218 -784595 -2780263 -4644873 -5087268 -4289481 -3158391 -2098295 -1030953 -68872 402777
39209 402777 121543 -822859 -1908463 -2246542 -1209012 723342 2140957 2096914 1077620
39200 1077620 350756 650591 1758998 3015226 3808130 3753376 2833228 1449394 210418
$$ packed form
39265A548697J025875O693q16715m43627K65640O8720p43356r15556j65233N37565
39255C68703M68696p1030n54463q79244r41828m23136M84369Q39571J43249p24451
39245a289564n70856L77690P32787l4519p77138l16686Q45023J232623M36660
39236F36020m79845o38791m43207n27725m62977M73726J633908J437444k76325
39227A352228j603296j046767L92567P40976q3266m53159J79311M23204o86393
39218g84595j995668j864610m42395P97787J131090J060096J067342R62081M71649
39209D02777k81234r44402j085604l38079J037530J932354J417615m4043j019294
39200A077620p26864K99835J108407J256228P92904n4754r20148j383834j238976
$$ plain form
39191 210418 -364498 -87837 621936 781759 -273943 -1866475 -2409539 -1280762 215239
39182 215239 296564 -1206652 -2825848 -3358884 -3127314 -3188089 -3820980 -4243110 -3748674 -2729985
39172 -2729985 -2199620 -2352115 -2199361 -1071149 97277 -74174 -1216306 -1480683 -265349
39163 -265349 731617 4660 -1468809 -1765766 -974414 -901308 -2077553 -2839869 -1847565
39154 -1847565 -102767 429492 -593286 -1608835 -1180435 356310 1341621 637961 -1092188
39145 -1092188 -2083477 -1443349 -7551 1010454 1542291 2134347 2537604 2037706 1004091
39136 1004091 777949 1741239 2619995 2179867 730671 -506962 -739137 90451 1471131
39127 1471131 2321310 1659269 -114098 -1327724 -1027410 -147675 -109310 -1004833 -1886528
$$ packed form
39191B10418n74916K76661P09773J59823j055702j592532n43064J128777J496001
39182B15239Q1325j503216j619196n33036K31570o0775o32891m22130M94436J018689
39172b729985N30365j52495J52754J128212J168426j71451j142132k64377J215334
39163b65349R96966p26957j473469k96957P91352P3106j176245p62316R92304
39154a847565J744798N32259j022778j015549M28400J536745R85311p03660j730149
39145a092188r91289O40128J435798J018005N31837N92056M03257m99898j033615
39136A004091k26142R63290Q78756m40128j449196j237633k32175Q29588J380680
39127A471131Q50179o62041j773367j213626L00314Q79735L8365q95523q81695
$$ plain form
39118 -1886528 -2129225 -1679239 -591650 761142 1512270 1218337 549323 301017 275604
39109 275604 18057 -6721 822283 1826544 1728620 601399 -303383 -652188 -1420888 -2853763
39099 -2853763 -3528852 -2271526 66638 1655430 1811022 1244724 719451 334450 -37433
39090 -37433 -317178 -346329 -141161 82079 132282 128064 365330 700188 419368 -812976
39080 -812976 -2265393 -3081458 -3504683 -4166077 -4465271 -3073900 -204912 2074147 2343693
39071 2343693 1389185 627181 293357 95390 361075 1238073 1761499 1173865 400484
39062 400484 661904 1247304 452662 -1562003 -2767418 -2243535 -1306187 -1170349 -1249833
39053 -1249833 -677187 -8341 -172255 -776001 -764968 -107677 379379 433867 470978 642951
$$ packed form
39118a886528k42697M49986J087589J352792P51128k93933o69014k48306k5413
39109B75604k57547k4778Q29004J004261r7924j127221r04782l48805p68700j432875
39099b853763o75089J257326K338164J588792J55592n66298n25273l85001l71883
39090c7433k79745k9151K05168K23240N0203m218K37266L34858k80820j232344
39080h12976j452417q16065m23225o61394k99194J391371K868988K279059K69546
39071B343693r54508p62004l33824j97967K65685Q76998N23426n87634p73381
39062D00484K61420N85400p94642k014665j205415N23883R37348J35838p9484
39053a249833N72646O68846j63914o03746J1033O57291M87056N4488L7111J71973
$$ plain form
39043 642951 823579 1253586 2110170 2612781 1772062 109497 -598962 317752 1425962
39034 1425962 1165816 -123940 -1005990 -1002273 -728964 -377270 615449 2169063 2975117
39025 2975117 2038029 205185 -666784 67428 1162964 1183544 303362 -91590 601711
39016 601711 1289948 646731 -931929 -1644794 -721249 295248 -522545 -2713848 -3705685
39007 -3705685 -2014844 860767 2323435 1642087 229859 -439542 -137591 634013 1303595
38998 1303595 1221568 13369 -1628566 -2278887 -1422354 -193258 2533 -911534 -1944818
38989 -1944818 -2391465 -2317996 -2081248 -1998691 -2272281 -2681512 -2539182 -1456580 40075
38980 40075 1122527 1627176 1902163 2043203 1990343 2113039 2814557 3604770 3462163 2251036
$$ packed form
39043F42951J80628M30007Q56584N02611q40719j662565p08459R16714J108210
39034A425962k60146j289756q82050L717K73309L51694R92719J553614Q06054
39025B975117r37088j832844q71969P34212J095536K0580q80182l94952O93301
39016F01711O88237o43217j578660p12865R23545J016497q17793k191303r91837
39007c705685J690841K875611J462668o81348j412228o69401L01951P71604O69582
38998A303595q2027j208199j641935o50321Q56533J229096J95791r14067j033284
38989a944818m46647P3469K36748Q2557k73590m09231J42330J082602J496655
38980D0075J082452N04649K74987J41040n2860J22696P01518P90213j42607j211127
$$ plain form
38970 2251036 967063 391813 331970 464719 1030272 2147119 3211531 3674731 3830861
38961 3830861 4101357 4063809 3109344 1770027 1362308 2238236 3289992 3485240 3121008
38952 3121008 3035228 3172711 2733944 1569428 567753 357240 283201 -644971 -2075028
38943 -2075028 -2457795 -1078467 827799 1536747 867369 67922 79451 753287 1559542
38934 1559542 2103897 1958444 977574 -81079 -264963 43094 -512731 -1968084 -2529914
38925 -2529914 -1267721 65887 -625612 -2623516 -3373030 -2078309 -364796 546173 1247965
38916 1247965 2246002 2587364 1486653 -99272 -809575 -818134 -1166193 -1887471 -2125507
38907 -2125507 -1691498 -1206852 -861397 -262482 412963 282570 -847123 -1850038 -1587755
$$ packed form
38970B251036j283973n75250n9843J32749N65553J116847J064412M63200J56130
38961C830861K70496l7548r54465j339317m07719Q75928J051756J95248l64232
38952C121008q5780J37483m38767j164516j001675k10513p4039r28172j430057
38943b075028l82767J379328J906266P08948o69378p99447J1529O73836Q06255
38934A559542N44355j45453r80870j058653j83884L08057n55825j455353n61830
38925b529914J262193J333608o91499j997904p49514J294721J713513R10969P01792
38916A247965R98037L41362j100711j585925p10303q559l48059p21278k38036
38907b125507M34009M84646L45455N98915O75445j30393j129693j002915K62283
$$ plain form
38898 -1587755 -285543 869274 1072528 381862 -777029 -1916503 -2312284 -1220331 1170650
38889 1170650 3221699 3066246 757761 -1384135 -1333558 110153 462740 -829197 -1437458
38880 -1437458 472567 3330285 4035649 1905538 -857636 -2216453 -2118844 -1340027 -316245
38871 -316245 409178 183086 -531311 -243730 1393701 2755355 2600106 2028291 2701120
38862 2701120 4105642 4333503 3076586 2016459 2243222 3002087 3380332 3697090 4445312
38853 4445312 4999165 4333901 2401180 49668 -1951652 -3221710 -3554373 -3028075 -2114888
38844 -2114888 -1289939 -736182 -569680 -853238 -1133719 -606671 768879 1874230 1758430
38835 1758430 926616 635658 1227136 1874820 1824438 1207652 655223 649957 1235547 1892818
$$ packed form
38898a587755J302212J154817K03254o90666j158891j139474l95781J091953K390981
38889A170650K051049j55453k308485k141896N0577J443711L52587j291937o08261
38880a437458J910025K857718P05364k130111k763174j358817R7609P78817J023782
38871c16245P25423k26092p14397K87581J637431J361654j55249n71815O72829
38862B701120J404522K27861j256917j060127K26763P58865L78245L16758P48222
38853D445312N53853o65264j932721k351512k001320j270058l32663N26298R13187
38844b114888Q24949N53757J66502k83558k80481N27048J375550J105351j15800
38835A758430q31814k90958N91478O47684n0382o16786n52429n266N85590O57271
$$ plain form
38825 1892818 1791008 671588 -599272 -909952 -273197 312127 383716 637752 1717393
38816 1717393 3034508 3390321 2494008 1332925 1055024 1816415 2762400 2911874 1978065
38807 1978065 456630 -944026 -1903908 -2571708 -3159509 -3538908 -3259558 -2030425 -247497
38798 -247497 1106497 1357041 890142 678342 1038313 1272945 665697 -626062 -1895210
38789 -1895210 -2649310 -2743029 -2172972 -1116004 155304 1639393 3404748 4775728 4487642
38780 4487642 2270428 -378774 -1761810 -1776990 -1438143 -1318009 -1443683 -1992622 -2769601
38771 -2769601 -2577557 -708690 1278728 1093689 -974232 -2181262 -1103525 662587
38763 662587 1271720 1161665 1618026 2434471 2546000 1907061 1279458 939383 864813 1450557
$$ packed form
38825A892818j01810j119420j270860l10680O36755N85324P1589K54036J079641
38816A717393J317115L55813q96313j161083k77901P61391R45985J49474r33809
38807A978065j521435j400656r59882o67800n87801l79399K79350J229133J782928
38798b47497J353994K50544m66899k11800L59971K34632o07248j291759j269148
38789a895210p54100r3719N70057J056968J271308J484089J765355J370980k88086
38780D487642k217214k649202j383036j5180L38847J20134j25674n48939p76979
38771b769601J92044J868867J987418j85039k067921j207030J077737J766112
38763F62587O09133j10055M56361Q16445J11529o38939o27603l40075p4570N85744
$$ plain form
38753 1450557 2768868 3786572 3583709 2815734 2802072 3671351 4480589 4597297 3917747
38744 3917747 2421846 667363 -52616 630539 1107860 -144991 -2207905 -3023928 -2291553
38735 -2291553 -1199703 -40229 1624659 2866379 2103495 43932 -666163 750063
38727 750063 2195841 2212797 1957829 2526798 2789585 1633342 341166 697717 2188307
38718 2188307 3077117 3138232 3362847 3817321 3714567 3076135 2609860 2304048 1609446 639018
$$ packed form
38753A450557J318311J017704k02863p67975j3662Q69279Q09238J16708o79550
38744C917747j495901j754483p19979O83155M77321j252851k062914q16023P32375
38735b291553J091850J159474J664888J241720p62884k059563p10095J416226
38727G50063J445778J6956k54968N68969K62787j156243j292176L56551J490590
38718B188307Q88810O1115K24615M54474j02754o38432m66275l05812o94602r70428
$$ [...]
0f36
##END NTUPLES=NMR SPECTRUM
##END=
