##TITLE=31Pdec_ADM506M
 CDCl3, 24 sc
 5.6.2019
##JCAMPDX= 6.0         $$ Bruker NMR JCAMP-DX V2.0
##DATA TYPE= NMR SPECTRUM
##DATA CLASS= NTUPLES
##ORIGIN= UXNMR, Bruker Analytische Messtechnik GmbH
##OWNER= root
$$ XWIN-NMR		Version 3.5
$$ Wed Jun  5 16:25:07 2019 Russian Standard Time (UT+4h)  she@DPX200
##.OBSERVE FREQUENCY= 81.013821
##.OBSERVE NUCLEUS= ^31P
##.ACQUISITION MODE= SIMULTANEOUS
##.ACQUISITION SCHEME= undefined
##.AVERAGES= 24
##.DIGITISER RES= 17
##SPECTROMETER/DATA SYSTEM= spect
##.PULSE SEQUENCE= zgpg30
##.SOLVENT NAME= DMSO
##.SHIFT REFERENCE= (INTERNAL, DMSO, 0, 182.463)
##AUDIT TRAIL= $$ (NUMBER, WHEN, WHO, WHERE, WHAT)
$$ ##TITLE= Audit trail, XWIN-NMR		Version 3.5
$$ ##JCAMPDX= 5.01
$$ ##ORIGIN= Bruker BioSpin GmbH
$$ ##OWNER= she
$$ F:/spectra/data/she/nmr/P31/1/pdata/1/auditp.txt
$$ ##AUDIT TRAIL=  $$ (NUMBER, WHEN, WHO, WHERE, WHAT)
(   1,<2019-06-05 16:22:28.20 +0400>,<she>,<DPX200>,
      <created by zg, POWCHK disabled, PULCHK disabled
       configuration hash MD5:
       00 E9 B6 7A A2 85 ED C7 34 08 36 98 17 FE 4E 26
       data hash MD5: 32K
       31 8E 7E 11 F5 8C 47 BA 74 BA 6A 67 7E 28 F1 AA>)
(   2,<2019-06-05 16:22:30.71 +0400>,<she>,<DPX200>,
      <Start of raw data processing
       efp BC_mod = 2 LB = 1 FT_mod = 6 PKNL = 1 PHC0 = -2179.776 PHC1 = 37.39912 SI = 64K 
       data hash MD5: 64K
       7A C0 D0 A1 A6 4B 89 74 09 A3 21 9D 2A 25 4D 6A>)
(   3,<2019-06-05 16:23:24.96 +0400>,<she>,<DPX200>,
      <pk PHC0 = 5.148923 PHC1 = 22.4 
       data hash MD5: 64K
       D7 87 A6 6D 10 B0 7C B1 7A 31 DF EC 0B AA 10 FC>)
$$ ##END=
$$ 
$$ hash MD5
$$ 14 C6 9A B0 6C F6 66 F4 F8 6E BF AC 0E 6A F2 F0
##$RELAX= 
##$RELAX= 
##$RELAX= 
##$RELAX= 
##$RELAX= 
##$RELAX= 
##$RELAX= 
##$RELAX= 
$$ Bruker specific parameters
$$ --------------------------
##$DU= <F:/spectra>
##$EXPNO= 1
##$NAME= <P31>
##$PROCNO= 1
##$TYPE= <nmr>
##$USER= <she>
##$AMP= (0..31)
100 100 100 100 100 100 100 100 100 100 100 100 100 100 100 100 100 100 
100 100 100 100 100 100 100 100 100 100 100 100 100 100 
##$AQSEQ= 0
##$AQ_mod= 1
##$AUNM= <au_zg>
##$AUTOPOS= <>
##$BF1= 81.014009
##$BF2= 200.13
##$BF3= 200.13
##$BF4= 200.13
##$BF5= 200.13
##$BF6= 200.13
##$BF7= 200.13
##$BF8= 200.13
##$BYTORDA= 1
##$CFDGTYP= 0
##$CFRGTYP= 5
##$CHEMSTR= <none>
##$CNST= (0..31)
1 1 145 1 1 1 1 1 1 1 1 1 1 1 1 1 1 1 1 1 1 1 1 1 1 1 1 1 1 1 1 1 
##$CPDPRG= <waltz16>
##$CPDPRG1= <>
##$CPDPRG2= <waltz16>
##$CPDPRG3= <>
##$CPDPRG4= <mlev>
##$CPDPRG5= <mlev>
##$CPDPRG6= <mlev>
##$CPDPRG7= <mlev>
##$CPDPRG8= <mlev>
##$CPDPRGB= <>
##$CPDPRGT= <>
##$D= (0..31)
0 1 0 0 0 0 0 0 0 0 0 0.03 2e-05 3e-06 0 0 0 0 0 0 0 0 0 0 0 0 0 0 0 0 
0 0 
##$DATE= 1559737347
##$DBL= (0..7)
120 120 120 11 120 120 24 19 
##$DBP= (0..7)
150 150 150 150 150 150 150 150 
##$DBP07= 0
##$DBPNAM0= <>
##$DBPNAM1= <>
##$DBPNAM2= <>
##$DBPNAM3= <>
##$DBPNAM4= <>
##$DBPNAM5= <>
##$DBPNAM6= <>
##$DBPNAM7= <>
##$DBPOAL= (0..7)
0.5 0.5 0.5 0.5 0.5 0.5 0.5 0.5 
##$DBPOFFS= (0..7)
0 0 0 0 0 0 0 0 
$$ [...]
##$SUBNAM2= <"">
##$SUBNAM3= <"">
##$SUBNAM4= <"">
##$SUBNAM5= <"">
##$SUBNAM6= <"">
##$SUBNAM7= <"">
##$SUBNAM8= <"">
##$SUBNAM9= <"">
##$SW= 369.568048894756
##$SWIBOX= (0..15)
0 1 3 0 0 0 0 0 0 0 0 0 0 0 0 0 
##$SW_h= 29940.119760479
##$TD= 32768
##$TD0= 1
##$TE= 0
##$TE2= 300
##$TE3= 300
##$TEG= 300
##$TL= (0..7)
0 120 53 12 22 120 120 120 
##$TP= (0..7)
150 150 150 150 150 150 150 150 
##$TP07= 0
##$TPNAME0= <>
##$TPNAME1= <>
##$TPNAME2= <>
##$TPNAME3= <>
##$TPNAME4= <>
##$TPNAME5= <>
##$TPNAME6= <>
##$TPNAME7= <>
##$TPOAL= (0..7)
0.5 0.5 0.5 0.5 0.5 0.5 0.5 0.5 
##$TPOFFS= (0..7)
0 0 0 0 0 0 0 0 
##$TUNHIN= 0
##$TUNHOUT= 0
##$TUNXOUT= 0
##$USERA1= <user>
##$USERA2= <user>
##$USERA3= <user>
##$USERA4= <user>
##$USERA5= <user>
##$V9= 5
##$VALIST= <valist>
##$VCLIST= <CCCCCCCCCCCCCCC>
##$VD= 0
##$VDLIST= <DDDDDDDDDDDDDDD>
##$VPLIST= <PPPPPPPPPPPPPPP>
##$VTLIST= <TTTTTTTTTTTTTTT>
##$WBST= 1024
##$WBSW= 4
##$XGAIN= (0..3)
0 0 0 0 
##$XL= 0
##$YL= 0
##$YMAX_a= 71879
##$YMIN_a= -84276
##$ZGOPTNS= <>
##$ZL1= 120
##$ZL2= 120
##$ZL3= 120
##$ZL4= 120
##$ABSF1= 0
##$ABSF2= 0
##$ABSG= 0
##$ABSL= 0
##$ALPHA= 0
##$AQORDER= 0
##$ASSFAC= 0
##$ASSFACI= 0
##$ASSFACX= 0
##$ASSWID= 0
##$AUNMP= <proc_1d>
##$AZFE= 0.1
##$AZFW= 0.5
##$BCFW= 0
##$BC_mod= 2
##$BYTORDP= 0
##$COROFFS= 0
##$CY= -3
##$DATMOD= 1
##$DC= 0
##$DFILT= <>
##$DTYPP= 0
##$F1P= 0
##$F2P= 0
##$FCOR= 1
##$FTSIZE= 65536
##$FT_mod= 6
##$GAMMA= 0
##$GB= 0
##$INTBC= 1
##$INTSCL= 5.30512e-09
##$ISEN= 30
##$LB= 1
##$LEV0= 0
##$LPBIN= 0
##$MAXI= 10000
##$MC2= 0
##$MEAN= 0
##$ME_mod= 0
##$MI= 50
##$NCOEF= 0
##$NC_proc= -4
##$NLEV= 6
##$NOISF1= 182.463
##$NOISF2= 159.3651
##$NSP= 0
##$NTH_PI= 0
##$NZP= 0
##$OFFSET= 182.463
##$PC= 4
##$PHC0= -2174.627
##$PHC1= 59.79912
##$PH_mod= 1
##$PKNL= yes
##$PPARMOD= 0
##$PSCAL= 0
##$PSIGN= 0
##$REVERSE= no
##$SF= 81.0140089999434
##$SI= 65536
##$SIGF1= 159.3651
##$SIGF2= -187.1042
##$SINO= 113.3802
##$SIOLD= 16384
##$SREGLST= <1H.CDCl3>
##$SSB= 0
##$STSI= 65536
##$STSR= 0
##$SW_p= 29940.119760479
##$SYMM= 0
##$S_DEV= 0
##$TDeff= 32768
##$TDoff= 0
##$TI= <>
##$TILT= no
##$TM1= 0
##$TM2= 0
##$TOPLEV= 0
##$USERP1= <user>
##$USERP2= <user>
##$USERP3= <user>
##$USERP4= <user>
##$USERP5= <user>
##$WDW= 1
##$XDIM= 65536
##$YMAX_p= 515046263
##$YMIN_p= -5837664
$$ End of Bruker specific parameters
$$ ---------------------------------
##NTUPLES= NMR SPECTRUM
##VAR_NAME=  FREQUENCY,     SPECTRUM/REAL,   SPECTRUM/IMAG
##SYMBOL=    X,             R,               I
##VAR_TYPE=  INDEPENDENT,   DEPENDENT,       DEPENDENT
##VAR_FORM=  AFFN,          ASDF,            ASDF
##VAR_DIM=   65536,         65536,           65536
##UNITS=     HZ,            ARBITRARY UNITS, ARBITRARY UNITS
##FACTOR=    0.456856943014862, 1,           1
##FIRST=     14782.0589164792, 0,            0
##LAST=      -15158.0608439998, 0,           0
##MIN=       -15158.0608439998, -5837664,    0
##MAX=       14782.0589164792, 515046263,    0
$$ Real data points
##PAGE= N=1
##DATA TABLE= (X++(R..R)), XYDATA
$$ [...]
41420b75497k29286m0438L51948L51898N7903K8923K78271K65306j26825l56195
41410C06008j45661M7062j64541m20304k54103P0716J7155k57024j51161K79714
41400f72139L11057k41012o04582k11754M21095N13148J70508M5495K21639K07003
41390A60458j14695k95730j33310K1630o1904j20267L5386J09589j37064l51832
41380h87739o0185N58894Q27522M46226j45296l44775q9638J47708k753l14277
41370A35687k49383K56074N69066J64405n78130q08584l35883J93458K71513J14424
41360b67353R3115J45346R6313Q6531K39741K73273p3995m86451m41068K0810
41350c13738L44882K06730j79080m28930l43303L3757M19652M60455J49164r1439
$$ plain form
41420 -275497 -504783 -545221 -193273 158625 216528 245451 523722 789028 662203 306008
41410 306008 160347 207409 42868 -377436 -631539 -560823 -543668 -800692 -951853 -672139
41400 -672139 -361082 -602094 -1206676 -1418430 -997335 -484187 -313679 -268184 -46545 160458
41390 160458 45763 -249967 -383277 -361647 -423551 -543818 -508432 -398843 -535907 -887739
41380 -887739 -947924 -389030 438492 884718 739422 394647 305009 452717 449964 135687
41370 135687 -113696 142378 711444 875849 297719 -510865 -846748 -653290 -381777 -267353
41360 -267353 -174238 -28892 67421 153952 393693 666966 592971 106520 -334548 -313738
41350 -313738 31144 237874 58794 -370136 -713439 -679682 -260030 200425 349589 258150
41340B58150p437P2798k02173n36041m10924L0700J74252p5286j72721J31647
41330g37035M04081K78513K280o4628r6l0632r7858o9054n3904j62730k18612
41319g49675n1739J42234P7328j57227k31860o6374J08727J19151K7664k9581
41309h11352n964M9464M9319l3383r6148m4085J2147r3900k20817k3320M56776
41298g61263O64732K68321k88863l50892L9674K48323J904k44657k4304M48039
41288A014N84205K31781j51963j43435J00922J23616j43565k65573M6393M57262
41278H40657M36587j0927l88361m14622k97066k47424j38901J52451L96160K89666
41268F18220r8472m24768m84536l26300p8058J39373K15710J38648J9880n5153
$$ plain form
41340 258150 250713 323511 121338 -414703 -825627 -794927 -620675 -695961 -868682 -737035
41330 -737035 -332954 -54441 -52161 -116789 -116885 -147517 -245375 -314429 -368333 -531063 -749675
41319 -749675 -801414 -659180 -581852 -739079 -970939 -1037313 -928586 -809435 -781771 -811352
41309 -811352 -817316 -767852 -718533 -751916 -848064 -892149 -880002 -973902 -1194719 -1218039 -761263
41298 -761263 -96531 171790 -117073 -467965 -428291 -179968 -178064 -422721 -447025 1014
41288 1014 585219 817000 665037 521602 622524 746140 602575 337002 383395 840657
41278 840657 1277244 1266317 877956 463334 166268 -81156 -220057 -67606 328554 618220
41268 618220 519748 94980 -389556 -715856 -793914 -654541 -438831 -300183 -280303 -335456
41258c35456r7573r0382J4113J06349j1309k48817k28273J44492M31598K75185
41248d0073m3995m1390K14772K38355j03297m18636l94715j71734m5015r6004
41238i01732j94530j55402J18013M63325N07329J16143l15866l27163k6143J06554
41228f09472k9391o1135J72989L37363J63589j16342j46718N1232K02367J71402
41218A35884J9032j49758k21678j30802l674n2610k21761j91049J29182L87244
41208b99990K74281l8201j81807q3239Q2300K14655K81597J83806n4276j26335
41198B52791J64285M81597L29566k11141n53691m35154k17446k26271k54105j9379
41188f88948K56883J73654j53269k04617J50927M35771K64887j17977k52712j17869
$$ plain form
41258 -335456 -433029 -523411 -509298 -402949 -414258 -663075 -891348 -746856 -315258 -40073
41248 -40073 -84068 -125458 89314 327669 224372 -194264 -588979 -760713 -805728 -901732
41238 -901732 -1096262 -1251664 -1133651 -670326 -162997 -46854 -362720 -689883 -716026 -609472
41228 -609472 -638863 -699998 -527009 -189646 -26057 -142399 -289117 -237885 -35518 135884
41218 135884 154916 5158 -216520 -347322 -350996 -403606 -625367 -816416 -687234 -299990
41208 -299990 -25709 -63910 -245717 -328956 -246656 -32001 249596 433402 379126 252791
41198 252791 417076 898673 1228239 1017098 463407 28253 -189193 -415464 -669569 -688948
41188 -688948 -432065 -258411 -411680 -616297 -465370 -29599 235288 117311 -135401 -253270
41178b53270l4515q9494n1693J61438L17348K60605J39695Q1668n9868l92973
41168G8941o67052n70176j97954Q1626J35257J28831J54210J31160P7988J37397
41158e09772K71067K46379K7708j18338l9540O9001J8179o7091k0226K9164j21198
41147b14667l49023l49611j05801Q3434N8006K1139K10936N19736N94311K79623
41137G48083j64130l64646l00914k93248m74910n15797j17578M16778N22609K10020
41127c33733M7845K36069K77708j41595n13868k52816L44604N10811J33873k00350
41117A08548j85245j07059j25975M8370M98220P09365K61885m79416p94844m97717
41107e63868k7108J77124N4891k06430l72137k67174P4135L74829L90695J73647
$$ plain form
41178 -253270 -287785 -377279 -428972 -267534 49814 310419 450114 531782 471914 78941
41168 78941 -588111 -1158287 -1356241 -1274615 -1139358 -1010527 -856317 -725157 -647169 -509772
41158 -509772 -238705 7674 35382 -82956 -122496 -53495 -35316 -102407 -122633 -93469 -214667
41147 -214667 -563690 -913301 -1019102 -935668 -877662 -856523 -645587 -125851 468460 748083
41137 748083 583953 219307 -81607 -374855 -849765 -1365562 -1483140 -1066362 -543753 -333733
41127 -333733 -285888 -49819 227889 86294 -427574 -680390 -335786 175025 308898 108548
41117 108548 -76697 -183756 -309731 -261361 236859 946224 1208109 728693 -66151 -563868
41107 -563868 -590976 -413852 -358961 -565391 -937528 -1204702 -1130567 -755738 -365043 -191396
41097a91396o0208k12492k88388k27854J0776K51066K24120p7742l50213l26156
41087a248487n3157K09842K72128J51185J360n8787n4646p9383j32188j20239
41077a112372k9803L2796K2372L9247J46914K38797J97612P1398j7198j8914P8862
41066c50289K73798M12288K42078j97373m45116j64181L41928M91804J97105j02613
41056F99429j22872l0325j1001K7017J52936J77614m2532l25473m18376l30326
41046b23909k07799p4793Q8583J83403J29843K2399n3400j92973m33162n20007
41036a281815k23464K27672L64586J01936j82858k12886j22684j07750p8398J25290
41026a390371L85312M33184K37530K8462m9107q2828j37515p6405J76584L44968
$$ plain form
41097 -191396 -251604 -464096 -752484 -980338 -969562 -718496 -494376 -572118 -922331 -1248487
41087 -1248487 -1301644 -1091802 -819674 -668489 -667129 -725916 -780562 -859945 -992133 -1112372
41077 -1112372 -1142175 -1109379 -1087007 -1047760 -900846 -662049 -464437 -393039 -410237 -429151 -350289
41066 -350289 -76491 335797 577875 380502 -64614 -228795 113133 604937 802042 699429
41056 699429 576557 546232 535231 562248 715184 892798 850266 524793 106417 -223909
41046 -223909 -431708 -506501 -417918 -234515 -104672 -82273 -135673 -328646 -761808 -1281815
41036 -1281815 -1505279 -1277607 -913021 -811085 -993943 -1206829 -1329513 -1437263 -1515661 -1390371
41026 -1390371 -1005059 -571875 -334345 -305883 -354990 -437818 -575333 -651738 -475154 -130186
41016a30186P7879m67443o65768k30503L30699L94888J02798P4911L88221M68994
41006C44490Q4640k34411p6734J60635l6391m15131l96277m6735R8797j4917N0360
40995d81674L45909M03418Q2567j63638p9883j499j60924k24523P3223L72319
40985A65295K53020o5905j17191N1159M3980j68766k44618o8729J10037J02921
40975F1203m3422k46846m15775l44487N1705M41225L87687m4712l44980k35064
40965g33466M0422J55861J11380Q4713J30594J65109J00309p6381k46812k01886
40955d70157J12183M26499M16165J07913j67103j94022n1811Q3741R5189p6844
40945B81753l53722m74035k75710J8547P5790l1842O5146L99290N46712K71744
$$ plain form
41016 -130186 -52307 -519750 -1185518 -1416021 -1085322 -690434 -587636 -512725 -124504 344490
41006 344490 429130 194719 117985 278620 242229 -172902 -569179 -615914 -517117 -532034 -481674
40995 -481674 -135765 267653 350220 186582 106699 105200 -55724 -280247 -207024 165295
40985 165295 418315 352410 235219 286378 330358 161592 -83026 -151755 -41718 61203
40975 61203 17781 -229065 -644840 -989327 -937622 -496397 -108710 -153422 -498402 -733466
40965 -733466 -693044 -537183 -425803 -341090 -210496 -45387 54922 -21459 -268271 -470157
40955 -470157 -357974 68525 484690 592603 425500 231478 179667 263408 358597 281753
40945 281753 -71969 -546004 -821714 -803167 -727377 -759219 -694073 -294783 251929 523673
40935E23673j00304j95151j43026k77239m97934l60254K23251P47123P24190K84811
40925I29140n2442p3953n0808k11883l51624j82336J37768J77964j26573l79390
40915a84137l03870n8748J15168J88129J52793m3940j96406O6382O10914P34211
40905A080496J63563m04942l01762R5872L8446l45874l45656P5478K78395J00732
40895D34748L3993K14254K01723q3773j55495P3352N3553l45513m87671j05474
40885a66303J55433j18756l40336p22L34868j3145n88165m87491J98945O20620
40875d05052M90176K37628Q7038j16750k99273k02324L9442Q4678K8547J76315
40865A20425L59588K19324k3461R8965L53652R5626n60571q04205m09745j1975
$$ plain form
40935 523673 423369 228218 85192 -192047 -689981 -1050235 -826984 -79861 644329 929140
40925 929140 876698 802745 751937 540054 188430 6094 143862 321826 195253 -184137
40915 -184137 -488007 -546755 -431587 -243458 -90665 -134605 -331011 -264629 346285 1080496
40905 1080496 1244059 839117 537355 633227 671673 325799 -19857 55621 334016 434748
40895 434748 468741 682995 884718 800945 645450 718802 772355 426842 -60829 -166303
40885 -166303 -10870 -129626 -469962 -470684 -135816 -148961 -737126 -1224617 -1025672 -405052
40875 -405052 85124 322752 409790 293040 -6233 -208557 -169115 -84437 -55890 120425
40865 120425 480013 699337 675876 774841 1128493 1224119 663548 -140657 -550402 -562377
40855e62377K7708P2948K94346K55620j93377m71506j95045J86922J76629k6225
40845d34357o4844p4546k44598l02360j1955K98970K67429J02864J31724J86620
40835a45053J7093j27300N8074K99698K10043K1738J43135K95960p7452p13046
40825a7110p17503P9475P71742O08125p1291m39035k21352K01696L84907J90247
40815G69901k09763m65373l32339M1752K52659J23871j20063k06323j24208q105
40805b77991Q1901J48060J65559J01238n1223k59231l90877k50743J46424M23152
40795a63731K24637k63690m75745j84003K35466L54751K14169J07797J02917M6482
40785A99050q4247j25623r631J24890J48480R3937J4355j59878m65968o84006
$$ plain form
40855 -562377 -534669 -461721 -167375 88245 -105132 -576638 -771683 -584761 -408132 -434357
40845 -434357 -499201 -573747 -818345 -1120705 -1132660 -833690 -566261 -463397 -331673 -145053
40835 -145053 -127960 -255260 -197186 102512 312555 334293 477428 773388 695936 -17110
40825 -17110 -734613 -655138 116604 724729 653438 214403 -6949 194747 579654 769901
40815 769901 560138 94765 -237574 -195822 56837 180708 60645 -145678 -269886 -277991
40805 -277991 -196090 -48030 117529 218767 167544 -91687 -482564 -733307 -586883 -163731
40795 -163731 60906 -202784 -678529 -862532 -627066 -272315 -58146 49651 152568 199050
40785 199050 114803 -10820 -20451 104439 252919 346856 361211 201333 -264635 -948641
40775i48641m88854R3741N61800M62413l4229l20546j17907K05485J90886r7074
40765d92926k47768j20505L1892J2868n9818k3879N7935N8990M3478J51475L12635
40754b75623L01837R6827l5359P6355K13720P6824k16730k51577L1646J57899
40744A75819j95530o42750n83514o0130L31002L17566K36325L59477M49037K35746
40734F23048q4504j91140j59875k41666l52387k29880K6806M3987k05419l08387
40724a079417m2826K79351K88836P7692j0380R3346J53825M3765r6822j31714
40714d24344j17172j19164m1492J77205L21593J15847l26213n36014k67821J92317
40704a025258M30305L83075K26367K8794k04668l46360l25942l19701m12584k88731
$$ plain form
40775 -948641 -1437495 -1343754 -781954 -319541 -353770 -674316 -792223 -586738 -395852 -492926
40765 -492926 -740694 -861199 -829307 -816439 -876257 -900136 -842201 -783211 -739733 -588258 -275623
40754 -275623 26214 123041 87682 164037 377757 454581 237851 -13726 17920 175819
40744 175819 -19711 -662461 -1245975 -1306105 -975103 -657537 -421212 -61735 387302 623048
40734 623048 538544 347404 187529 -54137 -406524 -636404 -609598 -565611 -771030 -1079417
40724 -1079417 -1122243 -842892 -554056 -476364 -486744 -393398 -239573 -195808 -292630 -424344
40714 -424344 -541516 -660680 -702172 -524967 -203374 -87527 -413740 -949754 -1217575 -1025258
40704 -1025258 -594953 -211878 14489 43283 -161385 -507745 -833687 -1153388 -1565972 -1854703
40694a854703K71784P87635O02266n6042k75768J85506N39246K30409k30513j84132
40684A5688J38434J51077p1980p7603O6563l6642k61463j15547L36700M87076
40674F32303J60127j38806q1698L3322q6418k21837p7432K09707L16179J84281
40664I29728l9239k76958m97973n92892m63985j54147J85427L67345K49444p9635
40654c72885k58216l5481L47704M29894J42030j50978j99171j21269q3401o8514
40644c70287n6084j29517k79726l33474j85344P1384K89046L70550K40150p8161
40634d61463l48792k97511Q1102N20697P32167N54096M1449m21975l64648J48838
40624A83960M36935R9319l56157k74342J23122J38656k61603n06295m45855m29105
$$ plain form
40694 -1854703 -1582919 -795284 -193018 -249060 -524828 -339322 199924 430333 199820 15688
40684 15688 154122 305199 233219 155616 222179 185537 -75926 -191473 145227 632303
40674 632303 792430 653624 571926 605248 518830 296993 219561 429268 745447 929728
40664 929728 890489 613531 115558 -477334 -941319 -1095466 -910039 -542694 -293250 -372885
40654 -372885 -631101 -666582 -318878 111016 253046 102068 -97103 -218372 -301773 -370287
40644 -370287 -426371 -555888 -835614 -1169088 -1354432 -1283048 -994002 -623452 -383302 -461463
40634 -461463 -810255 -1107766 -1026664 -505967 226200 780296 821745 399770 35122 183960
40624 183960 620895 720214 364057 89715 212837 351493 89890 -416405 -862260 -1291365
40614a291365m03305P2900P84023Q52856J32124l63159O3634P36483O82969L6771
40604A303931l79864l12310j35765n3732K7540O4579o5166k46312l28791m02410
40594e28300m76695k63210K61915N16627J16489l88878k62505K74095L96312n2992
40584d07142m42323m03890k28667j72229o8910K12067M78484N40896M17601J54012
40574G9899j87239l74888k43330k3538l4403j55088p2095Q8470m7947l64455l50757
40563a685371M1856K96537J80616O1001K02322L61404L12725K10409J59754k9432
40553A11821l51380l89613K1964L82538K11328k19265l10394k1614J62792L744
40543c98079k14929j63250J20924L39660K63307n6084l02746k05886J00031J86853
$$ plain form
40614 -1291365 -1694670 -1621770 -837747 15109 147233 -215926 -152292 584191 1267160 1303931
40604 1303931 924067 611757 475992 422260 449800 514379 449213 202901 -125890 -528300
40594 -528300 -1004995 -1268205 -1006290 -489663 -373174 -762052 -1024557 -750462 -354150 -407142
40584 -407142 -849465 -1253355 -1482022 -1654251 -1723161 -1511094 -1032610 -491714 -74113 79899
40574 79899 -107340 -482228 -725558 -749096 -783499 -938587 -1010682 -922212 -970159 -1334614 -1685371
40563 -1685371 -1643515 -1346978 -1166362 -1105361 -903039 -541635 -228910 -18501 141253 111821
40553 111821 -239559 -629172 -607208 -224670 -13342 -232607 -543001 -564615 -401823 -398079
40543 -398079 -613008 -776258 -655334 -315674 -52367 -108451 -411197 -617083 -517052 -330199
40533c30199r1337l51971j98566K24454M49603L14015O9784p1048j80694l42507
40523e08466m05830j97637J55639L29133K13397M4511N4172J62777J78207J47112
40513A73015K33636L25907J38787k42623l46584l0231K12169j8308l67528k60782
40503a82542J89943L57199L5047l46545m18227k70091j04231N0906J68575J37482
40493c82484l7387k13210l08020k78608j0540M33188O22530K87170j24679r075
40483b1115L79810K21845n25256r14658m04706L44406N15103K54675J57424K19345
40473B26873M4531k82275k94510L3072K26063O1142j70465j99335j24779j20723
40463f00406j43115p4813N3340J12483N1209l9438k1498J11075J87369R4114k2568
$$ plain form
40533 -330199 -421536 -773507 -972073 -747619 -298016 15999 85783 14735 -165959 -508466
40523 -508466 -914296 -1111933 -956294 -627161 -413764 -369253 -315081 -152304 25903 173015
40513 173015 406651 732558 871345 628722 282138 251907 464076 445768 78240 -182542
40503 -182542 7401 364600 399647 53102 -365125 -635216 -739447 -688541 -519966 -382484
40493 -382484 -419871 -633081 -941101 -1219709 -1230249 -797061 -174531 112639 -12040 -21115
40483 -21115 358695 580540 55284 -859374 -1264080 -919674 -404571 -149896 7528 226873
40473 226873 271404 -10871 -305381 -272309 -46246 14896 -155569 -354904 -479683 -600406
40463 -600406 -743521 -818334 -764994 -652511 -601302 -640740 -662238 -551163 -363794 -269680 -292248
40452b92248R971N2444j29079l70036k68654J37441L57927K16377P5919J12271
40442i7667j5478m30716o04152j62738L98353M20373P1085k9028J68143K01366
40432h0459k7283j61586p9747j3049j1038R8384K21247O6053k63309l09582K6917
40421e33452L35665L31148J51350l7918k28821k87824j9227L68025L87718K1419
40411D88083k05371p6861k3184l03082m53612m4324M91992L96878k99377q01802
40401h30660o14343o4172K70291K26039K9102q0705k6716J24859K26120J79958
40391e60227P1393P1784J81882K05806N4628p1675L2847K15083J34150j91189
40381A44482l19183l9527K23552J7617l72599l07816J40278J93481l88822p86680
$$ plain form
40452 -292248 -282277 -229833 -358912 -728948 -997602 -860161 -502234 -285857 -209938 -97667
40442 -97667 -113145 -543861 -1148013 -1310751 -912398 -492025 -420940 -449968 -281825 -80459
40432 -80459 -107742 -269328 -349075 -362124 -373162 -274778 -53531 12522 -250787 -560369 -533452
40421 -533452 -197787 133361 284711 246793 17972 -269852 -289079 78946 466664 488083
40411 488083 282712 205851 182667 -120415 -574027 -618351 -126359 270519 -28858 -830660
40401 -830660 -1445003 -1509175 -1238884 -1012845 -983743 -1064448 -1091164 -966305 -740185 -560227
40391 -560227 -488834 -417050 -235168 -29362 25266 -46409 -13562 201521 335671 144482
40381 144482 -174701 -214228 9324 26941 -345658 -653474 -513196 -319715 -708537 -1495217
40371a495217l02116N33088P05653J79961j73583O7545M00381L15816k7395k43627
40361c9494k55169j49618K6247J13488r0775m15760l98085J2943K84551R8589
40351h13083j40693L7609M12272M29723M8924k55478j93608O6196K59322K86950
40341A38134J36151j36854l26292k47584j3293R1258K5147M7713K97078N33400
40331E44858M35349J7908l89775n22107m02841k09739n1650N6256J00451Q2192
40321c39098Q1856J66724K48642K00686J09820J78272L25498J89845l13949p36050
40311A12246o40676j67444K28278L46433K42042o7787m80092o24198k91206J29937
40301a212467J59725k514J76404N82073N57916J3142l65068j98447M7354n7542
$$ plain form
40371 -1495217 -1797333 -1264245 -558592 -378631 -552214 -484669 -84288 231528 204133 -39494
40361 -39494 -294663 -444281 -418034 -304546 -395321 -811081 -1209166 -1196223 -911672 -813083
40351 -813083 -953776 -916167 -503895 -74172 -25248 -280726 -474334 -408138 -148816 138134
40341 138134 274285 137431 -188861 -436445 -449738 -358480 -333333 -285620 11458 544858
40331 544858 980207 998115 608340 86233 -316608 -526347 -577997 -521741 -421290 -339098
40321 -339098 -257242 -90518 158124 358810 468630 646902 972400 1162245 848296 112246
40311 112246 -528430 -695874 -467596 -121163 120879 53092 -427000 -1051198 -1342404 -1212467
40301 -1212467 -1052742 -1055256 -878852 -296779 261137 274279 -90789 -289236 -241882 -299424
40291b99424k09391j8230K60758K06629k8916n1596N8523n3993l39781m07183
40281h82604j32728K28514M29951L86830J03984k31325k81884L648K23397J05385
40271d6832m4738J29861L84651K52363j73254l90136k67430j14397o8064K4014
40261c13962J39851O2219j27654n8742L04778N06257K40272k13743l88468j81444
40251c0636J51870L48437L44897K54608J93763R0611k12193n74492n49645j7338
40241a18M61921L23817k06240m76708l59385k46641k35166k2951L44087L64105
40231e3279o1617l35282p1062K94766K34174m9688o7923Q7074l8807l80284l59901
40220h01829J87708O61041M77828j56057n46085l77644J3571K00925K02965K91627
$$ plain form
40291 -299424 -508815 -527045 -266287 -59658 -88574 -140170 -81647 -135640 -475421 -882604
40281 -882604 -1015332 -786818 -356867 29963 133947 -97378 -379262 -375614 -152217 -46832
40271 -46832 -91570 38291 422942 675305 502051 111915 -155515 -269912 -337976 -313962
40261 -313962 -174111 -111892 -239546 -298288 6490 512747 753019 539276 150808 -30636
40251 -30636 121234 469671 814568 1069176 1262939 1353550 1141357 566865 17220 -118
40241 -118 461803 785620 579380 102672 -256713 -503354 -738520 -761471 -417384 -53279
40231 -53279 -114896 -450178 -521240 -226474 7700 -41988 -109911 -22837 -61644 -441928 -801829
40220 -801829 -614121 46920 524748 368691 -177394 -555038 -541467 -340542 -137577 154050
40210A54050M36833K77588k75619p28014n69474K0454L74768J80580k20565l72681
40200g22080k03209Q3528K86947K66195k148k86924k75457j4048Q5703j65968
40190i47461m18927k70583J67893M61916M32419K51415P6017r1986k00382j07859
40180f47538J57538L27242K24585J8750l0742J2584j43358m86288n65367j15822
40170a248416M18568L82158j62550m87149k42498R5969P0662l9425J88704M91986
40160e31991L46289p5622j21803K65273M43895J01162l14727l67647k15355j64642
40150f35168j79328j19282k9454O6264K60356M47220L39144j1877j73864j7562
40140e3551Q2389l1169K1466L89919N31046M6561n49616n39641p0528J59355k0392
$$ plain form
40210 154050 590883 868471 592852 -135162 -704636 -684182 -309414 -128834 -349399 -722080
40200 -722080 -925289 -841761 -554814 -288619 -290767 -577691 -853148 -867196 -781493 -947461
40190 -947461 -1366388 -1636971 -1469078 -1007162 -574743 -323328 -247311 -339297 -539679 -647538
40180 -647538 -490000 -162758 61827 80577 49835 62419 -80939 -567227 -1132594 -1248416
40170 -1248416 -829848 -447690 -610240 -1097389 -1339887 -1243918 -1173256 -1212681 -1023977 -531991
40160 -531991 -185702 -261324 -383127 -117854 326041 427203 112476 -255171 -470526 -635168
40150 -635168 -814496 -933778 -963232 -896968 -636612 -189392 149752 137875 -35989 -53551
40140 -53551 28838 -2331 19135 409054 940100 986661 437045 -102596 -173124 -13769 -34161
40129c4161j81070j10437j3162K5072J47618L05299K65447N9405m0589J9974O3936
40118E07332O0842Q1618j7570l63820o19000l39829K48839M55945J35792j40576
40108I573m0715O8023j36659l45671j63366K37811M21548K94762M2287k31182
40098A56411m30475l24761J33494N43559M82281O3787k44218k45381j47483j51781
40088a64567k09770j85554m1959J51903K74873K46027J38609J07090J35703L0962
40078D83317k22906l22125p0153K39054J56224k92184o06252m51234l8597K00181
40068i24675J27915k1943J9939K55445M34960L26522m8064m39188n89042l91157
40058a249288Q6491O00313P93163M70504j16766m43650k70449J12197K89120J94709
$$ plain form
40129 -34161 -215231 -325668 -338830 -313758 -166140 139159 404606 464011 423422 443396 507332
40118 507332 568174 649792 632222 268402 -350598 -690427 -441588 14357 150149 9573
40108 9573 -31142 36881 -99778 -445449 -608815 -371004 50544 345306 387593 156411
40098 156411 -274064 -598825 -465331 78228 560509 624296 380078 134697 -12786 -164567
40088 -164567 -374337 -559891 -601850 -449947 -175074 70953 209562 316652 452355 483317
40078 483317 260411 -61714 -131867 107187 263411 -28773 -635025 -1086259 -1124856 -924675
40068 -924675 -796760 -818703 -798764 -543319 -108359 218163 170099 -269089 -858131 -1249288
40058 -1249288 -1162797 -562484 230679 701183 584417 140767 -129682 -17485 271635 466344
40048D66344M0969m5799r5106j14757q9006j04180k40287l53999k18569Q1736
40038f72654J57464j50659m54915k68126L29050P26213N21323l315k81985j81033
40028b78637o7378j90010k95414l9674M18922N52179J72986k83251l12212M2491
40018b79998L21459K62184L4418j09329j66510k62431l64239l01273l9472K18750
40008f86441K61107J11046j1504O6361L04423M82010L68786n4521m79142m76048
39998a13923L7910O06806O83951K41519k61145m85174n12018m96744l65547n7632
39988g21997K09745K06013M5590r05P2861O3567n7596j14123m3270K6437J3196
39977c00482l4752q2468j21941p4413J04283K67767K53008J39410Q5133J0942
$$ plain form
40048 466344 507313 461514 366408 251651 162645 58465 -181822 -535821 -754390 -672654
40038 -672654 -515190 -665849 -1120764 -1388890 -1059840 -333627 187696 184381 -97604 -278637
40028 -278637 -346015 -536025 -831439 -871113 -452191 99988 272974 -10277 -322489 -279998
40018 -279998 41461 303645 338063 228734 62224 -200207 -564446 -865719 -905191 -686441
40008 -686441 -425334 -314288 -325792 -259431 44992 527002 895788 841267 362125 -113923
39998 -113923 -76013 530793 1214744 1456263 1195118 709944 197926 -298818 -664365 -721997
39988 -721997 -512252 -306239 -260649 -261554 -188693 -125126 -182722 -296845 -340115 -313678 -300482
39977 -300482 -335234 -417702 -539643 -614056 -509773 -242006 11002 150412 235545 246487
39967B46487k26203m36419k90186R9437K32334o0113l72226l26843k4073K60764
39957h97041M31264M42861K19248q4544j17622J31771K28409k4881k35335r7860
39947c730M6166j74398l97428m1988O49568Q12167J89643m92698n32212r3930
39937c8840J73921k3063m18238n68861k76343K16330M00642O7223l41725k32721
39927a041675L22220O55854M26358J5626j39036j33736k15825k34780O0240M24046
39917A39292L42832j87354n73309m00857P2833L53981L31448K32542J76340O9177
39907E56925j17435k33005j61039L1001K11915L10671K66842K9583k85502m06315
39897B03641k38143m5389q9052k13645q1199K65595M33114K78413R0418O6954
$$ plain form
39967 246487 20284 -416135 -706321 -606884 -374550 -434663 -806889 -1133732 -1157805 -897041
39957 -897041 -465777 -22916 196332 111788 -5834 125937 354346 329465 94130 -3730
39947 -3730 42436 -131962 -529390 -571378 78190 890357 1080000 587302 55090 -38840
39937 -38840 135081 112018 -306220 -875081 -1151424 -935094 -534452 -467229 -808954 -1041675
39927 -1041675 -719455 -63601 362757 378383 239347 105611 -110214 -344994 -284754 139292
39917 139292 482124 294770 -278539 -679396 -606563 -252582 78866 311408 487748 556925
39907 556925 439490 206485 45446 76447 288362 599033 865875 895458 609956 203641
39897 203641 -34502 -79891 -168943 -382588 -463787 -198192 234922 513335 603753 670707
39887F70707J6169k06001l43679j55587J24041J42423L1701J98622O02948P10357
39877A791701K24234m96805q69157o89551k26936R6534N0131k36962m19305l24668
39867a100784j19696J4517J78354M94391P48029O36317K61155m573p6188j77618
39857H53904l30442k74110L2429K52620J52076j15775l19229l96473k95836L9982
39847d00854L88558L57101k5225k27730K7957L39807K55932n9619j83349j21786
39837C50792j76499l40110l16211n5667J51621J13624n5808j57424r2861J14144
39827d64399K75059J38509k36217l85362j8908M88494N55661J97249o2527R997
39817D97556J24682M3863q8321j01773o4372l9164N2010J63532Q3605j60168k12926
$$ plain form
39887 670707 686876 480875 137196 -18391 105650 248073 279774 478396 1081344 1791701
39877 1791701 2015935 1519130 649973 -39578 -266514 -169980 -119849 -356811 -776116 -1100784
39867 -1100784 -1220480 -1205963 -1027609 -533218 214811 851128 1112283 1107710 1031522 853904
39857 853904 523462 249352 281781 534401 686477 570702 251473 -145000 -440836 -400854
39847 -400854 -12296 344805 319580 91850 119807 459614 715546 655927 472578 350792
39837 350792 174293 -165817 -482028 -537695 -386074 -272450 -328258 -485682 -578543 -464399
39827 -464399 -189340 -50831 -287048 -672410 -691318 -202824 352837 550086 487559 497556
39817 497556 622238 666101 577780 476007 411635 372471 424481 588013 671618 511450 298524
39806B98524N2647K39847R73l83010l79755K9740L73810L85589K66919K50599
39796A135883K86087K73773K87395L64022L01473q4617o09251q59946o75829l00014
39786A18976l5789P2957J44600K02172J68457M6451o5764j41325k52787l89012
39776a31064l82917j23657K38248M07809K51406p3178k77371k07454J4383J01066
39766a82729r4289l82614m30300j52203J94473L28248K30119P9947M3865J67093
39756a98390L34787L10895m634l40946l32985p2577k7280k81142l07620J92437
39746g27455O79604N10209o1769k57276N2933K68261J11753j0465J38766J62249
39736H66810k29608o29143n48224j56511P9099J14352J87345K64391J51035n5472
$$ plain form
39806 298524 351171 591018 591991 208981 -170774 -141034 232776 618365 885284 1135883
39796 1135883 1421970 1695743 1983138 2347160 2648633 2564016 1954765 1094819 418990 118976
39786 118976 83187 156144 300744 502916 671373 717824 652060 510735 257948 -131064
39776 -131064 -513981 -637638 -399390 8419 259825 186647 -90724 -298178 -283795 -182729
39766 -182729 -277018 -659632 -1089932 -1242135 -1047662 -719414 -489295 -409348 -365483 -198390
39756 -198390 136397 447292 442658 101712 -231273 -303850 -331130 -612272 -919892 -727455
39746 -727455 -47851 462358 400589 143313 196246 464507 576260 565795 704561 866810
39736 866810 637202 8059 -540165 -696676 -617577 -503225 -315880 -51489 99546 44074
39726D4074j29398j68032l81179n67377l43498J58274L82613J84952L0237K13776
39716e75558L92446J65098k73678m08261j05273K74127L66424J78017o251M3965
39706E1056K57866L33058J04485k14435k97901j39344J21R025o350m8868k50570
39695b01857m93209m14623J9401L30990J93870n9793L9334L45690L29696p8562
39685A0937l72566k25352P3239R1109j53464k92351j17631K17162M33148M10536
39675G4767K41218Q1364p907o0408p3941J7305J83395K26480K623l39419m78778
39664a33301k71049J15423L81581L39512L4475k80560l52886j90910l0091J5338
39654c72468Q3644K33201K38633k7046k50507r3635K25761K30425l6068o7284
$$ plain form
39726 44074 -85324 -253356 -634535 -1201912 -1545410 -1387136 -1004523 -819571 -789334 -575558
39716 -575558 -183112 -18014 -291692 -699953 -805226 -531099 -164675 13342 7091 51056
39706 51056 308922 641980 746465 532030 234129 94785 94906 103931 97581 48713 -201857
39695 -201857 -695066 -1109689 -1090288 -759298 -565428 -625221 -585887 -240197 89499 10937
39685 10937 -361629 -586981 -513742 -422633 -576097 -868448 -986079 -768917 -335769 74767
39675 74767 315985 397349 389442 329034 255093 272398 455793 682273 684896 345477 -133301
39664 -133301 -404350 -288927 92654 432166 466641 186081 -166805 -357715 -387806 -372468
39654 -372468 -288824 -55623 183010 155964 -94543 -188178 37583 268008 231940 164656
39644A64656K45557L97223Q1840l38822m57106l79855l03942n5101M46950P23544
39634E24944L76578j47163j55723J56271Q418o04197p86758j73583M38734L39042
39624b3437l1599O1446L73139J59233m44490n34284R5455N54257J90955m68584
39614f7909n77799j51552J91098K40503K79137L58463J91902k02327l69729j22110
39604b30323J28334J2642k32744j99683L1229R8129l159J6679J41625M6853k66597
39593d57015l55113l1153K85051K03307l3148L4234L35896L92024L9326l74434
39583C8975m85078k60473J16152L92860L12213j32016n03193l37466K13641N09602
39573a34783K57100j46018k21391J131J89107J71927k3628l13854m98007l27577
$$ plain form
39644 164656 410213 807436 889276 550454 93348 -286507 -590449 -645550 -198600 524944
39634 524944 901522 754359 598636 754907 763325 159128 -627630 -801213 -362479 -23437
39624 -23437 -55036 6410 379549 538782 94292 -439992 -344537 209720 400675 -67909
39614 -67909 -645708 -797260 -606162 -365659 -86522 271941 463843 261516 -108213 -230323
39604 -230323 -101989 -89347 -322091 -521774 -490545 -392416 -395575 -378896 -237271 -190418 -457015
39593 -457015 -812128 -843281 -558230 -354923 -388071 -353837 -17941 374083 413409 38975
39583 38975 -446103 -706576 -590424 -197564 114649 -17367 -520560 -858026 -644385 -134783
39573 -134783 122317 -23701 -245092 -243961 -54854 117073 93445 -220409 -718416 -1045993
39563a045993J07755L19999L6767l60547l36300O9269L75609L66777K51453J95413
39553a9798J14045l5240j05449K364J95436L35593L38373J48494j60500l12134
39543E01184j25069J56177J42097j13596j76099Q4432K76398Q9543k71146m59931
39533A03990m52025l68743j49234K64119O18824N85282K01519j97107m07874m62186
39523b63435l90050j75120Q4812K32073K53891K11748K6773l67109o78818m56700
39513a521935K36456O96084L91694l23377o35567k74004K54091M00944J83016
39504e92598o3899k00148k85268k69920l4800K95781M05321K32611R6694K25161
39494a91065L90422K42864j54466m00497k97558m4013J11234J39818J05175K0324
$$ plain form
39563 -1045993 -938238 -618239 -581472 -942019 -1278319 -1209050 -833441 -466664 -215211 -19798
39553 -19798 94247 59007 -46442 -44078 151358 486951 825324 973818 813318 501184
39543 501184 376115 532292 674389 560793 384694 469126 745524 835067 563921 103990
39533 103990 -348035 -716778 -866012 -601893 16931 602213 803732 606625 198751 -263435
39523 -263435 -653485 -828605 -743793 -511720 -257829 -46081 -19308 -386417 -1065235 -1521935
39513 -1521935 -1285479 -589395 -197701 -521078 -1156645 -1430649 -1176558 -775614 -592598
39504 -592598 -656497 -856645 -1141913 -1411833 -1446633 -1150852 -745531 -512920 -416226 -191065
39494 -191065 199357 442221 287755 -112742 -410300 -454313 -343079 -203261 -98086 -77762
39484g7762m2233Q2741L95632N93315L93255q4731m52219n23276m57129m30542
39474f02949l80006j73862J07493K37713J56891N4924R6293J96321J83223Q5454
39464c8505P9234J75376J74149n201j63649j29945l7104q2994j67631m5859K34954
39453g175L56042J90249n3599k06826l58374n59428n92431k74298J88565M15679
39443i01596L43122K46240K82299K63935m255l49880m08093j31812J14910P9336
39433d65794P094K34491N45846L89575k17756n39552j63200L09536J32452m24007
39423a91315m96466l445K55152p5560l53882m0952M19010L55733o5262j78287
39413c75274J41773M00459K63142j14007m28614m88522k35617J24934J69226k17284
$$ plain form
39484 -77762 -119995 -37254 358378 951693 1344948 1260217 807998 284722 -172407 -602949
39474 -602949 -982955 -1156817 -1049324 -811611 -654720 -599796 -503503 -307182 -123959 -38505
39464 -38505 40729 216105 390254 385053 221404 91459 54355 -28639 -196270 -242129 -7175
39453 -7175 348867 539116 485517 278691 -79683 -639111 -1231542 -1505840 -1317275 -901596
39443 -901596 -558474 -312234 -29935 234000 229745 -120135 -528228 -660040 -545130 -465794
39433 -465794 -458700 -224209 321637 711212 493456 -46096 -209296 100240 232692 -191315
39423 -191315 -687781 -691226 -436074 -511634 -865516 -906468 -487458 -131725 -196987 -375274
39413 -375274 -233501 166958 430100 316093 -112521 -601043 -836660 -711726 -542500 -759784
39403g59784n40163l05755K67646N69429M27677J47246r2029l17257l64412j7917
39393i85319M54404N08071J40087p0386J38248L41639J68588j31182j65953r034
39383C89163K4779j10830k35294k58989j91225k6122J66524K19399R8634l4454
39373D1585j00863j95573k93180j67217K21854N38259M69910R0936l12738n21986
39363b29013l84910J11367O04138N74897M1258l52766k15153M0285j06517m42354
39353c58768m05193p050K35955J47900N3013J09122P3873j47711k46867l1830
39343e77556K04027J27716j01668o5184K96507N90660M83920R0473k16155k49228
39333E83512j43497p5762j8043J20100K37716J62308j9475l8127J10156J13089
$$ plain form
39403 -759784 -1299947 -1605702 -1338056 -768627 -340950 -193704 -285733 -602990 -967402 -985319
39393 -985319 -530915 -22844 117243 46857 185105 526744 695332 564150 398197 389163
39383 389163 413942 303112 67818 -191171 -382396 -408518 -241994 -22595 76039 41585
39373 41585 -59278 -254851 -548031 -715248 -493394 44865 514775 605711 292973 -229013
39363 -229013 -613923 -502556 101582 676479 717737 364971 149818 190103 83586 -358768
39353 -358768 -763961 -771011 -535056 -387156 -334143 -225021 -151148 -298859 -545726 -577556
39343 -577556 -373529 -245813 -347481 -412665 -116158 474502 958422 1048895 832740 583512
39333 583512 440015 364253 346210 466310 704026 866334 846859 808732 918888 1031977
39323A031977j29285k67323l7456K71337K29338q4366k45691j61439j46080l40306
39313A20706m58915k15483K89252O99252P17834K64099m47520r41199q42422l05548
39303a119944J12172R1761j09194n6611K92189N75938N03282J87481j4875P2073
39293E34272K49774K01279j17942m42256n23492l59861r7930J20996J83367O3805
39283a87988p8816n8516M4691o623j66998j14569J93083L63564J71257r3241j44877
39272g9033j42537k50765k21839J03307L16841P7426j68867J48294O32524L91011
39262H06362m97672r36790l68947M98493Q08244N99390L43448J37678j23588l00530
39252I66088k55113j75239k23921k08356K0182J94883O5592j25792k5034K47595
$$ plain form
39323 1031977 902692 635369 597913 869250 1098588 1014222 768531 607092 461012 120706
39313 120706 -338209 -553692 -264440 434812 1152646 1416745 969225 28026 -814396 -1119944
39303 -1119944 -1007772 -916011 -1025205 -1081816 -789627 -213689 289593 477074 462199 534272
39293 534272 784046 985325 867383 425127 -98365 -458226 -556156 -435160 -251793 -187988
39283 -187988 -266804 -325320 -280629 -287252 -454250 -568819 -375736 -12172 159085 65844 -79033
39272 -79033 -221570 -472335 -694174 -590867 -274026 -196600 -365467 -217173 415351 806362
39262 806362 308690 -628100 -997047 -498554 309690 909080 1252528 1390206 1266618 966088
39252 966088 710975 535736 311815 103459 123641 318524 384116 258324 233290 480885
39242D80885K96094K1424l51769o09866o11827k66418K46438M91818L14269P0516
39232H1564M6543J9848k30399m03237j81353J12302j0847l36199k42553K65012
39222h79319N28220K52236j14351j35632O3847J99643K69724L49481L44426K01208
39212A079483O6887L2772k4623j83240l02413k60803j42565n9134p404j0774j47148
39201D1038l01540j61278L30852P33901N83318Q3m21488l13656P8294K53275M6453
39190H69252k56710l43090k36966j53780j31555k6237J66396K54838J75190J04531
39180D21869J42424J46442L0755n3859k8613p9773l00111m32491k64073Q653J31207
39169b77570K05111L72254M03636P8178l01478l04733n3975N4085P2745K88776
$$ plain form
39242 480885 776979 798403 446634 -163232 -775059 -1041477 -795039 -303221 11048 81564
39232 81564 128107 147955 -82444 -485681 -667034 -554732 -565579 -901778 -1144331 -879319
39222 -879319 -351099 -98863 -213214 -348846 -284999 -85356 184368 533849 878275 1079483
39212 1079483 1146370 1179142 1154519 971279 668866 408063 265498 206364 198960 188186 41038
39201 41038 -260502 -421780 -90928 642973 1226291 1226374 804886 491230 569524 822799 869252
39190 869252 612542 269452 32486 -121294 -252849 -279086 -112690 142148 317338 421869
39180 421869 564293 710735 741490 687631 659018 579245 279134 -153357 -417430 -408777 -277570
39169 -277570 -72459 299795 703431 781609 480131 175398 121423 175508 248253 537029
39159E37029M73901J40025n09694p11568l02944O2159K1261j3800K29411L31432
39149B57212L747k84671q5310K39019J34195k28106l10720j11418m4346j71134
39139f01532j57862J37991N17896P51503O74808K01674m08010n87046j74951K22362
39129E76833M0068m12077m52789n2707K53736K34500R1767q9044l45904m10132
39119e65749L0738O59969P92911L50254o5231j19592j17537k95618m01860k17623
39109E0662O1217K20290L13312L26292N7307m03502n62925k19148J59099R4364
39099I6968k30983l30168j21752R0957J21168L6766n0991p5910j6234L5579l9022
39088d83622j49209r9377J6927r9290l59254k40740M10292R79140Q49203K12852
$$ plain form
39159 537029 1010930 1150955 641261 -70307 -373251 -311092 -289831 -303631 -74220 257212
39149 257212 260959 -23712 -109022 129997 264192 36086 -274634 -386052 -430398 -601532
39139 -601532 -759394 -621403 -103507 647996 1322804 1524478 1116468 529422 354471 576833
39129 576833 616901 204824 -247965 -300672 -46936 187564 279331 190287 -155617 -565749
39119 -565749 -535011 124958 917869 1268123 1202892 1083300 965763 670145 268285 50662
39109 50662 111879 332169 645481 971773 1029080 625578 62653 -156495 2604 96968
39099 96968 -134015 -464183 -585935 -494978 -373810 -337044 -388035 -463945 -480179 -444600 -483622
39088 -483622 -632831 -732208 -715281 -814571 -1173825 -1414565 -1004273 -25133 824070 1036922
39078A036922k67814l04302j00283Q9047J13125j10842m00396l22274K03608N96500
39068E33291L61413j45891k38906P3013K23173Q3854Q0677L10719L10779r4722
39058A497400l95895j97287J22697r297m85419o72350k68415L61455O57844M46616
39048A057349N4090p0276J29579K33544q8580n64951o72994l97052k05647k85763
39038h10701l14803j10401L7234o4902j20860J18947L82643L64357K77543M09152
39028A68209M73241L8193o10690p20441j56078L95805M00832Q6258r9596j23703
39018a47970j80478k57429k17879p8175O7977K26829L95744M44988L05873J27883
39008F87363O1431J9607j51923l76210m17685k08404N9927J69116J04121L9056
$$ plain form
39078 1036922 769108 464806 364523 453570 566695 455853 55457 -266817 -63209 533291
39068 533291 894704 748813 509907 582920 806093 889947 970624 1281343 1592122 1497400
39058 1497400 1101505 904218 1026915 1017618 532199 -140151 -408566 -47111 610733 1057349
39048 1057349 1111439 1041163 1170742 1404286 1315706 750755 77761 -319291 -524938 -810701
39038 -810701 -1125504 -1235905 -1198671 -1263573 -1384433 -1265486 -882843 -518486 -240943 168209
39028 168209 641450 679643 68953 -651488 -807566 -411761 -10929 75329 -24267 -147970
39018 -147970 -328448 -585877 -803756 -881931 -813954 -587125 -191381 253607 559480 687363
39008 687363 748794 768401 616478 240268 -177417 -385821 -325894 -156778 -52657 -13601
38998a3601J17860K49012J87341j04488l06784j57956R8874J4012l63715n04076
38988g83521k02152J00936L7543j04146Q6720L94336K87889k05366m81801j95010
38978a064572L44279O39941N11058R1290l22138l87903l1978L30278K30608j82596
38968A58267l22310m9889J24398j02089l09677n8968L45627L08398j13764k85966
38958c05973N3002M26028L09812j80571m93823l35650K7393J32695r9723k52398
38948g19208K9110M66375M40616j11065n03416k43176K39567K24015k37184m47529
38938h61895j27343K68274L35793K37213K31527K10960K4981j33513n0142Q3476
38928B19331l1908k56559j82627K07151M48693K35127j65318k89241q3082P7072
$$ plain form
38998 -13601 104259 353271 540612 436124 129340 -28616 70258 84270 -279445 -783521
38988 -783521 -985673 -884737 -847194 -951340 -864620 -470284 -182395 -387761 -869562 -1064572
38978 -1064572 -720293 -80352 430706 521996 199858 -188045 -220023 110255 340863 158267
38968 158267 -164043 -213932 -89534 -191623 -501300 -560268 -214641 93757 -20007 -305973
38958 -305973 -252971 173057 482869 302298 -191525 -527175 -499782 -367087 -466810 -719208
38948 -719208 -690098 -223723 216893 105828 -397588 -640764 -401197 -177182 -414366 -861895
38938 -861895 -989238 -720964 -385171 -147958 83569 294529 319510 185997 135855 219331
38928 219331 187423 -69136 -251763 -44612 404081 639208 473890 184649 101567 178639
38918A78639p1606k95241j40203M36466Q77305O13542k18627q62145p86085k49347
38908e17302J01327J9805j64648q9589J65695K39885L667k44577j54945J87080
38898d53602L24145L8934k91356j69309L07684N20191J39310m37762n94315k04734
38888h20814L17814N12375K67257j36487k76723j9917K66154J37321k83875m34007
38878d70902j52575O7458r0975k12259J22516N14871L25177k29538l51309N6997
38868d20539K40163j46688m70560j89015K55066J84675k14585k44471J77408M47527
38858c81019K29404j54047l15582k64825j61235l1888J04496J46528Q8047N2059
38848f88062O5164L2419j6947O1506K01665J21106k21898m61793l12031L3204
$$ plain form
38918 178639 107033 -188208 -328411 108055 985360 1598902 1380275 518130 -267955 -517302
38908 -517302 -415975 -396170 -560818 -650407 -484712 -244827 -241160 -485737 -640682 -453602
38898 -453602 -129457 -90523 -381879 -551188 -243504 276687 415997 -21765 -616080 -820814
38888 -820814 -503000 9375 276632 140145 -136578 -156495 109659 246980 -36895 -470902
38878 -470902 -623477 -556019 -646994 -859253 -736737 -221866 103311 -126227 -477536 -420539
38868 -420539 -180376 -327064 -797624 -986639 -731573 -546898 -761483 -1005954 -828546 -381019
38858 -381019 -151615 -305662 -621244 -886069 -1047304 -1079192 -974696 -828168 -740121 -688062
38848 -688062 -622898 -590479 -607426 -545920 -344255 -223149 -445047 -906840 -1218871 -1185667
38838a185667K06835J60387R7321J02215J26575K10881M01160N07135K71337k03673
38828F94506m96504m05019j72565o7906r287J87134L89550K84745j10926l60614
38818f6886j38919L17271M69616J43382k62388l08421q7175l6334k46700l03713
38808e20267L7384L70440K03483k21370k11602K89549N16979K2575n76393m68543
38798e57765J58375M42037J35214j70029r9431J12j45692j71652K10619N06983
38788C08771J32993n33748n68079J27088O31131L35566k37019l00178P1975K22888
38778A91388k0665j80885L7083L05759K31774m4004p8647K41116N76020N94558
38768A853497L39209Q9457O629J9896K16q8253k37296m66965p30274q16642n30840
$$ plain form
38838 -1185667 -978832 -818445 -721124 -618909 -492334 -281453 119707 626842 898179 694506
38828 694506 198002 -207017 -379582 -447488 -456775 -269641 119909 404654 293728 -66886
38818 -66886 -205805 111466 581082 724464 462076 153655 66480 30146 -216554 -520267
38808 -520267 -482883 -112443 91040 -130330 -341932 -52383 464596 487171 -89222 -557765
38798 -557765 -399390 42647 177861 7832 -91599 -91487 -237179 -408831 -198212 308771
38788 308771 441764 -91984 -660063 -532975 98156 433722 196703 -103475 -31500 191388
38778 191388 170723 -10162 26921 332680 564454 520450 441803 682919 1258939 1853497
38768 1853497 2192706 2282163 2288792 2308688 2308904 2220651 1983355 1516390 786116 -30526 -561366
38757e61366M425L89944L80578J46816R667N0111J23903J36422R5793l1101k72224
38746D72968m74747m29825k08538j08074j77771r7007K88737O05437M44995J2492
38736C28667j37754P7834J95535P91j14876J51632M14310J35826n05954q05742
38726b59731m94028j4115J89695J78561J75334J61232O7766J3036M9455k4633
38716D2572k79704l72698n2499L03799J70176k64842l11033J54515M74824K36853
38706A01963j28496j24114Q148j91720m94662k93650L53690P07654M15679m0696
38696C13796j49933m6555o7527j20200M7469K61948J32674k72144m40294j32800
38686d73566L06262M55091L08997J23895K4232l6935r5486j53658k45307l54654
$$ plain form
38757 -561366 -556941 -166997 213581 360397 370064 420175 544078 680500 776293 745192 472968
38746 472968 -1779 -431604 -640142 -748216 -925987 -1022994 -734257 -128820 316175 328667
38736 328667 190913 268747 464282 465073 350197 501829 916139 1051965 546011 -259731
38726 -259731 -753759 -767874 -578179 -399618 -224284 -63052 4714 17750 67205 42572
38716 42572 -237132 -609830 -662329 -358530 -188354 -453196 -764229 -609714 -134890 101963
38706 101963 -26533 -150647 -142499 -334219 -828881 -1122531 -768841 -61187 354492 313796
38696 313796 163863 117308 49781 -70419 -22950 238998 371672 99528 -340766 -473566
38686 -473566 -167304 287787 596784 720679 744911 707976 612490 458832 213525 -141129
38676a41129l39071j01934J94117K64150O8730j17062o4843J22414K01257J41400
38666B28029R9949R6597k7242k51289k51071J36568N20292L90052j14138l04791
38656E22956P5171M29684J64958m12561n23216j5696N08316O08959M73696L81291
38646B213558K69194Q0347L6571K00007J77966k82650p32455n82762k5816J88814
38636A542774j64723n11729l62795M9149K21271N8226j56708j77885L6653L46384
38626H80617M49396J20984m14702o13225k87307J14690J18063j66810l10064j86241
38616b94599k442J08701J65635J22879o4648k13727q3471K22559L18212M1129
38606C20228l34528m36242j70520K47223M91805L84799Q6054m7142P8349J36824
$$ plain form
38676 -141129 -480200 -582134 -388017 -123867 -55137 -172199 -237042 -114628 86629 228029
38666 228029 327978 424575 397333 146044 -105027 31541 551833 941885 827747 522956
38656 522956 598127 1027811 1192769 780208 256992 241296 749612 1358571 1832267 2213558
38646 2213558 2482752 2563099 2599670 2799677 2977643 2694993 1962538 1379776 1353960 1542774
38636 1542774 1378051 866322 503527 552676 773947 832173 675465 497580 534233 880617
38626 880617 1330013 1450997 1036295 423070 135763 250453 368516 201706 -108358 -294599
38616 -294599 -297041 -188340 -22705 100174 35526 -178201 -261672 -39113 279099 320228
38606 320228 -14300 -450542 -621062 -373839 117966 502765 588819 541677 620026 756850
38596G56850j08147l70824k60901O5911J42754l2251j1115K92862M08563J01617
38586I85319j99084q1505K23730K86760J45687Q3767O6566r2650k30762l7540
38576A150288L43464M36847J51480j00308n1114J01942J39348J55187K45686K15556
38566B788376j20783n66208p43150n52353k21497J5329J06558J14721J22532J89646
38556A133171K95309L39061K61076J20174n05j01088k09249k77139k22264n2621
38546A285925J10166J38680K6606p4313J9918K94724M79700L49200M6438q3276
38536B593768Q709M582k39244l77241p5559L90706M45722N7835j69929J36459
38526B775808N83949O01369K37493j7312j1835o3217l12130m17640q6127M37518
$$ plain form
38596 756850 648703 277879 16978 82889 225643 193392 182277 475139 883702 985319
38586 985319 786235 704730 928460 1215220 1360907 1444674 1511240 1418590 1187828 1150288
38576 1150288 1493752 1930599 2082079 1981771 1930657 2032599 2171947 2327134 2572820 2788376
38566 2788376 2667593 2101385 1358235 805882 584385 599714 706272 820993 943525 1133171
38556 1133171 1428480 1767541 2028617 2148791 2148286 2047198 1837949 1560810 1338546 1285925
38546 1285925 1396091 1534771 1561377 1487064 1506982 1801706 2281406 2630606 2677044 2593768
38536 2593768 2602477 2607059 2367815 1990574 1915015 2305721 2751443 2809278 2639349 2775808
38526 2775808 3359757 3961126 4198619 4181307 4169472 4106255 3794125 3376485 3290358 3727876
38516C727876O84157N57191L39083K42227K42730K89075L77920M14848K73532
38507G148639O0397Q3101M47138Q77635J065882J018785R15746P87222N61524
38498A2966069L44693L88647P36288J105086J243916J276411J530094K076019
38490B1667223K624121K926127L119491L540541M320035N364243O659422Q317200
38482E8538403J0316385J2545065J5222389J8921614K3959074L0148858L7452867
38475B07104655M6215152N5747620O2716260O2056921N0405021K8770499K030135
38468E15046263k3662483m3165096n3641119n5234007n0721984m3750567l6839889
38461B08031118l0843415k5760271k1469546j7836590j4753653j2256080j0326102
$$ plain form
38516 3727876 4412033 4969224 5308307 5550534 5793264 6082339 6460259 6875107 7148639
38507 7148639 7209036 7292137 7739275 8616910 9682792 10701577 11617323 12404545 12966069
38498 12966069 13310762 13699409 14435697 15540783 16784699 18061110 19591204 21667223
38490 21667223 24291344 27217471 30336962 33877503 38197538 43561781 50221203 58538403
38482 58538403 68854788 81399853 96622242 115543856 139502930 169651788 207104655
38475 207104655 253319807 309067427 371783687 433840608 484245629 513016128 515046263
38468 515046263 491383780 448218684 394577565 339343558 288621574 244871007 208031118
38461 208031118 177187703 151427432 129957886 112121296 97367643 85111563 74785461
38454G4785461q653868o968543n518329m752558m542580m222882l477547k688848
38446C3960306k262215k086654j889528j691700j607750j526693j302044j022316
38438B0571406q40601p46585p01594p50577q08923o34250k52692j03636m42312
38429A5290236q73419q59240m78790k60743l98268n75918n36647l82682k46126
38420A0678403m5391K63775M62045K97814j66855n72867n96390k47284J18467
38411A0191717J25698k09759m78546l84008j20534o4060k05860j76623J78700
38402H856725N40202N27118J67478j78717k41243o1898J38084K07481J81828J93124
38392A0330182K91443L93503M07894L36094K25335J22931J18002K85078M99396
$$ plain form
38454 74785461 66131593 59163050 53644721 48892163 44349583 40126701 36649154 33960306
38446 33960306 31698091 29611437 27721909 26030209 24422459 22895766 21593722 20571406
38438 20571406 19730805 18984220 18282626 17532049 16723126 16088876 15836184 15732548 15290236
38429 15290236 14416817 13557577 13078787 12818044 12419776 11843858 11307211 10924529 10678403
38420 10678403 10633012 10896787 11358832 11656646 11489791 10916924 10320534 10073250 10191717
38411 10191717 10317415 10107656 9629110 9245102 9124568 9060508 8854648 8678025 8856725
38402 8856725 9396927 9924045 10091523 9912806 9671563 9609665 9747749 9955230 10137058 10330182
38392 10330182 10621625 11015128 11423022 11759116 11984451 12107382 12225384 12510462 13009858
38383A3009858M76302J49266j41027l8082L60068O36884N69997K75555p0427l67042
38373A4861352m73378k67733J13100L33525K32851m2999l00531m68957m92718
38364A3494512l21877r2005o6294k86704m98700n22323m65891m54552m02468k28965
38354A0154733o7442m5034n1350M1415J00356o5204l45952m43040k67554k302
38344I008626J71892K03646J03590l3663k5365J53253K34484O4614K4747O10640
38334A0516464J566707J913748J068923l94554j370861j367072p80414k61729
38326A0891212j24501k76081m31551l85118k15700j62334k18856q0810L14705
38317I310966N07227J59730k69153p2975N80817P73778K12278k51885J20059Q21728
$$ plain form
38383 13009858 13486160 13635426 13494399 13456317 13816385 14453269 15023266 15298821 15228394 14861352
38373 14861352 14387974 14120241 14233341 14566866 14799717 14756718 14456187 13987230 13494512
38364 13494512 13172635 13080630 13014336 12727632 12228932 11706609 11240718 10786166 10383698 10154733
38354 10154733 10087291 10042257 9990907 10032322 10132678 10067474 9721522 9278482 9010928 9008626
38344 9008626 9180518 9384164 9487754 9454091 9428726 9581979 9816463 9881077 9905824 10516464
38334 10516464 12083171 13996919 15065842 14671288 13300427 11933355 11152941 10891212
38326 10891212 10766711 10490630 10059079 9673961 9458261 9295927 9077071 8996261 9310966
38317 9310966 9818193 9977923 9708770 9635795 10216612 10990390 11202668 10950783 11070842 11892570
38307A1892570Q86933L66561J83838O57575J056551Q15211M17741O10582J267559
38298A8155121J627581J402650J072858J113331J407201J551857J419907J217217
38290B8967723J151177J231178J354572J447604J469743J340220R67937M06987
38282C8337141r4549l12976k94340k85421m57763q12440j282543j737783j942461
38273C1116865j773357j488848j493151j777966j910971j676904j374707j296223
38265A8324738j280203j074573q12662p52929p99611p00756n36904n70238p30316
38256A1066546p03423m69627l00416k45169p9863K04231L22819J99355J09205
38247A0103658J98144K70901K11381K06222L62373M97870N32296O91869J064451
$$ plain form
38307 11892570 12779503 13146064 13329902 13987477 15044028 15859239 16276980 16887562 18155121
38298 18155121 19782702 21185352 22258210 23371541 24778742 26330599 27750506 28967723
38290 28967723 30118900 31350078 32704650 34152254 35621997 36962217 37930154 38337141
38282 38337141 38242592 37929616 37635276 37349855 36892092 36079652 34797109 33059326 31116865
38273 31116865 29343508 27854660 26361509 24583543 22672572 20995668 19620961 18324738
38265 18324738 17044535 15969962 15157300 14404371 13604760 12904004 12367100 11796862 11066546
38256 11066546 10363123 9893496 9593080 9347911 9268048 9472279 9795098 9994453 10103658
38247 10103658 10301802 10572703 10784084 10990306 11352679 11850549 12382845 13074714 14139165
38238A4139165J355241J440931J800704K914226M424402N356435N101912L838862
38230D0371878K070793J45451j731954l310702m264152m330464l591975k652778
38222B2706097k244480k435819k512650j938720j134183q69683j143603j241123
38214I185836q13321k73739n0669l4369K3722O2526m8773k10008l17706m62465
38204G061034o20840m87407L8730M84383L27819k82868p26493o97947m15899j37952
38194D542560R9259K44038J51639j31172l23258k95306k30868k56853j89597J28481
38184C738923M63478M59066J63865j1161J38655L49817K79873m2592k98198k95606
38174D946120j60331j31853k80457m43054m01050j36443P3141j01047o13680r55787
$$ plain form
38238 14139165 15494406 16935337 18736041 21650267 26074669 31431104 36533016 40371878
38230 40371878 42442671 42588122 40856168 37545466 33281314 28950850 25358875 22706097
38222 22706097 20461617 18025798 15513148 13574428 12440245 11570562 10426959 9185836
38214 9185836 8372515 8098776 8048107 8013738 8037460 8099986 8051213 7841205 7523499 7061034
38204 7061034 6440194 5952787 5991517 6475900 6803719 6520851 5794358 5096411 4680512 4542560
38194 4542560 4641819 4885857 5037496 4906324 4583066 4287760 4056892 3800039 3610442 3738923
38184 3738923 4202401 4661467 4825332 4814171 4952826 5302643 5582516 5539924 5241726 4946120
38174 4946120 4785789 4653936 4373479 3930425 3529375 3392932 3466073 3365026 2751346 1795559
38164A795559o71731M9094N19171L64438m2497j28879J20026K48744N2663j76728
38154B129860j60683j1438N4639O2470R8973M4125k16067m73350m14073o8904
38144A045552K41496L42662L00519J51787j10578k95371j46078K02672K80093
38135B012754n0123l25367j22369L40445N28623K95375n0587k29626k38280j88935
38125A971910j58456j65522j41413p637J12480l9924m21165n85103k83569J13854
38115C95455J52376k8111M750K29897K80872J44053J27556J96050P952l45575
38105A165275l41855Q3933L49216J62072m5541N9763J64353P125p5110J48956
38095A678187K28293j67000m86170j56686L34023J73836l60744l16494L19139
$$ plain form
38164 1795559 1123828 1172922 1692093 2056531 2014034 1885155 2005181 2253925 2306588 2129860
38154 2129860 1969177 1957739 2012378 2074848 2173821 2217946 2001879 1528529 1114456 1045552
38144 1045552 1287048 1629710 1930229 2082016 1971438 1676067 1529989 1732661 2012754
38135 2012754 1962631 1637264 1514895 1855340 2383963 2679338 2628751 2399125 2160845 1971910
38125 1971910 1813454 1647932 1506519 1498882 1611362 1571438 1150273 565170 281601 395455
38115 395455 547831 519720 524470 754367 1035239 1179292 1306848 1502898 1510850 1165275
38105 1165275 823420 907353 1256569 1418641 1373100 1432863 1597216 1604341 1529231 1678187
38095 1678187 1906480 1739480 1253310 1096624 1430647 1604483 1243739 927245 1246384
38086A246384N80556J30467k65560j25815O711l02168n05054m3528N85261N67544
38076A874798O7027o7789L80398P62894N89485J38033m9511J82317N93623Q92007
38066E363282R38584P44609L64875j60950o97231r47706p49179l93240l30132
38057D132912n40835n88799l44424j85510l27212m57017l01023q2122p8178j48414
38047A079378p1111L6668K5944O2706K48347K69021r4470m41744k73490K18466
38037A059715M18720J55910j98794l29877j97664J62057N80320O74497L04964
38028B629848p7338k5771J97510P3212k70639k95245k6198k0306l84582n96814
38018A203677l90233r4104N1970K24189M52203M08196L8991k04919q8739K5131
$$ plain form
38086 1246384 1826940 1957407 1691847 1566032 1572743 1270575 765521 721993 1307254 1874798
38076 1874798 1941825 1874036 2254434 3017328 3606813 3744846 3695335 3877652 4471275 5363282
38066 5363282 6301866 7046475 7411350 7250400 6553169 5605463 4856284 4463044 4132912
38057 4132912 3592077 3003278 2658854 2473344 2146132 1689115 1388092 1305970 1227792 1079378
38047 1079378 1008267 1044935 1070879 1133585 1381932 1650953 1556483 1114739 841249 1059715
38037 1059715 1478435 1634345 1435551 1105674 908010 1070067 1650387 2324884 2629848
38028 2629848 2552510 2526739 2724249 2797461 2526822 2231577 2205379 2185073 1800491 1203677
38018 1203677 813444 719340 771310 995499 1447702 1855898 1894889 1689970 1601231 1626362
38008A626362j42996k76823m5995K76647K57545M588n4325J40379K47941N7299
37998B090622k81182m79233l60636J6789L69595M46212L12241J91819P5735j86714
37988B195248m54059m09954j41850p3950k22251j12372L53335N82212J95518l43879
37978A567998m58414k84574k55361l19048j73113P5352J05005m295O1914K45162
37968E60626K25387J2322r2996l8684m5665j55823j90343j03976j201J15464K60993
37957E46104K71407O3031q7937O3696K60826J35530j30216r0686J77974K11429
37947A421158m903k0090K29947K59213j19834m44936l57234j15523m8275l5354
37937G64169R0311J15052j27475k95726j8593M32728M70125M3222l21736k98784
$$ plain form
38008 1626362 1483366 1206543 1160548 1437195 1694740 1699328 1645003 1785382 2033323 2090622
37998 2090622 1809440 1330207 969571 986360 1355955 1802167 2114408 2306227 2381962 2195248
37988 2195248 1741189 1331235 1189385 1115435 893184 780812 1134147 1716359 1911877 1567998
37978 1567998 1109584 825010 569649 250601 77488 152840 257845 253550 315464 560626
37968 560626 786013 798335 705339 666655 620990 465167 274824 170848 169647 285111 546104
37957 546104 817511 880542 792605 856301 1117127 1252657 1122441 1031755 1209729 1421158
37947 1421158 1416255 1396165 1626112 1885325 1765491 1320555 963321 847798 799523 764169
37937 764169 854480 969532 842057 546331 527738 960466 1430591 1473813 1152077 853293
37927H53293j21855q8610q8963J59887O15817Q83899O65383J06352l47396m03763
37917B234044j77836L917l9039k39392m33182m79087k99232K3462K21585J10287
37907I25527j26111j27641J28667K48628l1984m30155m46981j4179M07362L98185
37897I31318R1902p862L12052O68226N74854J33312o2499K43202N78036M11659
37887C874200q7874l47266k34912j28833j97768j58897J18040K71642J2100l54454
37877B765978l44421K748K41168J96002J08143J27383P8213j50887l35127k58190
37867B431010q0785p7478j70973q3760J09566J4046l94358n51656q1439N72890
37857A687063P30691M27784K36556K91810J86095j30888j18338M04256P89557
$$ plain form
37927 853293 731438 642828 553865 713752 1329569 2213468 2878851 2985203 2637807 2234044
37917 2234044 2056208 2060125 2021086 1781694 1348512 869425 570193 593655 815240 925527
37907 925527 799416 671775 800442 1049070 1017086 586931 139950 125771 533133 931318
37897 931318 1023220 1015358 1327410 1995636 2570490 2703802 2641303 2884505 3462541 3874200
37887 3874200 3786326 3439060 3204148 3075315 2877547 2718650 2836690 3108332 3120432 2765978
37877 2765978 2421557 2424305 2665473 2861475 2969618 3097001 3175214 3024327 2689200 2431010
37867 2431010 2350225 2272747 2101774 2018014 2127580 2141626 1747268 1195612 1114173 1687063
37857 1687063 2417754 2845538 3082094 3373904 3559999 3429111 3310773 3715029 4504586
37848D504586N35650J21354K38275O76670P37723M24860L66455O84264Q29889
37839I119726O33233O67498J281282J984436K218545K170720K314398K545515
37831B2935353K332649J525211N09405l77473j147633j820151k154429j960061
37823A9842871j500207j298226j504199j694892j477530j074005r57960j057804
37815I278048q66929l78419k19292n67132o73720m5560N74339K49320o22395q48322
37805E879938k39348K52337J37652m0205P7922N2952l08320l59250K72920Q39377
37795F565975N10348l68890q25737n90824j69260M4193N1520p3017k16540j62547
37785D765221O1710P2780k35968l71243k4278L04674P6376l42548k39125K80846
$$ plain form
37848 4504586 5040236 5161590 5399865 6076535 6814258 7239118 7605573 8289837 9119726
37839 9119726 9752959 10420457 11701739 13686175 15904720 18075440 20389838 22935353
37831 22935353 25268002 26793213 27302618 26925145 25777512 23957361 21802932 19842871
37823 19842871 18342664 17044438 15540239 13845347 12367817 11293812 10335852 9278048
37815 9278048 8411119 8032700 7813408 7246276 6572556 6526996 7101335 7350655 6728260 5879938
37805 5879938 5640590 5892927 6030579 5990374 6068296 6121248 5812928 5453678 5726598 6565975
37795 6565975 7076323 6707433 5881696 5290872 5121612 5165805 5217325 5144308 4927768 4765221
37785 4765221 4826931 4899711 4663743 4292500 4268222 4572896 4649272 4306724 4067599 4348445
37775D348445M84582J71728j40552j11300O1414J53642J55618J3139k85620m11852
37765D439244p7508L52867K76848j65996k50000J57779L51288p1542n52798m42143
37755D018039N8907K85515N7368k13628j57205J69452M47056M37620K03456M0869
37745E347449J24791K79643K47728M8173j70323m50689q32645r92472n65783K05963
37735C241835O46392N05668J95079J09261J90573K70840L68254M65730M03375
37726F397007J77654m028j03738l15014o12218o49306l06746L3466j1184l49610
37716D256283o32380o56417m07297j764K71427J62065j67272k95333j46559m7546
37706B335207j03449k7071K30545K44900j55265m53205j92063K75501L18163j5145
$$ plain form
37775 4348445 4833027 5004755 4864203 4752903 4814317 4967959 5123577 5136716 4851096 4439244
37765 4439244 4361736 4714603 4991451 4825455 4575455 4733234 5084522 5012980 4460182 4018039
37755 4018039 4076946 4362461 4419829 4206201 4048996 4218448 4665504 5103124 5306580 5347449
37745 5347449 5472240 5751883 5999611 6047784 5877461 5426772 4594127 3601655 3035872 3241835
37735 3241835 3888227 4393895 4588974 4698235 4888808 5159648 5527902 5993632 6397007
37726 6397007 6574661 6570633 6466895 6151881 5539663 4890357 4583611 4617077 4605893 4256283
37716 4256283 3623903 2967486 2560189 2558425 2829852 2991917 2824645 2529312 2382753 2335207
37706 2335207 2231758 2204687 2435232 2680132 2524867 2071662 1879599 2155100 2473263 2458118
37696B458118j44728J17156L63369K67791k3775k19964k22858q2894R0219J28851
37686B731285l4553j89971n9593K94658M94542L23736n371j35230K3592K46643
37676C689738K86607J28634l8560n3715P0052K24309L32323L51339K84325K90361
37666E565413O04030J154865J453139J133771M53723q2581m13353p86134j083628
37657G999245q94009k82547J39628Q8855l9754O6166J20537j55363m56665l93326
37647F192767j35377o9042j61126j68449j83378m38974p77797q28391n76024k97336
37637B556873n5222K73247N51519M47922l0919m55719m81430j71425J80102L13446
37627C128394J35076j92962l56941k64496j78087k85279l56547j21141K28478
$$ plain form
37696 2458118 2313390 2430546 2793915 3061706 3037931 2817967 2595109 2512215 2602434 2731285
37686 2731285 2696732 2506761 2447168 2741826 3236368 3560104 3554733 3419503 3443095 3689738
37676 3689738 3976345 4104979 4066419 4012704 4082756 4307065 4639388 4990727 5275052 5565413
37666 5565413 6169443 7324308 8777447 9911218 10364941 10282360 9869007 9082873 7999245
37657 7999245 7105236 6822689 6962317 7051172 7011418 7077584 7198121 7042758 6586093 6192767
37647 6192767 6057390 5988348 5827222 5658773 5475395 5036421 4258624 3430233 2854209 2556873
37637 2556873 2501651 2774898 3326417 3774339 3743420 3287701 2806271 2634846 2814948 3128394
37627 3128394 3263470 3070508 2713567 2449071 2270984 1985705 1629158 1508017 1736495
37618A736495K82631L0051j58508r7669J9863j2676j56528k46529j67354N8261
37608A288037K24692J14976j57049k03297P1949K67322R1657j72286j46627N3369
37598A432743J21889J05113J61738J28514j13218j78124K41269O31811L06146
37589B837881l96522m70889K13389O91012L87726j18399j73835m615n5102j16590
37579B794056J87291N62283M33270j05357l99761j89296J05042M3425l04567n51751
37569B574635m38521m5151K80888K33955j05780l26871j85693Q4009R0040k20135
37559A941376n31931n56350l27310j21990j10928r9609K35185P58816Q16016R1024
37549B094299p20164o49233K11767P55812L38743m35442o70210l15236O3438J62975
$$ plain form
37618 1736495 2019126 2049177 1890669 1793000 1812863 1800187 1643659 1397130 1229776 1288037
37608 1288037 1512729 1627705 1470656 1267359 1339308 1606630 1698287 1526001 1379374 1432743
37598 1432743 1554632 1659745 1821483 1949997 1836779 1658655 1899924 2531735 2837881
37589 2837881 2441359 1970470 2183859 2874871 3262597 3144198 2970363 2965748 2910646 2794056
37579 2794056 2981347 3543630 3976900 3871543 3471782 3282486 3387528 3430953 3126386 2574635
37569 2574635 2136114 2090963 2371851 2605806 2500026 2173155 1987462 2071471 2161511 1941376
37559 1941376 1409445 853095 525785 403795 292867 193258 428443 1187259 2003275 2094299
37549 2094299 1374135 724902 936669 1692481 2031224 1595782 925572 610336 673774 836749
37539H36749Q5439o9966k49499k76013o5173J44451J35979R6938K73047M37086
37529A349038J77103l75022n98484k23422L00310M20756J55251o0549K415J40097
37519A287493R0898o2808j8543K66641M50025K94610O9039J57562M16739L51487
37509C303143q5299l71719k34395q6600l54512p80444p93185k99152K76486N45507
37499A119830M21193R768m27955n47628k65583P4382J24672k9328j04104q4069
37489B91178j26449j70889k6920K25926K89053R4490r3281n6058J18219J85603
37479G30872J7909k66682l78984j58793J67972K35146Q5686J46975N16034O82105
37469A778240K69175l24360m57752j34520J18855N6461j03861j80742k21606k29500
$$ plain form
37539 836749 922188 852222 602723 326710 261537 405988 541967 638905 911952 1349038
37529 1349038 1526141 1151119 552635 329213 629523 1050279 1205530 1144981 1147396 1287493
37519 1287493 1378391 1315583 1297040 1563681 2013706 2308316 2377355 2534917 2951656 3303143
37509 3303143 3217844 2846125 2611730 2525130 2170618 1390174 596989 297837 574323 1119830
37499 1119830 1541023 1550791 1122836 575208 309625 384007 508679 479351 375247 291178
37489 291178 164729 -6160 -33080 192846 481899 576389 483108 427050 545269 730872
37479 730872 748781 482099 103115 -55678 112294 347440 433126 580101 1096135 1778240
37469 1778240 2047415 1723055 1265303 1130783 1249638 1306099 1202238 1021496 799890 570390
37459E70390j25710J5619M4652R638L5089K4009j64814l57880k84284n3719M992
37448b82018r9057p0329J20790K03388J07476M0756N7482j13j14286r4112J3406
37437a16617l3709j94390j74370L5560J34578O6108Q9927K44387K75263J80642
37427E07379K43458L95722J88780l75962o29858j95116M06459M96334J00234l18899
37417H18531n13708m38291n8362L73392L03755l57261q64300n60673J92815N72440
37407e31662M24582K09878J02680j23421m28526m40611j06526J71927J45408n719
37397e81990o0285N015J99103N09967O73832L83977j89465m88410k76187R3526
37387B69083J97212p550l15172n10037m06977p122L16818J54941l40219n66396
$$ plain form
37459 570390 444680 460299 504951 514589 549678 573687 408873 50993 -233291 -287010 -282018
37448 -282018 -381075 -451404 -330614 -127226 -19750 21006 78488 78375 -35911 -130023 -116617
37437 -116617 -150326 -344716 -519086 -483526 -348948 -282840 -192913 51474 326737 507379
37427 507379 750837 1146559 1335339 959377 329519 134403 540862 1037196 1137430 818531
37417 818531 304823 -133468 -191830 181562 485317 128056 -736244 -1296917 -1104102 -531662
37407 -531662 -107080 102798 205478 82057 -346469 -787080 -893606 -721679 -576271 -581990
37397 -581990 -642275 -637260 -438157 71810 745642 1129619 940154 451744 175557 269083
37387 269083 466295 458745 143573 -366464 -773441 -780563 -463745 -308804 -649023 -1215419
37377a215419k74017J54464L44531L79423M00328K51969j13906l01494l096M28081
37367E0864M41170J28883O3313L60148M72802L7047n60009p11059l63669K8706
37357e1804J32589J8683q8374p5653M6437J94692K32171Q6566j05423j13732O0791
37346C36943J29970r0149l66956l31789m614K15817J19897j6215J46707M90406
37336F30017N76517K26528k61782m87831l65135j16743J8246q445q5419r8163
37326B7790k1315J26254L26357M73586L38044j65555o77427o55264o8670M43940
37316A47740L36004j68355m46436l15495j11629n8674k0390J00800J61074R9089
37306b76272Q8057J89341J80312o1874k89859k45304n6166q970j00625r1857J01513
$$ plain form
37377 -1215419 -1489436 -1334972 -990441 -611018 -210690 41279 -72627 -374121 -377217 50864
37367 50864 492034 620917 684230 1044378 1517180 1554227 994218 283159 -80510 -51804
37357 -51804 80785 99468 11094 -64559 -18122 176570 408741 495307 389884 276152 336943
37346 336943 466913 376764 9808 -321981 -326595 -110778 9119 -7096 139611 630017
37336 630017 1206534 1433062 1171280 683449 318314 201571 219817 211372 125953 27790
37326 27790 6475 132729 459086 932672 1270716 1105161 427734 -227530 -296200 147740
37316 147740 483744 315389 -131047 -446542 -558171 -616845 -637235 -536435 -375361 -276272
37306 -276272 -188215 1126 181438 119564 -170295 -415599 -471765 -480735 -581360 -673217 -571704
37295e71704L13334L55648J64384j84185m36156k87073K27177N97272L75745k26578
37285C27864n59899l18391J79006M91579N36285M75845L89398K24241n5505l96689
37275A293734o68700p08959m45802J560M15264O33670N42734P8253n32481p02045
37265i2772q0518P94096R37907J61795o20149n98778r3084Q7620j31612j77757
37255A86748Q5528J54238j69410l75366r6216K45433R6319l46462m42624o0286
37245g22098L00911K65219Q297j12546j2617J35269J59661N9613J3882J83934
37235B79525M27598L77665k2074k94207n6614L38313K51356k68062n16735k02734
37225C14031J14130j08525o04875p72725n53164l70063m21838n10790m85706m23046
$$ plain form
37295 -571704 -258370 97278 261662 77477 -358679 -645752 -418575 178697 554442 327864
37285 327864 -232035 -550426 -371420 120159 656444 1132289 1521687 1745928 1690423 1293734
37275 1293734 625034 -83925 -529727 -528167 -112903 520767 1063501 1141754 609273 -92772
37265 -92772 -173290 620806 1558713 1720508 1100359 501581 408497 496117 364505 186748
37255 186748 272276 426514 257104 -118262 -214478 30955 127274 -219188 -661812 -722098
37245 -722098 -421187 -155968 -147671 -260217 -272834 -137565 22096 81709 95591 279525
37235 279525 707123 1084788 1062714 768507 711893 1050206 1301562 1033500 516765 314031
37225 314031 428161 319636 -285239 -1057964 -1611128 -1981191 -2403029 -2913819 -3399525 -3822571
37215c822571l57164j80476J23774M03733N46246N68141M92279L29496J88452
37206a708090K05531L45784M39234M04666K69503K1590l20602n19945l09097J68087
37196a003339M04906J72182j47633q0814K85212M51290K10523j08555j46055Q751
37186D6468J6016j81361k71989m9501K45935K27044j10072l78265l10739m4746
37176h11210J67003K76285L15930J94397j20649l64094k38838J20126K52580j6523
37166b24993l39221l11548K8536K91573J94586j65888m17442k51508K58103O77388
37156b60414O45462K47608j54719l63137m05098k61988J28229N72632O77049L39144
37146A164768q4099k53930k38590k46133k30162l2284K51267L39022J42131j51748
$$ plain form
37215 -3822571 -4179735 -4360211 -4236437 -3832704 -3286458 -2718317 -2226038 -1896542 -1708090
37206 -1708090 -1502559 -1156775 -717541 -312875 -43372 -21782 -342384 -862329 -1171426 -1003339
37196 -1003339 -598433 -426251 -573884 -654698 -369486 81804 292327 183772 37717 46468
37186 46468 62484 -118877 -390866 -440367 -194432 32612 -77460 -455725 -766464 -811210
37176 -811210 -644207 -367922 -51992 142405 21756 -342338 -581176 -461050 -208470 -224993
37166 -224993 -564214 -875762 -847226 -555653 -361067 -526955 -944397 -1195905 -937802 -260414
37156 -260414 385048 632656 477937 114800 -290298 -552286 -424057 148575 825624 1164768
37146 1164768 1080669 826739 588149 342016 111854 79570 330837 669859 811990 660242
37136F60242l38791l59086k27082J3352K38755K80048P0608k59819m53078l32029
37126g06880j2834J53206o563j93147P454M90102O72190K66816l04990m64397
37116i9043j65578J92378L07518J69726r1333k80680k08594P0045K30645J02841
37106B27925p5690n9460O325r5059j97087l9646J90383J07806j96286k60824j0236
37095d01849J35118l2485k07207j24079M5483M8017q2614j95283k32816j38120
37085a185835J16677L14556J92383o6200n334L26835L50186q3391l42535j4289
37075c96947L88922K66571j03445j31714K9017j59733n25362l86297K37409N48544
37065b33035K10313k01657k07497p3908j15389r8890J73724L33636P4475k07076
$$ plain form
37136 660242 321451 -37635 -264717 -251365 -12610 267438 338046 78227 -374851 -706880
37126 -706880 -719714 -566508 -573071 -766218 -758764 -268662 403528 670344 365354 -99043
37116 -99043 -264621 -72243 235275 405001 313668 32988 -175606 -105561 125084 227925
37106 227925 152235 92775 99100 4041 -193046 -232692 -42309 65497 -130789 -391613 -401849
37095 -401849 -266731 -299216 -506423 -630502 -585019 -537002 -619616 -814899 -1047715 -1185835
37085 -1185835 -1069158 -754602 -562219 -628419 -633753 -306918 43268 -40123 -382658 -396947
37075 -396947 -8025 258546 155101 23387 52404 -107329 -632691 -1018988 -781579 -233035
37065 -233035 -22722 -224379 -431876 -505784 -621173 -720063 -546339 -212703 -138228 -345304
37055c45304m0725K60934R0939l81984m15654J10040M80276K58359r5160l5626
37045a13905K07113O9075l98265n73859j81088L15215L31426j25636n41192n05012
37035a516128o8795M10156O04879M20495K7158k54014k09682M5608J77340J4559
37025c48424k57459l51977k18785j9712J20998J81862J48563M9092K5580J54592
37015e15670K40598M7251k75377l00694P1028M28279M05323J38568k8029m2736
37005A68541r6794k43505l26070k11808P5316L78485M57853J65724l02052n06878
36995d41188k68407J16217K88767K28796P6655j30773k91223j34121L44498O31877
36985D21098L28981k01650l16453l0638Q6632j59975l87574l45208k08308j02210
$$ plain form
37055 -345304 -386029 -125095 -34156 -416140 -831794 -721754 -241478 16881 -78279 -113905
37045 -113905 93208 162283 -235982 -809841 -990929 -675714 -344288 -469924 -1011116 -1516128
37035 -1516128 -1584923 -1174767 -569888 -149393 -122235 -376249 -585931 -540323 -362983 -348424
37025 -348424 -605883 -957860 -1176645 -1196357 -1075359 -893497 -744934 -695842 -670262 -515670
37015 -515670 -275072 -227821 -503198 -803892 -732864 -304585 100738 239306 211277 168541
37005 168541 71747 -171758 -497828 -709636 -634320 -255835 202018 367742 65690 -441188
36995 -441188 -709595 -593378 -304611 -75815 840 -129933 -421156 -555277 -210779 421098
36985 421098 750079 548429 231976 201338 287970 127995 -259579 -604787 -813095 -915305
36975i15305N6625J41665j15777m69485k63034N11493R56064N08855k06705l45882
36965a41486o4104m5024k72454j66920K64719L51979r6572m03733n9038N06488
36955a26145N84350J79770j11361K2023K77917K54841j3339j58536j1532J28491
36945A026479j23323o48292q67606m66572J85778N28327M58611K28430l8061l31691
36935d7920m64821k61556M6534P7071r5377o6967J72700J90944j17563k73361
36925h40316L4365M31912M37724J58972J8912Q4374R5517n227j602J67365K52538
36914H34534M8591k96043m20773j51564K73980M15316J21931k56292l01271p9289
36904A89120p19j78095k85921j14558J27393K13387K22391K45276J35273j55824
$$ plain form
36975 -915305 -858680 -717015 -832792 -1302277 -1565311 -1053818 -97754 411101 204396 -141486
36965 -141486 -205590 -250614 -523068 -689988 -425269 -73290 -169862 -573595 -632633 -126145
36955 -126145 458205 637975 526614 548637 826554 1081395 1068056 909520 897988 1026479
36945 1026479 903156 254864 -612742 -1079314 -893536 -365209 93402 321832 283771 -47920
36935 -47920 -512741 -774297 -727763 -650692 -746069 -813036 -640336 -449392 -566955 -840316
36925 -840316 -805951 -374039 63685 222657 241569 325943 421460 416233 414631 581996 834534
36914 834534 883125 587082 166309 14745 288725 704041 825972 569680 268409 189120
36904 189120 188401 10306 -275615 -390173 -262780 -49393 172998 418274 553547 397723
36894C97723l20673j30542J39971J05278j34081j98591o2987l3591j82796k55955
36884f76244j33333K9667J56418L46630N38389M48495O041m46684n50305l03570
36874e84496P3123M06852N62497M06208n685l50220l54112j06972Q8557R5215
36864B30967K0533j5825k6324o4056j12871j14589n1238K8578M4104n6333k33994
36853c51048l47486k46595N7578L23841K89461J2452j16493J37229M48861K87054
36843D94854l28374p46805n05262P2095L36091J32889j56576k31276j45076j9100
36833a096540J40375K73738K31995K9079j02739k6872J17741J53557J00083N7177
36823a22406J8900n3077r2006j4019J20398J58804M9594r4132j12091M8904K61007
$$ plain form
36894 397723 77050 -53492 86479 191757 57676 -140915 -203902 -237493 -420289 -676244
36884 -676244 -809577 -779910 -623492 -276862 261527 710022 716063 269379 -280926 -584496
36874 -584496 -511373 -104521 457976 864184 858499 508279 154167 47195 135752 230967
36864 230967 251500 235675 209351 145295 32424 -82165 -133403 -104825 -60721 -117054 -351048
36853 -351048 -698534 -945129 -887551 -563710 -274249 -261797 -378290 -241061 207800 494854
36843 494854 166480 -580325 -1085587 -1013492 -677401 -544512 -701088 -932364 -1077440 -1096540
36833 -1096540 -956165 -682427 -450432 -421353 -524092 -550964 -433223 -279666 -179583 -122406
36823 -122406 -103506 -156583 -248589 -262608 -142210 16594 66188 -27944 -140035 -91131 169876
36812A69876K87807O408m03907n66258k75058K52099N45409L35324j69796m89517
36802c07613l69861j6868K18536K70672L00133L06727J25144j61726j92334J02860
36792B75670K69894j4188l76714k70717J72262L31606L5063k44652j52125J26257
36782A52356L18303M40900N13845L63016Q55j83669M3519L44911K81425m8515
36772B226946k17574j30517o7258j52382j87048m5013R2159R104k44833m46793
36762H36791m66957l50769j97342l5426J57491L30618L42065J57257j5402L7050
36752G95376K07634K21901R2977J00299K58816K04895j93873n00107k99627J73677
36742A061968L88031K46338M5060j01341l00512m54121l26976n1091l0128k51484
$$ plain form
36812 169876 457683 464091 60184 -506074 -781132 -529033 16376 351700 181904 -307613
36802 -307613 -677474 -694342 -475806 -205134 94999 401726 526870 365144 172810 275670
36792 275670 545564 531376 154662 -116055 56207 387813 422876 178224 26099 152356
36782 152356 470659 911559 1425404 1788420 1789275 1605606 1649125 1994036 2275461 2226946
36772 2226946 2009372 1878855 1811597 1659215 1472167 1427154 1519313 1528417 1283584 836791
36762 836791 369834 19065 -178277 -213703 -56212 274406 616471 773728 758326 795376
36752 795376 1003010 1224911 1317888 1418187 1677003 1881898 1688025 1187918 888291 1061968
36742 1061968 1449999 1696337 1741397 1640056 1339544 885423 558447 507356 477228 225744
36732B25744k33411J51111L50261j4529m59278l18279K17821L66920p2845m64590
36722b51075l20970N2876J65253P8795J22214K16930L2671l32890l95336m9732
36712f81264K20193Q1532j60758j18341M4961k5475j76195K0252M49511N01725
36702A56141K5793l53457j40621L06056L55917L2343j45279k4249L6461j42995
36692A06110k58902p1182J57464N6040k62063l29372J0712L54132K49251k07587
36682a95397m75117k44863J86817L41750J78885L2257J8117j10747m19545n05891
36672a193734p2875M88307N12374m2903n25152m30959M7447M12624M64512L27678
36662a2681J29196r5357k80403l30497k36932q4803M2313J01793P7243n474o8408
$$ plain form
36732 225744 -7667 143444 493705 479176 19898 -298381 -80560 286360 213515 -251075
36722 -251075 -572045 -519169 -353916 -275121 -152907 64023 96694 -236196 -631532 -681264
36712 -681264 -461071 -379539 -540297 -658638 -613677 -639152 -815347 -795095 -345584 156141
36702 156141 181934 -171523 -312144 -6088 349829 382172 236893 212644 249105 106110
36692 106110 -152792 -223974 -66510 -10470 -272533 -601905 -591193 -237061 12190 -195397
36682 -195397 -670514 -915377 -728560 -386810 -207925 -175668 -157551 -268298 -687843 -1193734
36672 -1193734 -1266609 -778302 -265928 -308831 -833983 -1264942 -1217495 -804871 -340359 -12681
36662 -12681 116515 21158 -259245 -589742 -826674 -911477 -869164 -767371 -690128 -695602 -764010
36651g64010l9275Q3872K33783L14813K53155O6006j12430j43956n3864j6875
36641a78781j22997k19872r1848K10161L53416J35855j89773k04574Q0793K01459
36631b6161o6272l03114o0329L73975L22636k40390n83141k79087J97878K48041
36621d15964K594n1203R8013R5043p6368q2713J50111L36292L16826J93920J1148
36610E77699k46361l65295j10370K78150L06481j9997k17670j60486k49935n69038
36600g76822n74897j6420M96771L89817L9029J17617M39593K60730m51599q73663
36590i49844n11696J68568M91485L76144J33093o3656j70887r0124J65514L33921
36580a17482K25702K4405J0965J25427O9869k22873m77346m43242j87047L6832
$$ plain form
36651 -764010 -803285 -719413 -485630 -170817 82338 148344 35914 -108042 -161906 -178781
36641 -178781 -301778 -521650 -613498 -403337 -49921 85934 -103839 -308413 -227620 -26161
36631 -26161 -92433 -395547 -455876 -81901 240735 345 -582796 -861883 -664005 -415964
36621 -415964 -413370 -464573 -366560 -271517 -347885 -430598 -280487 55805 372631 566551 577699
36610 577699 331338 -33957 -144327 133823 440304 420307 202637 42151 -207784 -776822
36600 -776822 -1351719 -1368139 -871368 -481551 -442522 -324905 114688 375418 -76181 -949844
36590 -949844 -1461540 -1292972 -801487 -425343 -292250 -355906 -526793 -616917 -451403 -117482
36580 -117482 108220 132625 143590 269017 338886 116013 -361333 -804575 -991622 -954790
36570i54790R2272O9965J22518K44315K74726J49666M8383J42700K65567P6718
36560E32040m01150o89072m51919M4595L03705K28007R0827L1030m8473j26658
36550d87068k5912J89982J71995j72105m27410k22160K41081N00412M56364L39874
36540E65053K35492L3153k23349l31531k69825j99693j36150L2696K01547J16963
36530B4356j69338l19559k39332j51984p8882K19985O31477O25363J08306k69643
36520C80749q9861J63649k6697k78311j3450M09818K36645l28149l84798J30500
36510B00095L17117j36378m00839Q0118O44259M93026j17821m80621n34738n77428
36500e13210m43667J38531P35178O48751J9995l23614p9280K12879J08322j74718
$$ plain form
36570 -954790 -862518 -792553 -670035 -425720 -150994 -1328 47055 189755 455322 532040
36560 532040 130890 -558182 -1010101 -965506 -661801 -433794 -342967 -311937 -360410 -487068
36550 -487068 -512980 -322998 -151003 -323108 -750518 -972678 -731597 -231185 225179 565053
36540 565053 800545 833698 610349 278818 8993 -190700 -326850 -294154 -92607 24356
36530 24356 -144982 -464541 -703873 -855857 -934739 -714754 -83277 542086 650392 380749
36520 380749 290888 454537 427840 149529 136079 545897 782542 454393 69595 200095
36510 200095 517212 380834 -20005 60113 704372 1197398 1079577 598956 64218 -513210
36500 -513210 -956877 -818346 -83168 565583 585578 261964 182684 395563 503885 329167
36490C29167k83672k42649k00635j12157Q5282K79861L53878L19450J97973j1805
36480G14693k05587k46042j74283j16269k2288K08237L92300K20655k31607n20812
36470A8997m29190j98793r1839p0637l7342m9951j22435r4222J11695L21115L49533
36459b93069K12210n478k55616m14806l31985j00810K73m1497Q1106M28082N78984
36448a42606K62608j38863j26332J52069J69251j14286k15132M7162K52127P0951
36438B16949k29264k59422j01329n7850r4053K6340K00387P7989l00491m47114
36428i67858j57890J45078P9441q8587P4481L78556K73538k01507l67751P2828
36418g59671N51482M69905M6459j05824Q6153J53325j29017m37244l96296k0126
$$ plain form
36490 329167 45495 -197154 -397789 -509946 -424664 -144803 209075 528525 726498 714693
36480 714693 509106 263064 88781 -27488 -49776 158461 550761 771416 539809 18997
36470 18997 -410193 -608986 -700825 -771462 -808804 -858755 -981190 -1075412 -963717 -642602 -293069
36459 -293069 -80859 -86337 -341953 -756759 -1088744 -1189554 -1189281 -1230778 -1149672 -721590 -142606
36448 -142606 120002 -18861 -145193 6876 176127 61841 -153291 -106129 145998 216949
36438 216949 -12315 -271737 -373066 -430916 -524969 -498629 -298242 -220253 -520744 -967858
36428 -967858 -1125748 -980670 -901229 -989816 -915335 -536779 -263241 -464748 -832499 -759671
36418 -759671 -208189 261716 308175 202351 288504 441829 312812 -124432 -520728 -540854
36408e40854L97317N66938L49414j48963n80911o36516l44278K0512K70616M06030
36398b40695M65108M57420L86113K01313j56865n40147o13252k88744Q1140J86640
36388f1969J69818K46258K40021n1794l24079j79653J28059M5825l01600k51874
36378c40988K55508N00880J37563k79514k57227r8753j97140k77906L1079M08642
36368a17856L20542o6541j46713J57908L35844J03459k65259m06519k41536P9547
36358b47124K77442J00455l09018m03570N4630N21604L75295j47758k90629R9858
36348C1185M23436K80184n5963k17848k30653k32553j82937o4384n224k4757K1462
36337b58052J26082R8707n6573j04415k0525o6421k89446l76230j86538K323J3969
$$ plain form
36408 -540854 -143537 423401 772815 623852 42941 -593575 -937853 -917341 -646725 -240695
36398 -240695 224413 681833 1067946 1269259 1112394 572247 -41005 -329749 -248609 -61969
36388 -61969 107849 354107 594128 542334 218255 38602 166661 212486 -89114 -340988
36378 -340988 -85480 415400 552963 273449 16222 -82531 -279671 -557577 -526498 -117856
36368 -117856 202686 136145 -10568 147340 483184 586643 321384 -85135 -326671 -247124
36358 -247124 30318 130773 -178245 -581815 -527185 -5581 369714 221956 -68673 31185
36348 31185 454621 734805 678842 460994 230341 -2212 -185149 -249533 -254757 -279514 -258052
36337 -258052 -131970 -33263 -89836 -194251 -214776 -281197 -570643 -946873 -1133411 -1131088 -1117119
36326a117119R0025L88570O00845M55659K19525K38335L12063N5893l61940m34662
36316D47194j43225L6407o4292j02964P5921J36900j07902k80703k9494L60868
36306C28710L81220M5612k24156k74617l03450l54847k31419N3479K05673J58274
36296b15521K08688M46665M82549P0696l78368l50944j2210Q9723p6604l6623
36286B28051K97110M02621J9941l43655j54255L39389M88542J52585k33493l35348
36276H61488k28282r5654j682K2547m2276j14163j04917p9047j36011k09784j83763
36265c11544j05986p4605l0781R1120J51260L6048m6867J33886L61560K23573
36255D27664k17089m56901k75374K7806J77150K35631K59967J23504j17578j37514
$$ plain form
36326 -1117119 -1027094 -638524 -37679 417980 637505 875840 1187903 1243796 881856 447194
36316 447194 303969 340376 276084 173120 249041 385941 278039 -2664 -32158 328710
36306 328710 709930 755542 531386 256769 -46681 -401528 -632947 -579468 -373795 -215521
36296 -215521 -6833 439832 922381 993077 614709 263765 251555 341278 264674 228051
36286 228051 525161 927782 947723 604068 449813 789202 1277744 1430329 1196836 861488
36276 861488 633206 537552 535870 558417 516141 401978 297061 218014 82003 -127781 -311544
36265 -311544 -417530 -492135 -522916 -431796 -280536 -244488 -291355 -157469 204091 427664
36255 427664 210575 -246326 -521700 -493894 -316744 -81113 178854 302358 184780 47266
36245D7266J15554K13036r7070m23610l20962m830K447k87194l69856n0321L02351
36234h73189L47582K00482J36691J92817K34158K04845J39247M9452o1472j39374
36224D31239j29068o1325l7589j22493k53182k70160q7782J64818K54593J21556
36214A0607m7783o3329N3851J52352J38811J8072j50752k59568k03223k126J98150
36203a54938K89349K73018J61227n1208k83294l97972l80848l25313k20029K6950
36193a063058L17677M02652K76745K16894K87882J81800k15079m82903k55584
36184c32974J84433L39474K47847K78962L80777J55630l52737n81376k82599J09133
36174A46570J47007n9518j83973j67559q0775J25962M03344M44953J09711k37493
$$ plain form
36245 47266 162820 375856 278786 -144824 -465786 -470616 -468169 -755363 -1125219 -1175540 -873189
36234 -873189 -525607 -325125 -188434 4383 238541 443386 582633 632085 570613 431239
36224 431239 302171 240846 203257 80764 -172418 -442578 -530360 -365542 -110949 10607
36214 10607 -37176 -100505 -46654 105698 244509 262581 111829 -147739 -350962 -353088 -154938
36203 -154938 134411 407429 568656 517448 234154 -163818 -544666 -869979 -1090008 -1063058
36193 -1063058 -745381 -342729 -65984 150910 438792 620592 405513 -77390 -332974
36184 -332974 -148541 190933 438780 717742 1098519 1254149 901412 320036 37437 146570
36174 146570 293577 234059 50086 -117473 -198248 -72286 331058 776011 885722 648229
36164F48229j78901J48372K81421J27614O232M5594q221k85877m94595l42090
36154e2222Q061J65878M4783j03131j15675j09118j84519j84953P1208M30646
36144b9042N07437J64239k93308m82120l50983j14692P0823J87012K08948J12907
36134a8779L716J7910R2043M2058j04251j01944J05472K34333P3500j73251j73695
36123b888O6401K64198K77920K08493J36137J5944j44962k29412j91612j30667
36113B69552j25241j32670r6440j8711J08801K91065L99874K44924j21989l58254
36103D60911k52332m2067q8847l35503l71624l8318L24763L49413J18939o704
36093A18631J13306K94492L32857K06126l330j99462k83192k28639j49018j44533
$$ plain form
36164 648229 469328 617700 899121 1026735 1032967 1078561 1070340 784463 289868 -52222
36154 -52222 -44161 121717 166500 63369 -52306 -161424 -345943 -530896 -459688 -29042
36144 -29042 478395 642634 349326 -132794 -483777 -598469 -527646 -340634 -131686 -18779
36134 -18779 -15063 2847 94890 136948 32697 -69247 36225 270558 344058 170807 -2888
36123 -2888 63513 327711 605631 814124 950261 966205 821243 591831 400219 269552
36113 269552 144311 11641 -84799 -103510 5291 296356 696230 941154 819165 460911
36103 460911 208579 166512 77665 -257838 -629462 -667780 -343017 6396 125335 118631
36093 118631 231937 526429 859286 1065412 1062082 862620 579428 350789 201771 57238
36083E7238j22046M1634K00059Q4616k17420k71797O9008L75385K38260j38067
36073C16870k90608k08924k38440l93749k97346J31281M20882K11369j96354k54556
36063g99575R4389L92990K75001j34297l89911j77843L53678O74602M15543j50979
36053E53598l94185j41346J09023m7206l08292j63111K85073M64686J89734j24715
36043D23259j36951k0299o9526k21554k17414k9914J19021Q3027m6172q5548K1482
36032a80589J41773J06349n8295j28969Q582J68542J28778l5750r8878m9518k9278
36021b7253K283J72711L01470M8533m58261o15895j79975L22313L15161o0270
36011a79183k66273j39686P5476K22149L04912K38058k4802k18691p2899J91975
$$ plain form
36083 57238 -64808 -23174 176885 261501 44081 -227716 -158708 216677 454937 316870
36073 316870 26262 -182662 -421102 -814851 -1112197 -980916 -560034 -348665 -545019 -799575
36063 -799575 -705186 -312196 -37195 -171492 -561403 -739246 -385568 289034 704577 553598
36053 553598 159413 18067 127090 79884 -228408 -391519 -106446 358240 547974 423259
36043 423259 286308 266009 196483 -25071 -242485 -272399 -153378 -70351 -116523 -202071 -180589
36032 -180589 -38816 67533 9238 -119731 -111149 57393 186171 150421 51543 2025 -27253
36021 -27253 -24970 147741 449211 497744 39483 -576412 -756387 -434074 -118913 -179183
36011 -179183 -445456 -585142 -509666 -287517 17395 255453 230651 11960 -60939 131036
36001A31036J36242j81898k72227j5775J43458n3137k64488j39918J22540J46261
35991b47906k3475n0508J61804L81437L70595Q5818l22500n61436m04365K0340
35981e90196L16960K82218N9137k02928m89205o26045l09032L33882O68655L89818
35971a66736j0488j9553J17401m9586k85153p4363L74108L85289k3896j30944
35961A16079K68963N00138J24872l77268m48312k70523k44899k45231J3469L11747
35951b50965K61756K38o1157M3471k9420k13525q4322L53112N17145P2917n37276
35940G1974o51007k12202K18043J73860j94052l50890n4756L37242L51131M7920
35930b62737j08168P240K1373k10628k49113J90360O09912M07732j41191k62554
$$ plain form
36001 131036 267278 85380 -186847 -202622 -59164 -112301 -376789 -516707 -394167 -247906
35991 -247906 -271381 -321889 -160085 221352 591947 677765 355265 -206171 -610536 -590196
35981 -590196 -273236 8982 68119 -134809 -624014 -1250059 -1559091 -1225209 -556554 -166736
35971 -166736 -177224 -196777 -79376 -128962 -414115 -488478 -114370 270919 247023 116079
35961 116079 385042 885180 1010052 632784 184472 -86051 -330950 -576181 -562712 -250965
35951 -250965 10791 11029 -50128 -6657 -36077 -249602 -333924 19188 536333 609250 71974
35940 71974 -579033 -791235 -573192 -399332 -593384 -944274 -999030 -661788 -310657 -262737
35930 -262737 -370905 -363665 -342292 -552920 -802033 -611673 -1761 405971 264780 2226
35920B226J16232K83237j05518n25052m63094j59686q9031k08532j87878l4245
35910a371341L205n2931M1580K78074L86565K91782K12305K53449K28168J0862
35900B81718j93685j34766Q9550J52315l3722j91186q7513J11279O9553k13298
35890a49755l55432j05550K94487M11443J62969j29502j79574l2223J06089J70041
35880A92993K62087M29243N13370K94795j94480n84534n24437j03738K46514K80673
35870H12486J58462R6755P3213J4278P078J03905J45550L2422l9628J00830K48690
35859A754041J28314j15931j17710J28019K66369J14223j64708l68948m08638
35850A215031k21757J06903K44992K0585k04307l5906K36961N3477l86103k88360
$$ plain form
35920 2226 118458 401695 296177 -228875 -691969 -851655 -940686 -1149218 -1337096 -1371341
35910 -1371341 -1368136 -1421067 -1379487 -1101413 -714848 -423066 -210761 42688 270856 281718
35900 281718 88033 -46733 42817 195132 161410 -29776 -117289 -6010 63543 -149755
35890 -149755 -505187 -610737 -316250 95193 258162 128660 -50914 -83137 22952 192993
35880 192993 455080 884323 1397693 1692488 1498008 913474 389037 285299 531813 812486
35870 812486 970948 1067703 1140916 1155194 1162272 1266177 1411727 1444149 1404521 1505351 1754041
35859 1754041 1882355 1766424 1648714 1776733 2043102 2157325 1992617 1623669 1215031
35850 1215031 993274 1100177 1345169 1365754 1161447 1125541 1362502 1415979 1029876 741516
35840G41516M19635P92097K45235n22038n39550R4243N24040L68492k0799k68216
35830A834655l19620k09787p006Q3298l5430j20646K6265J38884j18749n19110
35820G52754n42938j83858M7168q3248k35387q0786K51206M54217M38624K97858
35810A115610J25256j5195r3124j33792j37823o2057n024k02402n95423o71624
35800f75598j42839M50464L74817j72492k57225L93970R08224N11118l51742o68179
35790C70518k42698J86290O2947l39234m65209k21118N5154J08651j118r4324
35780e80141r0723j8336O6285J04867N4011o0751j50561j75823j90756k04719
35770a246647j01946J55689L50872K69309P3850J17280L80420M52713J56871j83265
$$ plain form
35840 741516 1161151 1953248 2198483 1676445 1136895 1231138 1755178 2123670 2102871 1834655
35830 1834655 1515035 1305248 1298242 1381540 1346110 1225464 1251729 1390613 1271864 752754
35820 752754 209816 25958 73126 -10122 -245509 -326295 -75089 379128 817752 1115610
35810 1115610 1240866 1225671 1132547 998755 860932 798875 793851 591449 -3974 -675598
35800 -675598 -818437 -367973 6844 -165648 -422873 -28903 879321 1390439 1038697 370518
35790 370518 127820 314110 377057 37823 -427386 -648504 -593350 -484699 -485817 -580141
35780 -580141 -670864 -689200 -622915 -518048 -464037 -524788 -675349 -851172 -1041928 -1246647
35770 -1246647 -1348593 -1192904 -842032 -572723 -498873 -381593 -1173 451540 608411 425146
35760D25146k58122j77718j39519p1553R6819J66236K0500q3550L9156J08030
35750A25425j25882l32032j01782K90276K67201j02131k27178K2441J70112j4576
35740b8126k05769j73380j09126j42174j08148K9004O7603L0818J79690M12920
35730d6688K65674k74374n76384k89589J39720K20605J07548J33430J99049R5379
35720b5630l7827m2976r4398k63316k00478K39072N31150K44809j68684n1836
35710A29886L52386K76574k94284n79255k30343K00525J89147n7855j14189l701
35700a31109K680j03810j26193l7100k039q6508j39076r219J93369J70949j45419
35689d13475l78287j61902K56663K89345q8874k53404O3144L09317N5081k48305
$$ plain form
35760 425146 167024 -10694 -150213 -221766 -124947 41289 61789 -21761 17395 125425
35750 125425 -457 -332489 -434271 -143995 123206 21075 -206103 -183662 -13550 -28126
35740 -28126 -233895 -407275 -516401 -658575 -766723 -737719 -670116 -639298 -459608 -46688
35730 -46688 218986 -55388 -631772 -921361 -781641 -561036 -453488 -320058 -121009 -25630
35720 -25630 -63457 -106433 -200831 -464147 -664625 -425553 105597 350406 181722 129886
35710 129886 482272 758846 464562 -114693 -345036 -144511 44636 -13219 -127408 -131109
35700 -131109 -128429 -232239 -358432 -395532 -397571 -484079 -623155 -632374 -439005 -268056 -413475
35689 -413475 -791762 -953664 -697001 -407656 -496530 -749934 -686790 -377473 -322392 -570697
35679e70697o0295K72992J44774j57295R3476O91767O73374j13878o77737l75605
35669g9124K19048L49965J27305J2889k7353k27595m13311l22045j47943j87006
35659f95170k55246k1144L34736L52610K7777k03044j24635N9261J47378J61031
35649b16446J44929P2544l3398j14971j81070k17876j07110J68767L81331L36671
35639B33371J50450K1539p6264k12956k36492l5772J27697l0854k79026j46882
35629d85189L14605N52940L20092l6966j98051k82556m23690l96200k2857L82313
35619b75559L81454K6007k70923l36319l30868l16499j46441J52709K62884K2393
35609h31162k67277k11518J54663M44362M39046K97299K39131K34630J09280j61540
$$ plain form
35679 -570697 -630992 -358000 -213226 -370521 -277045 414722 1088096 974218 296481 -79124
35669 -79124 139924 489889 617194 630083 602730 375135 -38176 -360221 -508164 -695170
35659 -695170 -950416 -971560 -636824 -284214 -256437 -459481 -584116 -524855 -377477 -216446
35649 -216446 -71517 1027 -32371 -147342 -328412 -546288 -653398 -484631 -103300 233371
35639 233371 383821 405360 329096 116140 -120352 -156124 -28427 -59281 -338307 -485189
35629 -485189 -170584 382356 702448 665482 467431 184875 -238815 -635015 -657872 -275559
35619 -275559 105895 131902 -139021 -475340 -806208 -1122707 -1269148 -1116439 -853555 -831162
35609 -831162 -1098439 -1309957 -1155294 -710932 -271886 25413 264544 499174 608454 446914
35599D46914l94171m13238k42100n0548N5679J43079L08440M64075L90916O6482
35589G75528k00275j25858J45130K19520Q844j71200j08363K039p0096j82706
35579B92563o2705K14759K97432M6254l08726m81210l77826o6126K80816M25026
35569B60257K75802O3139Q3553K73888K73624o2157m51299n49460l17240M3396
35559a06497L17755L64494J63839j16415k42709j76334q9965r7923j29852j07588
35549b21195p3537q2391j07260r6554j1722J68767L47586L05394K2560j14011
$$ plain form
35599 446914 52743 -360495 -602595 -653143 -597464 -454385 -145945 318130 709046 775528
35589 775528 575253 449395 594525 814045 822889 651689 543326 545365 475269 292563
35579 292563 229858 444617 742049 788303 479577 -1633 -379459 -445585 -164769 260257
35569 260257 536059 599198 682751 956639 1230263 1168106 716807 167347 -149893 -106497
35559 -106497 211258 575752 739591 623176 380467 204133 114168 16245 -113607 -221195
35549 -221195 -294732 -377123 -484383 -580937 -592659 -423892 -76306 229088 251648 137637
$$ [...]
##END NTUPLES=NMR SPECTRUM
##END=
