##TITLE=31Pdec_ADM2905
 CDCl3, 24 sc
 29.5.2019
##JCAMPDX= 6.0         $$ Bruker NMR JCAMP-DX V2.0
##DATA TYPE= NMR SPECTRUM
##DATA CLASS= NTUPLES
##ORIGIN= UXNMR, Bruker Analytische Messtechnik GmbH
##OWNER= root
$$ XWIN-NMR		Version 3.5
$$ Wed May 29 15:58:39 2019 Russian Standard Time (UT+4h)  she@DPX200
##.OBSERVE FREQUENCY= 81.013821
##.OBSERVE NUCLEUS= ^31P
##.ACQUISITION MODE= SIMULTANEOUS
##.ACQUISITION SCHEME= undefined
##.AVERAGES= 24
##.DIGITISER RES= 17
##SPECTROMETER/DATA SYSTEM= spect
##.PULSE SEQUENCE= zgpg30
##.SOLVENT NAME= DMSO
##.SHIFT REFERENCE= (INTERNAL, DMSO, 0, 182.463)
##AUDIT TRAIL= $$ (NUMBER, WHEN, WHO, WHERE, WHAT)
$$ ##TITLE= Audit trail, XWIN-NMR		Version 3.5
$$ ##JCAMPDX= 5.01
$$ ##ORIGIN= Bruker BioSpin GmbH
$$ ##OWNER= she
$$ F:/spectra/data/she/nmr/P31/1/pdata/1/auditp.txt
$$ ##AUDIT TRAIL=  $$ (NUMBER, WHEN, WHO, WHERE, WHAT)
(   1,<2019-05-29 15:57:48.76 +0400>,<she>,<DPX200>,
      <created by zg, POWCHK disabled, PULCHK disabled
       configuration hash MD5:
       00 E9 B6 7A A2 85 ED C7 34 08 36 98 17 FE 4E 26
       data hash MD5: 32K
       C1 95 15 39 3D 10 2C 50 0A 54 BE 16 99 14 4D D5>)
(   2,<2019-05-29 15:57:51.79 +0400>,<she>,<DPX200>,
      <Start of raw data processing
       efp BC_mod = 2 LB = 1 FT_mod = 6 PKNL = 1 PHC0 = -2145.352 PHC1 = -3.800903 SI = 64K 
       data hash MD5: 64K
       87 0B DA 3B AE C5 D8 C9 60 15 9F 14 F9 42 93 8E>)
(   3,<2019-05-29 15:58:06.32 +0400>,<she>,<DPX200>,
      <pk PHC0 = 2.204412 PHC1 = 0 
       data hash MD5: 64K
       53 9F 30 21 76 9A 2D B7 FD 92 FC 99 30 16 9E B2>)
(   4,<2019-05-29 15:58:09.89 +0400>,<she>,<DPX200>,
      <abs ABSG = 5 
       data hash MD5: 64K
       CB F2 66 45 FD 79 50 59 1D C6 C2 68 CA 97 EC F8>)
$$ ##END=
$$ 
$$ hash MD5
$$ 48 42 FB DC 34 3F DE 5F 92 2D 65 41 D1 E5 BE E8
##$RELAX= 
##$RELAX= 
##$RELAX= 
##$RELAX= 
##$RELAX= 
##$RELAX= 
##$RELAX= 
##$RELAX= 
$$ Bruker specific parameters
$$ --------------------------
##$DU= <F:/spectra>
##$EXPNO= 1
##$NAME= <P31>
##$PROCNO= 1
##$TYPE= <nmr>
##$USER= <she>
##$AMP= (0..31)
100 100 100 100 100 100 100 100 100 100 100 100 100 100 100 100 100 100 
100 100 100 100 100 100 100 100 100 100 100 100 100 100 
##$AQSEQ= 0
##$AQ_mod= 1
##$AUNM= <au_zg>
##$AUTOPOS= <>
##$BF1= 81.014009
##$BF2= 200.13
##$BF3= 200.13
##$BF4= 200.13
##$BF5= 200.13
##$BF6= 200.13
##$BF7= 200.13
##$BF8= 200.13
##$BYTORDA= 1
##$CFDGTYP= 0
##$CFRGTYP= 5
##$CHEMSTR= <none>
##$CNST= (0..31)
1 1 145 1 1 1 1 1 1 1 1 1 1 1 1 1 1 1 1 1 1 1 1 1 1 1 1 1 1 1 1 1 
##$CPDPRG= <waltz16>
##$CPDPRG1= <>
##$CPDPRG2= <waltz16>
##$CPDPRG3= <>
##$CPDPRG4= <mlev>
##$CPDPRG5= <mlev>
##$CPDPRG6= <mlev>
##$CPDPRG7= <mlev>
##$CPDPRG8= <mlev>
##$CPDPRGB= <>
##$CPDPRGT= <>
##$D= (0..31)
0 1 0 0 0 0 0 0 0 0 0 0.03 2e-05 3e-06 0 0 0 0 0 0 0 0 0 0 0 0 0 0 0 0 
0 0 
##$DATE= 1559131068
##$DBL= (0..7)
120 120 120 11 120 120 24 19 
##$DBP= (0..7)
150 150 150 150 150 150 150 150 
##$DBP07= 0
##$DBPNAM0= <>
##$DBPNAM1= <>
##$DBPNAM2= <>
$$ [...]
##$SUBNAM3= <"">
##$SUBNAM4= <"">
##$SUBNAM5= <"">
##$SUBNAM6= <"">
##$SUBNAM7= <"">
##$SUBNAM8= <"">
##$SUBNAM9= <"">
##$SW= 369.568048894756
##$SWIBOX= (0..15)
0 1 3 0 0 0 0 0 0 0 0 0 0 0 0 0 
##$SW_h= 29940.119760479
##$TD= 32768
##$TD0= 1
##$TE= 0
##$TE2= 300
##$TE3= 300
##$TEG= 300
##$TL= (0..7)
0 120 53 12 22 120 120 120 
##$TP= (0..7)
150 150 150 150 150 150 150 150 
##$TP07= 0
##$TPNAME0= <>
##$TPNAME1= <>
##$TPNAME2= <>
##$TPNAME3= <>
##$TPNAME4= <>
##$TPNAME5= <>
##$TPNAME6= <>
##$TPNAME7= <>
##$TPOAL= (0..7)
0.5 0.5 0.5 0.5 0.5 0.5 0.5 0.5 
##$TPOFFS= (0..7)
0 0 0 0 0 0 0 0 
##$TUNHIN= 0
##$TUNHOUT= 0
##$TUNXOUT= 0
##$USERA1= <user>
##$USERA2= <user>
##$USERA3= <user>
##$USERA4= <user>
##$USERA5= <user>
##$V9= 5
##$VALIST= <valist>
##$VCLIST= <CCCCCCCCCCCCCCC>
##$VD= 0
##$VDLIST= <DDDDDDDDDDDDDDD>
##$VPLIST= <PPPPPPPPPPPPPPP>
##$VTLIST= <TTTTTTTTTTTTTTT>
##$WBST= 1024
##$WBSW= 4
##$XGAIN= (0..3)
0 0 0 0 
##$XL= 0
##$YL= 0
##$YMAX_a= 22594
##$YMIN_a= -25338
##$ZGOPTNS= <>
##$ZL1= 120
##$ZL2= 120
##$ZL3= 120
##$ZL4= 120
##$ABSF1= 182.463
##$ABSF2= -187.1042
##$ABSG= 5
##$ABSL= 3
##$ALPHA= 0
##$AQORDER= 0
##$ASSFAC= 0
##$ASSFACI= 0
##$ASSFACX= 0
##$ASSWID= 0
##$AUNMP= <proc_1d>
##$AZFE= 0.1
##$AZFW= 0.5
##$BCFW= 0
##$BC_mod= 2
##$BYTORDP= 0
##$COROFFS= 0
##$CY= -3
##$DATMOD= 1
##$DC= 0
##$DFILT= <>
##$DTYPP= 0
##$F1P= 0
##$F2P= 0
##$FCOR= 1
##$FTSIZE= 65536
##$FT_mod= 6
##$GAMMA= 0
##$GB= 0
##$INTBC= 1
##$INTSCL= 5.30512e-09
##$ISEN= 30
##$LB= 1
##$LEV0= 0
##$LPBIN= 0
##$MAXI= 10000
##$MC2= 0
##$MEAN= 0
##$ME_mod= 0
##$MI= 50
##$NCOEF= 0
##$NC_proc= -5
##$NLEV= 6
##$NOISF1= 182.463
##$NOISF2= 159.3651
##$NSP= 0
##$NTH_PI= 0
##$NZP= 0
##$OFFSET= 182.463
##$PC= 4
##$PHC0= -2143.148
##$PHC1= -3.800903
##$PH_mod= 1
##$PKNL= yes
##$PPARMOD= 0
##$PSCAL= 0
##$PSIGN= 0
##$REVERSE= no
##$SF= 81.0140089999434
##$SI= 65536
##$SIGF1= 159.3651
##$SIGF2= -187.1042
##$SINO= 113.3802
##$SIOLD= 16384
##$SREGLST= <1H.CDCl3>
##$SSB= 0
##$STSI= 65536
##$STSR= 0
##$SW_p= 29940.119760479
##$SYMM= 0
##$S_DEV= 0
##$TDeff= 32768
##$TDoff= 0
##$TI= <>
##$TILT= no
##$TM1= 0
##$TM2= 0
##$TOPLEV= 0
##$USERP1= <user>
##$USERP2= <user>
##$USERP3= <user>
##$USERP4= <user>
##$USERP5= <user>
##$WDW= 1
##$XDIM= 65536
##$YMAX_p= 325692875
##$YMIN_p= -6968038
$$ End of Bruker specific parameters
$$ ---------------------------------
##NTUPLES= NMR SPECTRUM
##VAR_NAME=  FREQUENCY,     SPECTRUM/REAL,   SPECTRUM/IMAG
##SYMBOL=    X,             R,               I
##VAR_TYPE=  INDEPENDENT,   DEPENDENT,       DEPENDENT
##VAR_FORM=  AFFN,          ASDF,            ASDF
##VAR_DIM=   65536,         65536,           65536
##UNITS=     HZ,            ARBITRARY UNITS, ARBITRARY UNITS
##FACTOR=    0.456856943014862, 1,           1
##FIRST=     14782.0589164792, 0,            0
##LAST=      -15158.0608439998, 0,           0
##MIN=       -15158.0608439998, -6968038,    0
##MAX=       14782.0589164792, 325692875,    0
$$ Real data points
##PAGE= N=1
##DATA TABLE= (X++(R..R)), XYDATA
$$ [...]
41270C39488k04248j01298K0881K44368N04170M22654p3740m85056m45325k44504
$$ 339488 135240 33942 54823 299191 803361 1226015 1152275 667219 221894 -22610
41260b2610k98142m93729m13102O5372O31963Q26290M00813l52858p24803l87681
$$ -22610 -320752 -814481 -1227583 -1162211 -530248 296042 696855 343997 -380806 -768487
41250g68487R6225O1697k12785J6306O00427N95196j94464p89566n03126J07513
$$ -768487 -672262 -610565 -823350 -807044 -206617 388579 194115 -595451 -1098577 -991064
41240i91064K62959J06204J82451M42581M75714K64406M1453k59286p91193j258172
$$ -991064 -728105 -621901 -439450 3131 478845 743251 784704 525418 -265775 -1523947
41230a523947j118755k47534Q85151J555292J238602R4621r20053r29010k34746
$$ -1523947 -2642702 -2890236 -2005085 -449793 788809 883430 -36623 -965633 -1200379
41221a200379Q5385k06937j82599O18957J236450P04611m17746q86875n30221
$$ -1200379 -1114994 -1321931 -1504530 -885573 350877 1055488 637742 -249133 -779354
41212g79354j39073l1364J85327N82350O72760K70687k25725n06977o34991n99082
$$ -779354 -918427 -949791 -764464 -182114 490646 761333 535608 28631 -606360 -1205442
41202a205442k42476K64086M56478K21529n8425q3783P0281K71273M83689N42092
$$ -1205442 -1447918 -1183832 -727354 -505825 -564250 -648033 -577752 -306479 177210 719302
41192G19302K12742l76211o96466l70423L97048R72763Q11708m2141q73105r51935
$$ 719302 932044 555833 -140633 -511056 -114008 858755 1670463 1628322 755217 -196718
41182a96718l91053Q425j07525k05627J47484N10331L22090j46368k82880j01626
$$ -196718 -587771 -579346 -686871 -892498 -745014 -234683 87407 -58961 -341841 -443467
41172d43467J1080Q5359L07082L66499n5121m81242k67297K29455J19780n32956
$$ -443467 -432387 -347028 -39946 326553 271432 -209810 -477107 -247652 -127872 -660828
41162f60828p46368j21661O71261R51041O59961m5836q87496j148552k92377J012289
$$ -660828 -1407196 -1528857 -857596 93445 753406 707570 -179926 -1328478 -1620855 -608566
41152f08566J457450P71557j15815n47158o67461n15784J03338P15915N13254
$$ -608566 848884 1620441 1504626 957468 290007 -225777 -122439 593476 1106730
41143A106730k00240l21357Q9535j53101r98930q51365N78481J251190l483j297527
$$ 1106730 906490 585133 674668 521567 -477363 -1328728 -750247 500943 497460 -800067
41133h00067n84143R84367R42126n05316j031937p3480N68937j9229n71709r8826
$$ -800067 -1384210 -399843 542283 36967 -994970 -1068450 -499513 -518742 -1090451 -1189277
41123a189277N65167M92046J37370J38379R3739m46164q98513n32331L72709J016452
$$ -1189277 -624110 -132064 5306 143685 237424 -208740 -1107253 -1639584 -1266875 -250423
41113b50423J058861N71763k73578r98008j015433m52528m9258J7377K89835P42530
$$ -250423 808438 1380201 1106623 108615 -906818 -1359346 -1408604 -1391227 -1101392 -358862
41103c58862N38393l66724o54486L87939J453093R77231n28489j264203p07480
$$ -358862 179531 -187193 -841679 -453740 999353 1976584 1448095 183892 -523588
41094e23588J3373O4875j57895j29316j5469o7046j13482m3576p4312j92785L1690
$$ -523588 -510215 -445340 -603235 -732551 -748020 -815066 -928548 -972124 -1046436 -1239221 -1207531
41083a207531O92506J154065Q68955J77533j83325q3693o978j90008k96368n5316
$$ -1207531 -515025 639040 1507995 1685528 1502203 1418510 1411532 1221524 925156 869840
41073H69840K18107P2741l33748l78793J06733M99958K37565l22509l51531K66829
$$ 869840 1087947 1160688 826940 448147 554880 1054838 1292403 969894 618363 885192
41063H85192P41403M62677j97208m58628j73422R5424q8869m75040m86259L1154
$$ 885192 1626595 2089272 1892064 1433436 1260014 1355438 1266569 791529 305270 336424
41053C36424N88367O21879J59492k78289m01730m27802n25677m54967j05027O6829
$$ 336424 924791 1546670 1706162 1427873 1026143 598341 72664 -382303 -487330 -420501
41043d20501k86278o39561k61154N57585P87542J69018m43439m00283n5214P0208
$$ -420501 -706779 -1346340 -1607494 -1049909 -262367 -93349 -536788 -937071 -992285 -922077
41033i22077J05798L41996N85840N33482K74344k3600m26085q06251o62361J19950
$$ -922077 -816279 -474283 111557 645039 919383 895783 469698 -336553 -998914 -878964
41023h78964Q17655P42974J59819j94543j06268J20328K70530K66311m1800n71168
$$ -878964 -61309 681665 841484 646941 540673 661001 931531 1197842 1156042 584874
41013E84874q08355m49744O0041J36233j31328k86043k54214k11559p2469K41269
$$ 584874 -223481 -673225 -613184 -476951 -608279 -894322 -1148536 -1360095 -1432564 -1191295
41003a191295L49920o9657n77481m85482J12092N04765M06039J72607J18741K31000
$$ -1191295 -841375 -911032 -1488513 -1973995 -1861903 -1357138 -951099 -778492 -659751 -428751
40993d28751M30617N45622K21148n48578j057849p19158K4363L37040K18924K42071
$$ -428751 1866 547488 768636 220058 -837791 -1556949 -1532586 -1195546 -976622 -734551
40983g34551L69081Q0858m58378m87876N1754M00649L09047L80717P95532P80877
$$ -734551 -365470 -284612 -742990 -1230866 -1179112 -778463 -469416 -88699 706833 1487710
40973A487710j29168j205953j478160q94212o8306N06691O05642K68353j604L15110
$$ 1487710 1358542 152589 -1325571 -2219783 -2288089 -1781398 -1175756 -907403 -909007 -593897
40963e93897Q39176O22973k89288o12930K91741J262663R20533l71980j138401
$$ -593897 245279 868252 578964 -33966 257775 1520438 2440971 2068991 930590
40954I30590q32693k13885J1357q5943k08303k54018j32937J95324M56538L45879
$$ 930590 97897 -115988 -104631 -190574 -398877 -652895 -785832 -590508 -133970 211909
40944B11909M2285n0972n906k63848q13519j005878l67849P25599J368679R98380
$$ 211909 254194 203222 197316 -66532 -880051 -1885929 -2253778 -1528179 -159500 838880
40934H38880n8230q37865o50580J93101P43968N31023j5740l30623l92226l65779
$$ 838880 780650 -57215 -707795 -514694 229274 760297 744557 413934 21708 -344071
40924c44071j06506M65558Q74488N92381j20540m34450J07O38069P18917Q3038
$$ -344071 -450577 14981 889469 1481850 1361310 926860 926967 1565036 2283953 2366991
40914B366991p26005j030859p06698l00364l18359n09498k54084L97451O99110
$$ 2366991 1640986 610127 -96571 -396935 -715294 -1224792 -1478876 -1081425 -382315
40905c82315L48183n5342N768K29476J85372M5971O2453k1635l52853l96608K15045
$$ -382315 -34132 -89474 -83706 145770 331142 377113 439566 417931 65078 -331530 -116485
40894a16485Q28225O61735O1530j46863j23380o26600j393048j265492r3362P68547
$$ -116485 711740 1373475 1435005 1288142 1164762 538162 -854886 -2120378 -2213740 -1445193
40884a445193L40013o15619p38189J31815R79905J023162M86609J00955J94591
$$ -1445193 -1105180 -1720799 -2458988 -2327173 -1347268 -324106 162503 263458 458049
40875D58049L57416K5935o23838p58567j26029L60014q2686p62147m58175O27200
$$ 458049 815465 841400 217562 -541005 -667034 -307020 -389706 -1151853 -1610028 -982828
40865i82828J090757M56296k31016j88659K6789k38006n95771m74676j28638L9781
$$ -982828 107929 564225 333209 144550 171339 -66667 -662438 -1137114 -1265752 -1225971
40855a225971L12507R02829J114547K91681r07945j222684m64736M09733O44945
$$ -1225971 -913464 -10635 1103912 1395593 487648 -735036 -1199772 -790039 -145094
40846a45094K76323l40089p47045m07090O13506J238240O15393m72017n33218
$$ -145094 131229 -208860 -955905 -1362995 -749489 488751 1104144 632127 98909
40837I8909M26825R26100L36362k49797Q946K86985l78478j292687j150980j52189
$$ 98909 525734 1451834 1788196 1538399 1547345 1834330 1455852 163165 -987815 -1140004
40827a140004L72072R4278k1210M04753M69255l49947j076781o22058N51876J088457
$$ -1140004 -767932 -673654 -694864 -290111 179144 -170803 -1247584 -1869642 -1317766 -229309
40817b29309N62732k31803n27876k89805J78221N62409N11327m1814n27104l36741
$$ -229309 333423 101620 -426256 -716061 -537840 24569 535896 494082 -33022 -369763
40807c69763K53533M41124J37853K9257L19089L81172l4161k62720L7543R3537
$$ -369763 -116230 324894 462747 492004 811093 1192265 1158104 895384 932927 1026464
40797A026464o75348j370302p66944P24338J464257Q09672j89521m02704P1257
$$ 1026464 351116 -1019186 -1786130 -1061792 402465 1212137 1022616 619912 691169
40788F91169M72917M49308J72993o8335j08780o7290l04703q33792r61428j70001
$$ 691169 1164086 1613394 1786387 1718052 1609272 1541982 1237279 403487 -557941 -727942
40778g27942Q17925P69870k23695o87963J36834J154436R95099r8415p96851n40783
$$ -727942 89983 859853 636158 -51805 85029 1239465 2234564 2136149 1339298 798515
40768G98515K3875K11683O7672n1048l6112J5572M9744O1629j4131k76984o56303
$$ 798515 822390 1034073 1101745 1050697 1014585 1030157 1079901 1141530 1127399 850415 194112
40757A94112p66057k15835P46740J226729P34096m5221j33755L23825L45772k88535
$$ 194112 -571945 -787780 -41040 1185689 1919785 1874564 1740809 2064634 2410406 2121871
40747B121871p21630m52770n3641n9093j29435J02891K50936l6575k83628j0514
$$ 2121871 1400241 947471 893830 834737 705302 808193 1059129 1022554 738926 728412
40737G28412L10394K1407n26779m96917R4071M89613L91798J49623p0407m15531
$$ 728412 1038806 1060213 533434 36517 130588 620201 1011999 1161622 1091215 675684
40727F75684p20266n86999j31246P6008j23688k97554j65495O6068J85092K51989
$$ 675684 -44582 -631581 -762827 -686819 -810507 -1108061 -1273556 -1207488 -1022396 -770407
40717g70407K97358J86513j10199m13767n10595k43797L70389R00842P55020K1736
$$ -770407 -473049 -286536 -396735 -810502 -1321097 -1564894 -1194505 -293663 461357 483093
40707D83093m05839k7085M74133K68346l41749n10624k24036q6541j13002J39964
$$ 483093 77254 50169 524302 792648 450899 -59725 -283761 -370302 -483304 -343340
40697c43340M59846K03853m18639n18972o0778M0073m33707n51546J21542O83977
$$ -343340 116506 320359 -98280 -617252 -678030 -637957 -1071664 -1623210 -1501668 -817691
40687h17691L69344k33527k43847J35112J92417n1982r0320J13988K47583L19028
$$ -817691 -448347 -681874 -925721 -790609 -598192 -650174 -740494 -626506 -378923 -59895
40677e9895M47696L39158k80630r67969r96777l39212L51169N82359L74317m0488
$$ -59895 387801 726959 446329 -521640 -1518417 -1857629 -1506460 -924101 -549784 -590272
40667e90272m06172m97268l61116l12265m00444k22787L91208R27018Q80501N17178
$$ -590272 -996444 -1493712 -1854828 -2167093 -2567537 -2790324 -2399116 -1472098 -591597 -74419
40657g4419M04421N22037M17859o747m34431o55820o49213l64577O4911J61445
$$ -74419 330002 852039 1269898 1263151 828720 172900 -476313 -840890 -775979 -614534
40647f14534k80341o73207l64807L43853O12742L23480J24290K56048K04403k92203
$$ -614534 -894875 -1568082 -1932889 -1589036 -976294 -652814 -528524 -272476 -68073 -360276
40637c60276o91446m85372L1422K82649K34516K21024K76620J56014j19556j90342
$$ -360276 -1051722 -1537094 -1505672 -1223023 -988507 -767483 -490863 -334849 -454405 -644747
40627f44747J41669O42801R34388Q31924L51084l69643r67813q93847M6391J145012
$$ -644747 -503078 139723 1074111 1906035 2257119 1887476 919663 25816 72207 1217219
40617A217219J239450K7673j374370j614184o15191N63077J108909J021312M86729
$$ 1217219 2456669 2484342 1109972 -504212 -1119403 -556326 552583 1573895 2060624
40608B060624l63646r94582p74134m6390J01452m43224m71985N03706J125575
$$ 2060624 1696978 702396 -71738 -118128 -16676 -459900 -931885 -428179 697396
40599F97396K34592j076861j003300J85643P12337K13503O9756P61201R71206
$$ 697396 931988 -144873 -1148173 -962530 -250193 -36690 33066 794267 1765473
40590A765473m6519j042924p37026K53987O31670M08584M02102O02597L75105
$$ 1765473 1718954 676030 -60996 192991 824661 1233245 1635347 2237944 2613049
40581B613049k52981p05981q78222r79357p51922N6628P56326M33817n18704p66148
$$ 2613049 2360068 1654087 775865 -203492 -955414 -898786 -142460 291357 -227347 -993495
40571i93495L6639Q06390P22334K56166J00059N4293l50162q14161o27632K47622
$$ -993495 -956856 -150466 571868 828034 928093 982386 632224 -181937 -809569 -561947
40561e61947J068725J187784O38382r9192o23873q58513q86869o64928r6921N26244
$$ -561947 506778 1694562 2332944 2233752 1609879 751366 -135503 -800431 -897352 -371108
40551c71108N42372k31881r54887o44127N16951J361896J180153L45633m48287
$$ -371108 171264 -60617 -1015504 -1659631 -1142680 219216 1399369 1745002 1296715
40542A296715q29935n77680L04668J078611P39369n42594j292780o52178L84897
$$ 1296715 466780 -110900 193768 1272379 2011748 1469154 176374 -475804 -90907
40533i0907M38441k99572o02404j53637K57483K39279K38298M24716L34785p7774
$$ -90907 347534 47962 -554442 -708079 -450596 -211317 26981 451697 786482 708708
40523G08708j23881L99557O45522M9306o04748l25662M69905N21299l53747r65901
$$ 708708 584827 984384 1629906 1679212 1074464 748802 1218707 1740006 1386259 420358
40513D20358n04341L50755N04200m2804m13217k36041m0951k32271l89123j5558
$$ 420358 -83983 266772 770972 728168 314951 78910 37959 -194312 -583435 -598993
40503e98993N05109M02864k02340l41749L05714P94846L24161m58152m09716L25936
$$ -598993 -93884 308980 106640 -235109 70605 865451 1189612 731460 321744 647680
40493F47680N71778q28m11924j6166M84642K14572n47297r09184o40407j99618
$$ 647680 1219458 1218630 806706 790540 1275182 1489754 942457 33273 -607134 -806752
40483h06752R5499K68510L28537K66216J95571J02092k38873p17178p05576O6593
$$ -806752 -711253 -442743 -114206 152010 347581 449673 210800 -506378 -1211954 -1145361
40473a145361Q82832Q86762K08095l69548n15334m52398k71689R9982M44008M73833
$$ -1145361 -262529 624233 832328 462780 -52554 -504952 -776641 -676659 -232651 241182
40463B41182L56587L78579L49789L5361j63514J74105N08609J6063r49750j221413
$$ 241182 597769 976348 1326137 1361498 1197984 1372089 1880698 1896761 947011 -274402
40453b74402n85900L5402K30624N62193J099080R21748k53029j220428r35343
$$ -274402 -860302 -824900 -594276 -32083 1066997 1988745 1735716 515288 -420055
40444d20055J871M09081J85425l2012q8218j72975r2314L16596N46888J45311
$$ -420055 -418184 -9103 176322 144310 56092 -116883 -209197 107399 654287 799598
40434G99598l90637l50986L6014J39571R8063L73560N98325J16243o15419n12947
$$ 799598 408961 57975 93989 233560 331623 705183 1303508 1419751 804332 291385
40424B91385L19674O23702l7359o66748n26607j62068j94682k55514J29402N43685
$$ 291385 611059 1234761 1197402 530654 4047 -158021 -352703 -608217 -478815 64870
40414F4870M39063J63301L20923O31939L64394l92567p86293m58290K1981N3694
$$ 64870 503933 667234 988157 1620096 1984490 1591923 805630 347340 369321 423015
40404D23015k82967n64461n81205l39086J28308O74062R75576Q31528M52593K33200
$$ 423015 140048 -424413 -1005618 -1344704 -1216396 -542334 433242 1264770 1717363 1950563
40394A950563K25109O0460m70192r62593q35016j76612K53371M1247k74371J1900
$$ 1950563 2175672 2236132 1765940 803347 -31669 -208281 45090 86337 -188034 -176134
40384a76134O75500P96380L9384q35670r22412k59786L02045J77468k72562k22257
$$ -176134 499366 1295746 1335130 499460 -422952 -682738 -380693 -203225 -475787 -698044
40374f98044N29323J179880Q72492j32248p15781l71527K05384K58941L132k8264
$$ -698044 -168721 1011159 1883651 1751403 1035622 664095 869479 1128420 1131552 1103288
40364A103288L825k93557n66555k26602L30120J62981n75931o54849L18487J158091
$$ 1103288 1107113 813556 247001 20399 350519 513500 -62431 -717280 -398793 759298
40354G59298Q30984r4682n00146l76399m60921p62674n49894L13560R87342Q06697
$$ 759298 1590282 1495600 995454 619055 158134 -604540 -1154434 -840874 146468 953165
40344I53165J40471k13594p3182L7089l15578q60189q97209j36437Q69398J251583
$$ 953165 1093636 880042 806860 843949 528371 -331818 -1229027 -1365464 -496066 755517
40334G55517P14867k64287j030379j268561r96998m17751J42471M36724N21827
$$ 755517 1470384 1206097 175718 -1092843 -2089841 -2507592 -2365121 -1928397 -1406570
40325a406570N63951M96198K03034q7284j00262j09283n56149j061759o72658
$$ -1406570 -842619 -346421 -143387 -230671 -330933 -440216 -996365 -2058124 -2730782
40316b730782O15597J456384Q57142m20433r01850l12473L75214M59749J90376
$$ -2730782 -2115185 -658801 198341 -222092 -1123942 -1436415 -1061201 -601452 -411076
40307d11076K4234R744K5530M4775K2018o9000n1793K04211L92799R2522n33824
$$ -411076 -386842 -377098 -351568 -306793 -284775 -353775 -405568 -201357 191442 283964 -249860
40296b49860q65806o95531m40130l66778j79307L35002P56090N85997M0624j98660
$$ -249860 -1115666 -1811197 -2251327 -2618105 -2797412 -2462410 -1706320 -1120323 -1079699 -1278359
40286a278359J15662N74268P22539M90551K4511m79087o85455l20907L18517M95563
$$ -1278359 -1162697 -588429 134110 624661 649172 170085 -515370 -836277 -517760 -22197
40276b2197L0351k50867L70009J264893J134556j47640j263046j214941m71346
$$ -22197 8154 -242713 127296 1392189 2526745 2379105 1116059 -98882 -570228
40267e70228P2295L64483P20496Q47697L11290n01887q37323o55948l80478L5358
$$ -570228 -497933 -133450 587046 1434743 1746033 1244146 406823 -249125 -629603 -594245
40257e94245P43288J081095K98540r44902j182766l07116K76874j05192m88672
$$ -594245 149043 1230138 1528678 583776 -598990 -906106 -629232 -734424 -1223096
40248a223096j07237L44447J01882l21887j89706J49841Q8473l8676K95713O61583
$$ -1223096 -1330333 -985886 -884004 -1205891 -1395597 -1245756 -1157283 -1195959 -900246 -238663
40238b38663M36192K1188J00720L00702j36709q29323p61363k5057L02686n1647
$$ -238663 197529 218717 319437 620139 483430 -345893 -1107256 -1132313 -829627 -881274
40228h81274j90906L90161J007444Q62523O9180o86262r07813n61502m2485J56267
$$ -881274 -1072180 -682019 325425 1187948 1257128 570866 -336947 -898449 -940934 -784667
40218g84667R6309L87092J085330J229848K61267p76189n96117L03199L75791
$$ -784667 -688358 -301266 784064 2013912 2275179 1498990 902873 1206072 1581863
40209A581863n06880r05603j60443P04129P62590L91617J32107k75546r36094
$$ 1581863 1074983 169380 8937 713066 1475656 1867273 1999380 1723834 787740
40200G87740j078531k82736M77830J01753r13920j080266n0J097430R89132k4336
$$ 787740 -290791 -573527 -95697 6056 -907864 -1988130 -1988180 -890750 98382 74046
40190G4046n56910J09962J066698Q74877m71850j372684p65871L66260M96513
$$ 74046 -482864 -372902 693796 1568673 1096823 -275861 -1041732 -675472 -178959
40181a78959j63349j92901O19297R86624L19966l84481k96200M1448q9153m12305
$$ -178959 -342308 -535209 84088 1070712 1390678 1006197 709997 751445 662292 249987
40171B49987m49599m08203m97115l05570L56392Q47842O56831J68413j50955m32862
$$ 249987 -199612 -607815 -1104930 -1410500 -1054108 -206266 450565 618978 468023 35161
40161C5161o45821k18878P71920J136575K84229o30592m00553L80549M41443q7775
$$ 35161 -610660 -829538 -57618 1078957 1363186 732594 332041 712590 1154033 1066258
40151A066258j95276J18360N6683l20581k56530J49039R3845l30550k14591M52621
$$ 1066258 870982 989342 1046025 725444 468914 617953 711798 381248 166657 619278
40141F19278N96869k04978j096912j290392q71654j10589Q16582J254406N50919
$$ 619278 1216147 1011169 -85743 -1376135 -2247789 -2358378 -1541796 -287390 263529
40132B63529n90761o13410O00299J330910N44658n97768o50302K1876K53746J03732
$$ 263529 -327232 -940642 -340343 990567 1535225 937457 287155 309031 562777 666509
40122F66509M12141J022514R56314R6563o44130p80303o89704n60313p8557N93864
$$ 666509 1078650 2101164 3057478 3154041 2509911 1729608 1039904 479591 401034 994898
40112I94898O40559j27675p22628l39410M50161N95958J14314j33901Q6988J13188
$$ 994898 1635457 1507782 785154 445744 895905 1491863 1606177 1472276 1559264 1672452
40102A672452l56679o46530j89066M50994L24494m63914q15739j53853P55436
$$ 1672452 1315773 669243 480177 931171 1255665 791751 -23988 -177841 577595
40093E77595P58115l01170j453306j661133p65601M88268J168426R48783K95223
$$ 577595 1335710 1034540 -418766 -2079899 -2845500 -2357232 -1188806 -240023 55200
40084E5200j36759k01575k07990l08162l05962p6207K22588M50826O26948O54896
$$ 55200 -81559 -283134 -491124 -799286 -1105248 -1181455 -958867 -508041 118907 773803
40074G73803L37144j66186l44355n9305J85058J6696k23142j01698J38603J0960
$$ 773803 1110947 944761 600406 541101 726159 742855 519713 418015 556618 567578
40064E67578l23557k56142K85867O89647N58405K30020J90168L43407J82604m37141
$$ 567578 244021 -12121 273746 963393 1521798 1751818 1941986 2285393 2467997 2030856
40054B030856r92048r16908m15335k77470p38599r86904k98288P56818J045401
$$ 2030856 1038808 121900 -293435 -570905 -1309504 -2296408 -2594696 -1837878 -792477
40045g92477N60142L28436O56321P09260J38299k16934J04720K24555n06565j167536
$$ -792477 -232335 96101 752422 1461682 1599981 1383047 1487767 1712322 1205757 38221
40035C8221p33350J23028J39081m21455l64806K80601M35661J8188M9557O88625
$$ 38221 -695129 -572101 -433020 -854475 -1219281 -938680 -503019 -484831 -435274 253351
40025B53351Q63955J59017m79487l60037j023L2118r516J05923N1241k10215j27560
$$ 253351 1117306 1276323 796836 436799 435776 467894 458378 564301 615542 405327 277767
40014B77767L26885L22773m38740j023284o26800K76137Q05120Q34922O52978
$$ 277767 604652 927425 488685 -534599 -1161399 -885262 -80142 754780 1407758
40005A407758K92357j67186m02116m60489p48156j018287m66005O75456R51318
$$ 1407758 1700115 1532929 1130813 670324 -77832 -1096119 -1562124 -886668 64650
39996F4650j18049j021212n10955M43134L23627m98906o52678j55433n5388k83775
$$ 64650 -53399 -1074611 -1585566 -1142432 -818805 -1317711 -1970389 -2125822 -2181210 -2464985
39986b464985J54821J061825J078110J0749o69426j22320O30977M41887k99637
$$ -2464985 -2310164 -1248339 -170229 -159480 -828906 -951226 -320249 121638 -177999
39977a77999n44803j53183K50827L23782J80947m6192k88298m39653m64551l52194
$$ -177999 -722802 -875985 -625158 -301376 -120429 -166621 -454919 -894572 -1359123 -1711317
39967a711317M9607P19256J058273M72909o04692j029685m46325K67105L08157
$$ -1711317 -1661710 -942454 115819 588728 -15964 -1045649 -1491974 -1224869 -916712
39958i16712l2073m9371K98463M74564J33992n35862r83834o98851K02622Q32351
$$ -916712 -948785 -998156 -699693 -225129 -91137 -626999 -1610833 -2309684 -2107062 -1274711
39948a274711M88455l35357n92603k25512j03398l96287k40623N98432J037519
$$ -1274711 -786256 -1121613 -1714216 -1939728 -2043126 -2439413 -2680036 -2081604 -1044085
39939a044085M04329l45277j94354K13656k06014q58097k78473J262335J797157
$$ -1044085 -639756 -985033 -1179387 -965731 -1171745 -2029842 -2308315 -1045980 751177
39930G51177N50877q60473p94433K16546O15240J58368j21964K32553N46571K64788
$$ 751177 1302054 441581 -352852 -136306 478934 637302 515338 747891 1294462 1559250
39920A559250k51888m40577l28045k40615j98532j6785K24870J88856k65016q42922
$$ 1559250 1307362 866785 538740 298125 99593 82808 307678 496534 231518 -611404
39910f11404j079684p75824j67353L32924N64540P15068R29029R86724O18881
$$ -611404 -1691088 -2466912 -2634265 -2301341 -1736801 -1021733 -92704 894020 1512901
39901A512901N4342j35895J48608K81460k24965r16193r49200l10937J24293j26371
$$ 1512901 1567243 1431348 1579956 1861416 1636451 720258 -228942 -539879 -415586 -541957
39891e41957m37793o0094O56918P14472j3400m99800l4795P11042O34508k29931
$$ -541957 -979750 -1039844 -382926 331546 318146 -181654 -216449 494593 1129101 899170
39881H99170q11673n37305P988J04253j29459j84357j6493J10087K33043M95612
$$ 899170 87497 -449808 -441820 -337567 -467026 -651383 -667876 -557789 -324746 170866
39871A70866O00528J72019m57854n70560j63969L8399k28513m09613j75405N2902
$$ 170866 771394 943413 485559 -85001 -248970 -210571 -439084 -848697 -1024102 -971200
39861i71200J8742J76909P45428J068089O68743J37641Q0968j1724p30856j314184
$$ -971200 -952458 -775549 -30121 1037968 1706711 1844352 1925320 1913596 1182740 -131444
39851a31444o91220N09004O50358l15042o72552L58195J427111J198436K20511
$$ -131444 -822664 -313660 336698 21656 -650896 -292701 1134410 2332846 2553357
39842B553357k53647j27624j06981l51456m86534l70054n8776M49680Q53511O12475
$$ 2553357 2299710 2172086 2065105 1713649 1227115 857061 798285 1247965 2101476 2713951
39832B713951o1375j36736O29284R88294K4182j268811j395303n53622r3232l63678
$$ 2713951 2652576 2515840 3145124 4133418 4157600 2888789 1493486 939864 846632 482954
39822D82954n37066k56448m1096j09778o9871J49526J52893m4522K4067L72130
$$ 482954 -54112 -310560 -351656 -461434 -531305 -381779 -228886 -273408 -249341 122789
39812A22789N19339L76839K96509K75075K1948k43989m9928L22497J41002m50639
$$ 122789 642128 1018967 1315476 1590551 1612499 1368510 1318582 1641079 1782081 1331442
39802A331442n37791J1956K73268j83377o08020l73038Q5651J71465O9263J84660
$$ 1331442 793651 805607 1078875 895498 287478 -85560 91 171556 240819 425479
39792D25479L70646K99332O1885n6231L5754L08656N97162M50558l45243j079550
$$ 425479 796125 1095457 1157342 1101111 1136865 1445521 2042683 2493241 2147998 1068448
39782A068448p85848L10840R42932N55166q9617k79369k24455k05222R86L23828
$$ 1068448 282600 593440 1536372 2091538 2001921 1722552 1498097 1292875 1293861 1617689
39772A617689J52832m86245o04301J72702P82905L56780l67316k91077K84031
$$ 1617689 1770521 1284276 679975 852677 1635582 1992362 1625046 1333969 1618000
39763A618000L16593k44825n93110m56845k50251j55884l7574O689j38806j38185
$$ 1618000 1934593 1689768 1096658 639813 389562 233678 196104 202793 63987 -74198
39753g4198K74271O69153N63672K33262J07574p8860o09954q52140j32655Q86730
$$ -74198 200073 869226 1432898 1666160 1773734 1694874 1084920 232780 100125 986855
39743I86855R54026Q6585n53592n02107m37860p53780r22691n36140O5187M75345
$$ 986855 1940881 2027466 1473874 971767 533907 -219873 -1142564 -1678704 -1613517 -1138172
39733a138172O57397N20465l8969n14470j67610P35881J044958M10235j38315
$$ -1138172 -480775 39690 721 -513749 -681359 54522 1099480 1509715 1371400
39724A371400K06835P91398N65705l44850r51599q13111l30622J18325N78279
$$ 1371400 1578235 2369633 2935338 2590488 1638889 825778 495156 613481 1191760
39715A191760J029087J098309N18960l74752q67031o15812q0553k5084n79588
$$ 1191760 2220847 3319156 3838116 3463364 2596333 1980521 1899968 1874884 1295296
39706A295296j057386q45095j64850L26313L96622L10343K74857K62159K37403
$$ 1295296 237910 -607185 -772035 -445722 -49100 261243 536100 798259 1035662
39697A035662J60811j09122n57253q29499o56443k44598P8013K87457L81523J33752
$$ 1035662 1196473 1087351 530098 -299401 -955844 -1200442 -1122429 -834972 -453449 -319697
39687c19697l64725m31281K57970R18364O64647j51153n16135k94473j55268k43964
$$ -319697 -684422 -1115703 -857733 60631 725278 574125 57990 -236483 -391751 -635715
39677f35715p8589L29116M02028P8019j16284j03882k75974m55874o1660N81540
$$ -635715 -714304 -385188 16840 94859 -21425 -125307 -401281 -857155 -918815 -337275
39667c37275M13432n78998j075387l84824N65985P73741M69694K35407N098k66019
$$ -337275 76157 -502841 -1578228 -1963052 -1397067 -623326 -153632 81775 86873 -179146
39657a79146o6974O35918Q49378k584r94097j026114l76503P4925L03731O88687
$$ -179146 -246120 389798 1239176 1236592 242495 -783619 -1160122 -1085197 -781466 -92779
39647i2779Q67070L07276n04200o58159k13749R5739J36198K46592K37808k94235
$$ -92779 774291 1081567 577367 -80792 -294541 -198802 -62604 183988 421796 127561
39637A27561r17168p90708N117O38216Q40261R60534Q88586J56289q67673j100883
$$ 127561 -789607 -1580315 -1575198 -936982 -96721 863813 1752399 1908688 1041015 -59868
39627e9868k90323N97410P76319M96534K41740k5768m37153p45605o70795k64121
$$ -59868 -350191 247219 1023538 1520072 1761812 1736044 1298891 553286 -117509 -381630
39617c81630K29060M90297K21004l75701m70142L32301J121647Q00150k01321
$$ -381630 -152570 337727 558731 183030 -287112 45189 1166836 1966986 1765665
39608A765665m65273K61723P44948K23917n90840q38343o35857m09517j67328
$$ 1765665 1300392 1562115 2307063 2530980 1940140 1101797 465940 56423 -110905
39599a10905L4470j25318m69750k88216M33542P11919L2272q41481j067345p39706
$$ -110905 -76435 -201753 -671503 -959719 -526177 185742 218014 -623467 -1690812 -2430518
39589b430518j65502P25054J549719J294536q9143j066034n80378L72265M33020
$$ -2430518 -2596020 -1870966 -321247 973289 884146 -181888 -762266 -390001 43019
39580D3019j9012P6092L92468K1818m83398Q1336J186371J120195j95698j045750
$$ 43019 24007 100099 492567 514385 30987 112323 1298694 2418889 2223191 1177441
39570A177441o95554k36189l09538j26423N71582O64584k10433o20670K60618
$$ 1177441 481887 245698 -63840 -190263 381319 1045903 835470 214800 475418
39561D75418R99251K49570q27696m41294P81101Q51796k30100n70061L75433R64505
$$ 475418 1474669 1724239 896543 455249 1236350 2088146 1858046 1287985 1663418 2627923
39551B627923J53777r07730q38208K3197N46222M59209J26493l50445q72485r29512
$$ 2627923 2781700 1873970 1035762 1058959 1605181 2064390 2190883 1840438 967953 38441
39541C8441l23750K72342K43453l6352N9493L11231J57544j62292L7265O20053
$$ 38441 -285309 -12967 230486 194134 253627 564858 722402 560110 597375 1217428
39531A217428P08581L9627o47793p36638m71918l17463k49501p0120J00754Q5441
$$ 1217428 1926009 1965636 1317843 581205 109287 -208176 -457677 -527797 -427043 -341602
39521c41602L4249J29424J84245k5286k29914L7525O60952R40525M96352k23356
$$ -341602 -307353 -177929 6316 -18970 -248884 -211359 449593 1390118 1886470 1663114
39511A663114n59549m46462k84388k56552k13258j44583k55019m62234l22141
$$ 1663114 1103565 657103 372715 116163 -97095 -241678 -496697 -958931 -1281072
39502a281072K59470O64623L41416l56414o11149k29332K60561M86274N76106
$$ -1281072 -1021602 -356979 -15563 -371977 -983126 -1212458 -951897 -465623 110483
39493A10483N90933K83795l30221p31748n71672j47300J32999L29501O13793P38756
$$ 110483 701416 985211 654990 -76758 -648430 -795730 -662731 -333230 280563 1019319
39483A019319L93544j67688l91183j88139N5391J50493K84013N02053M97285Q5772
$$ 1019319 1412863 1245175 853992 665853 721244 871737 1155750 1657803 2155088 2240860
39473B240860m43715o75647n57992l46208j93181l5690J13883L0865l41575n37306
$$ 2240860 1797145 1121498 563506 217298 24117 -11573 102310 133175 -208400 -745706
39463g45706l7359Q21965R69602J8622r70054q07386J82471P43522N74842M39999
$$ -745706 -783065 38900 1008502 1027124 57070 -750316 -567845 175677 750519 1190518
39453A190518M98243J4736r38591j070358N8701J009659O12140j97785p4473M25425
$$ 1190518 1688761 1703497 764906 -305452 -246751 762908 1375048 1177263 1102790 1528215
39443A528215q152r20594q03902J80740L94454m49675q48623j78679L52158M6006
$$ 1528215 1520063 599469 -204433 -23693 370761 -78914 -927537 -1106216 -754058 -708052
39433g08052n5711P22397J222116M19312o70914n78874K89438M77469k03192p25443
$$ -708052 -763763 -41366 1180750 1600062 929148 350274 639712 1117181 913989 188546
39423A88546o68528n27328m94228k33834K18547L95557K18496P5263J67142M10438
$$ 188546 -479982 -1007310 -1501538 -1735372 -1516825 -1121268 -902772 -827509 -660367 -249929
39413b49929P45067R51521N60996l87112r71128n41646K18828K48485l19361m89339
$$ -249929 495138 1446659 2007655 1620543 649415 107769 326597 575082 255721 -233618
39403b33618K0870N29323N25454J52167l06667o11045m11596L16815Q97548P41085
$$ -233618 -212748 316575 842029 994196 687529 76484 -335112 -18297 879251 1620336
39393A620336K16815l781l9715l44576o35179l65382J11088M3760l44035k57383
$$ 1620336 1837151 1833370 1793655 1449079 813900 448518 559606 603366 259331 1948
39383A948J29690o4176p14322p36366L3816N10902K21585K5035M76622Q60962
$$ 1948 131638 67462 -646860 -1383226 -1349410 -838508 -616923 -591888 -115266 745696
39373G45696N33834J285j07526p8260l25492n01579k06256J83942J48303j62026
$$ 745696 1279530 1280815 1173289 1095029 769537 267958 61702 245644 393947 231921
39363B31921l48511l62015j92838K89969P40047M55736l79899n68356L26642J096430
$$ 231921 -116590 -478605 -671443 -381474 358573 814309 434410 -133946 192696 1289126
39353A289126O42779l53715n62240K7987M23172K64456m4114l63039p69883q16810
$$ 1289126 1931905 1578190 1015950 1043937 1467109 1731565 1687451 1324412 554529 -262281
39343b62281l2514R89577J130774L65971j72433J58119P15299O40529k8420o26322
$$ -262281 -294795 694782 1825556 2191527 2019094 2177213 2892512 3533041 3504621 2878299
39333B878299p41080n22123l29709k38148O5373P13174J118537N91784m51395
$$ 2878299 2137219 1615096 1285387 1047239 1112612 1825786 2944323 3536107 3084712
39324C084712p49511N717O07335J88534l94086j0953Q16782P32915l18991j153728
$$ 3084712 2335201 2340918 2948253 3136787 2742701 2731748 3548530 4281445 3962454 2808726
39314B808726j195161r23396o61040k45795J21140j9202l57497j04850N90717
$$ 2808726 1613565 690169 29129 -216666 -95526 -114728 -472225 -577075 13642
39305A3642P38150J77761j15507K83895N55811J42079k62016M4810N49797M12301
$$ 13642 751792 929553 814046 1097941 1653752 1795831 1533815 1578625 2128422 2540723
39295B540723j92748m72920k18964J53089L54305L60894J26141k74897m64706
$$ 2540723 2347975 1875055 1656091 1809180 2163485 2524379 2650520 2375623 1910917
39286A910917j94197K42206L50672j944n54160q95937o68150O8460O03845K65964
$$ 1910917 1716720 1958926 2309598 2307654 1753494 857557 189407 257867 861712 1127676
39276A127676n64240p84842r8275N50192L80416j61989k54786R7026L38921K92784
$$ 1127676 563436 -221406 -319681 230511 610927 448938 194152 291178 630099 922883
39266I22883J38927j12722m91731o95207m00109K47919Q28000J057487P61664
$$ 922883 1061810 949088 457357 -237850 -637959 -390040 437960 1495447 2257111
39257B257111j01891j044374j215172m46947L62379M08085P455p4534K25223M77533
$$ 2257111 2155220 1110846 -104326 -551273 -188894 219191 226646 152112 377335 854868
39247H54868O28972Q58913R19238M49374k51042n34916l63000k49520l82532m84952
$$ 854868 1483840 2342753 3261991 3711365 3460323 2925407 2562407 2312887 1930355 1445403
39237A445403m44971m00292k68959J25207M98393L50601k18957n62533l86010
$$ 1445403 1000432 600140 331181 456388 954781 1305382 1086425 523892 137882
39228A37882k8566J75744K48393K52175J68242J05020J27152n9034o75798j223624
$$ 137882 109316 285060 533453 785628 953870 1058890 1186042 1127008 451210 -772414
39218g72414r62654m9871N48009L88794O3861J69103M79572M74071R5008l50943
$$ -772414 -1735068 -1784939 -1236930 -848136 -784275 -615172 -135600 338471 433479 82536
39208H2536n75123l44094L64318J010648Q48728o4872p34261m53837K80980M82584
$$ 82536 -492587 -836681 -472363 538285 1387013 1322141 587880 134043 415023 897607
39198H97607o5668o36525m47449M92607J274535Q80955n76839j613981r99989
$$ 897607 831939 195414 -252035 240572 1515107 2396062 1819223 205242 -794747
39189g94747N32852J124208L07773m88760k41737K50084q747m82824j98036M57864
$$ -794747 -261895 862313 1170086 681326 439589 689673 680926 198102 66 457930
39179D57930M64487j242j0191K93425k2086p21789n04324P08371J312169M76804
$$ 457930 922417 921175 910984 1204409 1182323 460534 -43790 664581 1976750 2453554
39169B453554n10787l14233M01513K72444m42680m18551L79246N68549l36476
$$ 2453554 1942767 1628534 2030047 2302491 1859811 1441260 1820506 2389055 2052579
39160B052579r88507k08515J140087J236096k07000j500811j120015M27588J311865
$$ 2052579 1064072 855557 1995644 3231740 3024740 1523929 403914 831502 2143367
39151B143367O29033o55503j072866l89743M21803N63774J40511l55621o04672
$$ 2143367 2772400 2116897 1044031 654288 1076091 1639865 1780376 1424755 820083
39142H20083m23197J88348P43600N97243j47766o22955l98033p5072k37244m80201
$$ 820083 396886 585234 1328834 1926077 1778311 1155356 757323 682251 445007 -35194
39132c5194j78916L46354L15162k12421m70995k67593j56694l26331k80698J60611
$$ -35194 -214110 132244 447406 234985 -236010 -503603 -660297 -986628 -1267326 -1106715
39122a106715M58488L16984K31767N72965Q28318M04424l42682n82766j88642
$$ -1106715 -648227 -331243 -99476 473489 1301807 1706231 1363549 780783 592141
39113E92141K39438L35469K98537L09146K21028m4386k58371k50414k22553m67992
$$ 592141 831579 1167048 1465585 1774731 1995759 1951373 1693002 1442588 1220035 752043
39103G52043q93483j012290m75397M24573R23679O17011K199j11197L20286N41928
$$ 752043 -141440 -1153730 -1629127 -1204554 -280875 336136 338335 227138 547424 1089352
39093A089352J30801m07634m82525k97006l41655m54073j27493M57030N34274
$$ 1089352 1220153 812519 329994 32988 -308667 -762740 -890233 -433203 101071
39084A01071n4717n39896l40288J51148K95076J80359L22190P05505P41589J42054
$$ 101071 46354 -493542 -833830 -682682 -387606 -207247 114943 820448 1562037 1704091
39074A704091o45371r78725o80333m2158N56886Q60219P49175L04026j70151l72425
$$ 1704091 1058720 79995 -600338 -642496 -85610 774609 1523784 1827810 1657659 1285234
39064A285234l21710l24174n59679q13844p28625k37223L69503P34832O66049
$$ 1285234 963524 639350 79671 -734173 -1462798 -1700021 -1330518 -595686 70363
39055G0363J88975m03162o25033k14510M94226Q57909O22571J17783k17391k10006
$$ 70363 259338 -143824 -768857 -983367 -489141 368768 991339 1109122 891731 681725
39045F81725R7257M75875N13255P7079k31173K46156J007147P51096o75587j710241
$$ 681725 778982 1254857 1768112 1845191 1614018 1860174 2867321 3618417 2942830 1232589
39035A232589j207252j74578k18032j002588q15128O33622J678087J209865J44928
$$ 1232589 25337 -149241 -367273 -1369861 -2184989 -1551367 126720 1336585 1481513
39026A481513k46064j20301k68263o02701n32131j49028J0810m1690P3864K79198
$$ 1481513 1235449 1115148 846885 244184 -287947 -436975 -426165 -467855 -393991 -114793
39016a14793K39963J09240K42628M15797J61839k97833l23843L9499J18040k19355
$$ -114793 125170 234410 477038 892835 1054674 756841 432998 472497 590537 371182
39006C71182l26324J15513N73527N39411K29962O1658J7694p6799j43028j02462
$$ 371182 44858 160371 733898 1273309 1503271 1564929 1582623 1505824 1362796 1260334
38996A260334j25870k48098j12062M81363J057111R45368J38166o84117r03971
$$ 1260334 1134464 886366 774304 1255667 2312778 3258146 3396312 2712195 1808224
38987A808224m95154J05198M26023L15630K0259j11079p127J60283L09409M40880
$$ 1808224 1313070 1418268 1844291 2159921 2180180 2069101 2061974 2222257 2531666 2972546
38977B972546L31200k90992j120329j342974o58504K09445M44170J73856N2993
$$ 2972546 3303746 3012754 1892425 549451 -109053 100392 544562 718418 771411
38968G71411J72195R6640j90894j98424J57373L16475J6090k25490L5613M29803
$$ 771411 943606 1040246 849352 650928 808301 1124776 1140866 915376 950989 1380792
38958A380792M09404J21907K0538r9l26251p28721o03710o8596R0325k71194l41239
$$ 1380792 1790196 1912103 1932641 1932542 1606291 877570 273860 205264 295589 24395 -316844
38947c16844K36850N82411m0678q46320n94718M42840Q43356K42483j52476M32195
$$ -316844 -79994 502417 461739 -384581 -979299 -536459 306897 549380 396904 829099
38937H29099J083853O86700l31642p38218l50095n0372k38104l60471m1204K76889
$$ 829099 1912952 2599652 2268010 1529792 1179697 1129325 891221 530750 489546 766435
38927G66435J13372l19609n21975l55824K209L49776M39113N7005n81315q44209
$$ 766435 879807 560198 38223 -317601 -315392 34384 473497 530502 -50813 -895022
38917h95022m04126K95163N80086L59950J18238K31456N67025P17640M58224l0055
$$ -895022 -1299148 -1003985 -423899 -63949 54289 285745 852770 1570410 2028634 1998579
38907A998579l43714l16935k53865n33580j024119j152360n98651L10668R38089
$$ 1998579 1654865 1337930 1084065 550485 -473634 -1625994 -2224645 -1913977 -975888
38898i75888Q66207J75777n17690m60699L57549R01667L24258o53825n69397N27740
$$ -975888 -109681 66096 -451594 -912293 -554744 346923 671181 17356 -552041 -24301
38888b4301R32689j05633j051778m38914P13439M69199q93691j323096k59566
$$ -24301 908388 802755 -249023 -687937 25502 494701 -398990 -1722086 -1981652
38879a981652O61352M01724p1937J31258L02925j82536l97666M37842J203109
$$ -1981652 -1320300 -918576 -990513 -859255 -556330 -738866 -1136532 -698690 504419
38870E04419N55210p13200q62575K5792M31148K6907j24168K24863K32817l9518
$$ 504419 1059629 346429 -516146 -490354 -59206 -32299 -156467 68396 301213 261695
38860B61695M47688J421532J151062o26756j774015r06662M74810M85773k76118
$$ 261695 709383 2130915 3281977 2655221 881206 -25456 449354 935127 659009
38851F59009j87119N22946M54136l64425o98021l59942k11014k56741K76127J112811
$$ 659009 471890 994836 1448972 1084547 386526 26584 -184430 -441171 -165044 947767
38841I47767J100438K25721l56579l72662o40805j092150o16816O73351J097262
$$ 947767 2048205 2273926 1917347 1544685 903880 -188270 -805086 -131735 965527
38832I65527R5028p02193j33235O25670J90799p10182o78597l7934K5791k96006
$$ 965527 1060555 358362 225127 850797 1041596 331414 -347183 -385117 -359326 -655332
38822f55332M7814Q46748Q93051R2375l94319r5605J90002q8993m29702k67875
$$ -655332 -607518 239230 1132281 1224656 830337 734732 924734 835741 406039 138164
38812A38164K24223N96958O25635K41252l86698p22046m36229L0774R6814o5441
$$ 138164 362387 959345 1584980 1826232 1439534 717488 281259 312033 408847 343406
38802C43406K9227K12008J1351l53634k98381N0929Q9264j56960j28723K46105
$$ 343406 372633 584641 595992 242358 -56023 -5094 84170 -72790 -201513 44592
38792D4592N91122Q81597J197644J038701P5935p68744l78304P11547J053112
$$ 44592 635714 1517311 2714955 3753656 3829591 3060847 2682543 3394090 4447202
38783D447202O25880O59429J259267J325841J014159J840331L592418L641939
$$ 4447202 5073082 5732511 6991778 8317619 9331778 11172109 14764527 18406466
38775A8406466P68009k517855l322194k231780j707571k136415j991424r89257
$$ 18406466 19174475 16656620 13334426 11102646 9395075 7258660 5267236 4277979
38767D277979m23950o05785m08986M35476P31572n0400q66762q87341n85832m47998
$$ 4277979 3854029 3248244 2839258 3274734 4006306 3955906 3089144 2201803 1615971 1167973
38757A167973j05296N15397N75852k45038q93110m79430L18060M01238n2985j29999
$$ 1167973 1062677 1578074 2153926 1908888 1015778 536348 854408 1255646 1202661 1072662
38747A072662K48122M21203K49686J82680K67912Q1638l87930o23366l90469M282
$$ 1072662 1320784 1741987 1991673 2174353 2442265 2523903 2135973 1512607 1122138 1126420
38737A126420K80887M07057L01803m5277k19435J40496N36610J21133q95678j301065
$$ 1126420 1407307 1814364 2116167 2070890 1851455 1991951 2528561 2649694 1754016 452951
38727D52951o55214k273k15249o16277j79314P05949Q99712M10421K07703L60278
$$ 452951 -202263 -204536 -419785 -1036062 -1215376 -509427 390285 800706 1008409 1368687
38717A368687n4133r96189j068487K47822J418334R71947l55330q38007k47460
$$ 1368687 1314554 318365 -750122 -502300 916034 1887981 1532651 694644 447184
38708D47184K56723J29578j04052j11701j18608r8659J98188M54252J38778m17620
$$ 447184 703907 833485 729433 617732 499124 400465 598653 1052905 1191683 774063
38698G74063m25656n09Q6252j22964N7156L86510p2076j010371r42624L33518
$$ 774063 348407 347898 434150 311186 368342 754852 682776 -327595 -1270219 -936701
38688i36701J150479N67316k27969p5403L55747J69454k5571M62426P35183j49625
$$ -936701 213778 781094 553125 477722 833469 1002923 977352 1439778 2174961 2025336
38678B025336j180683q89755J30309K63530l29600j59651P83481R63347J1606
$$ 2025336 844653 -45102 85207 348737 19137 -140514 642967 1606314 1617920
38669A617920o68218l03507K09374J40280J0161K36525L05461q233l4983M42450
$$ 1617920 949702 646195 855569 995849 1006010 1242535 1547996 1539763 1504780 1947230
38659A947230N52159j77031q77879p13239j31907O1072m1459O0955L22737M43148
$$ 1947230 2499389 2322358 1444479 731240 599333 660405 618946 679901 1002638 1445786
38649A445786M44226L54720m976m23590k65075M48239P60557J77916n15204m98383
$$ 1445786 1890012 2244732 2239756 1816166 1551091 1999330 2759887 2937803 2422599 1924216
38639A924216j34220j82324n56327o94474n37985l39877n7234L23229M07272N7455
$$ 1924216 1789996 1607672 1051345 356871 -181114 -520991 -578225 -254996 152276 209731
38629B09731j40092K03494N14875K20418j59172J65592Q47175Q74884J38225m97829
$$ 209731 69639 273133 788008 1008426 849254 1014846 1862021 2736905 2875130 2377301
38619B377301n06909j79007R1125J61944q1463n15649n01735L27466J143071P53969
$$ 2377301 1870392 1691385 1782510 1944454 1862991 1347342 845607 1173073 2316144 3070113
38609C070113o08578j344878n87694O47402Q68881l0219q93927q48351j27124
$$ 3070113 2461535 1116657 528963 1176365 2045246 2015027 1121100 272749 145625
38600A45625N06620O82517O41201P19862Q30554O06676K9428m04809l28536k7585
$$ 145625 652245 1334762 1975963 2695825 3526379 4133055 4162483 3757674 3429138 3401553
38590C401553l843k32967k65696L6741L05892K44536L4457J4314J78419J98995
$$ 3401553 3397710 3164743 2899047 2935788 3241680 3486216 3520673 3534987 3713406 3912401
38580C912401r1199l91284k53641K73189N64945K14339l21483k90484K56423M99553
$$ 3912401 3821202 3429918 3176277 3449466 4014411 4228750 3907267 3616783 3873206 4372759
38570D372759L9273n37656n07372P5278O07264O93973M01117O2991K9004L15290
$$ 4372759 4412032 3874376 3367004 3442282 4049546 4743519 5144636 5207627 5236631 5551921
38560E551921M62516J12746l59147l73444j87774n46713j263056j239403k17563
$$ 5551921 6014437 6127183 5768036 5394592 5206818 4660105 3397049 2157646 1940083
38551A940083O30632M13861k73868n59919n90071p15351m90396L38051Q17221
$$ 1940083 2570715 2984576 2710708 2150789 1560718 845367 354971 693022 1510243
38542A510243J59714o61392k49832Q79339J035000Q2920m34586O1100L49634l04922
$$ 1510243 1669957 1008565 758733 1638072 2673072 2755992 2321406 2382506 2732140 2427218
38532B427218q14945j30472R61955J063781K51283k49459M5400L96134J18921
$$ 2427218 1612273 1481801 2443756 3507537 3758820 3509361 3554761 3950895 4069816
38523D069816m71051n47431J72223J013140J009293O5037p58887m77692N24810
$$ 4069816 3598765 3051334 3223557 4236697 5245990 5311027 4552140 4074448 4599258
38514D599258J006036M93773l42408q75546j148511j170481o09210L37674O68268
$$ 4599258 5605294 6099067 5756659 4881113 3732602 2562121 1952911 2290585 2958853
38505B958853r0583r21455n42078P62279J401635N39388q59552j283369m77513
$$ 2958853 2868270 1946815 1404737 2167016 3568651 4108039 3248487 1965118 1487605
38496A487605M43851N33622J38772J96989P55781Q83188J45359o08430m59956
$$ 1487605 1931456 2465078 2603850 2800839 3556620 4439808 4585167 3976737 3516781
38487C516781K04296L23419k29909n96567l35115P2840K00059K72059N17209O46481
$$ 3516781 3721077 4044496 3814587 3218020 2882905 2955745 3155804 3427863 3945072 4591553
38477D591553L71022n6136j82103L9910K14279m1414n91726o95456K07286J428299
$$ 4591553 4962575 4906439 4724336 4764246 4978525 4937111 4345385 3649929 3857215 5285514
38467E285514J430864j42118j592038j242479K78471J045915N77587N5419J15747
$$ 5285514 6716378 6574260 4982222 3739743 4018214 5064129 5641716 5697135 5812882
38458E812882J74731N0021M53590J377198J628898P17551k09315j04792N59948
$$ 5812882 5987613 6037634 6491224 7868422 9497320 10214871 10005556 9900764 10460712
38449A0460712Q82600P90573M41098l26735j051170n35505J211487K257528J307878
$$ 10460712 11343312 12133885 12574983 12248248 11197078 10661573 11873060 14130588 15438466
38440A5438466k35153l14181P65648J162600N51287L46651J178690K056499K174121
$$ 15438466 15203313 14889132 15654780 16817380 17368667 17715318 18894008 20950507 23124628
38431B3124628J959442K031590K383714K882371L530608M058660M204569M460765
$$ 23124628 25084070 27115660 29499374 32381745 35912353 39971013 44175582 48636347
38423D8636347N566392P242494Q485543R200980J0465927J2978462J6282292J9798933
$$ 48636347 54202739 61445233 69930776 79131756 89597683 102576145 118858437 138657370
38415A38657370K3615649K7784248L1539946L3501884L2028422K5438946J3126410
$$ 138657370 162273019 190057267 221597213 255099097 287127519 312566465 325692875
38408C25692875k851092j8027162k8250480l2256188l1661252k9014942k6018867
$$ 325692875 322841783 304814621 276564141 244307953 212646701 183631759 157612892
38401A57612892k3014287j9649099j5983976j2812486j0722544r281035p735257
$$ 157612892 134598605 114949506 98965530 86153044 75430500 66149465 58414208
38394E8414208o173337n215091m816597m313606l543109k947904k581425k033315
$$ 58414208 52240871 47025780 42209183 37895577 34352468 31404564 28823139 26789824
38386B6789824j425900j394078j839098j804255r92925l53537n95383j092666
$$ 26789824 25363924 23969846 22130748 20326493 19333568 18980031 18384648 17291982
38378A7291982r76658m97217m55809q55071r69153m86073R3799J14318n44026
$$ 17291982 16315324 15818107 15362298 14507227 13538074 13052001 13145800 13260118 12716092
38369A2716092j311169j365760n27759L06270J34249p85402j258781q45614k73995
$$ 12716092 11404923 10039163 9511404 9817674 9951923 9166521 7907740 7062126 6788131
38360F788131k4690L29693R21744R55680P8600p00772m76996R7277k7071n00452
$$ 6788131 6763441 7093134 8014878 8970558 9049158 8348386 7871390 7968667 7941596 7441144
38350G441144l00625L60220L98353j70317k40943L53783M37661m61925j128994
$$ 7441144 7140519 7500739 7899092 7728775 7487832 7841615 8279276 7817351 6688357
38341F688357n21090N37012N69246l79937r05894k59126Q13394J267546J002673
$$ 6688357 6167267 6704279 7273525 6893588 5987694 5728568 6541962 7809508 8812181
38332H812181O37366N52547N36463K30738l25637o57900l59229L65968P66294
$$ 8812181 9449547 10002094 10538557 10769295 10443658 9785758 9426529 9792497 10558791
38323A0558791L00996o76049j172452o18551M47658R75257O48950K07558L58150
$$ 10558791 10859787 10183738 9011286 8392735 8840393 9815650 10464600 10672158 11030308
38314A1030308P77165O69084N5727k36455P1680K10953l67969r76765o82213J91880
$$ 11030308 11807473 12476557 12532284 12295829 12367509 12578462 12210493 11233728 10551515 10743395
38304A0743395M92959l6820m73742k45319N0661k12508n88619l27124L13380L95098
$$ 10743395 11236354 11199534 10725792 10480473 10531134 10318626 9730007 9402883 9716263 10111361
38294A0111361k56779p76153m97750K11205N88683L98421r1485n97665r09962
$$ 10111361 9854582 9078429 8580679 8791884 9380567 9778988 9687503 9089838 8179876
38285H179876q34139m57119k17468l22863l68532Q574M05147K35498j82153k047
$$ 8179876 7345737 6888618 6671150 6348287 5979755 5988329 6393476 6628974 6446821 6444774
38275F444774O74314P37272j47381p50104p2746R25441N79709r28360j621023
$$ 6444774 7119088 7856360 7708979 6958875 6886129 7811570 8391279 7462919 5841896
38266E841896m48539J227350J421477j1558j418825j451760m35929L33596J72561
$$ 5841896 5393357 6620707 8042184 8030626 6611801 5160041 4724112 5057708 5230269
38257E230269l86615m76992o8358R4105l33208p52763n62262o3820J23004P8034
$$ 5230269 4843654 4366662 4298304 4392409 4059201 3306438 2744176 2680356 2803360 2881394
38247B881394K53304M76679J93157m45930o74555k92573J54300M15230P82701
$$ 2881394 3134698 3611377 3804534 3358604 2684049 2391476 2545776 2961006 3743707
38238C743707J165398R58971J64642l53242j51344J72724Q7714q3327J3558J14643
$$ 3743707 4909105 5868076 6032718 5679476 5528132 5700856 5788570 5705243 5718801 5833444
38228E833444R1707L55273Q40785O75172l00109q11158n6184Q00324M64814j67193
$$ 5833444 5925151 6280424 7121209 7796381 7496272 6685114 6628930 7429254 7894068 7726875
38218G726875O35622K417904K995525J854969R66120J741276L104572L471003
$$ 7726875 8362497 10780401 13775926 15630895 16597015 18338291 21442863 24913866
38210B4913866L027625K809819K670925J600930m80553k461668l387044l236053
$$ 24913866 27941491 30751310 33422235 35023165 34542612 32080944 28693900 25457847
38202B5457847k534289j892758j791037k193253k439585j992142j187274q19083
$$ 25457847 22923558 21030800 19239763 17046510 14606925 12614783 11427509 10608426
38194A0608426j093612j431170j247836n51845K07394N63431L34410k25812o15511
$$ 10608426 9514814 8083644 6835808 6283963 6491357 7054788 7389198 7163386 6547875
38185F547875o42612o72338j035220j349879r07391K37633J069268P93776j21248
$$ 6547875 5905263 5232925 4197705 2847826 1940435 2178068 3247336 4041112 3919864
38176C919864n03525P6265Q55030Q98690J51636p07300j097113r35946m79274
$$ 3919864 3416339 3492604 4347634 5246324 5397960 4690660 3593547 2657601 2178327
38167B178327r5778k2613m8474L15801J015384J188675L15253p40406p12052K12360
$$ 2178327 2082549 2059936 2011462 2327263 3342647 4531322 4846575 4106169 3394117 3606477
38157C606477N83329j76973r99635q99338l13570o5267o9938M7619k541m65216
$$ 3606477 4189806 4012833 3013198 2113860 1800290 1735023 1665085 1712704 1710163 1244947
38147A244947o61557J8217Q62744P84923K0138l56472j82050j58327l75375k79238
$$ 1244947 583390 601607 1464351 2249274 2269412 1912940 1730890 1572563 1197188 917950
38137I17950O0736N8904j04500K46058P70055M55618m13088l68680P58088J241047
$$ 917950 978686 1037590 933090 1179148 1949203 2404821 1991733 1623053 2381141 3622188
38127C622188R1437j344198j425777m47586L08817N11294N25487K89548k25232
$$ 3622188 3713625 2369427 943650 496064 804881 1316175 1841662 2131210 1905978
38118A905978k80836N47579J233632N89584q24576j410604p80402r623J12049
$$ 1905978 1625142 2172721 3406353 3995937 3171361 1760757 980355 970732 1082781
38109A082781j59287m04967n25716l24138L67168J062074J008094K68844l36979
$$ 1082781 923494 518527 -7189 -331327 35841 1097915 2106009 2374853 2037874
38100B037874l70458j22618J03436L17821M96248N75807O83484P65374L30431
$$ 2037874 1667416 1544798 1648234 1966055 2462303 3038110 3721594 4486968 4817399
38091D817399o50938j065517k4451J398621J223225o04464j927421j319280J24675
$$ 4817399 4166461 3100944 3076493 4475114 5698339 5093875 3166454 1847174 1971849
38082A971849O66527L10805K06954N71895N54601j33095o61850l41606L71570
$$ 1971849 2638376 2949181 3156135 3728030 4282631 4149536 3487686 3146080 3517650
38073C517650N02869j90620r55185r72781l23443J80216P9306j88779p4737J87176
$$ 3517650 4020519 3829899 2874714 1901933 1578490 1758706 1838012 1649233 1574496 1761672
38063A761672L7350l43491k32598L79125N94691l4680p08577m37739N92383J268581
$$ 1761672 1799022 1455531 1222933 1602058 2196749 2162069 1453492 1015753 1608136 2876717
38053B876717R08521p1485p37280n83357O9220M87041L47839O5129J49438M70621
$$ 2876717 3785238 3713753 2976473 2393116 2462336 2949377 3297216 3362345 3511783 3982404
38043C982404N25423K45285Q276n5742j62125k83006j24834K10103K11382k00498
$$ 3982404 4507827 4753112 4761388 4705646 4543521 4260515 4135681 4345784 4557166 4356668
38033D356668m63675k45920Q9982J69221J46665K40378L03518K27589K43765M62834
$$ 4356668 3892993 3647073 3737055 3906276 4052941 4293319 4596837 4824426 5068191 5531025
38023E531025O21476O12057P13779R60155Q95830L77871k7707M1446P9076m24473
$$ 5531025 6152501 6764558 7478337 8438492 9334322 9712193 9684486 9725932 9805008 9380535
38013I380535j047240j082737o26622k66638j13632P4889J71328q5311l95400
$$ 9380535 8333295 7250558 6623936 6357298 6243666 6318555 6489883 6404572 6009172
38004F009172k83994O233j41298n91497n67389P1538N18311K01110m42885o94958
$$ 6009172 5725178 5731411 5590113 4998616 4431227 4502765 5021076 5222186 4779301 4084343
37994D084343n13966m04317o40063r21436p33311N846O62877N15273k29498n12851
$$ 4084343 3570377 3166060 2525997 1604561 871250 877096 1539973 2055246 1825748 1312897
37984A312897J40126Q40116N99279j71565l18294K82750O80020M48548J89753
$$ 1312897 1453023 2293139 2892418 2720853 2402559 2685309 3365329 3813877 4003630
37975D003630K76646K01459l92552r29895p40750n8416L76330K87025o710j20593
$$ 4003630 4280276 4481735 4089183 3159288 2418538 2360122 2736452 3023477 3016767 2896174
37965B896174N1599K94005K24032k58196p14631p36796n92217p10412p42142l2977
$$ 2896174 2947773 3241778 3465810 3207614 2492983 1756187 1163970 453558 -288584 -321561
37955c21561J017952J196302L18515l23301J05092P07652L23724o66305j016046
$$ -321561 696391 1892693 2211208 1887907 1992999 2700651 3024375 2358070 1342024
37946A342024m57525J73048K83917N8783j62623k45659j21134J13445J30429j03993
$$ 1342024 884499 1057547 1341464 1400247 1237624 991965 870831 984276 1114705 1010712
37936A010712p1460N01224R98411P12006j02021o49581p06924n74024l10735J33155
$$ 1010712 939252 1440476 2438887 3150893 3048872 2399291 1692367 1118343 807608 940763
37926I40763L41205q2767o38555m79720K47462N44556N3803m77363l39461L03670
$$ 940763 1281968 1199201 560646 80926 328388 872944 926747 449384 109923 413593
37916D13593Q56710R21948M26302k99772o30121l96142k81012p62429j092048
$$ 413593 1270303 2192251 2618553 2318781 1688660 1292518 1011506 249077 -842971
37907h42971l70169P41278P66346k37731o63272R2963P15270K21848m50865j20981
$$ -842971 -1213140 -471862 294484 56753 -606519 -513556 201714 423562 -27303 -148284
37897a48284O88054P22405J364m45727k69925l6270o8099n0045L21542R47657
$$ -148284 539770 1262175 1263539 817812 547887 511617 443518 393473 715015 1662672
37887A662672J442728J295176L28412p22754p77522J05427O90434M55046L74011
$$ 1662672 3105400 4400576 4728988 4006234 3228712 3334139 4024573 4479619 4853630
37878D853630J081297J553008Q25449j38885J34976J223271J543183R24968O16622
$$ 4853630 5934927 7487935 8313384 8174499 8309475 9532746 11075929 12000897 12617519
37869A2617519J003610J154207O24221j8308n93332j531476k429621k086941n00728
$$ 12617519 13621129 14775336 15399557 15381249 14787917 13256441 10826820 8739879 8239151
37860H239151P08261M87191m05880r35843j143293j238659p73705K82248Q27876
$$ 8239151 8947412 9434603 9028723 8092880 6949587 5710928 4937223 5219471 6047347
37851F047347Q8671j114243j523293j050623l69015K12375N55031K75984m70082
$$ 6047347 6136018 5021775 3498482 2447859 2078844 2291219 2846250 3122234 2652152
37842B652152o42235J94031Q62573K45094q38184p89207L30593J018595O46837
$$ 2652152 2009917 2203948 3066521 3311615 2473431 1684224 2014817 3033412 3680249
37833C680249O1641m5421M9323M9215J45541L10890J42356k85636l17820K32121
$$ 3680249 3741890 3696469 3745792 3795007 3940548 4251438 4393794 4108158 3790338 4022459
37823D022459P10408N70195M813n58383r21460r03574l55442L83484O48207K99614
$$ 4022459 4732867 5303062 5307875 4749492 3828032 2924458 2569016 2952500 3600707 3900321
37813C900321q6108j9160L89632P79456R14986O97047K81822J11069L09393K84341
$$ 3900321 3814213 3795053 4184685 4964141 5879127 6576174 6857996 6969065 7278458 7562799
37803G562799l75713r18383l50296Q32065J095874J72256m63147J45449J041661
$$ 7562799 7187086 6268703 5918407 6750472 7846346 8018602 7555455 7700904 8742565
37794H742565J013517M29241L26444O20414N39059K48826O32633J638788K181996
$$ 8742565 9756082 10185323 10511767 11132181 11671240 11920066 12552699 14191487 16373483
37785A6373483J821127J384444J592748K072054K281085K572977L501337M523003
$$ 16373483 18194610 19579054 21171802 23243856 25524941 28097918 31599255 36122258
37777C6122258M315032K414789j19530j878191k449504k373856k240835k299750
$$ 36122258 40437290 42852079 42732549 40854358 38404854 36030998 33790163 31490413
37769C1490413k649285l168602l294119k495924j131588k66735m14905r98453
$$ 31490413 28841128 25672526 22378407 19882483 18750895 18484160 18069255 17070802
37761A7070802j322206j419721j483942j178918k70349O16145P69977N53944Q55945
$$ 17070802 15748596 14328875 12844933 11666015 11395666 12011811 12781788 13335732 14191677
37752A4191677J674988K240156K280923K043998J219531p56519l160722m183454
$$ 14191677 15866665 18106821 20387744 22431742 23651273 22894754 19734032 15550578
37744A5550578l230904j808184j409930j637681j283813l23290K62271M5531m89263
$$ 15550578 12319674 10511490 9101560 7463879 6180066 5856776 6119047 6164578 5675315
37735E675315q20223q05998m84900r0992q98j82851r7699M04752O44135J14437
$$ 5675315 4855092 4049094 3564194 3473202 3472304 3289453 3191754 3596506 4240641 4355078
37725D355078o63634r40119p90457o50383m01810K17160P94392P47167K54663
$$ 4355078 3691444 2751325 1960868 1310485 908675 1125835 1920227 2667394 2922057
37716B922057j47306m58757q32305q23330p3592P10249O26080M7761l2388K10072
$$ 2922057 2774751 2315994 1483689 660359 586767 1297016 1923096 1970857 1938469 2148541
37706B148541k09777j080240j029011J88365J092181P54198J45857L47686P58062
$$ 2148541 1938764 858524 -170487 17878 1110059 1864257 2010114 2357800 3115862
37697C115862K60547q03025j141332m65610K63460L19384n7255l66064m71062
$$ 3115862 3376409 2573384 1432052 966442 1229902 1549286 1492031 1125967 654905
37688F54905m06404j29912L42536Q15508R98290O73495m5313o03973m99059M3208
$$ 654905 248501 118589 461125 1276633 2274923 2948418 2903105 2299132 1800073 1843281
37678A843281L01762P0970r9278J56628M74095M59250K84195J59344j35206o42650
$$ 1843281 2145043 2216013 2116735 2273363 2747458 3206708 3490903 3650247 3515041 2872391
37668B872391p85203k27384L48514J40454n04784o08949q7510J95458j56242n30994
$$ 2872391 2087188 1859804 2208318 2348772 1843988 1235039 1147529 1342987 1186745 655751
37658F55751l46475J69499N15012N86210M90981K21597j31157k51203m1283J18077
$$ 655751 309276 478775 993787 1579997 2070978 2292575 2161418 1910215 1868932 1987009
37648A987009j13565n03289n55205j92184J74580J81471j21858m13376m28952
$$ 1987009 1873444 1370155 814950 622766 797346 978817 856959 443583 14631
37639A4631j66162J13900J12739j60969l07664L9504O80936R36796M30126l50927
$$ 14631 -151531 -37631 75108 -85861 -393525 -354021 326915 1263711 1693837 1342910
37629A342910n58013m1439M57058L28548q0047m7639M27823O93052M68452J42332
$$ 1342910 784897 743458 1200516 1529064 1449017 1401378 1829201 2522253 2990705 3133037
37619C133037l5702l49078q97504j117621n31290M45456R71388P80382K39818
$$ 3133037 3097335 2748257 1850753 733132 201842 647298 1618686 2399068 2638886
37610B638886l16744p74412r41152o58285j86634J8428m8127M0203M20254O65259
$$ 2638886 2322142 1547730 606578 -51707 -238341 -219913 -268040 -227837 192417 857676
37600H57676L94292j53003l57250P8529P47820Q47251m004j164764j471345n93202
$$ 857676 1251968 1098965 741715 820244 1568064 2415315 2411311 1246547 -224798 -818000
37590h18000M23031L99343m46986q34675j68978P64909R94148N40429M3210k27121
$$ -818000 -394969 4374 -442612 -1277287 -1446265 -681356 312792 853221 896431 669310
37580F69310m30175n62825m09970k7823K08466J29228J2020J69727N22848P31661
$$ 669310 239135 -323690 -733660 -761483 -553017 -423789 -411769 -242042 280806 1012467
37570A012467O10363K50290j83144n74964p65854n54604K5130N42300N22236k8737
$$ 1012467 1622830 1873120 1689976 1115012 349158 -205446 -180316 361984 884220 855483
37560H55483o34107q62491o17548P773P65342J104402N34411n80905j100492m44004
$$ 855483 221376 -641115 -1258663 -1250890 -485548 618854 1153265 572360 -528132 -972136
37550i72136N61626P59355K36589N1710N48828Q63218K95237o44400j014401o86311
$$ -972136 -410510 348845 585434 637144 1185972 2049190 2344427 1700027 685626 -685
37540f85k64063j17729o1953J10046K30714N832n17616q39460m56846M72249J079796
$$ -685 -264748 -382477 -444430 -334384 -103670 -97838 -615454 -1454914 -1911760 -1439511 -359715
37529c59715P03296k55332p89947n39479n3039J94546L68688O35929O61152K04676
$$ -359715 343581 88249 -701698 -1241177 -1294216 -1099670 -730982 -95053 566099 770775
37519G70775l24507m45619l05686k65426j92826K08559O79922O88955K56458j10116
$$ 770775 446268 649 -305037 -570463 -763289 -554730 125192 814147 1070605 960489
37509I60489j74455r8395K7589J89785J50196k25537m97569k02312K86902K52802
$$ 960489 786034 687639 715228 905013 1055209 829672 332103 129791 416693 669495
37499F69495j40670q4483M12928M24644k87334p41987l37089J51990o1452m39764
$$ 669495 528825 444342 857270 1281914 994580 252593 -84496 67494 6042 -433722
37489d33722j68416K98894k5880r04008j117997k82167P24871J083677Q13946
$$ -433722 -602138 -303244 -329124 -1233132 -2351129 -2633296 -1908425 -824748 -10802
37480a0802K83540j43060m0547N75968Q16737l114j020535q05992L61782O92333
$$ -10802 272738 129678 89131 665099 1481836 1478722 458187 -347805 13977 706310
37470G06310l86463j294981p56153L29900M75082k00207n69999l23035O4522M06410
$$ 706310 319847 -975134 -1731287 -1401387 -926305 -1126512 -1696511 -2019546 -1955024 -1548614
37460a548614O62296M11238l51761n88973L55461J389518J113421k3318n46563
$$ -1548614 -886318 -475080 -826841 -1415814 -1060353 329165 1442586 1419268 872705
37451H72705l31904l48995m78987K85323J497206J375128k83012j438278q44663
$$ 872705 540801 191806 -287181 -1858 1495348 2870476 2587464 1149186 304523
37442C04523K30266L32910o718K34567N63917O5699p52912q52460m42146l27903
$$ 304523 534789 867699 860981 1095548 1659465 1725164 972252 119792 -322354 -650257
37432f50257l31506R8813M69331M2990n65554k40210O70722Q84238L10156j6608
$$ -650257 -981763 -882950 -413619 -370629 -936183 -1176393 -505671 378567 688723 672115
37422F72115J30883K3531l50284k15621L08498J90251o03603q50443j16689N45802
$$ 672115 802998 826529 476245 260624 569122 759373 155770 -694673 -811362 -265560
37412b65560M42135J97259K62246L5787o95379r27845r6081P40627N26559r2523
$$ -265560 176575 373834 636080 671867 -23512 -951357 -1047438 -306811 219748 127225
37402A27225M7279O90685P71959K69411N0921K64478K10094l08274o50172m21506
$$ 127225 174504 865189 1637148 1906559 1957480 2221958 2432052 2123778 1473606 1052100
37392A052100m38J37291l6103l05252m71872m01623j67253n3667j58975k17984
$$ 1052100 1051662 1188953 1152850 847598 375726 -25897 -193150 -246817 -405792 -623776
37382f23776o4014P6602J8379o0960n443P3010J76899M65012O49214J14426r33699
$$ -623776 -687790 -611188 -592809 -653769 -659212 -586202 -409303 55709 704923 819349 -114350
37371a14350j284033l16242R83248J312922O54831j37090n93512o70096k93638
$$ -114350 -1398383 -1714625 -731377 581545 1236376 1099286 505774 -164322 -457960
37362d57960K42437J73731n39260p61058O0350O99705M0224q94100n17750N88399
$$ -457960 -215523 -41792 -581052 -1342110 -1281760 -582055 -541831 -1435931 -1953681 -1365282
37352a365282O31394k68071k97357P88915J153870Q3465p21101j8660R44831O07212
$$ -1365282 -733888 -1001959 -1299316 -510401 643469 726934 5833 -12827 932004 1539216
37342A539216m54695p38512j57396L19291L69660L02786J21841k18884l21885
$$ 1539216 1084521 346009 188613 507904 877564 1180350 1302191 1083307 761422
37333G61422q8713j53543o75496p05494J90210P98082Q5176q96267n31392P87386
$$ 761422 672709 519166 -156330 -861824 -671614 126468 211644 -684623 -1216015 -428629
37323d28629J369780Q49366K18047k82595j229638k121578j599658J07518J006943
$$ -428629 941151 1790517 2008564 1725969 496331 -1625247 -3224905 -3117387 -2110444
37314b110444K76028m71608K19832J438519J503544M64640l73973n20758n09665
$$ -2110444 -1834416 -2306024 -2086192 -647673 855871 1320511 946538 425780 -83885
37305h3885n90362m63669r0260K16667L59440L86546J15413m71512p68164k63154
$$ -83885 -674247 -1137916 -1228176 -1011509 -652069 -265523 -150110 -621622 -1389786 -1652940
37295a652940N26501O49145Q9699k79672o3888K01478Q7394n6903J83197N36691
$$ -1652940 -1126439 -477294 -387595 -667267 -731155 -529677 -442283 -499186 -315989 220702
37285B20702M84230O3891k20647j12070J58343K74630J83330J1857j36498j94585
$$ 220702 704932 768823 548176 436106 594449 869079 1052409 1064266 927768 733183
37275G33183o9268K40172M58090K04814m67471r11510n97114J09473L28089j39797
$$ 733183 663915 904087 1362177 1566991 1099520 188010 -409104 -299631 28458 -111339
37265a11339n31161k45925L06996M02454M6949k49217l66636n13557m96900P4679
$$ -111339 -642500 -888425 -581429 -178975 -132026 -381243 -747879 -1261436 -1758336 -1683657
37255a683657Q39949Q47661k5499o42791j34705Q09226R10229J13487m42144j22909
$$ -1683657 -843708 3953 -21546 -664337 -799042 10184 920413 1033900 591756 468847
37245D68847M11572K91868m00194r13140p92490j95878M24941O28340K54104k90876
$$ 468847 880419 1172287 772093 -141047 -933537 -1129415 -704474 -76134 177970 -112906
37235a12906k89455M04028J016813Q06170Q9901k15173Q6571K84499p4288n39765
$$ -112906 -402361 1667 1018480 1824650 1914551 1699378 1785949 2070448 1996160 1456395
37225A456395n41486k22861q1940k03381k92942j98044p936J45201R4089k66535
$$ 1456395 914909 692048 610108 406727 113785 -84259 -92195 53006 147095 -119440
37215a19440o19468l86097L65622P02175J29423m17600J76908J321047J294446
$$ -119440 -738908 -1125005 -759383 -57208 72215 -345385 -168477 1152570 2447016
37206B447016k31270j527785j143271K21421R47767O96878L29165K26765p1638
$$ 2447016 2215746 687961 -455310 -233889 713878 1410756 1739921 1966686 1895048
37197A895048o82041r60709n51907j5447J9310k39722j65100K96044N29197R1288
$$ 1895048 1213007 252298 -299609 -315056 -295746 -535468 -700568 -404524 124673 215961
37187B15961o94054j070624o44674K39246Q68518Q05718J63658n58889p62445
$$ 215961 -478093 -1548717 -2193391 -1954145 -1085627 -279909 -116251 -675140 -1437585
37178a437585j19516R58545J401826N89169o64745r17974P332P78975M99624r2007
$$ -1437585 -1557101 -598556 803270 1392439 727694 -190280 -182948 596027 1095651 1003644
37168A003644k2746L08409J7979n27223k74417N89810P93575L9483n76736m37877
$$ 1003644 980898 1289307 1307286 780063 505646 1095456 1889031 1928514 1351778 913901
37158I13901k31198m37057m41819P8715K39663n26240j153705m50483R11832J311897
$$ 913901 682703 245646 -196173 -117458 122205 -404035 -1557740 -2008223 -1096391 215506
37148B15506N47107j30455o3036J43773k137j53908l4003K6446j74023k88764
$$ 215506 762613 632158 569122 712895 710758 556850 522847 549293 375270 86506
37138H6506q2861K00045L73595N24175N18234M5271o46323q46102m62818j88699
$$ 86506 3645 203690 577285 1101460 1619694 1664965 1018642 172540 -290278 -478977
37128d78977k94661j87542L70762N77228j36980r66506p94026J94408R22100J013747
$$ -478977 -773638 -961180 -590418 -13190 -150170 -1116676 -1910702 -1716294 -794194 219553
37118B19553R45203Q65402L85751m08927p63263l63785J54662J91192m358M2464
$$ 219553 1164756 2030158 2415909 2006982 1243719 879934 1034596 1225788 1221430 1263894
37108A263894J54633j18531n61130m34908L92713J039245O52040m32512j009883
$$ 1263894 1418527 1299996 738866 303958 696671 1735916 2387956 1955444 945561
37099I45561m74506M50458O61034O457p20471q96914o15194j62843L83320Q40152
$$ 945561 471055 921513 1582547 1589004 868533 -28381 -643575 -806418 -423098 417054
37089D17054Q00856K25986k94207k77799K1829J15844L039o5561j40374l25987
$$ 417054 1217910 1443896 1149689 871890 893719 1009563 1012602 947041 806667 480680
37079D80680l25533J15433N57999L59858l25648p27342n49043j95488M5490L00154
$$ 480680 155147 270580 828579 1188437 862789 135447 -413596 -609084 -563594 -263440
37069b63440N23755L65739j70138n54914m49667o9454K97708N60140N05849q8900
$$ -263440 260315 626054 455916 -98998 -548665 -618119 -320411 239729 745578 656678
37059F56678q18497q38153l1734O86390O18204J47095r2313j78000m02677m76158
$$ 656678 -161819 -999972 -1031706 -345316 272888 419983 327670 149670 -253007 -729165
37049g29165m3384M62991L56194j94771m17512j26558J44910J13087L0378j3291
$$ -729165 -772549 -309558 46636 -148135 -565647 -692205 -547295 -434208 -403830 -417121
37039d17121k56188n55897k87569O77724J487320J272145K36667o38282p51170
$$ -417121 -673309 -1229206 -1516775 -839051 648269 1920414 2157081 1518799 767629
37030G67629l58070k2749M1481J1736M6904K6302k41225o34221p56100m38731
$$ 767629 409559 386810 428291 440027 486931 513233 272008 -362213 -1118313 -1557044
37020a557044m067J43622L667j45097j64887r6773N4125K69592L77740K61815
$$ -1557044 -1561111 -1417489 -1413822 -1558919 -1723806 -1820579 -1766454 -1496862 -1119122 -857307
37010h57307J04896J38354K65266K37077P9244J7587J00309K11161L09989L33622
$$ -857307 -752411 -614057 -348791 -111714 -32470 -14883 85426 296587 606576 940198
37000I40198P2003m56663p57245m80551l7618L674j42087Q7716M59352K32998
$$ 940198 1012201 555538 -201707 -682258 -719876 -716202 -858289 -770573 -311221 -78223
36990g8223m22817m45796M19327J065112O92430j4005j13313J38214K734l49037
$$ -78223 -501040 -946836 -527509 537603 1230033 1216028 1102715 1240929 1243663 894626
36980H94626k73404N5641l8423m37715m09184M9635J80124j92447l73861l5040
$$ 894626 621222 676863 638440 200725 -208459 -158824 21300 -171147 -545008 -580048
36970e80048K82999J70708q5683k61605n75699r00954n50889N54048J375071J123819
$$ -580048 -297049 -126341 -212024 -473629 -1049328 -1950282 -2501171 -1947123 -572052 551767
36960E51767L73834K6822o0044m33915p18122j83036P26949P93696r0098p40476
$$ 551767 925601 952423 892379 458464 -259658 -442694 284255 1077951 987853 247377
36950B47377n54520k70329m48617m72571J85672P89259M60965k77745k35323O20714
$$ 247377 -307143 -577472 -1026089 -1498660 -1312988 -523729 -62764 -340509 -575832 44882
36940D4882J185974Q77507K17071k29137n08570p22384o76890l86689k40276l75804
$$ 44882 1230856 2108363 2325434 2096297 1587727 865343 188453 -198236 -438512 -814316
36930h14316m65488l39031k32557k03726O4891N97837Q92639O85852L42687J47079
$$ -814316 -1279804 -1618835 -1851392 -2055118 -1990227 -1392390 -499751 186101 528788 675867
36920F75867j19123m84709m52902N6957K27255l83049q12873k1875J293485J477037
$$ 675867 556744 72035 -380867 -323910 -96655 -479704 -1292577 -1314452 -20967 1456070
36910A456070K86906q15687q17853l23164k24532l64817j50634L49111O28382
$$ 1456070 1742976 927289 109436 -213728 -438260 -803077 -953711 -604600 23782
36901B3782N32693K53453n5203k24058m0743L54985M54403Q3366l00688k99997
$$ 23782 556475 809928 754725 530667 489924 844909 1299312 1382678 1081990 781993
36891G81993q6055N9965J51982J08234l97737j212067j459979o66712L95947O69350
$$ 781993 695938 755903 907885 1016119 618382 -593685 -2053664 -2720376 -2324429 -1655079
36881a655079J86788k18051k04969j30795j75335o2195L52068Q06233R67983O56407
$$ -1655079 -1468291 -1686342 -1891311 -2022106 -2197441 -2259636 -1907568 -1101335 -133352 523055
36871E23055r4484q14250p75978Q8440Q21359N99107j33321m14246k30475k77135
$$ 523055 428571 -385679 -1161657 -1073217 -251858 347249 213928 -200318 -430793 -707928
36861g07928n46669l13218M62977Q58681L94421k49675l06394J01099M48522N60433
$$ -707928 -1254597 -1567815 -1104838 -246157 148264 -101411 -407805 -306706 141816 702249
36851G02249M67581J46772k06526k02385J11500J77696k27989o40867o56153m35393
$$ 702249 1169830 1316602 1110076 907691 1019191 1196887 968898 328031 -328122 -763515
36841g63515k03217J06885L97904K92105j58222l29958l742K33778J2169j72432
$$ -763515 -966732 -859847 -461943 -169838 -328060 -658018 -661760 -427982 -415813 -588245
36831e88245R5059L29036M123m58495m07036p8854r5672l06789r7383M62077P16363
$$ -588245 -493186 -164150 -160027 -618522 -1025558 -1104412 -1200084 -1506873 -1604256 -1142179 -425816
36820d25816M94981K28816J30479M4452n980J22556J94420j21897n72464o07993
$$ -425816 69165 297981 428460 472912 466932 589488 783908 662011 89547 -518446
36810e18446k32816R9481K50513L52780K43849k48287o78380n21132j25045j72928
$$ -518446 -751262 -651781 -401268 -48488 195361 -52926 -731306 -1252438 -1377483 -1550411
36800a550411m11412m7975P17043Q61397L03354Q3275M93871N01772l72824j023938
$$ -1550411 -1961823 -2009798 -1292755 -431358 -128004 -44729 449142 950914 578090 -445848
36790d45848n14779L59241L83790j69351k01633L37822N41216J39784j95776n5868
$$ -445848 -960627 -601386 -217596 -386947 -588580 -250758 290458 430242 234466 178598
36780A78598J91606J15455k71099p04915q35931l52934N52191J113339Q97746
$$ 178598 370204 485659 214560 -490355 -1326286 -1679220 -1127029 -13690 884056
36771H84056M25515L29107L77723N5787l97755m47148l36788o45906j048556o95927
$$ 884056 1309571 1638678 2016401 2072188 1674433 1227285 890497 244591 -803965 -1499892
36761a499892K51196O82234K30257k68010k36021j15054k67309k54329K01666
$$ -1499892 -1248696 -566462 -336205 -604215 -840236 -955290 -1222599 -1476928 -1275262
36752a275262N40273L57325K04856O01301J001862O59165q8364l60074j41273
$$ -1275262 -734989 -377664 -172808 428493 1430355 2089520 2001156 1641082 1499809
36743A499809j41028m75439n09393j7738M13992L39626M8681o2597q4307j97726
$$ 1499809 1358781 883342 373949 356211 770203 1109829 1158510 1095913 1011606 813880
36733H13880j92944J59300N54899M54569j38075n85590l97701J49356L74880O9824
$$ 813880 620936 780236 1335135 1789704 1651629 1066039 668338 817694 1192574 1262398
36723A262398k72430j92364P1185r532l58995l51290J76780N44097J85543m77308
$$ 1262398 989968 797604 868789 859257 500262 148972 325752 869849 1055392 578084
36713E78084o20899j63438K51014K58195J44619J76625J45395j75700n42183n43108
$$ 578084 -42815 -206253 44761 302956 447575 624200 769595 593895 51712 -491396
36703d91396j71465K09819L62081L64515L22782J23396l61434q88030q88584j01646
$$ -491396 -662861 -453042 -90961 273554 596336 719732 358298 -529732 -1418316 -1519962
36693a519962R18690J231438N75822k49471l15434L18522P40295L63139l92947
$$ -1519962 -601272 630166 1205988 956517 641083 959605 1699900 2063039 1670092
36684A670092o94086l19337R9545j52227r43766j281316m28411J003869J522884
$$ 1670092 976006 656669 756214 603987 -339779 -1621095 -2049506 -1045637 477247
36675D77247N41152p63318q74666J31676Q28007M53115k42431l79541k16038l84811
$$ 477247 1018399 255081 -619585 -487909 340098 793213 550782 171241 -44797 -429608
36665d29608o03238j25252Q07465J008520N444j172427j275210l42105N52339
$$ -429608 -1032846 -1158098 -350633 657887 663331 -509096 -1784306 -2126411 -1574072
36656a574072O94536L41764Q7022J18585J94182N5691k50342l67784K2257P50549
$$ -1574072 -879536 -537772 -450750 -332165 -137983 -82292 -332634 -700418 -678161 72388
36646G2388J197013R74180M10244N9610r2332m74375j048183j194945o60621j7167
$$ 72388 1269401 2243581 2653825 2713435 2621103 2146728 1098545 -96400 -757021 -774188
36636g74188J92540K34221N60696Q63782N15337k57886n11851K1448M95662K09946
$$ -774188 -581648 -347427 213269 1077051 1592388 1334502 822651 844099 1339761 1549707
36626A549707m01776n28227j76011K3528j18996j58664J62162M88794M11238N9766
$$ 1549707 1147931 619704 443693 467221 348225 189561 351723 840517 1251755 1311521
36616A311521j02297R3098L32486K71933L140j13792m6723j95252p10118j069307
$$ 1311521 1209224 1302322 1634808 1906741 1909881 1796089 1749366 1554114 843996 -225311
36606b25311p61367j04187K14685J94117L32200N11116J11078o30424n92919L94020
$$ -225311 -986678 -1090865 -876180 -682063 -349863 161253 272331 -358093 -951012 -556992
36596e56992R37907J75981o87123j89534R86572J011155k60078j177862q54272
$$ -556992 380915 556896 -130227 -319761 666811 1677966 1417888 240026 -614246
36587f14246j19389J94117K70523K56696k29024r48093q65884J31374P08866J44861
$$ -614246 -733635 -539518 -268995 -12299 -241323 -1189416 -2055300 -1923926 -1215060 -1070199
36577a070199m08810J79383J090877Q89531j58917o13184j04517M19429L61155
$$ -1070199 -1479009 -1299626 -208749 680782 521865 -91319 -195836 223593 584748
36568E84748K3090l20334o57931o69334p8487N18973L16472l06941k32757N82079
$$ 584748 607838 287504 -370427 -1039761 -1118248 -599275 -282803 -589744 -822501 -240422
36558b40422R90949M86851j08036q8954J60424Q3188j82406l30575m11569m11630
$$ -240422 750527 1237378 1129342 1040388 1200812 1284000 1101594 771019 359450 -52180
36548e2180j33597J78767r705m65226l21751L60763M09655m85668r46890k9836
$$ -52180 -185777 -7010 -16715 -481941 -803692 -442929 -33274 -518942 -1465832 -1495668
36538a495668J061411P20173n52059r48586r6560O56389N04213J22149J62509
$$ -1495668 -434257 285916 -266143 -1214729 -1311289 -654900 -150687 -28538 133971
36529A33971K43402p3214m17550l36695n6898O3087J81911M97712O45499K01612
$$ 133971 377373 304159 -113391 -450086 -506984 -443897 -261986 235726 881225 1082837
36519A082837n11196p09466j68080M78373N26463L6965l06458j23293J46297q2377
$$ 1082837 571641 -137825 -305905 172468 698931 735896 429438 306145 452442 370065
36509C70065n47173m32619K73794N33170j81334r03713n85497K26064K80834k89338
$$ 370065 -177108 -609727 -335933 197237 15903 -887810 -1473307 -1247243 -966409 -1255747
36499a255747k34961N68532P59042k43878j136515p09591L32949O09202J51189
$$ -1255747 -1490708 -922176 -163134 -407012 -1543527 -2253118 -1920169 -1310967 -1159778
36490a159778K0123M49786O62657K82572k21982m67139n52974m92743j09136L90458
$$ -1159778 -1139655 -689869 -27212 255360 33378 -433761 -986735 -1479478 -1588614 -1198156
36480a198156N03929K41023J37210L13339K49368k33525m61063J54775J138391
$$ -1198156 -694227 -453204 -315994 -2655 246713 13188 -447875 -293100 845291
36471H45291J439303O95796l86732q61940n12604N714p4859p27522j113618o18445
$$ 845291 2284594 2980390 2593658 1731718 1219114 1224828 1149969 422447 -691171 -1309616
36461a309616L20673P75232N36646K42394L12386L61593j06973q95165j323999
$$ -1309616 -988943 -213711 322935 565329 877715 1239308 1132335 237170 -1086829
36452a086829j000276j54949N84900O73821J58837k45640P8000Q02669J013308
$$ -1086829 -2087105 -2242054 -1657154 -983333 -824496 -1070136 -992136 -189467 823841
36443H23841M43557k16728l83977k72049k20967o7434K91561L90151k9147l03410
$$ 823841 1267398 1050670 666693 394644 173677 106243 397804 787955 758808 455398
36433D55398J96778Q34938M87835o53645j227718p08408p6229j31045k96616J90025
$$ 455398 652176 1487114 1974949 1321304 93586 -614822 -691051 -822096 -1118712 -928687
36423i28687Q62846P86933J13006k01598Q1454K81536M5622k13061k50098m08813
$$ -928687 -65841 721092 834098 632500 713954 995490 1041112 828051 577953 169140
36413A69140p65442p11945N8513Q22000P50122Q4536l26043l00683l39182n67243
$$ 169140 -596302 -1308247 -1249734 -427734 322388 406924 80881 -219802 -558984 -1126227
36403a126227n58342k33522n2102q1435K46242R99784J208005K01697j117255
$$ -1126227 -1684569 -1918091 -1970193 -2051628 -1805386 -805602 402403 604100 -513155
36394e13155j290100k68268O10871N26342N1202l2104J73927K20569J71453L01254
$$ -513155 -1803255 -2071523 -1460652 -934310 -883108 -915212 -741285 -520716 -349263 -48009
36384d8009M42177K51144j69422m20682l47930n3696L38537N78677L27995k71622
$$ -48009 394168 645312 475890 55208 -292722 -346418 -7881 570796 898791 627169
36374F27169m94347k6851L90173J1259o52838n34589K95296O99040K23838l19812
$$ 627169 132822 105971 496144 507403 -145435 -680024 -384728 314312 538150 218338
36364B18338k55315N6302J49054K84724O91887Q26284K26561n27248o04427k02666
$$ 218338 -36977 19325 168379 453103 1144990 1971274 2197835 1670587 1066160 863494
36354H63494j05889l08842j19455M78653O41852L7900n51268m25971q301r4133
$$ 863494 757605 448763 329308 807961 1449813 1487713 936445 510474 502173 408040
36344D08040n94045p22727k19463K96534K45953j59153l16615m9215L05344M54326
$$ 408040 -186005 -908732 -1128195 -831661 -585708 -744861 -1061476 -1110691 -805347 -351021
36334c51021M28298L03244M2571k15496j06609L72461N74816M5859o01005m05332
$$ -351021 77277 380521 423092 207596 100987 473448 1048264 1094123 493118 87786
36324H7786M14505N97968k57469r40481l77585P53580J068927M56312r7514k17469
$$ 87786 502291 1100259 842790 -97691 -475276 278304 1347231 1803543 1706029 1488560
36314A488560m05791p11641m58405M29816R86830N92882j26786l63964k75591
$$ 1488560 1082769 371128 -87277 342539 1329369 1922251 1795465 1431501 1155910
36305A155910m00112o05464m05462J09152L98037K71560l7055l59581o07325n42449
$$ 1155910 755798 150334 -255128 -145976 252061 523621 486566 126985 -480340 -1022789
36295a022789q8103L32042K87362j5684p9681J23584K82556L84504N72256N55977
$$ -1022789 -1110892 -778850 -491488 -507172 -586853 -463269 -180713 203791 776047 1332024
36285A332024o8370r52238j216572o36658R4019L97353L82699K26716j97122p20685
$$ 1332024 1263654 311416 -905156 -1541814 -1447795 -1050442 -667743 -441027 -638149 -1358834
36275a358834p07810r35O42477O42212M52812O23472O88712n981q68126o84719
$$ -1358834 -2066644 -2067579 -1425102 -782890 -330078 293394 982106 976125 107999 -576720
36265e76720M49175J084130M69609n22063q93483p99186p12467l90115M09048
$$ -576720 -127545 956585 1426194 904131 10648 -788538 -1501005 -1891120 -1482072
36256a482072R99670O64997n5296r5027M59230N72452j1415m36899k06271J61863
$$ -1482072 -482402 182595 127299 32272 491502 1063954 1052539 615640 409369 571232
36246E71232K11175K28864M26027L83329j32770n84828m78391j08637M1555K7464
$$ 571232 782407 1011271 1437298 1820627 1687857 1103029 624638 516001 557556 585020
36236E85020N0533k6448k38713k37405J2111l7464m81243m77418M09049J195701
$$ 585020 635553 609105 370392 132987 145098 107634 -373609 -851027 -441978 753723
36226G53723Q19145k28082p16169m91581k24195O6330P55793J280569O92305n48703
$$ 753723 1572868 1344786 628617 137036 -87159 -20829 734964 2015533 2707838 2159135
36216B159135r45935k18803L91512K40808M7549J80424q3991r19942j210217l68726
$$ 2159135 1213200 994397 1385909 1626717 1674266 1854690 1770699 850757 -359460 -728186
36206g28186N34200M80025J1838l6465j7974m33156o17230R4992Q91514O91963
$$ -728186 -193986 286039 297877 261412 243438 -189718 -806948 -711956 179558 871521
36196H71521N197o032L70595n7974j157293j514094o38110M13824O82116K77887
$$ 871521 876718 870686 1241281 1183307 26014 -1488080 -2126190 -1712366 -1030250 -752363
36186g52363l17785p38564n47860K79627Q09775K78694m57428j8181J142168J185497
$$ -752363 -1070148 -1808712 -2356572 -2076945 -1267170 -988476 -1445904 -1464085 -321917 863580
36176H63580j90931j146467n36356M23029K37114o50445q95005l27174K63892
$$ 863580 672649 -473818 -1010174 -587145 -350031 -1000476 -1895481 -2222655 -1958763
36167a958763N84949Q62128R61088N63037j03429n20691n64912l35216K14466
$$ -1958763 -1373814 -511686 449402 1012439 909010 388319 -176593 -511809 -297343
36158b97343Q43818Q05483j56027j073347q90939L1054M42992J136l95098l9107
$$ -297343 546475 1351958 1195931 122584 -768355 -737301 -294309 -293173 -688271 -727378
36148g27378O74642R77166O93293J73321k89055o05521o81588m12859O7623L55136
$$ -727378 -52736 924430 1617723 1791044 1501989 896468 214880 -197979 -130356 224780
36138B24780J88753j56546j84163P4269O6477l02877l10032M18005R82417L81661
$$ 224780 413533 256987 72824 147093 213570 -89307 -399339 18666 1001083 1382744
36128A382744q16249j126868l07784M12123L25364R9517K94321L92178m1940m29669
$$ 1382744 566495 -560373 -868157 -456034 -130670 -31153 263168 655346 613406 183737
36118A83737k12686J85771K43305K53936N27069N67352l6316p10744p97647n74354
$$ 183737 -28949 156822 400127 654063 1181132 1748484 1712168 1001424 203777 -370577
36108c70577m76413j55800O43369J109202M85054n13651o73207j04335J79775
$$ -370577 -846990 -1002790 -359421 749781 1234835 721184 47977 -56358 123417
36099A23417j7379j12730n2986j99700k61504K39403P24583K68263o52164o78462
$$ 123417 106038 -6692 -59678 -259378 -520882 -281479 443104 711367 59203 -619259
36089f19259K20037O81763J97749k34889j1230J67317j77964l75623N5256M45465
$$ -619259 -399222 282541 480290 245401 234171 401488 223524 -152099 -96843 348622
36079C48622J76297k69333k64274o1621p0934j1512M04356P28453N01846N3220
$$ 348622 524919 255586 -8688 -70309 -141243 -152755 251601 980054 1481900 1535120
36069A535120j24573j61473l37561m46518k37353Q3400K89708M58734M67137m2698
$$ 1535120 1410547 1249074 911513 464995 227642 311042 600750 1059484 1526621 1483923
36059A483923p65893p55388R1670N98172Q5349n04924k12759L17996P1435m48977
$$ 1483923 718030 -37358 54312 652484 737833 232909 20150 338146 409581 -39396
36049c9396j00170P86300Q61781L8706l90703L4475K38051m84142j248189r57367
$$ -39396 -139566 646734 1508515 1547221 1156518 1190993 1429044 944902 -303287 -1260654
36039a260654J26678R16826R10534M34900j8885j70124R783K46587J89042j31704
$$ -1260654 -1133976 -217150 693384 1128284 1109399 939275 949058 1195645 1384687 1252983
36029A252983l48905l24170k72942k85109k02954o5944j52856m29116m80054j93501
$$ 1252983 904078 579908 306966 21857 -181097 -247041 -399897 -829013 -1309067 -1502568
36019a502568K5185k8430J7613L96588O31791K10155n21456p20926j74024M63602
$$ -1502568 -1477383 -1505813 -1488200 -1091612 -459821 -249666 -771122 -1492048 -1666072 -1202470
36009a202470N47855J59839j49246m8627K54262K68367k25427q06905p33573J85621
$$ -1202470 -654615 -494776 -644022 -692649 -438387 -170020 -395447 -1202352 -1935925 -1750304
35999a750304J162034J192592K47983o57257o96804j66314R4008j11794k14560
$$ -1750304 -588270 604322 852305 195048 -501756 -668070 -574062 -685856 -900416
35990i00416J60232O74546Q52922O96045M67947K64007P9780n2750k86652q72597
$$ -900416 -740184 -65638 787284 1483329 1951276 2215283 2295063 2242313 1955661 1083064
35980A083064j474811j159503K65615J447632J014471m13262r24495J0056Q91597
$$ 1083064 -391747 -1551250 -1285635 161997 1176468 763206 -161289 -151233 740364
35971G40364N29763l20534l85994K11952N05573L19610K08636K58824Q2227k49433
$$ 740364 1270127 949593 563599 775551 1281124 1600734 1809370 2068194 2150421 1900988
35961A900988k95615j55987l47440p91502q06854k17392L01416J80397l31951
$$ 1900988 1605373 1449386 1101946 310444 -496410 -713802 -412386 -231989 -563940
35952e63940o01708l18257L16646P63982N66609p4612l57907P9894N49292L31189
$$ -563940 -1165648 -1483905 -1167259 -403277 163332 88720 -269187 -189293 359999 691188
35942F91188j33180K3997N12629K27950q40754j347012n97633L74681M09325j20962
$$ 691188 558008 582005 1094634 1322584 481830 -865182 -1462815 -1088134 -678809 -799771
35932g99771j35612M03444O02762J34720l64118l52890n3922Q5443K6600r097
$$ -799771 -935383 -531939 70823 205543 -158575 -511465 -565387 -479944 -453344 -462441
35922d62441K0722m4352k63333m50785l90597j31913O7299J25691K35874M24875
$$ -462441 -441719 -486071 -749404 -1200189 -1590786 -1722699 -1655400 -1529709 -1293835 -868960
35912h68960L51283r7079l45065J33742Q51828Q43931J05681l69860j09947K11255
$$ -868960 -517677 -614756 -959821 -826079 25749 869680 975361 605501 495554 706809
35902G06809j6767m36551n61442o42576r59120r97512k59588O64547Q33613L96327
$$ 706809 690042 253491 -307951 -950527 -1909647 -2907159 -3166747 -2502200 -1668587 -1272260
35892a272260K67066N91045O25817J25135k63902j81422r9947l17012l48510J23732
$$ -1272260 -1005194 -414149 211668 336803 72901 -108521 -208468 -525480 -873990 -750258
35882g50258N15353K54987k00795p7569M31016M64084j27004n72037l79727M0707
$$ -750258 -234905 20082 -180713 -258282 172734 636818 509814 -62223 -441950 -401243
35872d01243J59431P2363J29458L06720L57752K88891L01440M23268M85782L57009
$$ -401243 -241812 -169449 -39991 266729 624481 913372 1214812 1638080 2123862 2480871
35862B480871J6103m39511p09193m67109J42819M61777Q7059n46063p25866l95229
$$ 2480871 2496974 2057463 1348270 881161 1023980 1485757 1572816 1026753 300887 -94342
35852i4342p8870m9918r4895l8496M9265J81461M40175N84142K57072l01056l89897
$$ -94342 -173212 -223130 -318025 -356521 -307256 -125795 314380 898522 1155594 854538 464641
35841D64641Q5861L44642j32188q16549r48065n61467j54029J58711N04179O78371
$$ 464641 550502 895144 762956 -53593 -1001658 -1563125 -1717154 -1558443 -1054264 -375893
35831c75893M39541J33429L12840Q32343R48015L08772o40713j221582j103017
$$ -375893 63648 197077 509917 1342260 2290275 2599047 1958334 736752 -366265
35822c66265m30319K75110M96030K85910J81783L09830J10037o16609j058730
$$ -366265 -796584 -521474 -25444 260466 442249 752079 862116 245507 -813223
35813h13223n15733M33751P74775N28502L53230J89342m22961j015535o45809
$$ -813223 -1328956 -895205 -120430 408072 761302 950644 527683 -487852 -1133661
35804a133661L81622P27881R6650l73400q0110J99489n2129j33133M05550P17106
$$ -1133661 -752039 -24158 72492 -300908 -381018 -181529 -233658 -366791 38759 755865
35794G55865J13624n93044l43444M91146Q17777M66756L1897k93109o24568o53782
$$ 755865 869489 276445 -66999 424147 1241924 1708680 1740577 1447468 822900 169118
35784A69118p6050O07798O61624J75781k37710m24416n82791o01900k97639P3422
$$ 169118 93068 700866 1362490 1538271 1300561 876145 293354 -308546 -606185 -532763
35774e32763K38056L84834N85014L86238k86043o05780j10193L74381J18184j63217
$$ -532763 -294707 90127 675141 1061379 775336 169556 59363 433744 551928 388711
35764C88711L26775P40878m9532j166790q67392M74725P78348l92996j192063
$$ 388711 715486 1456364 1406832 240042 -627350 -152625 625723 232727 -959336
35755i59336n57165L13095K61694j18096m0133P8782r6891J40456R67378J115568
$$ -959336 -1516501 -1203406 -941712 -1059808 -1099941 -1021159 -1118050 -977594 -10216 1105352
35745A105352l4532r53051k13071J072410R43610l26828r01544m01828r2492l77277
$$ 1105352 1070820 117769 -95302 977108 1920718 1593890 692346 290518 198026 -179251
35735a79251k93576L99352O62207J23860k17564J54057L60565j53951n04144K8063
$$ -179251 -472827 -73475 588732 712592 495028 649085 1009650 855699 351555 379618
35725C79618N73755J11417o88492m76927N39599Q66995L4566p57823n01882K88242
$$ 379618 953373 1064790 376298 -100629 438970 1305965 1340531 582708 80826 369068
35715C69068O03007L99292L11655M30098K03861n07489j006179o76976Q7147L45107
$$ 369068 972075 1371367 1683022 2113120 2316981 1809492 803313 126337 213484 558591
35705E58591j34429n91694l97563M6114k4826n16873o26449j47638J78275j05521
$$ 558591 424162 -167532 -565095 -518981 -543807 -1060680 -1687129 -1834767 -1656492 -1762013
35695a762013l79359L522N14919K22436n68621n70305M85235J218012N24082p62563
$$ -1762013 -2141372 -2137850 -1622931 -1400495 -1969116 -2539421 -2054186 -836174 -312092 -1074655
35685a074655r81501J27649J267116J408659Q08169J62103l08974n98175m91336
$$ -1074655 -2056156 -1928507 -661391 747268 1555437 1717540 1408566 810391 319055
35676C19055M2448M88955L53761j46149l81715j47474J61529J23253k36767n11043
$$ 319055 361503 850458 1204219 1058070 676355 528881 690410 813663 576896 65853
35666F5853l14022K91645P32088M94668j98508o01906m09575j07967k03605n41329
$$ 65853 -248169 43476 775564 1270232 1071724 469818 60243 -47724 -251329 -792658
35656g92658o61706m22176M8689O01049R21652N86790l07395r75676q75422m14413
$$ -792658 -1454364 -1876540 -1827851 -1226802 -305150 281640 -25755 -1001431 -1876853 -2291266
35646b291266k40272k67667j7651M82815Q34093R61348R72260O55528r5558o76249
$$ -2291266 -2531538 -2799205 -2816856 -2334041 -1499948 -538600 433660 1089188 993630 317381
35636C17381m78721K9554r7626p59599r24828k60465M26683N20169L38352K99778
$$ 317381 -161340 -131786 -229412 -989011 -1913839 -2174304 -1747621 -1227452 -889100 -589322
35626e89322K98626K31234K90396M26555L01489j341m4824M9241k67001p78712
$$ -589322 -290696 -59462 230934 657489 958978 957637 912813 962054 695053 -83659
35616h3659o38019K9958J9472q92446j221978n6371J268349J031381l53928j082344
$$ -83659 -721678 -691720 -672248 -1564694 -2786672 -2843043 -1574694 -543313 -897241 -1979585
35606a979585n05074M39372Q54509O54614M0778o27302p15177q9873L67988L0454
$$ -1979585 -2484659 -2045287 -1190778 -536164 -495386 -1122688 -1837865 -1927738 -1559750 -1529296
35596a529296k72189M36518J352008Q99174o26509j255025k88902P69350P03431
$$ -1529296 -1801485 -1364967 -12959 886215 259706 -995319 -1284221 -514871 188560
35587A88560K44289L99064O82391K54206l35552q280Q71736Q44646m51860j653494
$$ 188560 432849 831913 1514304 1768510 1432958 1424678 2296414 3141060 2689200 1035706
35577A035706j458940j83735Q51494R21365M11678q487j98289l65575m41393j40744
$$ 1035706 -423234 -606969 244525 1165890 1577568 1569081 1370792 1005217 563824 423080
35567D23080L50146L41763l71125j002683p79998l2319L62857K49349J29353J31006
$$ 423080 773226 1114989 743864 -258819 -1038817 -1071136 -708279 -458930 -329577 -198571
35557a98571l0155k14772j0733K87372n1219p82546p07644M91806J541221J317069
$$ -198571 -228726 -443498 -454231 -166859 -218078 -1000624 -1708268 -1216462 324759 1641828
35547A641828L46167j80221o9375M3104j20275l56219n94516p98424n89601K37501
$$ 1641828 1987995 1807774 1738399 1781503 1661228 1305009 710493 -87931 -677532 -440031
$$ [...]
##END NTUPLES=NMR SPECTRUM
##END=
