##TITLE=31Pdec_ADM2705
 CDCl3, 24 sc
 28.5.2019
##JCAMPDX= 6.0         $$ Bruker NMR JCAMP-DX V2.0
##DATA TYPE= NMR SPECTRUM
##DATA CLASS= NTUPLES
##ORIGIN= UXNMR, Bruker Analytische Messtechnik GmbH
##OWNER= root
$$ XWIN-NMR		Version 3.5
$$ Tue May 28 14:22:55 2019 Russian Standard Time (UT+4h)  she@DPX200
##.OBSERVE FREQUENCY= 81.013821
##.OBSERVE NUCLEUS= ^31P
##.ACQUISITION MODE= SIMULTANEOUS
##.ACQUISITION SCHEME= undefined
##.AVERAGES= 24
##.DIGITISER RES= 17
##SPECTROMETER/DATA SYSTEM= spect
##.PULSE SEQUENCE= zgpg30
##.SOLVENT NAME= DMSO
##.SHIFT REFERENCE= (INTERNAL, DMSO, 0, 182.463)
##AUDIT TRAIL= $$ (NUMBER, WHEN, WHO, WHERE, WHAT)
$$ ##TITLE= Audit trail, XWIN-NMR		Version 3.5
$$ ##JCAMPDX= 5.01
$$ ##ORIGIN= Bruker BioSpin GmbH
$$ ##OWNER= she
$$ F:/spectra/data/she/nmr/P31/1/pdata/1/auditp.txt
$$ ##AUDIT TRAIL=  $$ (NUMBER, WHEN, WHO, WHERE, WHAT)
(   1,<2019-05-28 14:21:17.14 +0400>,<she>,<DPX200>,
      <created by zg, POWCHK disabled, PULCHK disabled
       configuration hash MD5:
       00 E9 B6 7A A2 85 ED C7 34 08 36 98 17 FE 4E 26
       data hash MD5: 32K
       6B D0 86 24 46 E7 CE 66 2C 07 56 3F 59 6F A6 D4>)
(   2,<2019-05-28 14:21:19.70 +0400>,<she>,<DPX200>,
      <Start of raw data processing
       efp BC_mod = 2 LB = 1 FT_mod = 6 PKNL = 1 PHC0 = -1811.423 PHC1 = 19.39899 SI = 64K 
       data hash MD5: 64K
       25 A8 FE AF 59 EB 01 D0 84 58 02 A0 83 10 7A B5>)
(   3,<2019-05-28 14:21:36.20 +0400>,<she>,<DPX200>,
      <pk PHC0 = 20.48275 PHC1 = 0 
       data hash MD5: 64K
       1A 15 91 45 37 FB 05 8E F2 01 9F BA E4 07 8E 18>)
(   4,<2019-05-28 14:21:39.31 +0400>,<she>,<DPX200>,
      <abs ABSG = 5 
       data hash MD5: 64K
       A3 2A 98 98 BA FD 06 5C 1F F6 30 9F 0D E4 0E A8>)
$$ ##END=
$$ 
$$ hash MD5
$$ 2E EE ED 72 D2 CF AD AB 60 92 93 C3 1F 50 B7 7C
##$RELAX= 
##$RELAX= 
##$RELAX= 
##$RELAX= 
##$RELAX= 
##$RELAX= 
##$RELAX= 
##$RELAX= 
$$ Bruker specific parameters
$$ --------------------------
##$DU= <F:/spectra>
##$EXPNO= 1
##$NAME= <P31>
##$PROCNO= 1
##$TYPE= <nmr>
##$USER= <she>
##$AMP= (0..31)
100 100 100 100 100 100 100 100 100 100 100 100 100 100 100 100 100 100 
100 100 100 100 100 100 100 100 100 100 100 100 100 100 
##$AQSEQ= 0
##$AQ_mod= 1
##$AUNM= <au_zg>
##$AUTOPOS= <>
##$BF1= 81.014009
##$BF2= 200.13
##$BF3= 200.13
##$BF4= 200.13
##$BF5= 200.13
##$BF6= 200.13
##$BF7= 200.13
##$BF8= 200.13
##$BYTORDA= 1
##$CFDGTYP= 0
##$CFRGTYP= 5
##$CHEMSTR= <none>
##$CNST= (0..31)
1 1 145 1 1 1 1 1 1 1 1 1 1 1 1 1 1 1 1 1 1 1 1 1 1 1 1 1 1 1 1 1 
##$CPDPRG= <waltz16>
##$CPDPRG1= <>
##$CPDPRG2= <waltz16>
##$CPDPRG3= <>
##$CPDPRG4= <mlev>
##$CPDPRG5= <mlev>
##$CPDPRG6= <mlev>
##$CPDPRG7= <mlev>
##$CPDPRG8= <mlev>
##$CPDPRGB= <>
##$CPDPRGT= <>
##$D= (0..31)
0 1 0 0 0 0 0 0 0 0 0 0.03 2e-05 3e-06 0 0 0 0 0 0 0 0 0 0 0 0 0 0 0 0 
0 0 
##$DATE= 1559038876
##$DBL= (0..7)
120 120 120 11 120 120 24 19 
##$DBP= (0..7)
150 150 150 150 150 150 150 150 
##$DBP07= 0
##$DBPNAM0= <>
##$DBPNAM1= <>
##$DBPNAM2= <>
$$ [...]
##$SUBNAM3= <"">
##$SUBNAM4= <"">
##$SUBNAM5= <"">
##$SUBNAM6= <"">
##$SUBNAM7= <"">
##$SUBNAM8= <"">
##$SUBNAM9= <"">
##$SW= 369.568048894756
##$SWIBOX= (0..15)
0 1 3 0 0 0 0 0 0 0 0 0 0 0 0 0 
##$SW_h= 29940.119760479
##$TD= 32768
##$TD0= 1
##$TE= 0
##$TE2= 300
##$TE3= 300
##$TEG= 300
##$TL= (0..7)
0 120 53 12 22 120 120 120 
##$TP= (0..7)
150 150 150 150 150 150 150 150 
##$TP07= 0
##$TPNAME0= <>
##$TPNAME1= <>
##$TPNAME2= <>
##$TPNAME3= <>
##$TPNAME4= <>
##$TPNAME5= <>
##$TPNAME6= <>
##$TPNAME7= <>
##$TPOAL= (0..7)
0.5 0.5 0.5 0.5 0.5 0.5 0.5 0.5 
##$TPOFFS= (0..7)
0 0 0 0 0 0 0 0 
##$TUNHIN= 0
##$TUNHOUT= 0
##$TUNXOUT= 0
##$USERA1= <user>
##$USERA2= <user>
##$USERA3= <user>
##$USERA4= <user>
##$USERA5= <user>
##$V9= 5
##$VALIST= <valist>
##$VCLIST= <CCCCCCCCCCCCCCC>
##$VD= 0
##$VDLIST= <DDDDDDDDDDDDDDD>
##$VPLIST= <PPPPPPPPPPPPPPP>
##$VTLIST= <TTTTTTTTTTTTTTT>
##$WBST= 1024
##$WBSW= 4
##$XGAIN= (0..3)
0 0 0 0 
##$XL= 0
##$YL= 0
##$YMAX_a= 23627
##$YMIN_a= -27769
##$ZGOPTNS= <>
##$ZL1= 120
##$ZL2= 120
##$ZL3= 120
##$ZL4= 120
##$ABSF1= 182.463
##$ABSF2= -187.1042
##$ABSG= 5
##$ABSL= 3
##$ALPHA= 0
##$AQORDER= 0
##$ASSFAC= 0
##$ASSFACI= 0
##$ASSFACX= 0
##$ASSWID= 0
##$AUNMP= <proc_1d>
##$AZFE= 0.1
##$AZFW= 0.5
##$BCFW= 0
##$BC_mod= 2
##$BYTORDP= 0
##$COROFFS= 0
##$CY= -3
##$DATMOD= 1
##$DC= 0
##$DFILT= <>
##$DTYPP= 0
##$F1P= 0
##$F2P= 0
##$FCOR= 1
##$FTSIZE= 65536
##$FT_mod= 6
##$GAMMA= 0
##$GB= 0
##$INTBC= 1
##$INTSCL= 5.30512e-09
##$ISEN= 30
##$LB= 1
##$LEV0= 0
##$LPBIN= 0
##$MAXI= 10000
##$MC2= 0
##$MEAN= 0
##$ME_mod= 0
##$MI= 50
##$NCOEF= 0
##$NC_proc= -6
##$NLEV= 6
##$NOISF1= 182.463
##$NOISF2= 159.3651
##$NSP= 0
##$NTH_PI= 0
##$NZP= 0
##$OFFSET= 182.463
##$PC= 4
##$PHC0= -1790.94
##$PHC1= 19.39899
##$PH_mod= 1
##$PKNL= yes
##$PPARMOD= 0
##$PSCAL= 0
##$PSIGN= 0
##$REVERSE= no
##$SF= 81.0140089999434
##$SI= 65536
##$SIGF1= 159.3651
##$SIGF2= -187.1042
##$SINO= 113.3802
##$SIOLD= 16384
##$SREGLST= <1H.CDCl3>
##$SSB= 0
##$STSI= 65536
##$STSR= 0
##$SW_p= 29940.119760479
##$SYMM= 0
##$S_DEV= 0
##$TDeff= 32768
##$TDoff= 0
##$TI= <>
##$TILT= no
##$TM1= 0
##$TM2= 0
##$TOPLEV= 0
##$USERP1= <user>
##$USERP2= <user>
##$USERP3= <user>
##$USERP4= <user>
##$USERP5= <user>
##$WDW= 1
##$XDIM= 65536
##$YMAX_p= 376352015
##$YMIN_p= -33471470
$$ End of Bruker specific parameters
$$ ---------------------------------
##NTUPLES= NMR SPECTRUM
##VAR_NAME=  FREQUENCY,     SPECTRUM/REAL,   SPECTRUM/IMAG
##SYMBOL=    X,             R,               I
##VAR_TYPE=  INDEPENDENT,   DEPENDENT,       DEPENDENT
##VAR_FORM=  AFFN,          ASDF,            ASDF
##VAR_DIM=   65536,         65536,           65536
##UNITS=     HZ,            ARBITRARY UNITS, ARBITRARY UNITS
##FACTOR=    0.456856943014862, 1,           1
##FIRST=     14782.0589164792, 0,            0
##LAST=      -15158.0608439998, 0,           0
##MIN=       -15158.0608439998, -33471470,   0
##MAX=       14782.0589164792, 376352015,    0
$$ Real data points
##PAGE= N=1
##DATA TABLE= (X++(R..R)), XYDATA
$$ [...]
41104H15935N52122j098166j507524l58701O12361P53621P71033P00639k9032
41095A212288r75558j107906n41088k15449k16892O5840M80865L13149k82922
41086a267673m12324J34111P40712J064617J202278J010025L18477m37622q28574
41077A524027j289170k195593k508661r02452J780513K896035J353356q24445
41069a66390j160555J88101J151114P78098R9127R6911L02897o209l46731J44519
41059A080882J007313Q94514l32045j240654r09651j23679J56680K82094Q29992
41050A645446J123953K50596j178581j768707j310945n42523M55501J853216K562507
41041C090463J293553r49681j687105n38153L14936k58005p45170k2346N19067
$$ y = [815935, 1368057, 269891, -1237633, -1596334, -983973, -230352, 540681, 1241320, 1212288, 236730, -871176, -1412264, -1627713, -1844605, -1778765, -1297900, -984751, -1267673, -1679997, -1545886, -805174, 259443, 1461721, 2471746, 2790223, 2352601, 1524027, 234857, -1960736, -4469397, -5371849, -3591336, -695301, 658055, -166390, -1326945, -1138844, 12270, 790368, 889495, 986406, 1289303, 1283094, 936363, 1080882, 2088195, 2982709, 2650664, 1410010, 500359, 376680, 533360, 815454, 1645446, 2769399, 3019995, 1841414, 72707, -1238238, -1780761, -1325260, 527956, 3090463, 4384016, 3434335, 1747230, 1209077, 1524013, 1266008, 520838, 498492, 1017559]
41032A017559m86772j817736j665573n86968k98663p25807m85253M41524P08280
41023c899409J49m69478R9263J125608J722072J618967R87001J85583l77803o71189
41013C20764r67100j029487k26766J074306J425426L71050p04188p28951m43268
41004i08214n86307l45927P46179J171452j69883j547586r63081L25509j41299
40995b419157j589909j158886J079831K068233Q84272M8976Q92423J405699K34903
40986A446385p15275J60255J070950l0208j668061j202087Q16669J730717J039976
40977B649321N12571O74925K27981j034181j501718n07468M72084K10221n01913
40968A201823m41319J51026L21291j3924k80417l26636l64002l12777j7359K03326
$$ y = [1017559, 530787, -1286949, -2952522, -3539490, -3838153, -4563960, -5049213, -4607689, -3899409, -3899260, -4368738, -4269475, -3143867, -1421795, 197172, 1184173, 1369756, 991953, 320764, -646336, -1675823, -1902589, -828283, 597143, 968193, 264005, -464946, -908214, -1494521, -1840448, -1094269, 77183, -92700, -1640286, -2603367, -2277858, -2419157, -4009066, -5167952, -4088121, -2019888, -1135616, -1086640, -194217, 1211482, 1446385, 731110, 891365, 1962315, 1932107, 264046, -938041, -121372, 1609345, 2649321, 3161892, 3836817, 4064798, 3030617, 1528899, 1021431, 1493515, 1703736, 1201823, 760504, 911530, 1232821, 1218897, 938480, 611844, 247842, -64935, -82294, 121032]
40958A21032p6979o59854r30836o62105j21314M43426Q75362Q19868Q9668o29655
40948g31387k76665J021046J710636Q39531m34319m55002L24179j10119k112475
40939b24575l410134k153052M30546J661899Q32168l50512l25975N80827J043972
40930a914836N02296k08164K04394J773434K705072J406612r85902j657197j09632
40921A716077R02659m05549j912712j000246J020030Q99322j256976k138542m81155
40912b657092J234669R38598k32068m44209O3260J58706j82297m20167n00643
40903b041243l42349L39707J009635O43367m04499o56844q2745k30093j173145
40894b938209r24326R71727J993045N50478j188166o30526J241311J762618P52609
$$ y = [121032, 44053, -615801, -1546637, -2208742, -2330056, -1886630, -1011268, -191400, -101732, -731387, -1008052, 12994, 1723630, 2563161, 2128842, 1673840, 1998019, 1887900, -224575, -3634709, -5787761, -5357215, -3695316, -2863148, -3213660, -3539635, -2958808, -1914836, -1412540, -1620704, -1416310, 357124, 3062196, 4468808, 3482906, 1825709, 1716077, 2618736, 2213187, 300475, -699771, 320259, 1219581, -37395, -2175937, -2657092, -1422423, -483825, -715893, -1160102, -1096842, -938136, -1120433, -1540600, -2041243, -2383592, -2043885, -1034250, -390883, -795382, -1452226, -1534971, -1765064, -2938209, -3862535, -2890808, -897763, -347285, -1535451, -2165977, -924666, 837952, 1590561]
40885A590561M8060J01696j84676r03553r28093p200Q80301J019704L53523r76967
40875I93356k125859j609788N76763K145337J554479M18358P66855J505823M07113
40866D632437j655941j815710M3448J107496K27823o60826k56078J46647n30070
40857A239226j116070m16954O90984Q80547M36114L13423M10977M5222o98209
40848A785260j060907n79133M73399J188258O67734q19384j780059j415794p86004
40839b326630q94730p84963O50469K126535J682588J00598k03828Q10366R90548
40830B150953l0965l88720K96784K79114o31412m15553J049268J016404j289436
40821B036437k554372n02904K143856J762700q04661k131674j344126j88948M27378
$$ y = [1590561, 1638621, 1740317, 1555641, 652088, -276005, -283205, 597096, 1616800, 1970323, 993356, -1132503, -2742291, -2165528, -20191, 1534288, 1952646, 2719501, 4225324, 4632437, 2976496, 1160786, 1204234, 2311730, 2539553, 1878727, 1622649, 1769296, 1239226, 123156, -293798, 397186, 1277733, 1713847, 2027270, 2438247, 2483469, 1785260, 724353, 145220, 618619, 1806877, 2474611, 1655227, -124832, -1540626, -2326630, -3221360, -4006323, -3355854, -1229319, 453269, 553867, 350039, 1160405, 2150953, 2119988, 1731268, 2028052, 2307166, 1675754, 1260201, 2309469, 3325873, 2036437, -517935, -1020839, 1123017, 2885717, 2081056, -50618, -1394744, -1583692, -1156314]
40812a156314Q76692R50511L63711J40999J016682J561983L88946j033217n22801
40803B587192J008612R55682o30501j380153q60745j042222k307514k358352n5759
40794d083760K417798K570168P77821p61350p55049M81880J854181K238296J301590
40785F041575j1213n49679m51827o42364j188059j397047j189967r57203m60125
40776h05909N25979R50249j97971j663453j264406N99619J237250j91538j355750
40767b165930m31374J238357J424646L4098j522302k378761k264930r23400J061742
40758e927854J961679Q61644q43624j103463K69663J698387J852136P51853n65104
40749a044683q78420J10046J163423Q44955l69340o00446N28366J229843N14687
$$ y = [-1156314, -279622, 670889, 1034600, 1175599, 2192281, 3754264, 4143210, 3109993, 2587192, 3595804, 4551486, 3920985, 2540832, 1680087, 637865, -1669649, -4028001, -4083760, -1665962, 904206, 1682027, 920677, 165628, 647508, 2501689, 4739985, 6041575, 6030362, 5480683, 5028856, 4386492, 3198433, 1801386, 611419, -345784, -805909, -279930, 670319, 472348, -1191105, -2455511, -1855892, -618642, -810180, -2165930, -2597304, -1358947, 65699, 99797, -1422505, -3801266, -6066196, -6989596, -5927854, -3966175, -3104531, -3948155, -5051618, -4781955, -3083568, -1231432, -479579, -1044683, -1923103, -1813057, -649634, 195321, -174019, -774465, -246099, 983744, 1498431]
40740A498431j55911M83124J107756N3070j536337j278305N64321J410564L72749
40731B519462o70806m20128r0861r36754j920038j490342k38635J45709k55629
40722c358022J45537J455756J734516J17325j381922o74033J108918J162592p15418
40713d04751j781532n60483J037551R65379J66526M89698J249021N22616j136139
40704E47886j298356K41386J012878j4625q30812J535R10126K44138p08561R2962
40694A98557J924576K399425J024982o40813j644929k199908k071191p10278J031918
40685f87661J436729M32511k63619J37320M50038k13728q63565l59442N98570
40676F67153M98885p04963j572697j188845k24253J27562l40394p48318l71177
$$ y = [1498431, 1342520, 1825644, 2933400, 2986470, 1450133, 171828, 736149, 2146713, 2519462, 1848656, 1428528, 1337667, 400913, -1519125, -3009467, -3248102, -3102393, -3358022, -3212485, -1756729, -22213, 95112, -1286810, -1960843, -851925, 310667, -404751, -2186283, -2746766, -1709215, -743836, -577310, -87612, 1161409, 1684025, 547886, -750470, -509084, 503794, 489169, -341643, -340108, 570018, 814156, 105595, 198557, 2123133, 4522558, 5547540, 4906727, 3261798, 1061890, -1009301, -1719579, -687661, 749068, 1181579, 917960, 1055280, 1505318, 1291590, 428025, 68583, 667153, 1166038, 461075, -1111622, -2300467, -2524720, -2397158, -2737552, -3485870, -3857047]
40667c857047M20606P85489P35976J061835J752930J540553j91508j942917j825351
40658a519434k40191O58779L3821o91292k05328R28640J548268J580668J490570
40649C584501J084898K2409j147483j589304j421482j298461j052844P1789J795590
40640D9613K553531J359919q04307k027878j481575N9797J344629J701948J087491
40631C843168k53692j797649k699900k276948p66110O10957P24183k21060q01669
40622c638720M868J521937K095991J059148n33922j255922q32857J3133O42222
40613i24122P63570J16138j129416j818337p99625J323085K490667J660005L793
40604A685758q47867o98898k27560L15067P93294N88567l83465q97851j18083
$$ y = [-3857047, -3436441, -2650952, -1914976, -853141, 899789, 2440342, 2248834, 305917, -1519434, -1759625, -1100846, -1067025, -1758317, -1963645, -1035005, 513263, 2093931, 3584501, 4669399, 4691808, 3544325, 1955021, 533539, -764922, -1817766, -1745977, 49613, 2603144, 3963063, 3158756, 1130878, -350697, -290900, 1053729, 2755677, 3843168, 3589476, 1791827, -908073, -3185021, -3951131, -3340174, -2615991, -2837051, -3638720, -3633852, -2111915, -15924, 1043224, 509302, -746620, -1579477, -1566344, -924122, -160552, -44414, -1173830, -2992167, -3791792, -2468707, 21960, 1681965, 1685758, 837891, 138993, -88567, 226500, 1019794, 1608361, 1224896, 327045, 208962]
40595B08962O80325k08165k061443k500631r20409Q35903J297534Q96410M40775
40586a330739O9301J83792J410745K938489K805635O64051j541824k366997k340940
40577D91513j912615l84865J795593K246130J05670j965250j506408Q6034K03552
40568h40646o28102j86347J142993J058593l88552p93345M23278J181245M33414
40559A402531l95984l04246j92315n65907l56355Q32286J537244P19740n97355
40550B079639j045701o75608j78171J10347j90391j270777k040490j101563P89153
40541c523562J349260L33469j9933J114561J622020K18658j054853j91141J351039
40532A199518J101876l96206p47124L82578J166938O99738j79186o77584o89902
$$ y = [208962, 889287, 681122, -1380321, -3880952, -4801361, -3965458, -2667924, -1771514, -1330739, -1261438, -1077646, 333099, 3271588, 6077223, 6741274, 5199450, 2832453, 491513, -1421102, -1805967, -10374, 2235756, 2341426, 376176, -1130232, -1044198, -840646, -1468748, -1655095, -512102, 546491, 157939, -635406, -212128, 969117, 1402531, 1006547, 702301, 509986, -55921, -412276, 420010, 1957254, 2676994, 2079639, 1033938, 358330, 180159, 290506, 100115, -1170662, -3211152, -4312715, -3523562, -2174302, -1840833, -1860766, -746205, 875815, 1094473, 39620, -151521, 1199518, 2301394, 1905188, 1158064, 1540642, 2707580, 3407318, 3228132, 2550548, 1860646]
40523A860646o0491J079134J701987J103774R6508l58086p24041j581270j956076
40514A162085q67700N81745P84348K42131L04921L73347q99292k431552j866846
40505b616813L97171J518851O33254k57365j87652n89980j784897j570534R18185
40496c539780K952721K088851j13207p20030J78938L64976o55285j412296j230927
40487b086039p26313j03374P48701R49232k52250j386395l21086K070578K486953
40478A380007L3954k185824j581301K75942N01326n34511j92499J837898K910996
40469B445988J573437l35943p27288k05956m24329j178908j170073n91113o87430
40460a301615j190412n75026J003556J438617L9838j109606l76567R24182R11588
$$ y = [1860646, 1800155, 2879289, 4581276, 5685050, 5781558, 5423472, 4699431, 3118161, 1162085, 294385, 876130, 1660478, 1902609, 2207530, 2580877, 1681585, -749967, -2616813, -2219642, -700791, -67537, -324902, -512554, -1102534, -2887431, -4457965, -3539780, -587059, 1501792, 1388585, 668555, 847493, 1212469, 557184, -855112, -2086039, -2812352, -2915726, -2167025, -1217793, -1470043, -2856438, -3177524, -1106946, 1380007, 1413961, -771863, -2353164, -2077222, -1575896, -2110407, -2302906, -465008, 2445988, 4019425, 3683482, 2956194, 2750238, 2325909, 1147001, -23072, -614185, -1301615, -2492027, -3067053, -2063497, -624880, -585042, -1694648, -2071215, -1147033, -235445]
40451b35445J59596K23156O60802N4638j036195r22276k0251k80699j450458j042550
40441c889682J363088K872765J617286m09287o18521M19707O48118M1739k2526
40432B022687L73451J7381r06428r76800m592O82578M06089j56940m69995p43177
40422B44254r16170m84753M27279J022815J006175P52696L42459m43516j214691
40413G36548j235460n76474J14775Q00298J692279J966182N70161j574829k071306
40404D22174l17184J426948J080056o44503j647666j155266P8294J164133J499753
40395A906739O68484r17495j884939j370759r9409O93324O70496Q5820r07152
40386a154891j752941j412458N5170Q90688K218j069111k42666J841284K623777
$$ y = [-235445, -75849, 147307, 808109, 862747, -173448, -1095724, -1115975, -1396674, -2847132, -3889682, -2526594, 346171, 1963457, 1554170, 935649, 1355356, 2003474, 2045213, 2022687, 2396138, 2413519, 1507091, 530291, 525699, 1208277, 1614366, 1457426, 987431, 244254, -671916, -1156669, -729390, 293425, 1299600, 2052296, 2394755, 1951239, 736548, -498912, -1075386, -960611, -160313, 1531966, 3498148, 4068309, 2493480, 422174, 104990, 1531938, 2611994, 1967491, 319825, -835441, -757147, 406986, 1906739, 2575223, 1657728, -227211, -1597970, -1697379, -1004055, -333559, -247739, -1154891, -2907832, -4320290, -4265120, -3374432, -3372214, -4441325, -4683991, -2842707, -218930]
40377b18930J272478n15081j271731j276747j052787l32785Q06546J433258J186558
40368C0779Q80604R71442P00836m47820j591483j601350n49634O28654J114611
40359A36639M92613r26428j794453r80158N90394Q50381l01160o72270P83784
40350a820658K316240K264919J413299R21730J18846j586220k631738j680316
40342f83898l51159p44432j698145o95773J615646K336588J102556K73096N34246
40333A688725J45954j127845j252487P8357M96412p32180j188399K61382J203649
40324d26432j2659j248195m57430P22006L08132j76270J258811K853750J896405
40315D718118l92434r77778l20864j068029k612114j843013R78881J989899n1596
$$ y = [-218930, 1053548, 538467, -733264, -2010011, -3062798, -3395583, -2589037, -1155779, 30779, 911383, 1882825, 2583661, 2135841, 544358, -1056992, -1606626, -977972, 136639, 629252, -297176, -2091629, -3071787, -2481393, -1631012, -1932172, -2604442, -1820658, 495582, 2760501, 4173800, 5095530, 5214376, 3628156, 996418, -683898, -1035057, -1779489, -3477634, -4173407, -2557761, -221173, 881383, 1154479, 1688725, 1834679, 706834, -545653, -467296, 29116, -703064, -1891463, -1630081, -426432, -439091, -1687286, -2144716, -1422710, -1114578, -1290848, -32037, 2821713, 4718118, 4325684, 3347906, 3027042, 1959013, -653101, -2496114, -1517233, 472666, 421070]
40306D21070j827355r64708N96727M75996m33697k43387O96200R59355L93759
40297G3960l96571j151462j320276k22154J182012Q59735r57489j487117L34646
40288c084716K004867J513805M64178R22650J735859P62504j240283j945226j198134
40279f4496n20745n5694J018411J867011Q65358j232613j879123n63489N63417
40270a963K10567l73641P5640P88741M83331o09906j322707j170289n43815R6660
40260b367382N93155R23135R38244L11805q98257j606332n74856J581503K460166
40251A361181R04488j196534j450510j91968N06951J42727M5078P39064J121390
40242A981867M11396p38726j341472j035625O1372J316776J623057O83723j56034
$$ y = [421070, -1406285, -2370993, -1774266, -1298270, -1731967, -1975354, -1279154, -319799, 73960, -322611, -1474073, -2794349, -3016503, -1834491, -974756, -1932245, -3419362, -3084716, -1079849, 433956, 898134, 1820784, 3556643, 4319147, 3078864, 1133638, -64496, -585241, -640935, 377476, 2244487, 3109845, 1877232, -1891, -565380, -1963, 208604, -165037, -89397, 699344, 1182675, 572769, -749938, -1920227, -2464042, -2367382, -1774227, -851092, 87152, 398957, -499300, -2105632, -2680488, -1098985, 1361181, 2265669, 1069135, -381375, -573343, -66392, 76335, 121413, 860477, 1981867, 2393263, 1654537, 313065, -722560, -661188, 655588, 2278645, 2962368, 2806334]
40233B806334K58542Q27493k29270k186896k420466k58521J962287K172426R56545
40224C888474K1072j621N09099R30902M48257j294072l044215k852730o68020
40215b062854J374538J743993J087087M92981q3844p81014q32038J62981J144812
40206B246642R09356l50828j619743k243956j918426o11906P93154R48071j37079
40197a984715q76859l88278L60231M43868M66317J041005J323096N23558l91699
40188E16524j50263O88673P25602N4427j21056L47880N03298J34439N9408N25616
40178C284548P09652M9966r20466j297864p40176K97121Q06323M8229j380007
40169H57326j854489p15116P51775J084510N67421L35096L93946j6304o13186
$$ y = [2806334, 3064876, 3892369, 3663099, 1476203, -944263, -1202784, 759503, 2931929, 3888474, 3909546, 3907925, 4417024, 5347926, 5796183, 4502111, 1457896, -1394834, -2062854, -688316, 1055677, 2142764, 2635745, 2551901, 1770887, 938849, 1101830, 2246642, 3155998, 2805170, 1185427, -1058529, -2976955, -3588861, -2795707, -1847636, -1984715, -2861574, -3249852, -2889621, -2445753, -1979436, -938431, 384665, 908223, 516524, 366261, 1054934, 1780536, 1834963, 1713907, 2061787, 2565085, 2699524, 2758932, 3284548, 3994200, 4044166, 3123700, 1825836, 1085660, 1382781, 2189104, 2237333, 857326, -997163, -1712279, -960504, 124006, 691427, 1026523, 1420469, 1404165, 790979]
40160G90979l05681P78116J086480q8233j388642j178076K29020R63270L867j521561
40150f30461j764209n62736L39030j84768q43716J78824K204222K779520J354003
40141B869709L0690P8156Q5167j119394k073485j267640j12592o43091j718838
40132c871318o76395J928568K613322K38417k130555j621363P12677J942808J162913
40123B99074j72955n77779J37946J142317J301801J92087j157601j257339j57392
40114b49841N06907j96537j226791j103489K08946J491998J635813M66313j104598
40105D28721j617172n41052Q03502P73677k93364o29726J82993P11300K59840
40096G8719L1463Q29072J401210M49322j094151j382161l45099M89287L38065
$$ y = [790979, 485298, 1263414, 2349894, 2261661, 873019, -305057, -76037, 887233, 891100, -630461, -2394670, -2957406, -2618376, -2803144, -3646860, -3468036, -1263814, 1515706, 2869709, 2900399, 2978555, 3063722, 1944328, -129157, -1396797, -1509389, -2152480, -3871318, -4547713, -2619145, -5823, 232594, -1897961, -3519324, -2806647, -863839, 299074, 126119, -451660, -313714, 828603, 2130404, 2322491, 1164890, -92449, -249841, 257066, 60529, -1166262, -2269751, -2060805, -568807, 1067006, 1533319, 428721, -1188451, -1729503, -926001, -152324, -445688, -1075414, -892421, -181121, 78719, 110182, 939254, 2340464, 2789786, 1695635, 313474, -31625, 457662, 795727]
40087G95727j07707q9925K79791N34308M77634K14740L671k0868j98801j015492
40077H73078k161609k510494j453439K79859J523262J826210J371408M82044k84566
40068e4247k61045M76536R02583K37679j079827j982046j834291o80344R10721
40059c364281J996448J965187J263424O78722J9930j295622k476299j970875j55356
40050c338722O71351k21483p10630O59986K105983J512601n0160k29905O82043
40041A081064N79664o25445r90633k5260O90364M41995K29816L62280j45970j147329
40031D50546r08925R05646K127790J222076n05809j218457j160850j339341j287272
40022a714596j62588J062993O35239j210691k305769j358348N90150J624906J016584
$$ y = [795727, 688020, 598095, 877886, 1412194, 1889828, 2104568, 2108239, 2087371, 1888570, 873078, -1288531, -3799025, -5252464, -4972605, -3449343, -1623133, -251725, 230319, -54247, -315292, 161244, 1063827, 1301506, 221679, -1760367, -3594658, -4275002, -3364281, -1367833, 597354, 1860778, 2539500, 2559430, 1263808, -1212491, -3183366, -3338722, -2667371, -2888854, -3599484, -2939498, -833515, 679086, 628926, 399021, 1081064, 1660728, 1035283, 44650, 19390, 709754, 1151749, 1381565, 1743845, 1597875, 450546, -458379, 447267, 2575057, 3797133, 3291324, 2072867, 912017, -427324, -1714596, -1877184, -814191, -178952, -1389643, -3695412, -5053760, -4463610, -2838704, -1822120]
40013a822120k31050m39393R45592K454147K143829K08279j087024n29091M33947
40004B077116J70983n79256k44017P01524M76673r61158j768160j076623l2507
39995a235425L36823M90936R70780J137468K38024j251478k145295j790399l84095
39986c632661J249493J957994J207197l761j33847P24746Q29430n97086k055219
39977d53714j911937o49208J56142J16276o996J03605J60311K60939P06385J098514
39967d19683Q44477L02426K03964K54792k79707q73440l51704P96649O95822q61692
39957C11904j676849m59439J024833O44094q14803r66266N83431J978984J907079
39948B532968P38622q10180k249730k600471j029811J460638K646953J803993
$$ y = [-1822120, -2053170, -2492563, -1546971, 907176, 3051005, 3259284, 2172260, 1643169, 2077116, 2248099, 1668843, 1424826, 2126350, 2603023, 1641865, -126295, -1202918, -1235425, -898602, -407666, 563114, 1700582, 1938606, 687128, -1458167, -3248566, -3632661, -2383168, -425174, 782023, 778262, 644415, 1369161, 2198591, 1601505, -453714, -2365651, -3014859, -2858717, -2742441, -2749437, -2645832, -2485521, -2224582, -1518197, -419683, 424794, 727220, 931184, 1185976, 906269, 32829, -318875, 477774, 1173596, 311904, -1364945, -1824384, -799551, -155457, -970260, -1936526, -1353095, 625889, 2532968, 3271590, 2461410, 211680, -2388791, -3418602, -1957964, 688989, 2492982]
39940B492982L29612o17899j321950j821957j081730R36721K131491Q94484j309296
39931F32458j761835j04015J580127J762842Q59725j50670q69301j118271p58619
39922G2441j45708J33237O4203L6316P7517M9250K07214O16121N31159m28519
39912A213231j057665q2082J511066J524873j79179j490265j287303o85659n50379
39903a083362j09828R26363J149050j07094j094116k96295R60920O73887n21738
39894D97787o26266K28747K64800n57068m52370R06528J711019J027484N8639
39885C059300k20839l97846q00756n85127L26762N32572l89657q15562M9770M00514
39875A159131j071671k344539r94723J527044J680348p91217k484511j393176
$$ y = [2492982, 2822594, 2204695, 882745, -939212, -2020942, -1084221, 1047270, 1941754, 632458, -1129377, -1233392, 346735, 2109577, 2969302, 2818632, 1949331, 831060, 72441, -73267, 59970, 124173, 160489, 238006, 287256, 494470, 1110591, 1641750, 1213231, 155566, 73484, 1584550, 3109423, 2930244, 1439979, 152676, -532983, -1083362, -1193190, -266827, 882223, 775129, -318987, -615282, 345638, 1019525, 497787, -128479, 100268, 365068, -192000, -644370, 262158, 1973177, 3000661, 3059300, 2838461, 2440615, 1639859, 1054732, 1381494, 1914066, 1524409, 708847, 758617, 1159131, 87460, -2257079, -3251802, -1724758, -44410, -835627, -3320138, -4713314]
39867d713314P19103J658662J684343J814130J676851P60489q848K43783O16263
39858D451462k4983q68244m24814P78865P97437o72142j719080r87319M81474
39849A812656P36098p09929k478244k748770r22889J662890K781382J612435k66259
39840A479370q28799o1973N24340L75093L79919Q87109Q87958j90543j222270
39831B230204q70734N16568J415869R86042k95237j385899j458644l62569J120606
39822A896206J811815J322229L38734m66871j140653j753444j881187j382479
39814a255650q97365q31651n87040L50381J283142J296143P55364O16219P13423
39805A442966J45147q25275q02470N06729J476633P01653r97588j572125k82045
$$ y = [-4713314, -3994211, -2335549, -651206, 1162924, 2839775, 3600264, 3591416, 3835199, 4451462, 4426479, 3558235, 3133421, 3912286, 4709723, 4037581, 2318501, 1331182, 1812656, 2548754, 1838825, -639419, -3388189, -4311078, -2648188, 133194, 1745629, 1479370, 650571, 588598, 1112938, 1488031, 1867950, 2755059, 3643017, 3452474, 2230204, 1359470, 1876038, 3291907, 4277949, 3982712, 2596813, 1138169, 775600, 1896206, 3708021, 5030250, 5368984, 4902113, 3761460, 2008016, 126829, -1255650, -2153015, -2984666, -3571706, -3221325, -1938183, -642040, 113324, 729543, 1442966, 1588113, 762838, -39632, 467097, 1943730, 2645383, 1647795, 75670, -206375]
39796b06375J496819J897849N61412j061507j318945j88284P84348M68386n15116
39787A918587r22603o76829n70878o52432k20765O01069P07898j56063o72660
39778f44676J99965J644881K152541J531100P64508L49308j53471r86200j521881
39769C336075j004397M50050J778721J805936K86810j710591k656468j987304
39761B98832n36484M78129N31562j61288j037953j350563o18167N69632Q17301
39752a008999l27348j431905q65844R50348K016406J325779j46861j108205j360332
39743a956961j095364l0884J711712K715311J642701p21360k093695j482889j91617
39734a503046K72086M7466l968J03270k2521Q7730R90037J743215Q13710j343269
$$ y = [-206375, 1290444, 3188293, 3749705, 2688198, 1369253, 1180969, 1965317, 2433703, 1918587, 995984, 319155, -251723, -904155, -1124920, -523851, 184047, 27984, -644676, -444711, 1200170, 3352711, 4883811, 5648319, 5997627, 5844156, 4857956, 3336075, 2331678, 2781728, 4560449, 6366385, 6653195, 4942604, 2286136, 298832, -237652, 240477, 772039, 610751, -427202, -1777765, -2395932, -1826300, -1008999, -1336347, -2768252, -3634096, -2683748, -667342, 658437, 511576, -596629, -1956961, -3052325, -3083209, -1371497, 1343814, 2986515, 2265155, 171460, -1311429, -1503046, -1230960, -1183494, -1187462, -1084192, -1106713, -1018983, -28946, 1714269, 2527979, 1184710]
39724A184710k313621r28325J032911J244254k34797j466329j163561L08011J705392
39715f31355J764070P8949j952314k003944K87005K334472J798852l45352j543554
39706b13171j286058q74960n61945L93067J276505N26337j091744r64967J091335
39697a705601K114068O48615r65859o46044J03753p10162j780901q54984J057344
39688b739771J203120l38874r91075o5049M66013l40582r46529j59444J106956
39679b805235J653262J479973P82127n67027j819620j543574J48405J295052Q78766
39670d97871K23848O04670J132900L84804j177088j908660j284065j85814N34426
39661b172850O92544L93672r0762l66540m01144n46515p41256m23454L40228N65347
$$ y = [1184710, -1128911, -2057236, -1024325, 219929, -14868, -1481197, -2644758, -2336747, -631355, 1132715, 1211664, -740650, -2744594, -2457589, -123117, 1675735, 1330383, -213171, -1499229, -2374189, -2936134, -2543067, -1266562, -740225, -1831969, -2796936, -1705601, 408467, 1057082, 91223, -554821, -451068, -1161230, -2942131, -3797115, -2739771, -1536651, -1875525, -2866600, -2931649, -2465636, -2806218, -3752747, -3912191, -2805235, -1151973, 328000, 1110127, 543100, -1276520, -2820094, -2671689, -1376637, -497871, -274023, 330647, 1463547, 1848351, 671263, -1237397, -2521462, -2707276, -2172850, -1480306, -1086634, -1177396, -1543936, -1945080, -2491595, -3232851, -3656305, -3316077, -2750730]
39651b750730j73263r12332p63856l12874n38696j093082q47508L05520J377570
39642e709251J767832J724117J426735O96585k41660o40851k22660L76719N28410
39633b94024M75551Q10833J373786J254416N1980j288901j424149l60465L93915
39624I92942k13578j301318j254278M3964J157014J108453L93968r3839j15246
39615G18082J84325N97955N50745n71203k287437l071440k096489k26133J195959
39606e005636J753274J650200R09225l11849j244258j210397m77222J80803M48698
39597c307162N71088Q58021J412610J945088J725912L48467j363649k038097j470067
39588a317789o65772o8681Q98113K148483K396681J139207l06801p87185r13908
$$ y = [-2750730, -2923993, -3836325, -4600181, -4913055, -5451751, -6544833, -7392341, -7086821, -5709251, -3941419, -2217302, -790567, -93982, -335642, -976493, -1199153, -822434, -294024, 181527, 992360, 2366146, 3620562, 3672542, 2383641, 959492, 599027, 992942, 779364, -521954, -1776232, -1732268, -575254, 533199, 927167, 833328, 718082, 902407, 1500362, 2051107, 1479904, -807533, -3878973, -5975462, -6201595, -5005636, -3252362, -1602162, -692937, -1004786, -2249044, -3459441, -3936663, -3755860, -3307162, -2736074, -1878053, -465443, 1479645, 3205557, 3554024, 2190375, 152278, -1317789, -1983561, -2052242, -1154129, 994354, 3391035, 4530242, 4223441, 3436256, 2522348]
39579B522348j489031j792681r94752M529o3846o41621l58671N99545J059490
39570a154690J073230J514827J994229J341020p7068o70258k32150j33241p76211
39561B879688r45613q4402P22086N97018Q000m66100q88606j007906k01173J043667
39551A656659J178342k16739j727316k122078j608699o66395O36543J570918Q98415
39542d00350r68211j752218l91882J333204J485874O37253L77302O52135L39228
39533A312335n82021j144119r84115m41113K66430Q04097M98038m96242p55183
39524a521893M21671J571864J025093o42351j619208j443319r39164l63380N72554
39515b938133J341734J071236J27193l57982l01250m90913q42449m12616Q85333
$$ y = [2522348, 1033317, -759364, -1754116, -1749587, -1813433, -2455054, -2813725, -2214180, -1154690, -81460, 1433367, 3427596, 4768616, 4691548, 4021290, 3789140, 3655899, 2879688, 1934075, 1849673, 2571759, 3168777, 3176777, 2710677, 1822071, 814165, 612992, 1656659, 2835001, 2618262, 890946, -1231132, -2839831, -3506226, -2869683, -1298765, -400350, -1368561, -3120779, -3512661, -2179457, -693583, -56330, 320972, 973107, 1312335, 730314, -413805, -1397920, -1839033, -1572603, -768506, -270468, -766710, -1521893, -1100222, 471642, 1496735, 854384, -764824, -2208143, -3147307, -3510687, -2938133, -1596399, -525163, -397970, -755952, -1057202, -1548115, -2390564, -2803180, -1917847]
39506a917847J964434J973170R52486o23189j876499j642512J46701J746680J617828
39497B341252M75289j16707k20220p04684r76910J2708J204239O72520q99783
39488A787704j004545M45598Q96496m09006j198713l17981L80770j95461j82010
39479B02852J517726K542035R02149j284553j158743R0806m90957k250216j934446
39470a863347P13372K453390J669728K28614l10820p71477j556933j098591J105607
39461E69543K589712J286338j104715j434332M29183J735414Q95458p14105j118592
39452C133904k88869L23019r8621q53779q36991k4478N40178K09716m28015n92764
39442A083300n52864r76586j519334j216479j14912P19361Q47646Q32685P95098
$$ y = [-1917847, 46587, 2019757, 2972243, 2349054, 472555, -1169957, -1023256, 723424, 2341252, 2816541, 2699834, 2479614, 1774930, 798020, 810728, 2014967, 2687487, 1787704, 783159, 1228757, 2125253, 1716247, 517534, 199553, 580323, 384862, 202852, 1720578, 4262613, 5164762, 3880209, 2721466, 2812272, 2321315, 71099, -1863347, -1149975, 1303415, 2973143, 3201757, 2890937, 2119460, 562527, -536064, 569543, 3159255, 4445593, 3340878, 1906546, 2335729, 4071143, 4966601, 4252496, 3133904, 2845035, 3168054, 3069433, 2215654, 1378663, 1354185, 1894363, 2104079, 1676064, 1083300, 530436, -446150, -1965484, -3181963, -3296875, -2577514, -1729868, -897183, -102085]
39433a02085J2815j501198k320151j355539O17022J955888J958569J068655M5474
39424C79450m51715j48172M26313M52178O1435J20943M87775j11592j729296k299215
39414b811896m49285K065533K453635N49792j386726j889592j367674l62070J090366
39405b107917K185321J580353l84228j468021m96584R41378Q72181l03606q26725
39396g848l71439j62683p17705j106533o14147J88472N14888N40190Q65645J426899
39386E55739J636488J323406Q90345N89722J95543m69502j114313j355391j224222
39377A027815r98642p63720m99413l81864n14234n31805r4765L52095J43944k89202
39367b549791J92702J418422J647027K05745j000347j32660J528951J276171q25493
$$ y = [-102085, -89270, -1590468, -3910619, -5266158, -4649136, -2693248, -734679, 333976, 379450, -72265, -220437, 205876, 658054, 719489, 840432, 1328207, 1216615, -512681, -2811896, -3261181, -1195648, 1257987, 1807779, 421053, -1468539, -2836213, -3198283, -2107917, 77404, 1657757, 1273529, -194492, -691076, 250302, 1122483, 818877, -7848, -379287, -541970, -1259675, -2366208, -2980355, -2791883, -2276995, -1736805, -871160, 555739, 2192227, 3515633, 4405978, 4995700, 5191243, 4721741, 3607428, 2252037, 1027815, 29173, -734547, -1233960, -1615824, -2130058, -2661863, -2756628, -2404533, -2260589, -2549791, -2357089, -938667, 708360, 914105, -86242, -218902, 1310049, 2586220, 1760727]
39358A760727j902291o50595Q11406M68045n72624k98562Q48232J084221N12397
39349B060956O78760J423870Q30608j407845k967820k156094k96854L63785l13285
39340a783919q51387o54592m20857n06195l71041K49789P41144N28622p3864l08226
39330c450526Q5511O49504Q12428N45562K99781K50188n9054q69200j355789n67452
39320c659047Q26140J021562k24491q23900O58043K558065K313127K05745j140885
39311A734359o41726J47352N395k45226J13463N3888j147090j985624q46184J157659
39301a653734J639958N65803J34016J157308J836666P05894j107737j600069n84259
39292A093846M32013L25737n78048j139629n83411O64466J209627K73782j067058
$$ y = [1760727, -141564, -792159, 19247, 487292, -85332, -383894, 464338, 1548559, 2060956, 2739716, 4163586, 4994194, 3586349, 618529, -1537565, -1834419, -1470634, -1783919, -2635306, -3289898, -3710755, -4216950, -4587991, -4338202, -3597058, -3068436, -3142300, -3450526, -3365015, -2715511, -1903083, -1357521, -1057740, -807552, -866606, -1735806, -3091595, -3659047, -2832907, -1811345, -2035836, -2859736, -2201693, 356372, 2669499, 2875244, 1734359, 1092633, 1239985, 1245380, 1000154, 1113617, 1167505, 20415, -1965209, -2811393, -1653734, -13776, 552027, 686043, 1843351, 3680017, 4385911, 3278174, 1678105, 1093846, 1525859, 1851596, 1273548, 133919, -449492, 214974, 1424601, 1698383, 631325]
39283F31325j110335J00481Q85095N30597J98489O46740P62378m23868j698681
39274E22221j276347M99742J751838J721083J140759M38649n91320j461058j198539
39265A547028j21365K98289k48853l80126N55342J176528K54136j208725j501887
39256C70367q21045o77571j151773n72953J689247L622156K851025j52764k389324
39247B767365j941990j78635L59319n64694r03506L24665J488300R62133k99744
39238B013213l98457M12105L57710o25040o86899O54777J400226J74570j577322
39229A724883j872834j007719m40226j89227O83943J779832J619264P0180j235090
39220A133006j131928k27389L08759J66926j86804j75087M93877J389564J365092
$$ y = [631325, -479010, -378529, 506566, 1037163, 1235652, 1882392, 2644770, 2220902, 522221, -754126, -254384, 1497454, 3218537, 4359296, 4797945, 4206625, 2745567, 1547028, 1425663, 1723952, 1475099, 1094973, 1650315, 2826843, 3080979, 1872254, 370367, -450678, -1128249, -2280022, -2852975, -1163728, 2458428, 5309453, 5156689, 2767365, 825375, 646740, 1006059, 441365, -462141, -137476, 1350824, 2312957, 2013213, 1614756, 2026861, 2384571, 1759531, 1072632, 1727409, 3127635, 3302205, 1724883, -147951, -1155670, -1595896, -1785123, -1101180, 678652, 2297916, 2368096, 1133006, 1078, -226311, 82448, 249374, 62570, -112517, 381360, 1770924, 3136016]
39211C136016j43860j886419j913758q8816J568955J402765N169r51915q98084
39202B30053n70866n88422p39198o22282k76203M6667L00389N02757L85399l30833
39192a662539j217145j253879j53939R05742P17150j16190N976J054475J198493
39183e21856j69155j035290K55626K154383K002225k633j194198l94430Q44716
39174A939388J048949N90793J17561o26638j458179j182421L24550J116179j39410
39165A730772j784039j354211P01170J566498J55187j349609o49069J482408K312956
39156B812063P84000j222776j425036r751Q81909J93549p82625o30817q034l50512
39146B41970j279452j105159L63714J472410J367149J001504R48557K83633j284550
$$ y = [3136016, 2992156, 1105737, -808021, -896837, 672118, 2074883, 2080052, 1128137, 230053, -340813, -929235, -1668433, -2290715, -2566918, -2520251, -2219862, -1717105, -1331706, -1662539, -2879684, -4133563, -4287502, -3381760, -2664610, -2780800, -2774824, -1720349, -521856, -691011, -1726301, -1470675, 683708, 2685933, 2683300, 1489102, 1094672, 1939388, 2988337, 3579130, 3696691, 3070053, 1611874, 429453, 754003, 1870182, 1730772, -53267, -1407478, -706308, 860190, 1015377, -334232, -983301, 499107, 2812063, 3596063, 2373287, 948251, 938500, 1820409, 2013958, 1231333, 600516, 592482, 241970, -1037482, -2142641, -1778927, -306517, 1060632, 2062136, 3010693, 3294326, 2009776]
39137B009776k117547j027304O33418R98289M63616N37127J077626Q55774M7351
39128C478126j45465J18159l20925j071905m96071J230653J871257O31616m69111
39119D826334J41088J118919N82494q10654j127824l36778j15456r98123j674911
39110A605089j188787k16591K32387J69514J09595P1598k13837n60859m57920
39101d49811J34271N96620M44699M0943J38187P08076P36692l98592j730657j618534
39091a398106J44086J859792J837038K44443j262366j375458k78339P67205O90936
39082A229231l98566j361343j216209q1065J184865J889219J667290K91285j784534
39073A420173k992308j965955N44106K156118J629950J91878l52494J70490O75925
$$ y = [2009776, -107771, -1135075, -501657, 496632, 960248, 1497375, 2575001, 3430775, 3478126, 3332661, 3450820, 3129895, 2057990, 1561919, 2792572, 4663829, 5295445, 4826334, 4967422, 6086341, 6668835, 5858181, 4730357, 4393579, 4278123, 3280000, 1605089, 416302, 199711, 432098, 601612, 711207, 782805, 568968, 8109, -449811, -315540, 281080, 725779, 766722, 904909, 1612985, 2349677, 1951085, 220428, -1398106, -1254020, 605772, 2442810, 2687253, 1424887, 49429, -228910, 538295, 1229231, 830665, -530678, -1746887, -1827952, -643087, 1246132, 2913422, 3204707, 1420173, -1572135, -3538090, -2993984, -837866, 792084, 983962, 631468, 801958, 1477883]
39064A477883N64960J70603j09402l08709o16199j020375j144017m40416J012408
39055d13264K048744J571031J44770o38306m67437n77150j359880j432246J6058
39046a107680J595758J737321Q76382J67619m90278j358988j289571M53492K042249
39037B626304J469526J24199Q08210K729373K239837j115957l325282k032485
39029C523725o3146n04012j736969o67650J751850K173988M45833n59284o7114
39020D297221k95201j947433k619979q63923J305281J572727N27296k9050N9746
39011B006685q126n5399L92591O46165r1090j035106q88064M2130L86991j02964
39001A293813m71678l34768k55792m70447n75975m68459l92801r5574Q75596J984213
$$ y = [1477883, 2042843, 2213446, 2104044, 1795335, 1179136, 158761, -985256, -1425672, -413264, 1635480, 3206511, 3351281, 2712975, 2245538, 1668388, 308508, -1123738, -1107680, 488078, 2225399, 3101781, 3269400, 2779122, 1420134, 130563, 584055, 2626304, 4095830, 4220029, 5028239, 7757612, 9997449, 8881492, 5556210, 3523725, 3460579, 2956567, 1219598, 551948, 2303798, 4477786, 4923619, 4364335, 4297221, 4002020, 2054587, -565392, -1429315, -124034, 1448693, 1975989, 1946939, 2006685, 1998559, 1943160, 2335751, 2981916, 2890826, 1855720, 967656, 1009786, 1396777, 1293813, 822135, 487367, 231575, -238872, -814847, -1283306, -1676107, -1771681, -896085, 1088128]
38991A088128J995182O47129r59079j775102j660156q18921M44243J235751O24342
38982H21517q28925j262898N9990J536659J317327j85225r53563j03488J137001
38973A538395J214052J46249p47321n91242Q4650K11187l65404q01759n90685
38964I8122k36206k53416l02591J4067L32122M57095J165326K623091K939631
38955F837241M75659k859276l326994o78443J139167l46866k634880k301614L695
38946c692311J239135P34632K43893M08493K96727m8835M17138J314612J138427
38937B051911Q4502j11603N98876L18191j252290j861562l58402J373978J510313
38928B353914Q38120N91718J03477j337391k344044j527249j14945p14n00259
$$ y = [1088128, 3083310, 3730439, 2771360, 996258, -663898, -1482819, -1038576, 197175, 821517, -7408, -1270306, -1210316, 326343, 1643670, 1458445, 504882, 401394, 1538395, 2752447, 2898696, 2151375, 1560133, 1644783, 1855970, 1490566, 688807, 98122, -138084, -391500, -694091, -680024, -347902, 109193, 1274519, 3897610, 6837241, 7312900, 4453624, 1126630, 448187, 1587354, 1240488, -1394392, -3696006, -3692311, -2453176, -1718544, -1474651, -1066158, -769431, -818266, -401128, 913484, 2051911, 2136413, 2024810, 2623686, 2941877, 1689587, -171975, -530377, 843601, 2353914, 3192034, 3783752, 3887229, 2549838, 205794, -1321455, -1436400, -1437114, -1937373]
38919a937373K83945J842479J905685L06244p03005j61356K93535m94211j262851
38910G3092o61915M19032L51358o77079j109214l42524O68680Q97437M18112O0068
38900I7047L44982Q54414O58809m70044j495443j223482J97384J458044J624231
38891B045942Q51295k63985j240601j639823j235383l81413L76821R91628J588448
38882A092929J724175R01322l10649p16873r4833O40869Q73013P92368M66199
38873E368520l06839j010022o83465L58544M93514q20853j966568j430396L4409
38864C6844O76594K23098k37553k09707k33000n69907o52152l275J023011J614107
38854A668060J287814L35003m27471n69292n73980q98343q59539L32782J601842
$$ y = [-1937373, -1653428, 189051, 2094736, 2400980, 1697975, 1536619, 1830154, 1335943, 73092, -588823, -169791, 181567, -495512, -1604726, -1947250, -1278570, -381133, 36979, 97047, 442029, 1296443, 1955252, 1485208, -10235, -1233717, -1036333, 421711, 2045942, 2897237, 2633252, 1392651, -247172, -1482555, -1863968, -1487147, -495519, 1092929, 2817104, 3718426, 3407777, 2690904, 2596071, 3236940, 4109953, 4902321, 5368520, 5061681, 4051659, 3368194, 3726738, 4220252, 3399399, 1432831, 2435, 36844, 713438, 936536, 698983, 489276, 256276, -313631, -965783, -969058, 53953, 1668060, 2955874, 3290877, 2863406, 2294114, 1720134, 821791, -37748, 295034, 1896876]
38845A896876R17636j366942k279071n38049J127915M0979k019446j439231J409960
38836b249373K570252O49862j107292l2656J913655J440781r92740k056562m23640
38827b87713J749281K089114P79859l85015m34547K6608J1268m81903n07741L92747
38817B951958J239568P78021o13157j233507m29872N29590M26180k63362m99154
38808B886265l82205o21120j055073q99210n1723Q43721J315271J219380M29328
38799C684634p38744j234577l98581R50364J497763J168051Q95139J012573J012051
38790G848673P27089O02192P93541J036202J386457K071843K645204K413891J772577
38781B1297669J940223L176545M408924M896239N028144M971412L761693O97151
$$ y = [1896876, 2814512, 1447570, -831501, -1369550, -241635, -200656, -2220102, -3659333, -2249373, 320879, 970741, -136551, -169207, 1744448, 3185229, 2192489, 135927, -287713, 1461568, 3550682, 4330541, 3945526, 3510979, 3537587, 3548855, 3066952, 2559211, 2951958, 4191526, 4969547, 4356390, 3122883, 2693011, 3222601, 3648781, 3385419, 2886265, 2504060, 1882940, 827867, -71343, -123066, 720655, 2035926, 3255306, 3684634, 2945890, 1711313, 1312732, 2263096, 3760859, 4928910, 5824049, 6836622, 7848673, 8575762, 9177954, 9971495, 11007697, 12394154, 14465997, 17111201, 19525092, 21297669, 23237892, 26414437, 30823361, 35719600, 40747744, 45719156, 49480849, 50178000]
38773E0178000l093067n440640n317965l746060k672989l112789m193033m145124
38765A8456333k537960j059581j360484k711678l053342j971628r88423r44377
38757C828860r90140n72116m53871r07581p42442O21895J707851J082141l87729
38748C186868r33691m67594j37718j64793J79731R33664J302753R08359N8783
38739D866362q52930j345776q95792J56589N94034M7800l97065j63105j29121
38730A880996m73186L11088K402730K989549L32844k630913k203199L25105R22417
38721C857431n31100o77526Q25216P14694j428694j796747Q76702K597741Q36069
38712E273786j131998j61286J153087o68055l392246k637917O84347K031810O39800
$$ y = [50178000, 47084933, 41644293, 36326328, 32580268, 29907279, 26794490, 22601457, 18456333, 15918373, 14858792, 13498308, 10786630, 7733288, 5761660, 4773237, 3828860, 2838720, 2266604, 1812733, 905152, 162710, 784605, 2492456, 3574597, 3186868, 2253177, 1785583, 1647865, 1483072, 1662803, 2596467, 3899220, 4807579, 4866362, 4013432, 2667656, 1771864, 1928453, 2522487, 2570287, 2173222, 2010117, 1880996, 1407810, 1718898, 4121628, 7111177, 7444021, 4813108, 2609909, 2935014, 3857431, 3326331, 2648805, 3474021, 4188715, 2760021, 963274, 1839976, 4437717, 5273786, 4141788, 3980502, 5133589, 4465534, 1073288, -1564629, -880282, 1151528, 1791328]
38703A791328k23038M64794L79313r55330j003563R12389K029390O75597j325626
38694B745254j947690j333767L8231K166581L551851J984074j431010k603600
38686C169924l70982J538216M02410j343976n98445J147284O03230j696693k426044
38677D24924p24172J136488J600099J213870N62283m03204j106965q02005j87770
38668A713548n05466j254498q80935M83369J118277N12508m4220J79119M22275
38659A743977K21142K64207Q99625J356016J044037L42673l29770r59945j139916
38650C442046k41346J130998J292035j90633j590678j336403j24624L44945j12751
38641B613589k01646O65293J456603J008900m13656j525374j599217j079017n87541
$$ y = [1791328, 1568290, 2033084, 2412397, 1457067, 453504, 1365893, 3395283, 4070880, 2745254, 797564, -536203, -497972, 1668609, 5220460, 7204534, 5773524, 3169924, 2798942, 4337158, 4739568, 3395592, 2797147, 3944431, 4547661, 2850968, 424924, -299248, 837240, 2437339, 3651209, 4213492, 3810288, 2703323, 1901318, 1713548, 1208082, -46416, -927351, -443982, 674295, 1186803, 1142583, 1321702, 1743977, 1965119, 2229326, 3128951, 4484967, 5529004, 5871677, 5541907, 4581962, 3442046, 3200700, 4331698, 5623733, 5433100, 3842422, 2506019, 2381395, 2726340, 2613589, 2411943, 3077236, 4533839, 5542739, 5129083, 3603709, 2004492, 925475, 337934]
38632C37934P7844J360145K615296K362212K53567k014046k478853j091316N95362
38623B018145J427226J476618J206296Q20864M68158K71254K9608n15250j077898
38614F125021j076238n31661j49273l44493o47218l30683N83701J212459Q35748
38605E677363k7646o1132R47699J349666j29705j933133j270900J716523L557644
38596I826379K077668o97367j724572j029637n48402n88324q1581P25928O90927
38587H651019L28045J089534K282002J653252o97047j967164r34870K87488m4476
38578A0647783n80666M15383J937302J973402P66800J93616R27074K076362K830370
38569B1187426K832434J717077j22350j040798q3671J161171L99084k016170l372147
$$ y = [337934, 415778, 1775923, 4391219, 6753431, 7006998, 4992952, 2514099, 1422783, 2018145, 3445371, 4921989, 6128285, 6949149, 7417307, 7688561, 7718169, 7202919, 6125021, 5048783, 4517122, 4367849, 4023356, 3376138, 3045455, 3629156, 4841615, 5677363, 5649717, 5588585, 6536284, 7885950, 7756245, 5823112, 4552212, 6268735, 9826379, 11904047, 11206680, 9482108, 8452471, 7904069, 7315745, 7234164, 7960092, 8651019, 8979064, 10068598, 12350600, 14003852, 13306805, 11339641, 10404771, 10692259, 10647783, 10067117, 10482500, 12419802, 14393204, 15160004, 15353620, 16280694, 18357056, 21187426, 24019860, 25736937, 25614587, 24573789, 24490118, 25651289, 26050373, 24034203, 20662056]
38560B0662056k324957o35241n85314j950598k566314j383414J13154q9920j691044
38551I548408k275067o62860J165022P56205j141104j631677o0674J179144O40647
38542G518044r6915M50206J072794L03455p91469o24492n2641o68201j622657
38533E488124j087712K60373L81631l18591K32874J593100J184664q72904j268059
38524E593500J063947K803059J411949r78680j338470m22525o06279j365043n15173
38515E646285J394753J616377k71622j658772r14150P00903J546950J510205Q04913
38506A0375842p36114k286529k105216j45428J269489O55579m31826Q1247J532114
38497H209158J666663J32089j143777p94832M47522J171829R32893K15064l05812
$$ y = [20662056, 18337099, 17701858, 17116544, 15165946, 12599632, 11216218, 11329372, 11239452, 9548408, 7273341, 6610481, 7775503, 8531708, 7390604, 5758927, 5698253, 6877397, 7518044, 7421129, 7871335, 8944129, 9247584, 8456115, 7831623, 7778982, 7110781, 5488124, 4400412, 4660785, 5042416, 4723825, 4956699, 6549799, 7734463, 6861559, 5593500, 6657447, 9460506, 10872455, 9893775, 8555305, 8132780, 7526501, 6161458, 5646285, 7041038, 8657415, 8385793, 6727021, 5812871, 6513774, 8060724, 9570929, 10375842, 9639728, 7353199, 5247983, 5102555, 6372044, 7027623, 6595797, 6677044, 8209158, 9875821, 10007910, 8864133, 8069301, 8516823, 9688652, 10621545, 10836609, 10530797]
38488A0530797k27144J94435J06862q49947j684378j121130N38437J568311R72052
38479A0028295l83271j052012o71075J2371J93909k26030n57547M7795J456698
38470H849133K289708J565383L02716K66820J225342J118301o24631j812211o66271
38461A2514290J398377J876618Q18034K69803P78876Q13441k97449j114998m72520
38452A6584472P23835J104887Q68701J015869J499090J360335K81015r24240j162767
38443B1351197O6418K234258L798403L302938J114548m93046K21874K325012L336647
38434C7258249K300447Q23779R35923K688906M356712M616186L923297L662161
38426F0565660M421509N560606O272328O418021O228180N975687O358113Q336778
$$ y = [10530797, 10303653, 10498088, 10604950, 9755003, 8070625, 6949495, 7487932, 9056243, 10028295, 9645024, 8593012, 7921937, 7934308, 8128217, 7902187, 7344640, 7392435, 8849133, 11138841, 12704224, 13006940, 13273760, 14499102, 15617403, 14992772, 13180561, 12514290, 13912667, 15789285, 16607319, 16877122, 17655998, 18469439, 18171990, 17056992, 16584472, 17308307, 18413194, 19281895, 20297764, 21796854, 23157189, 23438204, 22513964, 21351197, 21417615, 23651873, 27450276, 30753214, 31867762, 31374716, 31596590, 33921602, 37258249, 39558696, 40382475, 41318398, 44007304, 48364016, 52980202, 56903499, 60565660, 64987169, 70547775, 76820103, 83238124, 89466304, 95441991, 101800104, 110136882]
38418A10136882J1762433J4851190J6106741J6280669J7248688J9372593K1384955
38411B27144151K2595693K3498111K4084366K3317480K0731467J6965458J2208424
38404C70545150N806865j860450q870566j4147048j8688710k3144541k5848860
38397B83791840k5082244k2084253j9806215j9270697j8926694j7265235j4535354
38390A46821148j2035839j0895178j1287540j1910915j0816514p769858n011536
38383G7093768m484632n217879m953114l491862k577383l005006l781928l938331
38375D5643633l419378k335971r80727l93145j260576k493149k552546j802904
38367C0405237j651604j843077r66986N76341Q34024k82762p20329m1866m02132
$$ y = [110136882, 121899315, 136750505, 152857246, 169137915, 186386603, 205759196, 227144151, 249739844, 273237955, 297322321, 320639801, 341371268, 358336726, 370545150, 376352015, 374491565, 365620999, 351473951, 332785241, 309640700, 283791840, 258709596, 236625343, 216819128, 197548431, 178621737, 161356502, 146821148, 134785309, 123890131, 112602591, 100691676, 89875162, 82105304, 77093768, 72609136, 67391257, 62438143, 58946281, 56368898, 53363892, 49581964, 45643633, 42224255, 39888284, 38907557, 38514412, 37253836, 34760687, 32208141, 30405237, 28753633, 26910556, 25943570, 26519911, 27353935, 27071173, 26350844, 26308978, 25906846]
38358B5906846k482403l470240j226871J959595K408705J84236j502345j018525
38350B0758998K02159N22680N6063m52182q34050j076954r05413k58947M76289
38341A8488643Q74249P26383J12780m22408k33328M85855P53894K30964k39822
38332B0777210q2133K0727o01671j316683j171620l30112M54175R35735R65206
38323A9650834K2882j599765k221375r21694O51205L98104j058281j333061O1029
38314A3649878J243750J130773Q05762J245915J708911J272063L85974p6180q4809
38305B1282037Q0310N05242R57633O00059o99343j690648j312240j59446N09708
38296B0073312M77628K93272j6581p86942j645618j754637j020714j30119N30173
$$ y = [25906846, 23424443, 19954203, 18727332, 20686927, 23095632, 23279868, 21777523, 20758998, 20961157, 21483837, 21539900, 21087718, 20253668, 19176714, 18271301, 18012354, 18488643, 19362892, 20089275, 20202055, 19779647, 19546319, 20032174, 20786068, 21017032, 20777210, 20695077, 20715804, 20114133, 18797450, 17625830, 17295718, 17749893, 18685628, 19650834, 19673716, 18073951, 15852576, 14930882, 15582087, 15980191, 14921910, 13588849, 13649878, 14893628, 16024401, 16830163, 18076078, 19784989, 21057052, 21443026, 21366846, 21282037, 21362347, 21867589, 22825222, 23425281, 22725938, 21035290, 19723050, 19563604, 20073312, 20550940, 20844212, 20827631, 20040689, 18395071, 16640434, 15619720, 15489601, 16019774]
38287A6019774J073096J308012P81236k01528n99120q8823L96225J41585j89530
38278A8640927L01583J153605J228877O29245O21380J592432K383443K107418
38270B8658910J491149J731907L006317M915471P473703J0669696J3857663J6545903
38262H8350719J8698667J8916873J3802467J835380j2485842k1391296k1594016
38255H6132952j7054752j3208305j1019038q384100m940310k578236k185535k578644
38247B4184032k610372k330814j924984j167053k70421k4167o89462j561539j808718
38238A1796502j209896j82032M68963K15884l45074l9886R85553J074603l06041
38229A2458576j160771K01096K174518J904665m04881j709605n25803J338265
$$ y = [16019774, 17092870, 18400882, 19182118, 18980590, 18381470, 18292647, 18688872, 18830457, 18640927, 18942510, 20096115, 21324992, 21954237, 22575617, 24168049, 26551492, 28658910, 30150059, 31881966, 34888283, 39803754, 47277457, 57947153, 71804816, 88350719, 107049386, 125966259, 139768726, 141604106, 129118264, 107726968, 86132952, 69078200, 55869895, 44850857, 36466757, 31526447, 28948211, 26762676, 24184032, 21573660, 19242846, 17317862, 16150809, 15880388, 15856221, 15166759, 13605220, 11796502, 10586606, 10404574, 10873537, 11089421, 10744347, 10704461, 11690014, 12764617, 12458576, 11297805, 11498901, 13673419, 15578084, 15173203, 13463598, 12937795, 14276060]
38221A4276060J836274J211594O89587N75639P03976J291798K279136K903083
38213B5767147K769259K438650K392368K398877K341682K548479K837092K424613
38205D5918167J284490L69443j1743o85837j892232k554432k114588j641825k052764
38196C6618679k567105k146954j274781r92297j227935j403666j673753k130606
38188B3201582j795875p7620J595836J457059J54476j30118R76311J653870R41736
38179B7977257Q7511K70468Q44406Q09262N07290O51524Q08944J65847r58568
38170C1163941j633432j809820k027330k029085j129642O2993j31637j976320
38162B0489668l405467k592083m27733P88885M18267k75759n70727j104891j942738
$$ y = [14276060, 16112334, 17323928, 18013515, 18589154, 19293130, 20584928, 22864064, 25767147, 28536406, 30975056, 33367424, 35766301, 38107983, 40656462, 43493554, 45918167, 47202657, 47572100, 47560357, 46874520, 44982288, 42427856, 40313268, 38671443, 36618679, 34051574, 31904620, 30629839, 29637542, 28409607, 27005941, 25332188, 23201582, 21405707, 21328087, 22923923, 24380982, 24535458, 24405340, 25381651, 27035521, 27977257, 28064768, 28335236, 29179642, 29988904, 30496194, 31147718, 31956662, 32122509, 31163941, 29530509, 27720689, 25693359, 23664274, 22534632, 22597625, 22465988, 20489668, 17084201, 14492118, 14064385, 14853270, 15271537, 14995778, 14425051, 13320160, 11377422]
38153A1377422j724348J42355J861924J350447q56532k311089j817429m46557
38145G576193L75365L61004q1211m84852l21700N40996J178940M25344j422112
38136H147967k639642k083012l94000R24749R44741j19544j036782m89740J275846
38127D530583K188134Q46094j316403j872104q19909j89061o04020o82872L5155
38118B115597K34107m53161m97181O96063J542951J181538J030946J794945J603741
38109I249546n51181k064221m27907K278964K134096o42243k194062j049867J76464
38100F909589m69363j374419n35309J093827J259787k46286j552159j168155N62929
38091D480441J974333J621780j31481j180665j90912J378691J157132o12942j387907
$$ y = [11377422, 9653074, 9795429, 11657353, 13007800, 12151268, 9840179, 8022750, 7576193, 7951558, 8312562, 8231351, 7746499, 7424799, 7965795, 9144735, 9570079, 8147967, 5508325, 3425313, 3031313, 3956062, 4900803, 4781259, 3744477, 3254737, 4530583, 6718717, 7564811, 6248408, 4376304, 3556395, 3367334, 2763314, 2080442, 2115597, 2349704, 1896543, 1399362, 2095425, 3638376, 4819914, 5850860, 7645805, 9249546, 8698365, 6634144, 6206237, 8485201, 10619297, 9977054, 7782992, 6733125, 6909589, 6440226, 5065807, 4530498, 5624325, 6884112, 6637826, 5085667, 3917512, 4480441, 6454774, 8076554, 7945073, 6764408, 6573496, 7952187, 9109319, 8496377, 7108470]
38082G108470k52883O88764l35751k041115k110915n39835O71573M16023m33366
38073C170965o58224k41947P104k12916k23636O47987J850721K009724P61045
38064G110823o27162j030275r20197j126813j202443m36413M19844K53798k64423
38055B176739K77045J323819J101693p9664j2251J532050K001271K00354j517167
38046G003889q58468R64937J478425P58060O88552J721056K686899L033223L148293
38037B0624866L013811K421496K079095K713234L446667K830659J221267L38058
38029C8689153N35112L04558j270267l180882m092248l992968l697301l644483
38021A9650674l669851l345767k375643j174968q27960j665985k290309j229497
$$ y = [7108470, 6855587, 7544351, 7208600, 5167485, 3056570, 2516735, 3188308, 3604331, 3170965, 2512741, 2270794, 2277898, 2064982, 1841346, 2489333, 4340054, 6349778, 7110823, 6483661, 5453386, 4533189, 3406376, 2203933, 1767520, 2187364, 2441162, 2176739, 2453784, 3777603, 4879296, 4799632, 4787381, 6319431, 8320702, 8521056, 7003889, 6145421, 7110358, 8588783, 9346843, 10035395, 11756451, 14443350, 17476573, 20624866, 23638677, 26060173, 28139268, 30852502, 34299169, 37129828, 38351095, 38689153, 39224265, 39528823, 38258556, 35077674, 30985426, 26992458, 23295157, 19650674, 15980823, 12635056, 10259413, 9084445, 8256485, 6590500, 4300191, 3070694]
38013C070694O98150J255760R2346o57853K93816J329349N33931j135778j241327
38004D239088L57746J318342M50997n99272j59612P62323J43017j745579k608396
37995B158654j471862R7237M82248N7753p9633M4994l6376J30795J010962J567253
37985C962025M93604j374473j809601m22771Q14012P04225M39079J091524J457816
37976E355440J16731j723574j581143N90889K077683J009192j270747k056540
37968B517931n06791J673866K297449R03916r75509j531862n77150M32498K78000
37959D512348n92374q71069k03291M41805J14206r56038j655357j130031M57875
37950A18074K104444K785557K217283R77207N068r5658M35622O39332j52414j301387
$$ y = [3070694, 3768844, 5024604, 5116950, 4459097, 4752913, 6082262, 6616193, 5480415, 4239088, 4596834, 5915176, 6366173, 5766901, 5607289, 6369612, 6512629, 4767050, 2158654, 686792, 784029, 1266277, 1324030, 1244397, 1289391, 1253015, 1383810, 2394772, 3962025, 4455629, 3081156, 1271555, 848784, 1662796, 2367021, 2806100, 3897624, 5355440, 5472171, 3748597, 2167454, 2758343, 4836026, 5845218, 4574471, 2517931, 2011140, 3685006, 5982455, 6886371, 5910862, 4379000, 3801850, 4234348, 4512348, 3919974, 3048905, 2845614, 3287419, 3401625, 2445587, 790230, -339801, 118074, 2222518, 5008075, 7225358, 8202565, 8207633, 8111975, 8547597, 9186929, 9034515, 7733128]
37940G733128j412180j53128J195546J472980J057921Q72813R64447J070157J534074
37931A4335758K341203K335899J063632K84915J631839L877170M950944N446059
37923C6267419P140788R538522J1999357J7630498K8406376L6116466K6773766
37916A73873192j213170k9873768l9529502k9906707j6807141j1277870j0560862
37909C4704172q488573n210123l622500l267989k363858j681468k436703l211363
37901D421595k269284o72626k82555o15227k33730M63140K78264l75462l46275
37892C67840J13114N4978k78398l4562N85416O94998M5280j033410k092495k247692
37882c824931p42341J400853J917172M14348q35696k52039R37405J219815J188440
$$ y = [7733128, 6320948, 6167820, 7363366, 8836346, 9894267, 10767080, 11731527, 12801684, 14335758, 16676961, 19012860, 20076492, 20361407, 21993246, 25870416, 30821360, 36267419, 43408207, 52946729, 64946086, 82576584, 110982960, 147099426, 173873192, 172660022, 142786254, 103256752, 73350045, 56542904, 45265034, 34704172, 26215599, 21005476, 17382976, 14114987, 11751129, 10069661, 7632958, 4421595, 2152311, 1479685, 1197130, 581903, 348173, 811313, 1089577, 714115, 367840, 480954, 535932, 257534, 222972, 808388, 1503386, 1548666, 515256, -1577239, -3824931, -4567272, -3166419, -1249247, -834899, -1670595, -1922634, -985229, 234586, 1423026]
37873A423026J652217J571183J00467j250587r57566k33169p89944j490551k90891
37864b65815J735122J700747m05365j695182r04460K56335M89955N92138J120198
37855B623673J136800K15963n71274n78779n26928p93137o76530n1538J49807
37846I28057k08257m3693Q14866J073678L44804k9568M67039L39017j154254k151081
37836C80608r63454J026663J360904J28037n81340O894P25283P29498M25582K24180
37826C462855q255k34039k69016l93984p60853n45051R02838K388853K044984
37817F588332J20437j191015r62453o70620j439370k060397j097643N52210R97964
37808H37445L30091K72581J189916J490991L52115q27179n79168N15617J101515
$$ y = [1423026, 3075243, 4646426, 4746893, 3496306, 2538740, 2305571, 1515627, 25076, -265815, 1469307, 3170054, 2764689, 1069507, 165047, 421382, 911337, 1503475, 2623673, 3760473, 3976436, 3405162, 2826383, 2299455, 1506318, 829788, 778250, 928057, 719800, 676107, 1490973, 2564651, 2909455, 2879887, 3346926, 3685943, 2531689, 380608, -582846, 443817, 1804721, 1932758, 1351418, 1358312, 2083595, 2813093, 3238675, 3462855, 3454600, 3220561, 2951545, 2557561, 1796708, 1251657, 2154495, 4543348, 6588332, 6708769, 5517754, 4555301, 3884681, 2445311, 384914, -712729, -160519, 837445, 1167536, 1440117, 2630033, 4121024, 4473139, 3645960, 3066792, 3582409, 4683924]
37799D683924J258826J844877K379806J519474m53776j532130q38318J31025r0749
37790H902959q92386j079610r28916j163623j097874J79722J527641R64205j009621
37781E402497j659179K3152J845494J743181N12399l2193J81002J83653k069J31899
37771H329836J03151o26810j052131M424J476155J253795l82072r53530K63648
37762H416466R89960l59750k063175j851029m13071K0471o64215p03034K29217
37753C601840N39591k74493o09308L82501J036008k64417k315715k652701r54830
37744a511524Q64741J472705J272562R09068L84103n6597K23418Q89685N37285
37735D985446j196515k655105k358580j081973m12916j82941Q74047K366759K283325
$$ y = [4683924, 5942750, 7787627, 10167433, 11686907, 11233131, 9701001, 8862683, 8993708, 8902959, 8010573, 6930963, 6002047, 4838424, 3740550, 3920272, 5447913, 6412118, 5402497, 3743318, 3766470, 5611964, 7355145, 7867544, 7835351, 8016353, 8200006, 8197937, 8329836, 8432987, 7806177, 6754046, 6758470, 8234625, 9488420, 9106348, 8152818, 8416466, 9406426, 9046676, 6983501, 5132472, 4719401, 4739872, 4075657, 3372623, 3601840, 4141431, 3866938, 3257630, 3640131, 4676139, 4411722, 2096007, -556694, -1511524, -646783, 825922, 2098484, 3007552, 3391655, 3335058, 3558476, 4448161, 4985446, 3788931, 1133826, -1224754, -2306727, -2719643, -2902584, -2028537, 338222, 2621547]
37726B621547J44269j826949j673059k96921K60390r1142R8547J008110J216733
37717A461525K51514n04097j00026M78993J31606n14113m55220k49125p79868
37708b78811j022910O49545L213350L596487J052345j476235j463202q0231K18436
37699D408774n68561q30572m56075n63669r59113m79172M52302K02619j052110
37690A54423j215705L43272J662190J222362l1851o60812p22904p06659l18180
37681b73864M38327O03368j23565o35352l09081M2362J07237R34802K581065L128405
37671F493704J728609L56020N65094R38051J86493J71496K608558N188342M947613
37662B3183980L520163M586046P899137J1068921J5483471K3223570K8166257
$$ y = [2621547, 2765816, 938867, -734192, -1031113, -770723, -861865, -763318, 244792, 1461525, 1713039, 1208942, 1108916, 1587909, 1719515, 1205402, 750182, 501057, -278811, -1301721, -652176, 2561174, 6157661, 7210006, 5733771, 4270569, 4190338, 4408774, 3840213, 3009641, 2553566, 1989897, 1030784, 551612, 1003914, 1206533, 154423, -1061282, -718010, 944180, 2166542, 2134691, 1473879, 750975, 44316, -273864, 164463, 767831, 644266, 8914, -300167, -257805, -150568, 784234, 3365299, 6493704, 8222313, 8578333, 9143427, 10081478, 10267971, 10439467, 13048025, 18236367, 23183980, 26704143, 31290189, 39189326, 50258247, 65741718, 88965288, 117131545]
37655A17131545J9133452m227192k6110410l1220788k1868776j2145305r253231
37648C1439295q586443n352234j923249j705484k908525k356513q98998r93900
37640F713949j923109j281746O15770J334499L21417p23998r33356r83049r35271
37631B205106M80J294518J139317o15238j744700r45774J16422m42230j645708
37622f37807j372877O5979N44247k26243l31160Q91600J707302J087726M08320
37613B137087P21338P40630o02159j767938j094803K05971J99241l18082L84204
37604F05489J197547o4674k136458j825929K71544L61178j782992j857040J510067
37595c721268L603743R61255k839036k811130j23118Q05004j71643K62764K275585
$$ y = [117131545, 136264997, 132037805, 105927395, 74706607, 52837831, 40692526, 31439295, 22852852, 17500618, 15577369, 13871885, 10963360, 8606847, 7707849, 6713949, 4790840, 3509094, 4124864, 5459363, 5780780, 5056782, 4123426, 3140377, 2205106, 2205586, 3500104, 4639421, 4024183, 2279483, 1333709, 1450131, 1007901, -637807, -2010684, -1944705, -1400458, -1626701, -1957861, -1066261, 641041, 1728767, 2137087, 2858425, 3599055, 2996896, 1228958, 134155, 340126, 539367, 221285, 605489, 1803036, 1738362, -398096, -2224025, -1952481, -1591303, -3374295, -5231335, -3721268, -117525, 843730, -1995306, -4806436, -4929554, -4124550, -4296193, -4033429, -1757844]
37586a757844K709757J045312K70143J353222J610852l14534k065785j732429
37578A118694p55479p85291p56762O87861K283143J983554J27475j259486j286663
37569A357046p53689n98008r19857j121137n23040O86979J277114N88011k36842
37560b43423K652L87093n44087j813031j308658L35814M09174j166629j351712
37551e292807Q99315K626622J570672m10952p30480N2652J67974r4669K83242
37542i28431N33283l66776j324755q86350J10680P9050n42573m66394p0807k40590
37532d103663j31403J185364K147794P51735j780827k401356o72742J078737J520033
37523b406328J341309R64254J76227j84661Q71273K013479J007666j393523k104285
$$ y = [-1757844, 951913, 1997225, 2267368, 3620590, 5231442, 4916908, 2851123, 1118694, 363215, -422076, -1178838, -490977, 1792166, 3775720, 3903195, 2643709, 1357046, 603357, 5349, -914508, -2035645, -2558685, -1871706, -594592, -6581, -243423, -240771, 146322, -397765, -2210796, -3519454, -3183640, -2774466, -3941095, -5292807, -4393492, -1766870, -196198, -607150, -1337630, -1284978, -1117004, -1211673, -928431, -395148, -761924, -2086679, -2973029, -2862349, -2783299, -3325872, -3792266, -3863073, -4103663, -4235066, -3049702, -901908, -150173, -1931000, -4332356, -5005098, -3926361, -2406328, -1065019, -100765, 75462, -109199, 762074, 2775553, 3783219, 2389696, 285411]
37514B85411m84849P93511K45727l97147K75487R83198M69089k37450p7028l2887
37504A823062j013245j762064q93401O89228J271790P63491M0525o27858r71776
37495f80248k25784J091221P34034j884647l650553j660415K175408L358684R17629
37486A75329j666969j572148J43322J002947M56675k95725k66602N42898J410784
37477f9489J360512Q2353j395811j710889q16036K42143R78427J672171J998655
37468B342036J007409j082225k434566j762603j8035Q73032L05062p00052j001570
37459b471512m39899L97486R86314J342886J774991K208472K067984J091015j35555
37450F822182r29467j356684j657487j392912k34677Q11492M11059r16830j200290
$$ y = [285411, -199438, 594073, 839800, 442653, 718140, 1701338, 2170427, 1932977, 1855949, 1823062, 809817, -952247, -1845648, -1156420, 115370, 878861, 919386, 291528, -680248, -906032, 185189, 919223, -965424, -4615977, -6276392, -4100984, -742300, 175329, -1491640, -3063788, -2920466, -1917519, -1460844, -1756569, -2023171, -1480273, -69489, 1291023, 1373376, -22435, -1733324, -2549360, -2307217, -1328790, 343381, 2342036, 3349445, 2267220, -167346, -1929949, -1947984, -1074952, -769890, -1469942, -2471512, -2911411, -2513925, -1527611, -184725, 1590266, 3798738, 5866722, 6957737, 6822182, 5892715, 4536031, 2878544, 1485632, 1250955, 2062447, 2473506, 1556676, 356386]
37441C56386R2673J195597P46555k89564m93071k55199o15728j059221m19071
37432g40643P57843Q70163Q779j21921Q57038J360163O68925J31303M83072K27877
37422D502599j575819k893835j505984J158728J822402K80702n91570K73468O12148
37413B082839q98769k122903j118585M46823J53786r93085l80334J537291J825939
37404E33002o5107j434956p01416N05031N66426L19955P82022R27477k72241j513037
37394c52844j076048K73164N33207l35678p06298j85526P5894j51645L60845J949944
37384C85015L063721K407091O83629o41802j215317j533559j663833j268601n36639
37375c20295j67039l74578n14819J3845P57147N51864q93482k159946j568682
$$ y = [356386, 449059, 1644656, 2391211, 2101647, 1608576, 1353377, 737649, -321572, -740643, 17200, 887363, 896142, 774221, 1631259, 2991422, 3660347, 3791650, 4274722, 4502599, 2926780, 32945, -1473039, -314311, 1508091, 1788793, 1197223, 1470691, 2082839, 1184070, -938833, -2057418, -1610595, -1456809, -2449894, -2830228, -1292937, 533002, 467895, -967061, -1668477, -1163446, -597020, -277065, 504957, 1432434, 1160193, -352844, -1428892, -1155728, -622521, -958199, -1664497, -1850023, -1774129, -1925774, -1564929, 385015, 3448736, 5855827, 6539456, 5897654, 4682337, 3148778, 1484945, 216344, -320295, -487334, -861912, -1376731, -1362886, -605739, -53875, -947357, -3107303, -4675985]
37366d675985N60091K027610J500692J66829p1606Q51184J485400J060435Q9566
37357B994216q21840j446755j384124l65566Q25567R48696k8350r30472j098125
37348a306753r36465o77031K2681R17679J022166J91564m42279k91044k43151
37339a742633q91727j162236q611J545028J623374K26623p88842l12647P98296
37330g13375J240747Q53137K88658p8050l95396q59916j346281j429451p76367
37321c216294L58205J183649J133399M14220l57480p86241p70293l24845L25384
37312b040296P46750O89655K91150k04187n72501m65055K60578J000717R79826
37303F86637M96746N92449J202220R39993o13878j808154j210767K55111Q49455
$$ y = [-4675985, -4115894, -2088284, -587592, -420763, -492369, 358815, 1844215, 2904650, 2994216, 2172376, 725621, -658503, -1024069, -198502, 750194, 721844, -208628, -1306753, -2243218, -2920249, -2897568, -1979889, -957723, -766159, -1208438, -1499482, -1742633, -2634360, -3796596, -3805207, -2260179, -636805, -410182, -1199024, -1511671, -713375, 527372, 1380509, 1669167, 1591117, 1195721, 335805, -1010476, -2439927, -3216294, -2858089, -1674440, -541041, -126821, -484301, -1270542, -2040835, -2365680, -2040296, -1293546, -603891, -312741, -516928, -1089429, -1554484, -1293906, -293189, 686637, 1183383, 1775832, 2978052, 3918045, 3304167, 1496013, 285246, 540357, 1389812]
37294A389812N30521K63256r5685j090228j615226j31503K245716K561284L53009
37285D410956j425966p42896P01527M30710j159763j979975j479197o83396r4221
37276b022221M86145P55544L33484j46382L5618K41281m05279j076605l33392
37267b131807J243732J638406N89634J4168Q59099J662286J048651k66663j062800
37258C594706j467270j838544j315006P19262K729919K580181N79678q59653n69822
37249D153451J49508j6705m66609j40167M36839m81j200121j509081k97450J044679
37239B153863J066555J89150k35605j21329o15880j944379k648115j590922K79217
37230c467445J127753O04012k6482J57054P12131Q39607M72086L9662k02177k61587
$$ y = [1389812, 1920333, 2183589, 2087904, 997676, -617550, -749053, 1496663, 4057947, 4410956, 2984990, 2242094, 2943621, 3374331, 2214568, 234593, -1244604, -1928000, -2022221, -1536076, -780532, -447048, -593430, -557812, -316531, -721810, -1798415, -2131807, -888075, 750331, 1339965, 1354133, 2213232, 3875518, 4924169, 4657506, 3594706, 2127436, 288892, -1026114, -306852, 2423067, 5003248, 5582926, 4723273, 4153451, 4302959, 4286254, 3819645, 3679478, 4116317, 4115836, 2915715, 1406634, 1109184, 2153863, 3220418, 3409568, 3173963, 3052634, 2436754, 492375, -2155740, -3746662, -3467445, -2339692, -1735680, -1762162, -1605108, -892977, -53370, 418716, 458378, 256201, -5386]
37220e386k18591j65794j22267l2689l9838m04588p72999j53947J552511K653613
37210B290025J594109n95899j400834l26315N28097k21270j318520j182372l29121
37201i62100o9597k28647J57646Q82443J016059O33578M85016M44887j73362j142159
37191A043764j610279j507250j254197n33485J042364K395326J950698J11011
37183A637952j024096n79804J58040L47o69569j142788j450880j511420o99821
37174e282039Q89411J949666J525496J72023r02250r24716L26208K215574K990304
37165B959677J459681q81070j363452j04136k25j962806l046056j094524J522573
37156b510338J511541k17684l44838J369270K060002P01452o00013n65803n97884
$$ y = [-5386, -223977, -389771, -512038, -544727, -584565, -989153, -1762152, -1916099, -363588, 2290025, 3884134, 3288235, 1887401, 1561086, 2089183, 1867913, 549393, -632979, -962100, -1031697, -1260344, -1102698, -220255, 795804, 1429382, 1914398, 2359285, 2185923, 1043764, -566515, -2073765, -3327962, -3861447, -2819083, -423757, 1526941, 1637952, 613856, 34052, 192092, 192439, -477130, -1619918, -3070798, -4582218, -5282039, -4392628, -2442962, -917466, -745443, -1647693, -2572409, -2246201, -30627, 2959677, 4419358, 3538288, 2174836, 2070700, 2070475, 107669, -2938387, -4032911, -2510338, -998797, -1216481, -1561319, -192049, 1867953, 2569405, 1969392, 1403589, 805705]
37147H05705j658991k224321q98122J127777J865164J145320J9239r76191j524463
37138b318883q81462Q56456J905133R06600q60711j071997L43488J243219M79397
37129F01240o94020p92879j36737J38823j47K74404J005888J266643O74045M3266
37119B380526O1387J48004n50052j600737j842678j278549j059376j359161p79840
37110e880476J284186L050866K528309M13657q06579k37546N91941K60217p46757
37101D57818j141630n22643N37724J221982R46102j43438r60100n08574P76625
37092F63866J490012J058792K33207j99278k18491m8124J85892J81294k63457
37083C083713p36634q51299j049701j616899j475018K90358K140697J646130o29508
$$ y = [805705, -853286, -3077607, -3975729, -2847952, -982788, 162532, 181771, -794420, -2318883, -3200345, -2343889, -438756, 467844, -392867, -1464864, -1121376, 121843, 601240, -92780, -885659, -1022396, -883573, -883720, -609316, 396572, 1663215, 2337260, 2380526, 2441913, 2589917, 2039865, 439128, -1403550, -2682099, -3741475, -5100636, -5880476, -4596290, -1545424, 982885, 1396542, 589963, 352417, 944358, 1204575, 457818, -683812, -1206455, -668731, 553251, 1499353, 1355915, 395815, -112759, 663866, 2153878, 3212670, 3445877, 3246599, 3028108, 2979984, 3165876, 3347170, 3083713, 2347079, 1495780, 446079, -1170820, -2645838, -2355480, -214783, 1431347, 801839]
37074H01839j475381J17094J316428Q537j810910j354002N78868J247974L46641
37065b22912k32071l585k52984j114332j111693J37727J145623R63454L82625
37056c08148K13250J60418j264K08960P29707N44900o36813j494901q03477Q30297
37046e57071J737648J119706l53779j392436j161423L9344R57500O68274l43003
37037G14760r12773q04062p22763q46873m71927O02640J380242R63186j29496
37028b27066n79964P7100Q84119N92141p09415j337338M5265K236141K359081
37019C340064m13077l188784k728012L83088K598157J978160O0325p79382j8006
37010A232533J284958J885170J013069j053974k668872k244060k74343J234583
$$ y = [801839, -673542, -556448, 759980, 768517, -1042393, -2396395, -1817527, -569553, -222912, -454983, -458568, -711552, -1825884, -2937577, -2799850, -1654227, -690773, -308148, -94898, 65520, 64256, 273216, 1002923, 1547823, 911010, -583891, -1387368, -557071, 1180577, 2300283, 1946504, 554068, -607355, -568011, 389489, 1057763, 714760, -198013, -1002075, -1724838, -2571711, -3043638, -2440998, -1060756, -97570, -227066, -807030, -729930, 154189, 746330, 36915, -1300423, -1255158, 980983, 3340064, 2926987, -261797, -2989809, -2606721, -8564, 1969596, 2029921, 1250539, 1232533, 2517491, 4402661, 5415730, 4361756, 1692884, -551176, -825519, 409064]
37002D09064J382670R47865L71651q19851k147051j954085j15191J067896J43554
36993g13478j095872l21904J656902K077806K62028j651687j759287l93775R38370
36984a000897J186007K25796j139944j587037n90063P39095R62445J96892k62687
36975a270393J06302O10245P09721O65919P25672O77774M04120M6600m60289j199134
36965A016537j581538q10916P58310J662423J130290O0036k85254J17994L59716
36956B427598J4259m77337o85253p81999j087526j443970j373452p30677J00402
36947d037955O77012Q87158P80188L44620l09022q60941j169114j358840j182740
36938f229634M9973K142052L283567J962374o80490j909155q85465M73865M94838
$$ y = [409064, 1791734, 2739599, 3111250, 2291399, 144348, -1809737, -1924928, -857032, -713478, -1809350, -2131254, -474352, 1603454, 1865482, 213795, -1545492, -1939267, -1000897, 185110, 410906, -729038, -2316075, -2906138, -2167043, -1204598, -1007706, -1270393, -1164091, -553846, 155875, 821794, 1547466, 2225240, 2629360, 2675960, 2215671, 1016537, -565001, -1375917, -617607, 1044816, 2175106, 2235142, 1949888, 2067882, 2427598, 2441857, 1964520, 1279267, 497268, -590258, -2034228, -3407680, -4138357, -4037955, -3360943, -2473785, -1693597, -1348977, -1657999, -2518940, -3688054, -5046894, -6229634, -6179661, -4037609, -754042, 1208332, 527842, -1381313, -2266778, -1792913, -1298075]
36929a298075j14639J6157O37850O52981P9118j76771J50549N77959P96566P42702
36919B064397L06455k14757j07706N07602M05828p79716j510849o26859N37367
36910E81762J40403j052715p93941R35349J790527P20639n80074m55563M79033
36901A765420P53886J19240o98206j100847p50659L34746J253376Q65981n52296
36892A990641j451861j229144r76409j422148j584530m55108J223981K039561
36884a865017J810616J251851N53363m53019j290735j288670p82107p42292j253439
36875d059449j298381j96160J419746K282333J821733O99331R5366M08629P76266
36866A949414K11792r58189j442269p42761K40916N18865P9198n88970j117692
$$ y = [-1298075, -1412714, -1396557, -758707, -105726, -26608, -203379, -52830, 525129, 1321695, 2064397, 2370852, 2156095, 2048389, 2555991, 2961819, 2182103, 671254, 44395, 581762, 722165, -330550, -1124491, -189142, 1601385, 2322024, 1741950, 1286387, 1765420, 2519306, 2638546, 1940340, 839493, 88834, 423580, 1676956, 2542937, 1990641, 538780, -690364, -1666773, -3088921, -4673451, -5128559, -3904578, -1865017, -54401, 1197450, 1750813, 1297794, 7059, -1281611, -2063718, -2806010, -4059449, -5357830, -5553990, -4134244, -1851911, -30178, 669153, 764519, 1173148, 1949414, 2161206, 1203017, -239252, -982013, -741097, -222232, -143034, -732004, -1849696]
36857a849696j029080J30123J814151K512491J486115k20329j126414r50884l19180
36848D47297K58847L54702m71108j713187j768556J7329J892477J703965j82755
36839E39011j500245j223573l68628K31394R73026J860043J746968K55940j043436
36830A470500p32337K47486K4555j229571j496878j7340J479832J216823k31756
36821G31314r13853j11342J060055J336264O07615m75431j344157j678255j361065
36812b148855o74675j57107O3992M56064J282413J970861J712214M94989q17009
36803B182887j311470p40943K87987O29024m13478k024766k379916q08109J108747
36794c470037J431341L36610m27078k15974j57261r82043j685582j066802N06636
$$ y = [-1849696, -2878776, -2748653, -934502, 1577989, 3064104, 2843775, 1717361, 766477, 447297, 706144, 1060846, 589738, -1123449, -2892005, -2874676, -982199, 721766, 539011, -961234, -2184807, -2553435, -2322041, -1349015, 511028, 2257996, 2513936, 1470500, 738163, 985649, 1010204, -219367, -1716245, -1733585, -253753, 963070, 731314, -182539, -293881, 766174, 2102438, 2710053, 2234622, 890465, -787790, -2148855, -2823530, -2980637, -2916645, -2460581, -1178168, 792693, 2504907, 2999896, 2182887, 871417, 130474, 418461, 1047485, 634007, -1390759, -3770675, -4578784, -3470037, -2038696, -1702086, -2129164, -2345138, -2502399, -3484442, -5170024, -6236826, -5730190]
36785e730190J753981K083892J645211N06971j080803k031048j320399L71078
36777c801307J068975R478j192399o63862J082391J787865O29617n91922p5757
36768a746921J355071J548143K25561q26190o35405k11246m07853n61391k05562
36759a465793k88034j253355j591643j22130J694529J801281O66054N2901j50563
36750f56753j101759j906867o56556J733634K208666L64456r74509o09067o20027
36741b218782j877861j826590R49434L427404K448551l99173j462929m21365M01730
36732i79581L83583O42548Q76165j81331j654259j318715N72869J404717L06859
36723E2855p89852n91061j14371k17693k9555J062238J910367J311342k19388
$$ y = [-5730190, -3976209, -1892317, -247106, 259865, -820938, -2851986, -4172385, -3801307, -2732332, -2722854, -3915253, -4579115, -3496724, -1708859, -1079242, -1671164, -1746921, -391850, 1156293, 1381854, 555664, -79741, -290987, -698840, -1260231, -1465793, -1753827, -3007182, -4598825, -4720955, -3026426, -1225145, -559091, -506190, -656753, -1758512, -3665379, -4321935, -2588301, -379635, -15179, -989688, -1598755, -2218782, -4096643, -5923233, -4973799, -1546395, 902156, 502983, -959946, -1381311, -979581, -595998, 46550, 922715, 741384, -912875, -2231590, -1658721, -254004, 52855, -736997, -1328058, -1442429, -1660122, -1689677, -627439, 1282928, 2594270, 2374882]
36714B374882j323110j394312p30211n78J65678j35668K8191R75932J474116N47746
36704A982666n91142k42328Q61388N65461j160257k127852j379360l15987j15840
36695b523251k99462k72260k02306o166N66685P45240k15136r36443M70654K722335
36685D9890K485697l65738k113617q28698R55584Q12886Q2854O46336J293238
36676C018432K22153j424241j562196o17446o0359N44447K000121K807807J300951
36667F229669j009291j509564o44176o48396j312257p18576O13653L44414j171638
36658A73838j096988P96448J332568p31229k416316j258860J012729J624345P67723
36649B04258J54943j00639o71963r01510j1426Q93199L98211o90670o60334J86434
$$ y = [2374882, 1051772, -342540, -1072751, -1073329, -907651, -1043319, -1015128, -39196, 1434920, 1982666, 1391524, 1149196, 2010584, 2576045, 1415788, -712064, -2091424, -2407411, -2523251, -2822713, -3094973, -3297279, -3303445, -2736760, -1991520, -2206656, -3143099, -2672445, 49890, 2535587, 2169849, 56232, -772466, 183118, 996004, 1078858, 1725194, 3018432, 3240585, 1816344, 254148, -363298, -423657, 120790, 2120911, 4928718, 6229669, 5220378, 3710814, 3066638, 2418242, 1105985, 387409, 1001062, 1345476, 173838, -923150, -126702, 1205866, 474637, -1941679, -3200539, -2187810, -563465, 204258, 359201, 258562, -413401, -1314911, -1326337, -433138, -34927, -725597, -1385931, -1199497]
36639a199497K92022j77166K76911J366083J067912p94771j730685m43925R04272
36630d38844Q2326j525222j077710J068621J819162L03776o98702O96023K288088
36621B517518J242876j290377j871741r5462R65453k80802j680061j114402J87064
36612a419934L7123j009269p30845J069598K294372J626733n2168j288855j536966
36603a010211r44353L3653O71799N96866L33875M51562N56726Q4343m80374l89973
36593i6087q4103l90846p68146r5050J027358P56956j008528k081901j012520
36584c752867J030304K139909J921279J038747l5717q05147n37984N67228J006962
36575B572714q1227j444582j382431j83992M10894k31030r58265o81934K49139
$$ y = [-1199497, -907475, -1084641, -807730, 558353, 1626265, 831494, -899191, -1343116, -438844, -356518, -1881740, -2959450, -1890829, -71667, 232109, -466593, 229430, 2517518, 3760394, 2470017, 598276, 502814, 1468267, 1187465, -492596, -1606998, -1419934, -1382811, -2392080, -3122925, -2053327, 241045, 1867778, 1815610, 526755, -1010211, -1954564, -1920911, -1249112, -652246, -318371, 133191, 689917, 774260, 293886, -96087, -180190, -571036, -1339182, -1434232, -406874, 350082, -658446, -2740347, -3752867, -2722563, -582654, 1338625, 2377372, 2341655, 1536508, 998524, 1565752, 2572714, 2491487, 1046905, -335526, -519518, -108624, -339654, -1297919, -1979853, -1730714]
36566a730714P89486N01033k52895r10640j137635q86164l40057J80371L85893
36557c401322K36093M1762J79977N66829O57813K34974j30704J33106O67066P18879
36547i5527L98072M82942R44993P18636o13536j818233j478745P7214J189481
36538a94703J010620L88265M40122R62833Q37505k55499j260402j135636k52941
36529E40164J90489j52747m97658k85826Q5819J62328J75883L95427M93845J76588
36519A284312k04403k88635l40885o04530o52033j00210N91444P41492L38824
36510G65376k60791q43601r83937j10506J335492J846936Q57070l10054m96709
36501A799276l97651r01145j219604m25304N21617L73886o752P55161J654989
$$ y = [-1730714, -941228, -440195, -693090, -1603730, -2741365, -3627529, -3967586, -3787215, -3401322, -3165229, -3123467, -2943490, -2376661, -1718848, -1483874, -1614578, -1481472, -814406, -95527, 302545, 785487, 1730480, 2449116, 1835580, 17347, -1461398, -1384184, -194703, 815917, 1204182, 1644304, 2607137, 3444642, 3189143, 1928741, 793105, 540164, 730653, 577906, 80248, -205578, -119759, 42569, 218452, 613879, 1107724, 1284312, 1079909, 791274, 450389, -154141, -806174, -906384, -314940, 426552, 765376, 504585, -339016, -1322953, -1433459, -97967, 1748969, 2606039, 2295985, 1799276, 1401625, 500480, -719124, -1144428, -622811, -248925, -255677, 499484, 2154473]
36492B154473P80002j111777j529886l66501J11380o71176q44159K43538R17403
36483c16703M68458L55460J128286J257836K37063k03290O29154R23783k36483
36474D243564j064186m88836k90425j606817k384972r88804N54277K8845q96475
36465b893829L33794K305221J800365p02547j855238q94953j65017m95108j29895
36456b697207J341898J760222J66046j294627o28836J195200K050440J463833
36448C356969M09810l77319q40631j138016j325574j123591k03885Q22828O13951
36439A94542p80723j297985J48192J526063O46195j157370j056266O47348J169549
36430C9545m9893q13968l28340k35349r08229l87334J709361K633046P50106j562873
$$ y = [2154473, 2934475, 1822698, 292812, -73689, 37691, -633485, -1477644, -1234106, -316703, 151755, 507215, 1635501, 2893337, 3130400, 2927110, 3556264, 4480047, 4243564, 3179378, 2690542, 2400117, 793300, -1591672, -2580476, -2026199, -1997354, -2893829, -2560035, -254814, 1545551, 843004, -1012234, -1907187, -2072204, -2567312, -2697207, -1355309, 404913, 570959, -723668, -1352504, -157304, 1893136, 3356969, 3766779, 3389460, 2548829, 1410813, 85239, -1038352, -1242237, -419409, 194542, -586181, -1884166, -1735974, -209911, 436284, -721086, -1777352, -1130004, 39545, -10348, -824316, -1152656, -1388005, -2296234, -2683568, -974207, 1658839, 2408945, 846072]
36420H46072j520534n2279J90440q13986q08464R08785K431556J983363P4487
36411C239440j338839j070767O4223J87004j198576k181507q96401J551046K339293
36402F94916Q72257o72917q69739o85990r88477r34426l7123M62520j90349o72860
36392c022188J49256J163509R91229M02638P94329J567566J099037n09346j533423
36383A102607j021398L29696J265588R56168m59872j577259r63035O73342R88321
36374A294158n32396j500567k79159J345262J018156n25598j016281l82949k90471
36365h69845r27122r46294j10466M99672O42653R74779J166710K80167j002998
36356b92744q55207P08952J489321L21018j236458j210178K47762J450167J303804
$$ y = [846072, -674462, -726741, -536301, -1350287, -2158751, -1249966, 1181590, 3164953, 3239440, 1900601, 829834, 894057, 1081061, -117515, -2299022, -3195423, -1644377, 694916, 1567173, 894256, 24517, -661473, -1649950, -2584376, -2621499, -2158979, -2349328, -3022188, -2872932, -1709423, -718194, -315556, 478773, 2046339, 3145376, 2636030, 1102607, 81209, 410905, 1676493, 2632661, 2172789, 595530, -367505, 305837, 1294158, 761762, -738805, -1017964, 327298, 1345454, 819856, -196425, -579374, -869845, -1796967, -2743261, -2853727, -2354055, -1711402, -736623, 430087, 710254, -292744, -1147951, -438999, 1050322, 1371340, 134882, -1075296, -827534, 622633, 1926437]
36347A926437J98166o58425n07527J08065R0725m31987j97413P21334L32238j880872
36337b99259k968901n24071K872243K652796r95415l243871j662850Q26869J184304
36328b158155O02381J422652K792205K324274J35865j628595k105009k000602
36320f14984j457270j01792J204989R79784n07275j374929p95118J52014N04888
36311b009693O83519J207239J548171J107786L95644K97177O43244L65728r79629
36302C259186k440890k617598j160766Q14761J746216J005401n94323j520902
36294a508915q94817N72176J142353L5935j286363p02406J571877K813440J349435
36285C092715j036960j632124n93832k07322r72845r87747N08248J568092O85687
$$ y = [1926437, 2124603, 1466178, 958651, 1066716, 1157441, 725454, 528041, 1249375, 1581613, -299259, -3268160, -3792231, -919988, 1732808, 737393, -2506478, -4169328, -3342459, -2158155, -1555774, -133122, 2659083, 4983357, 5119222, 3490627, 1385618, -614984, -2072254, -2174046, -969057, 10727, -496548, -1871477, -2666595, -2514581, -2009693, -1326174, -118935, 1429236, 2537022, 2932666, 3229843, 3873087, 4238815, 3259186, 818296, -1799302, -2960068, -2145307, -399091, 606310, 11987, -1508915, -2403732, -1831556, -689203, -653268, -1939631, -2642037, -1070160, 1743280, 3092715, 2055755, 423631, -170201, -377523, -1350368, -2338115, -1829867, -261775, 423912]
36276D23912o38557k52165J218893J348960m34195k158618k120264p17413P20668
36267b608779J568956J886877J730194J126720L23510l50061p23047q00181p07111
36258A447078n95434m40060l4640O39679J187745J135836L98329o54114j408967
36249A675452j324203m04927N71642P39259J57942l07942k03531K6600o2182k42486
36239F25624k23541k40659m81706n15445K8377O56077O42850K00064K37907J013304
36229A942852J694984J422260L42854n95307o62111n3178L36751j19903j036722
36220C272480j442978j002445m19548l98744o25151k91734N74213R80921L46695
36211I93709n35277m37947N66380J018242M5277j200994r29463P08602J582110
$$ y = [423912, -214645, -466810, 752083, 2101043, 1666848, -491770, -2612034, -3329447, -2608779, -1039823, 847054, 2577248, 3703968, 4027478, 3677417, 2954370, 2154189, 1447078, 851644, 411584, 376944, 1016623, 2204368, 3340204, 3738533, 3084419, 1675452, 351249, -53678, 517964, 1257223, 1415165, 1107223, 903692, 930292, 868110, 625624, 402083, 161424, -320282, -835727, -807350, -151273, 491577, 691641, 929548, 1942852, 3637836, 5060096, 5402950, 4807643, 4145532, 4092354, 4429105, 4309202, 3272480, 1829502, 827057, 407509, 8765, -616386, -908120, -333907, 647014, 993709, 458432, 20485, 586865, 1605107, 1650384, 449390, -480073, 228529, 1810639]
36202A810639M38570j356339j727376n77946N43020P57827M97946J91725k55432
36193C22634o52180m47730L30743J046077J428819J649530J501478O23847n04629
36184E298589r98306r68787j202366j491693q52040M74690R76940K30532m57506
36175A010053l08505j25682l37415K2923J230754J692949M06145j070314q66115
36166A654793L72087P83676K29924r1211k7038l43208q04542m45403N24474R27961
36156B781513N63051K87548L60041K87771J26375L43335N58836J4074q26416p26770
36146C769358L07024R64742N40061m92478j592516k348612j906571J0170J753070
36137A004248J414691k37280o46179O26348J290624J24639j116127o26170Q46613
$$ y = [1810639, 2249209, 892870, -834506, -1412452, -869432, -111605, 386341, 578066, 322634, -329546, -777276, -446533, 599544, 2028363, 3677893, 5179371, 5803218, 5298589, 4300283, 3331496, 2129130, 637437, -214603, 260087, 1237027, 1467559, 1010053, 701548, 575866, 238451, 261374, 1492128, 3185077, 3591222, 2520908, 1654793, 2026880, 2810556, 3040480, 2949269, 2922231, 2579023, 1774481, 1329078, 1853552, 2781513, 3344564, 3632112, 3992153, 4279924, 4406299, 4749634, 5308470, 5322544, 4496128, 3769358, 4076382, 5041124, 5581185, 5088707, 3496191, 1147579, -758992, -748822, 1004248, 2418939, 2181659, 1535480, 2161828, 3452452, 3577091, 2460964, 1834794, 2681407]
36128B681407J681050J740162J540042P76886n84342j122822K69739K335059K878697
36119A2195878J661506L95030L44826J280435K437233L299655L637151L743101
36111B8994815M516177O679238J0110549J4027723J6914692J6133712R438948
36104A06815854j824494j2376056j7490625j7072940j4114190j0557415o734987
36097B6645147l686312k982491m034079m162420k243502l24029n39688k038955
36089F633671k349284p74721R76522J136440k50715j745076k103042j343878m82315
36080c02398k59695l19871M8698O59546O60138m0556m77372k2829P19299Q38071
36070A503031L00375k53194l99799j67439K48090O16900Q05055R68946J248593
$$ y = [2681407, 4362457, 6102619, 7642661, 8419547, 7835205, 6712383, 6982122, 9317181, 12195878, 13857384, 14252414, 14597240, 15877675, 18314908, 21614563, 25251714, 28994815, 33510992, 40190230, 50300779, 64328502, 81243194, 97376906, 106815854, 104991360, 92615304, 75124679, 58051739, 43937549, 33380134, 26645147, 22958835, 19976344, 15942265, 11779845, 9536343, 9212314, 8672626, 6633671, 4284387, 3509666, 4486188, 5622628, 5371913, 3626837, 1523795, 179917, -302398, -562093, -881964, -833266, -173720, 486418, 445862, -31510, -54339, 664960, 1503031, 1803406, 1550212, 1150413, 982974, 1231064, 1847964, 2653019, 3621965, 4870558]
36061D870558J195726J66319j456835k227123j407862j29024O387r88948j670004
36052a640806j177139j37936M55593M18095K00600K07414N46910R68710Q92450
36043G33891M1957q21065n13526R03647J859814J246156q9660o47863m13016n09252
36033A791083j103689j136824k77693L59972P4185k03011M42469J126326M17401
36024A490219j261507j971920q50128R33234J857388J565042N75708m24325p73432
36015A140279l05625J24463m56775j525029j465271O7994J437132J264664J70186
36006D52018n50032p68444r22271o48840M66623J456992R49077o27256j355916
35997a548049m89349N82571L89626p26031j301770n20475J177935K591758K514137
$$ y = [4870558, 6066284, 6232603, 4775768, 2548645, 1140783, 1011759, 1018146, 29198, -1640806, -2817945, -2955881, -2500288, -2082193, -1881593, -1674179, -1127269, -158559, 733891, 775848, -45217, -558743, 344904, 2204718, 3450874, 3361214, 2713351, 2300335, 1791083, 687394, -449430, -727123, -367151, -292966, -495977, -53508, 1072818, 1490219, 228712, -1743208, -2593336, -1660102, 197286, 1762328, 2338036, 1913711, 1140279, 834654, 959117, 502342, -1022687, -2487958, -2419964, -982832, 281832, 452018, -98014, -866458, -1788729, -2437569, -1970946, -513954, 435123, -192133, -1548049, -2037398, -1454827, -1065201, -1791232, -3093002, -3613477, -2435542, 156216, 2670353]
35988B670353O85290j576124k300115r37326R30118J405763M06886n53420m29006
35979C02419K01422J85225n12374p64606j4909O02393l21722k136950k469339
35970d928441m31336J747631J533294l74582j057256M28800J899627J408718k19852
35961F603j153262j124307q56818k70721R86763K026365J572926N2111q05942
35952D33718l72048L63218O43670P34795O92683L1379q79630p31306N95855J348905
35942B861239M30185q04996o43596L54248N13349j62110l41840R3410M0342m92399
35932A847832k93570N87372N74222n90195j006707K21654J122872j49227k174220
35923A40033k219087k15871J371891J062971k43562j090952r31711N4609J062580
$$ y = [2670353, 3355643, 1779519, -520596, -1457922, -527804, 877959, 1284845, 731425, 302419, 503841, 689066, 176692, -587914, -602823, -430, -322152, -2459102, -4928441, -5359777, -3612146, -2078852, -2453434, -3510690, -3081890, -1182263, 226455, 6603, -1146659, -2270966, -3127784, -3398505, -2411742, -385377, 1187549, 1239660, 433718, 61670, 424888, 1068558, 1803353, 2496036, 2527415, 1647785, 916479, 1512334, 2861239, 3291424, 2486428, 1842832, 2197080, 2710429, 2548319, 2206479, 2299889, 2340231, 1847832, 1554262, 2141634, 2715856, 2125661, 1118954, 1340608, 2463480, 2314253, 140033, -2079054, -2294925, -923034, 139937, -103625, -1194577, -2126288, -2071679, -1009099]
35914a009099Q11091r25471k305566j545402L99611J145274M39696J67438R51921
35905a870507J301318M72968l64856n24481q77639j613532j366165K20723J402916
35896c219255J137399O12269N60082k83823k139603k454318J09879K564851J785647
35887a326872m07538k35641J719889J727526m52281j106761R51928K301346O87638
35878C859234j418810j207106J43237J84536n89479k31055R45210J094063J18617
35869B898447l97439R2072O17504O35221P40481J525167K833631L959322L969408
35860A6873814K419812J78547j362308k137977l091708l824513k741644l04485
35852F009538N01888j421403l022482j644775N51573n0342k509076k582163O85229
$$ y = [-1009099, -198008, -1123479, -3429045, -4974447, -4574836, -3429562, -2989866, -2822428, -1870507, -569189, -96221, -461077, -985558, -1863197, -3476729, -4842894, -4622171, -3219255, -2081856, -1469587, -909505, -1193328, -3332931, -5787249, -5677370, -3112519, -1326872, -1734410, -1970051, -250162, 1477364, 1025083, -81678, 870250, 3171596, 3859234, 2440424, 1233318, 1376555, 1561091, 971612, 740557, 1685767, 2779830, 2898447, 2501008, 2593080, 3210584, 3845805, 4586286, 6111453, 8945084, 12904406, 16873814, 19293626, 19472173, 18109865, 15971888, 12880180, 9055667, 6314023, 6009538, 6511426, 5090023, 2067541, 422766, 974339, 923997, -1585079, -4167242, -3482013]
35843c482013L600572L365686J381567M4619n79374j317824j669575r48601K3054
35834D18111R9731m31572o05829l01081R0205N28176Q42313L54148r59425j797865
35824a763088j121194K86352Q35122J25027r63833j576918j389104l69372R95468
35815d941540J642034J011846n5649k78920M45511J068834Q15690p0011q27758
35806a189963q40569M0091J278287J897093J419880M37724j48629k07571k56024
35797B430319n55357r07858j167069j324648j162568m65846L52481M81960j72430
35788b491016o62948k36869M99170L30678p26336j152704P9259J881476K270608
35779b08682R53616l58039l49281L42545N43091L63327N06624O06350k50566j671096
$$ y = [-3482013, 118559, 3484245, 4865812, 4910431, 4331057, 3013233, 1343658, 395057, 418111, 517842, 86270, -519559, -820640, -730435, -202259, 640054, 994202, 34777, -1763088, -2884282, -2597930, -1762808, -1637781, -2601614, -4178532, -5567636, -5937008, -4941540, -3299506, -2287660, -2343309, -2622229, -2176718, -1107884, -292194, -362205, -1189963, -2030532, -1990441, -712154, 1184939, 2604819, 3042543, 2893914, 2686343, 2430319, 1874962, 967104, -199965, -1524613, -2687181, -3153027, -2800546, -2318586, -2491016, -3153964, -3390833, -2891663, -2560985, -3287321, -4440025, -4360766, -2479290, -208682, 744934, 386895, 37614, 380159, 923250, 1286577, 1793201, 2399551, 2148985, 477889]
35769D77889k175493j377892n49786o49043j039959p24418K19837J064429J412876
35760c341560J181066M38382j85015J59372J160983J290296o5422j367890r12519
35751a642307P26783J505679O82478n07273p37160M0233J058623J513376Q85849
35742C526281n02185j287830m99853P93646N34843j382318k644160j680215Q6298
35733c055493L89318n14335l65306J534851L135568K508958M34806q61214n72855
$$ y = [477889, -1697604, -3075496, -3625282, -4274325, -5314284, -6038702, -5818865, -4754436, -3341560, -2160494, -1722112, -1907127, -1747755, -586772, 703524, 638102, -729788, -1642307, -915524, 590155, 1272633, 765360, 28200, 68433, 1127056, 2640432, 3526281, 3024096, 1736266, 1236413, 2030059, 2564902, 1182584, -1461576, -3141791, -3055493, -2666175, -3180510, -3545816, -2010965, 1124603, 3633561, 4068367, 3207153, 2634298]
$$ [...]
##END NTUPLES=NMR SPECTRUM
##END=
