##TITLE=31Pdec_ACP15_pH9
 D2O, 24 sc
 5.6.2019
##JCAMPDX= 6.0         $$ Bruker NMR JCAMP-DX V2.0
##DATA TYPE= NMR SPECTRUM
##DATA CLASS= NTUPLES
##ORIGIN= UXNMR, Bruker Analytische Messtechnik GmbH
##OWNER= root
$$ XWIN-NMR		Version 3.5
$$ Wed Jun  5 15:42:31 2019 Russian Standard Time (UT+4h)  she@DPX200
##.OBSERVE FREQUENCY= 81.013821
##.OBSERVE NUCLEUS= ^31P
##.ACQUISITION MODE= SIMULTANEOUS
##.ACQUISITION SCHEME= undefined
##.AVERAGES= 24
##.DIGITISER RES= 17
##SPECTROMETER/DATA SYSTEM= spect
##.PULSE SEQUENCE= zgpg30
##.SOLVENT NAME= D2O
##.SHIFT REFERENCE= (INTERNAL, D2O, 0, 182.463)
##AUDIT TRAIL= $$ (NUMBER, WHEN, WHO, WHERE, WHAT)
$$ ##TITLE= Audit trail, XWIN-NMR		Version 3.5
$$ ##JCAMPDX= 5.01
$$ ##ORIGIN= Bruker BioSpin GmbH
$$ ##OWNER= she
$$ F:/spectra/data/she/nmr/P31/1/pdata/1/auditp.txt
$$ ##AUDIT TRAIL=  $$ (NUMBER, WHEN, WHO, WHERE, WHAT)
(   1,<2019-06-05 15:41:29.76 +0400>,<she>,<DPX200>,
      <created by zg, POWCHK disabled, PULCHK disabled
       configuration hash MD5:
       00 E9 B6 7A A2 85 ED C7 34 08 36 98 17 FE 4E 26
       data hash MD5: 32K
       09 9F E8 C6 C0 93 54 34 45 F9 AC A7 D9 D2 BA 5C>)
(   2,<2019-06-05 15:41:32.32 +0400>,<she>,<DPX200>,
      <Start of raw data processing
       efp BC_mod = 2 LB = 1 FT_mod = 6 PKNL = 1 PHC0 = -2162.475 PHC1 = 46.39912 SI = 64K 
       data hash MD5: 64K
       50 48 B9 95 C2 7D 3D 77 B2 4D BD ED CE 41 41 B5>)
(   3,<2019-06-05 15:41:56.07 +0400>,<she>,<DPX200>,
      <abs ABSG = 5 
       data hash MD5: 64K
       E2 3F 02 C8 C4 BB 87 86 C1 39 9C 72 BA 86 D5 FB>)
$$ ##END=
$$ 
$$ hash MD5
$$ F2 90 E1 97 84 88 E7 45 07 36 CE 25 F5 3F 72 35
##$RELAX= 
##$RELAX= 
##$RELAX= 
##$RELAX= 
##$RELAX= 
##$RELAX= 
##$RELAX= 
##$RELAX= 
$$ Bruker specific parameters
$$ --------------------------
##$DU= <F:/spectra>
##$EXPNO= 1
##$NAME= <P31>
##$PROCNO= 1
##$TYPE= <nmr>
##$USER= <she>
##$AMP= (0..31)
100 100 100 100 100 100 100 100 100 100 100 100 100 100 100 100 100 100 
100 100 100 100 100 100 100 100 100 100 100 100 100 100 
##$AQSEQ= 0
##$AQ_mod= 1
##$AUNM= <au_zg>
##$AUTOPOS= <>
##$BF1= 81.014009
##$BF2= 200.13
##$BF3= 200.13
##$BF4= 200.13
##$BF5= 200.13
##$BF6= 200.13
##$BF7= 200.13
##$BF8= 200.13
##$BYTORDA= 1
##$CFDGTYP= 0
##$CFRGTYP= 5
##$CHEMSTR= <none>
##$CNST= (0..31)
1 1 145 1 1 1 1 1 1 1 1 1 1 1 1 1 1 1 1 1 1 1 1 1 1 1 1 1 1 1 1 1 
##$CPDPRG= <waltz16>
##$CPDPRG1= <>
##$CPDPRG2= <waltz16>
##$CPDPRG3= <>
##$CPDPRG4= <mlev>
##$CPDPRG5= <mlev>
##$CPDPRG6= <mlev>
##$CPDPRG7= <mlev>
##$CPDPRG8= <mlev>
##$CPDPRGB= <>
##$CPDPRGT= <>
##$D= (0..31)
0 1 0 0 0 0 0 0 0 0 0 0.03 2e-05 3e-06 0 0 0 0 0 0 0 0 0 0 0 0 0 0 0 0 
0 0 
##$DATE= 1559734889
##$DBL= (0..7)
120 120 120 11 120 120 24 19 
##$DBP= (0..7)
150 150 150 150 150 150 150 150 
##$DBP07= 0
##$DBPNAM0= <>
##$DBPNAM1= <>
##$DBPNAM2= <>
##$DBPNAM3= <>
##$DBPNAM4= <>
##$DBPNAM5= <>
##$DBPNAM6= <>
##$DBPNAM7= <>
##$DBPOAL= (0..7)
0.5 0.5 0.5 0.5 0.5 0.5 0.5 0.5 
##$DBPOFFS= (0..7)
0 0 0 0 0 0 0 0 
##$DE= 6
$$ [...]
##$SUBNAM3= <"">
##$SUBNAM4= <"">
##$SUBNAM5= <"">
##$SUBNAM6= <"">
##$SUBNAM7= <"">
##$SUBNAM8= <"">
##$SUBNAM9= <"">
##$SW= 369.568048894756
##$SWIBOX= (0..15)
0 1 3 0 0 0 0 0 0 0 0 0 0 0 0 0 
##$SW_h= 29940.119760479
##$TD= 32768
##$TD0= 1
##$TE= 0
##$TE2= 300
##$TE3= 300
##$TEG= 300
##$TL= (0..7)
0 120 53 12 22 120 120 120 
##$TP= (0..7)
150 150 150 150 150 150 150 150 
##$TP07= 0
##$TPNAME0= <>
##$TPNAME1= <>
##$TPNAME2= <>
##$TPNAME3= <>
##$TPNAME4= <>
##$TPNAME5= <>
##$TPNAME6= <>
##$TPNAME7= <>
##$TPOAL= (0..7)
0.5 0.5 0.5 0.5 0.5 0.5 0.5 0.5 
##$TPOFFS= (0..7)
0 0 0 0 0 0 0 0 
##$TUNHIN= 0
##$TUNHOUT= 0
##$TUNXOUT= 0
##$USERA1= <user>
##$USERA2= <user>
##$USERA3= <user>
##$USERA4= <user>
##$USERA5= <user>
##$V9= 5
##$VALIST= <valist>
##$VCLIST= <CCCCCCCCCCCCCCC>
##$VD= 0
##$VDLIST= <DDDDDDDDDDDDDDD>
##$VPLIST= <PPPPPPPPPPPPPPP>
##$VTLIST= <TTTTTTTTTTTTTTT>
##$WBST= 1024
##$WBSW= 4
##$XGAIN= (0..3)
0 0 0 0 
##$XL= 0
##$YL= 0
##$YMAX_a= 5867
##$YMIN_a= -4172
##$ZGOPTNS= <>
##$ZL1= 120
##$ZL2= 120
##$ZL3= 120
##$ZL4= 120
##$ABSF1= 182.463
##$ABSF2= -187.1042
##$ABSG= 5
##$ABSL= 3
##$ALPHA= 0
##$AQORDER= 0
##$ASSFAC= 0
##$ASSFACI= 0
##$ASSFACX= 0
##$ASSWID= 0
##$AUNMP= <proc_1d>
##$AZFE= 0.1
##$AZFW= 0.5
##$BCFW= 0
##$BC_mod= 2
##$BYTORDP= 0
##$COROFFS= 0
##$CY= -3
##$DATMOD= 1
##$DC= 0
##$DFILT= <>
##$DTYPP= 0
##$F1P= 0
##$F2P= 0
##$FCOR= 1
##$FTSIZE= 65536
##$FT_mod= 6
##$GAMMA= 0
##$GB= 0
##$INTBC= 1
##$INTSCL= 5.30512e-09
##$ISEN= 30
##$LB= 1
##$LEV0= 0
##$LPBIN= 0
##$MAXI= 10000
##$MC2= 0
##$MEAN= 0
##$ME_mod= 0
##$MI= 50
##$NCOEF= 0
##$NC_proc= -9
##$NLEV= 6
##$NOISF1= 182.463
##$NOISF2= 159.3651
##$NSP= 0
##$NTH_PI= 0
##$NZP= 0
##$OFFSET= 182.463
##$PC= 4
##$PHC0= -2162.475
##$PHC1= 46.39912
##$PH_mod= 1
##$PKNL= yes
##$PPARMOD= 0
##$PSCAL= 0
##$PSIGN= 0
##$REVERSE= no
##$SF= 81.0140089999434
##$SI= 65536
##$SIGF1= 159.3651
##$SIGF2= -187.1042
##$SINO= 113.3802
##$SIOLD= 16384
##$SREGLST= <1H.CDCl3>
##$SSB= 0
##$STSI= 65536
##$STSR= 0
##$SW_p= 29940.119760479
##$SYMM= 0
##$S_DEV= 0
##$TDeff= 32768
##$TDoff= 0
##$TI= <>
##$TILT= no
##$TM1= 0
##$TM2= 0
##$TOPLEV= 0
##$USERP1= <user>
##$USERP2= <user>
##$USERP3= <user>
##$USERP4= <user>
##$USERP5= <user>
##$WDW= 1
##$XDIM= 65536
##$YMAX_p= 493957312
##$YMIN_p= -73609476
$$ End of Bruker specific parameters
$$ ---------------------------------
##NTUPLES= NMR SPECTRUM
##VAR_NAME=  FREQUENCY,     SPECTRUM/REAL,   SPECTRUM/IMAG
##SYMBOL=    X,             R,               I
##VAR_TYPE=  INDEPENDENT,   DEPENDENT,       DEPENDENT
##VAR_FORM=  AFFN,          ASDF,            ASDF
##VAR_DIM=   65536,         65536,           65536
##UNITS=     HZ,            ARBITRARY UNITS, ARBITRARY UNITS
##FACTOR=    0.456856943014862, 1,           1
##FIRST=     14782.0589164792, 0,            0
##LAST=      -15158.0608439998, 0,           0
##MIN=       -15158.0608439998, -73609476,   0
##MAX=       14782.0589164792, 493957312,    0
$$ Real data points
##PAGE= N=1
##DATA TABLE= (X++(R..R)), XYDATA
$$ [...]
4097e627054R825637J2173129P353806m463105j3328347j2814155q742267o752553
$$ -5627054 4198583 16371712 23725518 19262413 5934066 -6880089 -15622356 -22374909
4089b2374909j744626R819203J7117669Q294890r357545j6268353n377772J0988506
$$ -22374909 -24119535 -14300332 2817337 11112227 1754682 -14513671 -19891443 -8902937
4081h902937J7600230J0505095l719017j4614571j4873686p168849j890058l284411
$$ -8902937 8697293 19202388 15483371 868800 -14004886 -21173735 -23063793 -26348204
4073b6348204l170322N075080J3530401J0886219P48702l433052J730024P229114
$$ -26348204 -29518526 -24443446 -10913045 -26826 721876 -2711176 -981152 6247962
4065F247962P239163M460460Q43539m025329n135409L432531J4021628R886433
$$ 6247962 13487125 17947585 18791124 14765795 9630386 13062917 27084545 36970978
4057C6970978j0508711k6811736k1948519k830425J2372055J6930314J4969179
$$ 36970978 26462267 -349469 -22297988 -25128413 -12756358 4173956 19143135
4050A9143135P724169n235511j5675122j2738220n2475O009118j208720q675015
$$ 19143135 26867304 21631793 5956671 -6781549 -6834024 -824906 -2033626 -10708641
4042a0708641k346828J2548713J8701455R791769l361027r489576j0180783j1999556
$$ -10708641 -13055469 -506756 18194699 27986468 24625441 15135865 4955082 -7044474
4034g044474j2533451l450949J3507974K2913759J3113283p623765j9229254j3066469
$$ -7044474 -19577925 -23028874 -9520900 13392859 26506142 18882377 -346877 -13413346
4026a3413346o74302K246997n171391j0608786n990692L274134P498305N572057
$$ -13413346 -14087648 -11840651 -17012042 -27620828 -33611520 -30337386 -22839081 -17267024
4018a7267024M265128P270356J0359549P987479L84722p787846j2590259j2444020
$$ -17267024 -13001896 -5731540 4628009 12615488 13000210 5212364 -7377895 -19821915
4010a9821915p525976j80016O108428R990358J1946708R798321o7483j3763093
$$ -19821915 -27347891 -27527907 -21419479 -11429121 517587 10315908 10248425 -3514668
4002c514668j8770380q400158P606126J4758984J1781647P872697O345126K917044
$$ -3514668 -22285048 -30685206 -23079080 -8320096 3461551 11334248 17679374 20596418
3994B0596418j731255j314316L130912L017912k411571l871233Q20959J576762
$$ 20596418 18865163 17550847 20681759 23699671 21288100 17416867 18237826 19814588
3986A9814588n611619r525083k272423O250971M338185k447878k024254L202954
$$ 19814588 14202969 4677886 2405463 8656434 12994619 10546741 8522487 11725441
3978A1725441J340048q040480j2381137m021370J1052498K0794850J6282573j967551
$$ 11725441 13065489 5025009 -7356128 -11377498 -325000 20469850 36752423 34784872
3970C4784872k0075909k0905747o064699K630424n971770j3582216o84099J9995083
$$ 34784872 14708963 -6196784 -12261483 -9631059 -15602829 -29185045 -29869144 -9874061
3962i874061K1203265L422538p453737j569950L960366j792033p136703k701441
$$ -9874061 11329204 14751742 7298005 5728055 9688421 7896388 759685 -1941756
3954a941756J857874k106669o196798j847562M469603N517706O217556R505084
$$ -1941756 -83882 -2190551 -8387349 -10234911 -5765308 -247602 5969954 15475038
3946A5475038N701425r219914j9671762j1463486N116924J0015623J750023n119426
$$ 15475038 21176463 11956549 -7715213 -19178699 -14061775 -4046152 -2296129 -7415555
3938g415555l169888K627323O967399P992516M149187j762453j959221L558387
$$ -7415555 -10585443 -7958120 -990721 7001795 11150982 9388529 7429308 10987695
3930A0987695L393492n897303r941319K13964R551054K373898r354943m255624
$$ 10987695 14381187 8483884 -1457435 -1243471 8307583 10681481 1326538 -2929086
3922b929086J2038205J5109289Q85125j0638093r063953m002036q19509O741861
$$ -2929086 9109119 24218408 25103533 14465440 5401487 1399451 579942 7321803
3914G321803J5547548J1636103k996198q220647M19847K223067j1818066j9679383
$$ 7321803 22869351 34505454 31509256 23288609 23708456 25931523 14113457 -5565926
3906e565926m271918J5379190J2482883o537166j5070917p173204O80315M59204
$$ -5565926 -9837844 5541346 18024229 11487063 -3583854 -10757058 -10076743 -9617539
3898i617539j8382L122952N033129N737786Q942428Q663480l868290k0537063
$$ -9617539 -9635921 -6512969 -1479840 4257946 13200374 21863854 17995564 -2541499
3890b541499k2589727p786648O417148Q696827N660742N265417N625977M665833
$$ -2541499 -25131226 -32917874 -26500726 -17803899 -12143157 -6877740 -1251763 3414070
3882C414070N148457N496754M44414n460788j170137R824156R903931m507211
$$ 3414070 8562527 14059281 14503695 9042907 7872770 17696926 27600857 23093646
3874B3093646j4362675p633243J647609k127593j0596782q267368M27046K137168
$$ 23093646 8730971 1097728 2745337 617744 -9979038 -18246406 -17819360 -15682192
3866a5682192R03593R418074K1012663J6259186l149309j2000320J811436J9399194
$$ -15682192 -14778599 -5360525 15652138 31911324 28762015 16761695 18573131 37972325
3858C7972325J8073813l86056j7817785k2128382j2460881N805389K1082418K0274392
$$ 37972325 56046138 55660082 37842297 15713915 3253034 9058423 30140841 50415233
3850E0415233L346600j3753058j7839276j2278962o102386l35997N584041M997655
$$ 50415233 53761833 40008775 22169499 9890537 3788151 3452154 9036195 14033850
3842A4033850m999239j2037015l389688J2381158J4829535J052350j0707344q710327
$$ 14033850 9034611 -3002404 -6392092 5989066 20818601 21870951 11163607 2453280
3834B453280k670849m678687r342053l996133J0009622J8441938J3359161R89056
$$ 2453280 -217569 -4896256 -14238309 -18234442 -8224820 10217118 23576279 24565335
3826B4565335r027799j3615557j3752222r214743n54318P124894P604962J055111
$$ 24565335 15537536 1921979 -11830243 -21044986 -21599304 -14474410 -6869448 -5814337
3818e814337n226593n112461n84461J903145N45335m8598L257675O428441L384287
$$ -5814337 -11040930 -16153391 -16737852 -14834707 -14289372 -14337970 -11080295 -4651854 -1267567
3809a267567n238178j1873664j0406389k469343M956178O832259M374018K431966
$$ -1267567 -6505745 -18379409 -28785798 -31255141 -26298963 -19466704 -15092686 -12660720
3801a2660720L281853M595600M329550M709511P910395J0302837O937866R72926
$$ -12660720 -9378867 -4783267 -453717 4255794 12166189 22469026 29406892 30379818
3793C0379818J175682Q366462J1915048L675297j0854918j9807550j7974515q424093
$$ 30379818 31555500 39921962 51837010 55512307 44657389 24849839 6875324 -1548769
3785a548769K880585R156610N702070l451221p548785l213526O13963j913135
$$ -1548769 1331816 10488426 16190496 12739275 5190490 1976964 2590927 677792
3777F77792k641231O136291J5629547J2834711K016197k218206R19208j055831
$$ 677792 -1963439 4172852 19802399 32637110 34653307 32435101 33354309 32298478
3769C2298478j0352327j4612354q639864k369138j929695J9473P298961R733356
$$ 32298478 21946151 7333797 -1306067 -3675205 -5604900 -5585427 1713534 11446890
3761A1446890M17540r960287q459460N41585L395091k746384r271567r692873
$$ 11446890 11864430 1904143 -6555317 -6013732 -2618641 -5365025 -14636592 -24329465
3753b4329465l926165N781555J4243940J3750136L495917o245149o855656k682390
$$ -24329465 -28255630 -22474075 -8230135 5520001 9015918 2770769 -4084887 -6767277
3745f767277k091045l605027J8193Q810856J5428877J4563705O329898n117487
$$ -6767277 -8858322 -12463349 -12445156 -3634300 11794577 26358282 32688180 27570693
3737B7570693j1781316p967190p31490l711524j4799751j4492726L382009J6216452
$$ 27570693 15789377 7822187 7090697 3379173 -11420578 -25913304 -22531295 -6314843
3729f314843M821255j4337641j2277940Q047715J7752168P385347l029366o71792
$$ -6314843 -1493588 -15831229 -28109169 -20061454 -2309286 5076061 2046695 1374903
3721A374903K656170k309852m511110M662422J3006564Q347368L25973L582400
$$ 1374903 4031073 1721221 -2789889 1872533 14879097 23226465 23552438 27134838
3713B7134838J2306967R948836m249903j5754070j6825889j2702702q062608j021468
$$ 27134838 39441805 49390641 45140738 29386668 12560779 -141923 -8204531 -9225999
3705i225999Q607555J5133046J3403924M405757n862669j0794394q737102n391964
$$ -9225999 -618444 14514602 27918526 32324283 26461614 15667220 6930118 1538154
3697A538154o409134p736869j163257R998053J2047224J246601r233807q600463
$$ 1538154 -4870980 -12607849 -13771106 -3773053 8274171 9520772 286965 -8313498
3689h313498k140731J755202M627419P970799M499704o989509j1477403N84718
$$ -8313498 -10454229 -8699027 -4071608 3899191 8398895 1409386 -10068017 -9483299
3681i483299J3305885P220391q604452r946839L279321P901928l178752j0826349
$$ -9483299 3822586 11042977 2438525 -7508314 -4228993 3672935 494183 -10332166
3673a0332166m246460K022704k737015m868479P540304J9431206J2064848m147968
$$ -10332166 -14578626 -12555922 -15292937 -20161416 -12621112 6810094 18874942 14726974
3665A4726974n465263O047127O454062r219678j7357395l099468J5995528J6275570
$$ 14726974 9261711 15308838 21762900 12543222 -4814173 -7913641 8081887 24357457
3657B4357457J123061q053174l616933K433731O29613l845690l664153j863149
$$ 24357457 25480518 17427344 13810411 16244142 16873755 13028065 9363912 7500763
3649G500763n155035j1254965j0613428J67803J2188962J3852814M475870m969714
$$ 7500763 2345728 -8909237 -19522665 -19354862 -7165900 6686914 11162784 6193070
3641F193070n467731p95866m90343m072550o05977J2967296K2181294J3048705
$$ 6193070 725339 -70527 -560870 -4633420 -5239397 7727899 29909193 42957898
3633D2957898n971247j3184165m029008K766931n926419j7665679j4209705P69366
$$ 42957898 36986651 23802486 19773478 22540409 16613990 -1051689 -15261394 -14492028
3625a4492028R193713O487414M245462P410153P234943k80327n904981l459997
$$ -14492028 -5298315 1189099 5434561 12844714 20079657 19799330 13894349 10434352
3617A0434352k76196l588002q850916r759764q104051n169600L889366J6531438
$$ 10434352 10158156 6570154 -2280762 -12040526 -20144577 -25314177 -21424811 -4893373
3609d893373J7204309l82333j7371790j3565124K733487Q466865J416678j204464
$$ -4893373 12310936 11928603 -5443187 -19008311 -16274824 -7807959 -6391281 -7595745
3601g595745M657082N163272k101864j331259J1335924J6602389L768185r546180
$$ -7595745 -2938663 2224609 122745 -1208514 10127410 26729799 30497984 20951804
3593B0951804o373561J495914m367742j5670643j1742870L495305O699734o342770
$$ 20951804 14578243 16074157 11706415 -3964228 -15707098 -12211793 -5512059 -11854829
3585a1854829j4354695n435883O137285N544601q92895p14405M364415O016883
$$ -11854829 -26209524 -31645407 -25508122 -19963521 -20856416 -21570821 -17206406 -11189523
3577a1189523N113283O663974P442308J789220n505028m555512L823780Q839180
$$ -11189523 -6076240 587734 8030042 9819262 4314234 -241278 3582502 12421682
3569A2421682N982567K559966M700078P015613M41553j3422829k1373486j3034636
$$ 12421682 18404249 20964215 25664293 32679906 33121459 19698630 -1674856 -14709492
3561a4709492O101542J8722023J3541943l053270j5204795j4920753p298742n49457
$$ -14709492 -8607950 10114073 23656016 20602746 5397951 -9522802 -16821544 -17371001
3553a7371001K772118L945826L831257L279338L598746M286607L497006J463650
$$ -17371001 -14598883 -10653057 -6821800 -3542462 56284 4342891 7839897 9303547
3545I303547n68550m260569j0759239j3852346n718306Q783166J4424914O701258
$$ 9303547 8734997 4474428 -6284811 -20137157 -25855463 -17072297 -2647383 4053875
3537D053875j025988J192250M036931l536864j2237702n615653J0962953J5036544
$$ 4053875 3027887 4220137 8257068 4720204 -7517498 -13133151 -2170198 12866346
3529A2866346R01754j1335822o239854N315089N306265m670259r377782m041353
$$ 12866346 13768100 2432278 -3807576 1507513 6813778 2143519 -7234263 -11275616
3521a1275616J712183P56681k781511k197550K652907O571010M853418k451326
$$ -11275616 -9563433 -8806752 -11588263 -13785813 -11132906 -4561896 291522 -2159804
3513b159804r495404r324853j982283M716775M900068J431280J21641J809077
$$ -2159804 -11655208 -20980061 -22962344 -18245569 -13345501 -11914221 -11792580 -9983503
3505i983503M232768O858490Q499530M794100n233431j3594902j1661309k011946
$$ -9983503 -5750735 1107755 9607285 14401385 9167954 -4426948 -16088257 -18100203
3497a8100203M964367M745550J930968P61298j54507k747351n309256n228567
$$ -18100203 -13135836 -8390286 -6459318 -5698020 -5852527 -8599878 -13909134 -19137701
3489a9137701k034696K694087N283972J428369p587085j1933103k957352J4214331
$$ -19137701 -21172397 -18478310 -13194338 -11765969 -19353054 -31286157 -34243509 -20029178
3481b0029178K3941619J7073233R7392j3098814j4278054n862961K481080K298337
$$ -20029178 3912441 20985674 21083066 7984252 -6293802 -12156763 -9675683 -7377346
3473g377346m894417q714833l451289L578076L541947O48300M375594J0656759
$$ -7377346 -12271763 -20986596 -24437885 -20859809 -17317862 -16669562 -12293968 -1637209
3465a637209N618143j0502107j8815897p765333R785811J5216111R122992N463709
$$ -1637209 3980934 -6521173 -25337070 -33102403 -23316592 -8100481 1022511 6486220
3457F486220Q221406Q107080M65151o569936m820976J423070N34825j1555536
$$ 6486220 14707626 22814706 23279857 16709921 11888945 13312015 13846840 2291304
3449B291304k4522336k2880037l575823J7194619K0053382N419087p124878m408981
$$ 2291304 -22231032 -45111069 -48686892 -31492273 -11438891 -6019804 -13144682 -17553663
3441a7553663N157867P466351L098881J434570K583068p91059p162799o254171
$$ -17553663 -12395796 -4929445 -1830564 -395994 2187074 1396015 -5766784 -12020955
3433a2020955L757520J1925655J0514280M274747m87458n738092j4004985j9273894
$$ -12020955 -8263435 3662220 14176500 18451247 17963789 12225697 -1779288 -21053182
3425b1053182j4413027l118605L996739L411392J485977L493408O683011O383283
$$ -21053182 -35466209 -38584814 -34588075 -31176683 -29690706 -26197298 -19514287 -13131004
3417a3131004L680855K858594L981305L031646q23245l078629r50884J873503
$$ -13131004 -9450149 -6591555 -2610250 421396 -401849 -3480478 -4431362 -2557859
3409b557859J349153J28936K855341P107333O364296Q22206l226760m932909r694651
$$ -2557859 -1208706 -1079770 1775571 8882904 15247200 16069406 12842646 7909737 -1784914
3400a784914j6115054j3753220j3919J1582258R111796q24837m483686j176438
$$ -1784914 -17899968 -31653188 -31667107 -20084849 -10973053 -11797890 -16281576 -17458014
3392a7458014N42383P1117K849985N188191j855304j3266670j2036138N154177
$$ -17458014 -16915631 -16844514 -13994529 -8806338 -10661642 -23928312 -35964450 -30810273
3384c0810273J9492374J4991640j71480o365197K173316J3721964J5079286L906822
$$ -30810273 -11317899 3673741 3502261 -2862936 -689620 13032344 28111630 32018452
3376C2018452j0811628j5874013o061317P705945Q963442k700466r816341j796812
$$ 32018452 21206824 5332811 -728506 6977439 15940881 13240415 3424074 1627262
3368A627262R212689O355378p291874j4459311q432349J198909N295614M796576
$$ 1627262 10839951 17195329 9903455 -4555856 -12988205 -11789296 -6493682 -1697106
3360a697106K871896q43443m737611l294537M239912R612339N207038n680848
$$ -1697106 1174790 331347 -4406264 -7700801 -3460889 6151450 11358488 5677640
3352E677640j2327301q452378J902235R130102P379806j37627n183104m227376
$$ 5677640 -6649661 -15102039 -13199804 -4069702 3310104 3172477 -2010627 -6238003
3344f238003j927208l224266n893302n326772k958380k961320k925410L072482
$$ -6238003 -8165211 -11389477 -17282779 -22609551 -25567931 -28529251 -31454661 -28382179
3336b8382179J1878812J2027075R09086q333639m010691P544010J1572030N728550
$$ -28382179 -16503367 -4476292 -3567206 -11900845 -15911536 -8367526 3204504 8933054
3328H933054N29154J344186J957085k218302n842113l990729j732500n459801
$$ 8933054 9462208 10806394 12763479 10545177 4703064 712335 -1020165 -6479966
3320f479966j0759831q106557K241534J0042479R478335N713502N312073O605563
$$ -6479966 -17239797 -25346354 -23104820 -13062341 -3584006 2129496 7441569 14047132
3312A4047132K998611p558922j8781779k0491773p888927J0882730J9165955R268529
$$ 14047132 17045743 9486821 -9294958 -29786731 -37675658 -26792928 -7626973 1641556
3304A641556o670141j0394453k61272R089463Q999167O236760P164859O140172
$$ 1641556 -5028585 -15423038 -15684310 -6594847 2404320 8641080 15805939 21946111
3296B1946111k083129r674606o723169K677390O744796L000787j943301m914596
$$ 21946111 19862982 10188376 3465207 6142597 12887393 15888180 13944879 9030283
3288I030283p194777o707417j046272L948044N36426o991041o478586L840949
$$ 9030283 1835506 -4871911 -5918183 -1970139 -1433713 -8424754 -14903340 -11062391
3280a1062391J2692927J2608434Q387345O230926M625413K9051o239549j0548923
$$ -11062391 1630536 14238970 22626315 28857241 33482654 33511705 27272156 16723233
3272A6723233j0894076o877181r70745R59058l267959o486848j363184P306639
$$ 16723233 5829157 -1048024 -2018769 -1059711 -4327670 -10814518 -12177702 -4871063
3264d871063Q818737K642960k318814k355257j203257K28101L662156N015046
$$ -4871063 3947674 6590634 4271820 1916563 713306 941407 4603563 9618609
3256I618609P7306l703465K936818J1867877P200754p135251j1703105m335086
$$ 9618609 9695915 5992450 8929268 20797145 27997899 20862648 9159543 4824457
3248D824457k896914j0753423q507960R056410J7699920K987309j2982712p095784
$$ 4824457 1927543 -8825880 -17333840 -8277430 9422490 12409799 -572913 -7668697
3240g668697P330111O195222l486598L65947J2333486Q152370j1968290k2956974
$$ -7668697 -338586 5856636 2370038 2735985 15069471 23221841 11253551 -11703423
3232a1703423j5576894n799517k593767L290377J3887441J5745964N138951l068862
$$ -11703423 -27280317 -33079834 -35673601 -32383224 -18495783 -2749819 2389132 -679730
3224f79730j022386l68170q941252j4944608o650952P986063J3592534P564840
$$ -679730 -1702116 -2070286 -11011538 -25956146 -32607098 -24621035 -11028501 -3463661
3216c463661j715965p354235p407642l895065k409291n241919n138747M180783
$$ -3463661 -5179626 -12533861 -19941503 -23836568 -26245859 -31487778 -36626525 -32445742
3208c2445742J4409128J3521152O437493O817695J1616831O537038m134312n75050
$$ -32445742 -18036614 -4515462 1922031 8739726 20356557 26893595 22759283 22184233
3200B2184233J5416842J6302371o998837k6138149j8048405K7921J006235r217738
$$ 22184233 37601075 53903446 46904609 20766460 2718055 2745976 3752211 -5465527
3192e465527p123834O338866R233726l379520j2877784p320181M496980J0515181
$$ -5465527 -12589361 -6250495 2983231 -396289 -13274073 -20594254 -16097274 -5582093
3184e582093Q771019J826518o919819j0015468j908758J0840201J5567607R089256
$$ -5582093 3188926 5015444 -1904375 -11919843 -13828601 -2988400 12579207 21668463
3176B1668463j415233r719124j3208153r061070Q62471N682583j857104j2284569
$$ 21668463 20253230 10534106 -2674047 -11735117 -10872646 -5190063 -7047167 -19331736
3168a9331736j1320676q63932N660997N482093Q055269J4853010J4140272K05919
$$ -19331736 -30652412 -31516344 -25855347 -20373254 -12317985 2535025 16675297 16881216
3160A6881216j5516761j8975392j0133385N04137N397094N000530L360048K734620
$$ 16881216 1364455 -17610937 -27744322 -27240185 -21843091 -16842561 -13482513 -10747893
3152a0747893K006374j2026n34811L888237R567399Q234614J1346m852008j611240
$$ -10747893 -8741519 -8753545 -9288356 -5400119 4167280 12401894 12413240 7561232 5949992
3143E949992J603111j721828n949600n688227o139711r657492n354827J2233556
$$ 5949992 7553103 5831275 -118325 -5806552 -11946263 -21603755 -26958582 -14725026
3135a4725026K6351776J9290663Q76501n893375j87721J125p987640q066507K695502
$$ -14725026 11626750 30917413 31793914 25900539 25712818 25713943 17726303 9659796 12355298
3126A2355298O391896m495393j3307732p490602J479411O9247m480528M43675
$$ 12355298 18747194 14251801 944069 -6546533 -5067122 -4997875 -9478403 -9034728
3118i034728R287375P708169l738615j1183179p626092R90382O724817P356642
$$ -9034728 252647 7960816 4222201 -6960978 -14587070 -13596688 -6871871 484771
3110D84771N457165N464482Q783120R746439K508026p449038q598932j706094
$$ 484771 5941936 11406418 20189538 29935977 32444003 24994965 16396033 14689939
3102A4689939K8616p047120r938127j268940O822601K612714n002093j075640
$$ 14689939 14718555 7671435 -2266692 -3535632 3286969 5899683 897590 -178050
3094a78050J0616826J3636883L951601o463756q715485o420058o058444q002288
$$ -178050 10438776 24075659 28027260 21563504 12848019 6427961 369517 -7632771
3086g632771q173194k785117P547992J5181817J1632767j93000p544663o023553
$$ -7632771 -15805965 -18591082 -11043090 4138727 15771494 15578494 8033831 2010278
3078B010278n662536j1705484j2523863N04805J3234406P220946r470947j0985453
$$ 2010278 -3652258 -15357742 -27881605 -27376800 -14142394 -6921448 -16392395 -27377848
3070b7377848Q182960K4362042J8168771p39510j0258779m098624N901907P455906
$$ -27377848 -19194888 5167154 23335925 22596415 12337636 8239012 14140919 21596825
3062B1596825n19152r539352r703018M67777J0209940P207128o637379j6134972
$$ 21596825 21077673 11538321 1835303 2303080 12513020 19720148 13082769 -3052203
3054c052203j1301117J724237J0951435J2725037J0930112P837272K418482m546421
$$ -3052203 -14353320 -12629083 -1677648 11047389 21977501 29814773 32233255 27686834
3046B7686834r460615j0054260p120261k326921K461086L500634k806914j2904775
$$ 27686834 18226219 8171959 1051698 -1275223 1185863 4686497 1879583 -11025192
3038a1025192j4575279K86252K0937320K5236097P535111j0232518o399817R329747
$$ -11025192 -25600471 -25314219 -4376899 20859198 28394309 18161791 11761974 21091721
3030B1091721R567175r417720k1845673j1959623L529418M296975l002108r68986
$$ 21091721 30658896 21241176 -604497 -12564120 -9034702 -4737727 -7739835 -8708821
3022h708821Q109535J0017918N426930N219495O107802m090989j9442852j9572925
$$ -8708821 -599286 9418632 14845562 20065057 26172859 22081870 2639018 -16933907
3014a6933907k663525R090533L038534o674494m302456M465911O258095J126934
$$ -16933907 -19597432 -10506899 -7468365 -14142859 -18445315 -13979404 -7721309 -6594375
3006f594375k552767k514031q68906K446670N618486L704346j408326m67022O836375
$$ -6594375 -9147142 -11661173 -12530079 -10083409 -4464923 -760577 -2168903 -2635925 4200450
2997D200450P512939m263801j5473474j3565056m701588n21021Q86819O322850
$$ 4200450 11713389 7449588 -8023886 -21588942 -26290530 -26811551 -25924732 -19601882
2989a9601882J0946102O935832r173P7390K873333j624036p911838k243864J1968601
$$ -19601882 -8655780 -1719948 -1729121 -1651731 1221602 -402434 -8314272 -10558136 1410465
2980A410465J6751250P986556Q11198L110255L697196n495814j3494758q072845
$$ 1410465 18161715 26148271 26959469 30069724 33766920 28271106 14776348 6703503
2972F703503M066242P764667J161797n039995m386268j37407L009908M129502
$$ 6703503 10769745 18534412 19696209 14656214 10269946 10132539 13142447 17271949
2964A7271949M056496L465751K083368j931331q431846j0937243l057148Q996614
$$ 17271949 21328445 24794196 26877564 24946233 16514387 5577144 2519996 11516610
2956A1516610J0128947k323953j1320023k944207J2457207J4111434q0411j2418410
$$ 11516610 21645557 19321604 8001581 5057374 17514581 31626015 31545604 19127194
2948A9127194j1458709m420861j100320M94318M885674O308418l194553j7394478
$$ 19127194 7668485 3247624 2147304 2641622 7527296 13835714 10641161 -6753317
2940f753317j9590873m316596J3436896J5609075K757509p807892m069369P122669
$$ -6753317 -26344190 -30660786 -17223890 -1614815 1142694 -6665198 -10734567 -3611898
2932c611898J0841194L113124o631433j0064345r348094r529305q051768J374937
$$ -3611898 7229296 10342420 3710987 -6353358 -15701452 -25230757 -33282525 -31907588
2924c1907588J6417696K4892146J8327519K425775r458312j0843156o405619l171013
$$ -31907588 -15489892 9402254 27729773 30155548 20697236 9854080 3448461 277448
2916B77448k444061j845459p47042K03527K077330N167914N209596j553638r725353
$$ 277448 -2166613 -4012072 -4759114 -4555587 -2478257 2689657 7899253 6345615 -3379738
2907c379738r101563L1715M767584j843626r105765m775299N102534N828180j482443
$$ -3379738 -12481301 -12449586 -7682002 -9525628 -18631393 -23406692 -18304158 -12475978 -13958421
2898a3958421j965793O715115R039405j645255r361046k35290J4018210J3288703
$$ -13958421 -15924214 -9209099 -169694 -1814949 -11175995 -11411285 2606925 15895628
2890A5895628p23840r390611o136681j952015l831801n637149k187922L214934
$$ 15895628 15171788 5781177 -355504 -2307519 -6139320 -11776469 -13964391 -10749457
2882a0749457Q202428J3813374J4858589L598663j2444282j3627711K661607J3333268
$$ -10749457 -2547029 11266345 26124934 29723597 17279315 3651604 6313211 19646479
2874A9646479K606077j2420036o936778J2927658J8470682J28700k1204932k5335934
$$ 19646479 22252556 9832520 2895742 15823400 34294082 34422782 13217850 -12118084
2866a2118084j5497798n091972J330908N632070P279273O113004N613039O483323
$$ -12118084 -27615882 -32707854 -31376946 -25744876 -18465603 -12352599 -6739560 -256237
2858b56237M283300j191993k524938L113893O772290M79366r954366j3305227
$$ -256237 4027063 2835070 310132 3424025 10196315 10675681 721315 -12583912
2850a2583912q159132j253132L945578P757354Q049487L612200M19559M045065
$$ -12583912 -20743044 -21996176 -18050598 -10293244 -2243757 1368443 1788002 5833067
2842E833067Q408164L524544p081776r948487l549305j792647j0463832j4846441
$$ 5833067 14241231 17765775 10683999 735512 -2813793 -4606440 -15070272 -29916713
2834b9916713j536683J8581205K3560128J0647244k075006l115873j126150o713345
$$ -29916713 -31453396 -12872191 10687937 21335181 19260175 16144302 15018152 8304807
2826H304807j4132160j0902935J932544J0477706P047173j007429l192561P25930
$$ 8304807 -5827353 -16730288 -14797744 -4320038 2727135 1719706 -1472855 -746925
2818g46925L333970J107100k252959l148059l416934n679465o614089k43865J1363275
$$ -746925 2587045 3694145 1441186 -1706873 -5123807 -10803272 -17417361 -17661226 -6297951
2809f297951J6255213O267143j0581369j8145327j2057593l723971k539496l301944
$$ -6297951 9957262 16224405 5643036 -12502291 -24559884 -28283855 -30823351 -34125295
2801c4125295K368433J0230569R842864K758977J772357J1264163J9717850J5711401
$$ -34125295 -31756862 -21526293 -11683429 -8924452 -7152095 4112068 23829918 39541319
2793C9541319K277886r629808j4590142j4320540j1906596r614597p866108l191124
$$ 39541319 41819205 32189397 17599255 3278715 -8627881 -18242478 -26108586 -29299710
2785b9299710P156064J6696365J4656956K717121m244803R1445L719517k741313
$$ -29299710 -22143646 -5447281 9209675 11926796 7681993 7773438 11492955 8751642
2777H751642r395235n074453J646045j726183o289469L691593J8240746J2249864
$$ 8751642 -643593 -5718046 -4072001 -5798184 -12087653 -8396060 9844686 22094550
2769B2094550j1972480k2986755p673239Q953377M278789q671459p267273M511687
$$ 22094550 10122070 -12864685 -20537924 -11584547 -7305758 -15977217 -23244490 -18732803
2761a8732803R117687O987779R397135J1992552K116273j3890842j6098045j848784
$$ -18732803 -9615116 -2627337 6769798 18762350 20878623 6987781 -9110264 -10959048
2753a0959048J1095952J2294769R196939Q686832P036085J461873m335420q936718
$$ -10959048 136904 12431673 21628612 30315444 37351529 38813402 34477982 25541264
2745B5541264j3556887j3281370k974182Q483745O766751m817092r123127l053518
$$ 25541264 11984377 -1296993 -4271175 4212570 10979321 6162229 -2960898 -6014416
2737f014416j064178p576961q708246R28845O203509j702862p948215N51842J1371575
$$ -6014416 -7078594 -14655555 -23363801 -22434956 -16231447 -17934309 -25882524 -25330682 -13959107
2728a3959107P570988l095209j932373Q827337J1239688K568929k192713K555523
$$ -13959107 -6388119 -9483328 -11415701 -2588364 8651324 11220253 9027540 11583063
2720A1583063M993236j836481q217838m864276K221276K137098m838861r052136
$$ 11583063 16576299 14739818 6521980 1657704 3878980 6016078 1177217 -7874919
2712g874919m413833N346289J0882068O279793l865803q017988j880659M624723
$$ -7874919 -12288752 -6942463 3939605 10219398 6353595 -1664393 -3545052 1079671
2704A079671P35327q662884r150797K118107J1900547R274453q14120o635449
$$ 1079671 1814998 -6847886 -15998683 -13880576 -1980029 7294424 6480304 -155145
2696a55145m994318j597667m87152L75788L421357O198047M355563j493126n153727
$$ -155145 -5149463 -6747130 -7234282 -6858494 -3437137 2760910 7116473 5623347 469620
2687D69620k636058K240510L543063K069393K809839N083166L075791l164514
$$ 469620 -2166438 74072 3617135 5686528 8496367 13579533 16655324 13490810
2679A3490810o082156k695392L49672k087475n801852n454068k519993J65123
$$ 13490810 7408654 4713262 5062934 2975459 -2826393 -8280461 -10800454 -10635331
2671a0635331L368575N540975J559591o061701n624755N251115J0936219n24519
$$ -10635331 -7266756 -1725781 -166190 -6227891 -11852646 -6601531 4334688 3810169
2663C810169j7013850j7605475p49709J6537411K1101308J2178502m815079j8562342
$$ 3810169 -13203681 -30809156 -31558865 -15021454 6079854 18258356 13443277 -5119065
2655e119065j4175666P971692K3508448J2870076q873501j2854091Q942L334377
$$ -5119065 -19294731 -11323039 12185409 25055485 16181984 3327893 3336835 6671212
2647F671212r529687j5578203k189896J3080676J3546146P080625M630431q9829
$$ 6671212 -2858475 -18436678 -20626574 -7545898 6000248 13080873 17711304 17621475
2639A7621475j1930088j7236946n738527Q216000P008776k632432m104584O37215
$$ 17621475 5691387 -11545559 -17284086 -9068086 -2059310 -4691742 -8796326 -8159111
2631h159111p28812n607447k699107M815371N358617J692252M330335P682430
$$ -8159111 -8887923 -14495370 -17194477 -12379106 -7020489 -5328237 -997902 6684528
2623F684528k007994j7359519j5320107N744220K0453795J4048582R52324l366459
$$ 6684528 4676534 -12682985 -28003092 -22258872 -1805077 12243505 13195829 9829370
2615I829370m682482j0238125r319826O291627J9475681R241905j4700956k3069832
$$ 9829370 5146888 -5091237 -14411063 -8119436 11356245 20598150 5897194 -17172638
2607a7172638q995382M647507J577981o821695m775457L037775L796836j10651
$$ -17172638 -26168020 -21520513 -19942532 -26764227 -31539684 -28501909 -24705073 -24815724
2599b4815724K651325J0291713J0580986L781338M145060J4623800J8022868L335470
$$ -24815724 -22164399 -11872686 -1291700 2489638 6634698 21258498 39281366 42616836
2591D2616836j4210948j4511985l212387j981277j3367561j6870444k146648J4416859
$$ 42616836 28405888 13893903 10681516 8700239 -4667322 -21537766 -23684414 -9267555
2583i267555J4682970L535020l083651j804470L06506J946584O371679R397406
$$ -9267555 5415415 8950435 5866784 4062314 4368820 6315404 12687083 22084489
2575B2084489L622847p003874j0127288l174767K740188p30853q279231r745154
$$ 22084489 25707336 18703462 8576174 5401407 8141595 7410742 -868489 -10613643
2567a0613643k584264P782223J4507074J3107089L308453r088960j4561436p836585
$$ -10613643 -13197907 -5415684 9091390 22198479 25506932 16417972 1856536 -5980049
2559e980049N693917J3022386N529832j0529599j8135997p861897J0094570J7662758
$$ -5980049 -286132 12736254 18266086 7736487 -10399510 -18261407 -8166837 9495921
2551I495921J0393588o76101o937222j0709321j4288809j3095493n507491R03898
$$ 9495921 19889509 19213408 12276186 1566865 -12721944 -25817437 -31324928 -30421030
2543c0421030K8947m086103n144469l148108L3864M922809R641389J0157575Q558766
$$ -30421030 -30392083 -34478186 -39622655 -42770763 -42736899 -37814090 -28172701 -18015126 -9456360
2534i456360R921205R504486j125163j3493504r541392N436613M463580j5747638
$$ -9456360 464845 9969331 8844168 -4649336 -14190728 -8754115 -4290535 -20038173
2526b0038173k2732208l44654K0820161J2681013m709105l626637k79010j5623714
$$ -20038173 -42770381 -43115035 -22294874 -9613861 -14322966 -17949603 -18228613 -33852327
2518c3852327j5354517M2368581J13628854J03110552J775856q5959451q0239560
$$ -33852327 -49206844 -6838263 106790591 209901143 211676999 125717548 45477988
2511D5477988k2592915M743341o227711j0399537K142332M922239l811465j158950
$$ 45477988 22885073 27628414 21400703 11001166 13143498 18065737 14254272 13095322
2503A3095322J0474798P124781q264396q804064O852354J1996904l48266q498757
$$ 13095322 23570120 30694901 22430505 13626441 20478795 32475699 32127433 23628676
2495B3628676m313863m660842j3880755j2315588O629041K1062020J5410482K285708
$$ 23628676 19314813 14653971 773216 -11542372 -4913331 16148689 31559171 33844879
2487C3844879l278130n494006j0404665j0481466j162545O791142M552030j888523
$$ 33844879 30566749 25072743 14668078 4186612 3024067 9815209 14367239 12478716
2479A2478716n880735r776611j2007042l752670J1705823J5826368K402050j0316966
$$ 12478716 6597981 -3178630 -15185672 -18938342 -7232519 8593849 10995899 678933
2471F78933p331901J497877J114184n045131o521635n312018p044489o007700
$$ 678933 -6652968 -5155091 -4040907 -9086038 -15607673 -20919691 -27964180 -33971880
2463c3971880L571321J2111352P927546k483451m074896L309325P182731L776970
$$ -33971880 -30400559 -18289207 -10361661 -12845112 -16920008 -13610683 -6427952 -2650982
2455b650982J944660O963651J2675148J0505435j065945j5266832k1160090j3015661
$$ -2650982 -706322 6257329 18932477 29437912 28371967 13105135 -8054955 -21070616
2447b1070616J024406N982403r11027o710193k233248N624340P058440L634377
$$ -21070616 -20046210 -14063807 -14974834 -21685027 -23918275 -18293935 -11235495 -7601118
2439g601118J504400Q26829M78081L335312Q264743O887865k906036j0330288
$$ -7601118 -6096718 -5269889 -4791808 -1456496 6808247 13696112 10790076 459788
2431D59788p069985J355392P268406J0917783J0778851K68610j4481661j2474163
$$ 459788 -6610197 -5254805 2013601 12931384 23710235 23978845 9497184 -2976979
2423b976979R996728K4021546P008055k0023987k1354293L25154J1361286L98189
$$ -2976979 7019749 31041295 38049350 18025363 -3328930 -3003776 8357510 8755699
2415H755699j0099411n545932J497837O66519J363416Q855471R728565l028447
$$ 8755699 -1343712 -6889644 -5391807 -4725288 -3361872 5493599 15222164 12193717
2407A2193717j2661542m022067J1438199J4196928N937136J508579K256748k986094
$$ 12193717 -467825 -4489892 6948307 21145235 27082371 28590950 30847698 27861604
2399B7861604j5380942k2174505j5000719N95706J4478878K1337665K0213581
$$ 27861604 12480662 -9693843 -24694562 -24098856 -9619978 11717687 31931268
2392C1931268J2159149L37206j0838937j7146157j5220221n378403N550372R227817
$$ 31931268 44090417 44427623 33588686 16442529 1222308 -4156095 1394277 10622094
2384A0622094M988843q44931m624499p301683p198104j001674O317361M189815
$$ 10622094 15610937 14766006 10141507 2839824 -4358280 -5359954 957407 5147222
2376E147222o567807j1083129j454166J0553003J0702703K505874o28123L836751
$$ 5147222 -1420585 -12503714 -13957880 -3404877 7297826 9803700 9175577 13012328
2368A3012328O681208K977206k176577l207220j053562k80145l982118j0386299
$$ 13012328 19693536 22670742 20494165 17286945 16233383 15953238 11971120 1584821
2360A584821j1979516k416409J2532829J7607648O921502o985514j0055651n173676
$$ 1584821 -10394695 -12811104 -278275 17329373 24250875 17265361 7209710 2036034
2352B036034l864573n884833l88208J4030222K3413938J5936598l265363j8761722
$$ 2036034 -1828539 -7713372 -8101580 5928642 29342580 45279178 42013815 23252093
2344B3252093k0998770j2620405k285505M422951Q049281J0304293Q769792Q03303
$$ 23252093 2253323 -10367082 -12652587 -8229636 -180355 10123938 18893730 19697033
2336A9697033q378155r129142j094986M670255J533120l460312k425426M23381
$$ 19697033 11318878 2189736 1094750 5765005 7298125 3837813 1412387 1835768
2328A835768k090440o139593l791703K019032K285337k087931k248785K882706
$$ 1835768 -254672 -6394265 -10185968 -8166936 -5881599 -7969530 -10218315 -7335609
2320g335609O086918N701091O076567M533707o463346k1593175k3540354p961509
$$ -7335609 -1248691 4452400 10528967 15062674 8599328 -12993847 -36534201 -44495710
2312d4495710P458132Q124068L071407P862510J7982601J5699987j338863j4783798
$$ -44495710 -37037578 -28913510 -25842103 -17979593 3008 15702995 14364132 -419666
2304d19666j0160311N916597J7179000J7001554J0404932K681812o501890j7698618
$$ -419666 -10579977 -4663380 12515620 29517174 39922106 42603918 36102028 18403410
2296A8403410k5283558k0755034l820762J2641430J3889910N10226j0954824p572590
$$ 18403410 -6880148 -27635182 -31455944 -18814514 -4924604 -4414378 -15369202 -22941792
2288b2941792M829977J0959773N868169j996991n088714m821781m101785p84049
$$ -22941792 -18111815 -7152042 -1283873 -3280864 -8369578 -13191359 -17293144 -18077193
2280a8077193O469862J2230427J0825524N083056J746610N87878l961182j0633224
$$ -18077193 -11607331 623096 11448620 16531676 18278286 18866164 14904982 4271758
2272D271758r971103J271865J2359017J1808914K777714l006735k897082m554266
$$ 4271758 -5699345 -4427480 7931537 19740451 22518165 19511430 16614348 12060082
2264A2060082j0044213j0365849l52171J0631924J0830365K815588j065316K970316
$$ 12060082 2015869 -8349980 -8702151 1929773 12760138 15575726 14510410 17480726
2256A7480726N866431M00211q241287j0449775n413116q52403j253028j903265
$$ 17480726 23347157 23747368 15506081 5056306 -356810 -1209213 -2462241 -4365506
2248d365506L058204J0207848R949251M90376p675166n672542J077786J868477
$$ -4365506 -1307302 8900546 18849797 19340173 11665007 5992465 7070251 8938728
2240H938728k122206j267267L504162K07600j1967838j5939560j985718J4168788
$$ 8938728 6816522 5549255 9053417 9261017 -2706821 -18646381 -20632099 -6463311
2232f463311J2733116j123267o724717K90515M822720q93155o927869n253110
$$ -6463311 6269805 5146538 -1578179 -1287664 3535056 2641901 -4285968 -9539078
2224i539078k012242l311475l346067M186631J3653713J5586503R398835P34974
$$ -9539078 -11551320 -14862795 -18208862 -14022231 -368518 15217985 24616820 25351794
2216B5351794o481754q963282l252686O490986P767328m355065j7065216j4997028
$$ 25351794 18870040 9906758 6654072 13145058 20912386 16557321 -507895 -15504923
2208a5504923n65012J0532343J0269879M547455N38022j638348l495667l141795
$$ -15504923 -16069935 -5537592 4732287 9279742 9817764 8179416 4683749 1541954
2200A541954R54510O093852P913381M523692k161830p058662n246427K099515
$$ 1541954 2496464 8590316 16503697 21027389 18865559 11806897 6560470 8659985
2192H659985O644872J770148q480304j3567811r289177k199134m23263l652070
$$ 8659985 15304857 17075005 8594701 -4973110 -14262287 -16461421 -16884684 -20536754
2184b0536754m434818J994119J1222346J3987053P020138k162195l472876L829116
$$ -20536754 -24971572 -22977453 -11755107 2231946 9252084 7089889 3617013 7446129
2176G446129J0709913R533939J882131n111285o371989k305671J651309r82766
$$ 7446129 18156042 27689981 29572112 24460827 18088838 15783167 17434476 16451710
2168A6451710r736023j4122210n252120R668832J3198975J05854j5290803j8192051
$$ 16451710 6715687 -7406523 -12658643 -2989811 10209164 10315018 -4975785 -23167836
2160b3167836j0354167k239808K465913O041684Q067522P331521O896874Q025214
$$ -23167836 -33522003 -35761811 -33295898 -27254214 -19186692 -11855171 -4958297 3066917
2152C066917M569997o283862j3122494l319463J5354623K0424548M096825j5479279
$$ 3066917 7636914 1353052 -11769442 -15088905 265718 20690266 24787091 9307812
2144I307812j7260659k027069J2208224J2654080K466153p605405j1389661j0112467
$$ 9307812 -7952847 -9979916 2228308 14882388 17348541 9743136 -1646525 -11758992
2136a1758992o823103j926910M114054O744809J867795n691776o009706J105200
$$ -11758992 -18582095 -20509005 -16394951 -9650142 -7782347 -13474123 -19483829 -18378629
2128a8378629L973255l078488r453609m508006N367459P914786N231992P443996
$$ -18378629 -14405374 -17483862 -26937471 -31445477 -26078018 -18163232 -12931240 -5487244
2120e487244J1546037N013108j0090223j5632858m334914Q760825Q816699N02971
$$ -5487244 6058793 11071901 981678 -14651180 -18986094 -10225269 -1408570 -905599
2112i05599m009021l469539l369771l579187j593692q35577m857029q496665m585001
$$ -905599 -4914620 -8384159 -11753930 -15333117 -16926809 -17762386 -22619415 -31116080 -35701081
2103c5701081M531393J0641220J1019459Q329798L375412l533075p278412k965266
$$ -35701081 -31169688 -20528468 -9509009 -1179211 2196201 -1336874 -8615286 -11580552
2095a1580552N266619Q343459M420828J36890L24938K790658L333905P48873l288938
$$ -11580552 -6313933 2029526 6450354 6587244 6912182 9702840 13036745 13785618 10496680
2086A0496680n563090l532703O41302Q99961m022630o510384l33718Q683227R845862
$$ 10496680 4933590 1400887 2042189 2942150 -1080480 -7590864 -7924582 758645 10604507
2077A0604507L070662j763023o10224m91778n911339r271824j941568J0481897
$$ 10604507 13675169 11912146 11301922 10810144 4898805 -4373019 -6314587 4167310
2069D167310J2803483j03596j5423697j7337750n505661O067907O758580J41359
$$ 4167310 16970793 16867197 1443500 -15894250 -21399911 -15332004 -8573424 -8432065
2061h432065l784146j162381M621181R255808R309020K084402q965339j2347250
$$ -8432065 -12216211 -13378592 -8757411 498397 9807417 11891819 2926480 -9420770
2053i420770j591403J2037799J1483844j767296q970635k222743M431454q36423
$$ -9420770 -11012173 1025626 12509470 10742174 1771539 -451204 3980250 3143827
2045C143827q196454l597664P198506Q545364N58749k965839J857270M930306
$$ 3143827 -5052627 -8650291 -1451785 7093579 7652328 4686489 6543759 11474065
2037A1474065P22773n203743q816159j1416161r442529L423664K0151070K2335950
$$ 11474065 12196838 6993095 -1823064 -13239225 -22681754 -19258090 892980 23228930
2029B3228930N144336j3639683j7438272j0858173o715993n637125p85292O506233
$$ 23228930 28373266 14733583 -2704689 -13562862 -20278855 -25915980 -26701272 -20195039
2021b0195039R135966O531916L108747n77692m581162k962225P789020J8116575
$$ -20195039 -11059073 -4527157 -1418410 -1996102 -6577264 -9539489 -1750469 16366106
2013A6366106J5606140K744411p828718j2522332j6930396j8957987r435865P828796
$$ 16366106 31972246 34716657 26887939 14365607 -2564789 -21522776 -30958641 -23129845
2005b3129845J4515776L845302p341624l004548Q886210J0652148J819749l854045
$$ -23129845 -8614069 -4768767 -12110391 -15114939 -6228729 4423419 6243168 2389123
1997B389123j653274L98839j178152k09005N620171R810681Q654943N911727K543505
$$ 2389123 735849 1134688 -43464 -252469 5367702 15178383 23833326 29745053 32288558
1988C2288558o070213j7346163j7948852j899617J6642428J8829106L902730j2420018
$$ 32288558 26218345 8872182 -9076670 -10976287 5666141 24495247 28397977 15977959
1980A5977959j7866278j3010861m231050L299020O526580O001218O060014Q319700
$$ 15977959 -1888319 -14899180 -19130230 -15831210 -9304630 -3303412 2756602 11076302
1972A1076302P881808K252021p77811N910494J3519015O503578j2556590k1966852
$$ 11076302 18958110 21210131 20432320 26342814 39861829 46365407 33808817 11841965
1964A1841965j0325060O380098P022918n504715j1070307l123657L218385l636031
$$ 11841965 1516905 7897003 14919921 9415206 -1655101 -4778758 -1560373 -5196404
1956e196404j2628585o053844J2869584K2002328J0623034n083227m972541O029487
$$ -5196404 -17824989 -23878833 -11009249 10993079 21616113 16532886 11560345 17589832
1948A7589832O116896r361653j9971986j1297563L416392M830026l520376n038181
$$ 17589832 23706728 14345075 -5626911 -16924474 -13508082 -8678056 -12198432 -17236613
1940a7236613J285215L051068J25001M774886J5637534J5291661k15240j1695154
$$ -17236613 -15951398 -12900330 -12775329 -8000443 7637091 22928752 22713512 11018358
1932A1018358o586158K091803l60619o367677k778082M518205K410528m973051
$$ 11018358 4432200 6524003 6163384 -204293 -2982375 1535830 3946358 -1026693
1924a026693m494218J697705J205232m675331l170701O191425J0370862N443213
$$ -1026693 -5520911 -3823206 -2617974 -7293305 -10464006 -4272581 6098281 11541494
1916A1541494J297516K098259M96883n286876o123317J242236P942006Q939227
$$ 11541494 12839010 14937269 15434152 10147276 4023959 5266195 13208201 22147428
1908B2147428R840966J1815165N796278r640976j9738555j4105159l074723j008827
$$ 22147428 31988394 43803559 49599837 39958861 20220306 6115147 3040424 2031597
1900B031597m216173j61104R204595R989134j65444o906103o08416Q948367O308954
$$ 2031597 -2184576 -2345680 6858915 16848049 16682605 9776502 9168086 18116453 24425407
1891B4425407p637879j5846515p491250O732337P766832n811595j4883179o553982
$$ 24425407 16787528 941013 -6550237 182100 7948932 2137337 -12745842 -19299824
1883a9299824P214540Q163729k82190j88602J0017330J2302291o58673j2371574
$$ -19299824 -12085284 -3921555 -4203745 -4392347 5624983 17927274 17268601 4897027
1875D897027q610001J096650R99215o017914o650802k35742K804939k52980k484985
$$ 4897027 -3712974 -2616324 -1617109 -7635023 -14285825 -14521567 -11716628 -11969608 -14454593
1866a4454593j120466M9815K36491J952566L544068K288391K627723R748418J6868201
$$ -14454593 -15575059 -15525244 -15288753 -13336187 -9792119 -7503728 -4876005 4872413 21740614
1857B1740614J1682196m500786j6589393j6078421r556818m628277J93080P044349
$$ 21740614 33422810 28922024 12332631 -3745790 -13302608 -17930885 -17737805 -10693456
1849a0693456J1713616J1399152R882289Q652052K412411r091538j4536553o606429
$$ -10693456 1020160 12419312 22301601 30953653 33366064 24274526 9737973 3131544
1841C131544M118080L668855k954440L62073J2894611J5278766j72605j5124953
$$ 3131544 7249624 10918479 7964039 8326112 21220723 36499489 36326884 21201931
1833B1201931j1796902O74597J926758p765328j0614468j771775M677774J807954
$$ 21201931 9405029 10079626 12006384 4241056 -6373412 -8145187 -3467413 -1659459
1825a659459N31138O837498Q681145j590695r663684j701084J0135119O018633
$$ -1659459 -1128321 5709177 14390322 12799627 3135943 1434859 11569978 17588611
1817A7588611q131902j0142123J116067M759410n444347j0731076j49187J1658778
$$ 17588611 9456709 -685414 430653 5190063 -254284 -10985360 -11134547 524231
1809E24231J0708209N231895O546760Q035598M15856q303538o814101j312173
$$ 524231 11232440 16464335 23011095 31046693 31462549 23159011 16344910 15032737
1801A5032737l322523q070894m885490P65298k561046p824215N54087J6069970
$$ 15032737 11710214 3639320 -1246170 -480872 -3041918 -10866133 -10312046 5757924
1793E757924J5273379m688461j8516940r635640P341968J1328637L169431l588217
$$ 5757924 21031303 16342842 -2174098 -11809738 -4467770 6860867 10030298 6442081
1785F442081n135269n837927n116167p02473K208924j449939n405990j255184
$$ 6442081 1306812 -4531115 -9647282 -10349755 -8140831 -9590770 -14996760 -16251944
1777a6251944N822130M333191l448744l884853N145407R615237K288362m864625
$$ -16251944 -10429814 -6096623 -9545367 -13430220 -8284813 1330424 3618786 -1245839
1769a245839l73707P683848N695444k364482k853895K394577q14266j1306358
$$ -1245839 -1619546 6064302 11759746 9395264 6541369 8935946 8121680 -3184678
1761c184678j0520419N618162J5651018O359731m023983L653785J4378973K016739
$$ -3184678 -13705097 -8086935 7564083 13923814 9899831 13553616 27932589 29949328
1753B9949328k4266462k9221447n060772J6603938J2301425l060640n024215O007300
$$ 29949328 5682866 -23538581 -28599353 -11995415 306010 -2754630 -7778845 -1771545
1745a771545J3992411J2066966L977540m853479p359850J46505O855608j279372
$$ -1771545 12220866 24287832 28265372 23411893 16052043 16198548 23054156 21774784
1737B1774784j5125055j0746073R677867J4685348o852228k5304900j7872554
$$ 21774784 6649729 -4096344 5581523 20266871 13414643 -11890257 -29762811
1730b9762811l120416k711428k213559J6094570L1426785J6987793q910670r480616
$$ -29762811 -32883227 -35594655 -37808214 -21713644 9713141 26700934 17790264 8309648
1722H309648R451873J2162685m207363q666421O002109J3239805K721781n192391
$$ 8309648 17761521 29924206 25716843 17050422 23052531 36292336 39014117 33821726
1714C3821726j252024j040441q508267o116354Q288335J2735674M60316p927015
$$ 33821726 32569702 31529261 23020994 16904640 25192975 37928649 38388965 30461950
1706C0461950k515595P52849o238130r782507m650694l653789p170308R26912
$$ 30461950 27946355 28699204 22461074 12678567 8027873 4374084 -2796224 -1869312
1698a869312J7582726J8733343K576960n260378J314624L38055j0875277q833181
$$ -1869312 15713414 34446757 37023717 31763339 33077963 33416018 22540741 13707560
1690A3707560M985435P93257j8296738j3210468J5979176K2438100K648989J0473991
$$ 13707560 18692995 19486252 1189514 -12020954 3958222 26396322 29045311 39519302
1682C9519302M6954771L6812777k5129024j7496839J13992575K09189531R0114219
$$ 39519302 86474073 123286850 98157826 80660987 194653562 403843093 493957312
1675D93957312j56494522k65131834j45940432J7855008N0180097o646965k5833883
$$ 493957312 337462790 72330956 -73609476 -55754468 -5574371 -12221336 -38055219
1668c8055219M415683J8332569Q017391R491514J4130982o999670k9956137j4023549
$$ -38055219 -33639536 -15306967 -7289576 2201938 16332920 9333250 -20622887 -34646436
1660c4646436J9276454J9209298p241121j2687507O638719J3009758m09993m741508
$$ -34646436 -15369982 3839316 -3401805 -16089312 -9450593 3559165 3149172 -1592336
1652a592336M507174L059450r618847r154409L328636K089633j1243317p666271
$$ -1592336 2914838 5974288 -3644559 -12798968 -9470332 -7380699 -18624016 -26290287
1644b6290287J3510891J8892531q36182j4120341k522470J1622976P649303j837221
$$ -26290287 -12779396 6113135 5276953 -8843388 -11365858 257118 7906421 6069200
1636F069200n74567K768884l708325j1628380r652539l063479Q1164L622722J0551225
$$ 6069200 5494633 8263517 4555192 -7073188 -16725727 -19789206 -19708042 -16085320 -5534095
1627e534095J3077548P437577K468113L422139L072917k658302o566258n286165
$$ -5534095 7543453 14981030 17449143 20871282 23944199 21285897 14719639 9433474
1619I433474n665957q893804o228146K028005K799734n467927n487008R585780
$$ 9433474 3767517 -5126287 -11354433 -9326428 -6526694 -11994621 -17481629 -7895849
1611g895849J9825183P961043j2093883j5505375k729658M862520j950244j1096567
$$ -7895849 11929334 19890377 7796494 -7708881 -10438539 -5576019 -7526263 -18622830
1603a8622830j0765400l635987J954366L355251K993702L105021L753673L964251
$$ -18622830 -29388230 -33024217 -31069851 -27714600 -24720898 -21615877 -17862204 -13897953
1595a3897953M323194P195195J1388463R641881j529829j2303796j0397064j47648
$$ -13897953 -9574759 -2379564 9008899 18650780 17120951 4817155 -5579909 -5727557
1587e727557K353704o020586j0836400m103591L336921J085741m496731l932392
$$ -5727557 -3373853 -9394439 -20230839 -24334430 -20997509 -19911768 -24408499 -28340891
1579b8340891j031912k700184l640317L921267J3268969J1264853j141715j0248577
$$ -28340891 -29372803 -32072987 -35713304 -31792037 -18523068 -7258215 -8399930 -18648507
1571a8648507q830797k077443L523980O020744M216811j447727n071348j652550
$$ -18648507 -27479304 -29556747 -26032767 -20012023 -15795212 -17242939 -22314287 -23966837
1563b3966837M034565M138075J324520M806763J3426989J4923159M578952o773568
$$ -23966837 -19932272 -15794197 -14469677 -9662914 3764075 18687234 23266186 16492618
1555A6492618q417400l794762k027322l123046p31412M524052M587493k517144
$$ 16492618 8075218 4280456 2253134 -869912 -1601324 2922728 7510221 4993077
1547D993077p082877j23624J3261932J8894117J0877079j828732p828984o758089
$$ 4993077 -2089800 -2213424 11048508 29942625 40819704 38990972 31161988 24403899
1539B4403899n709854o465451m134004J936675M456258j065677q461901r270709
$$ 24403899 18694045 12228594 8094590 10031265 14487523 13421846 4959945 -4310764
1531d310764m539421j944049l567865l497064K065254Q291600Q047391J226759
$$ -4310764 -8850185 -10794234 -14362099 -17859163 -15793909 -7502309 545082 1771841
1523A771841n464443o760353m069861k221318l096932m118656k296690K194013
$$ 1771841 -3692602 -10452955 -14522816 -16744134 -19841066 -23959722 -26256412 -24062399
1515b4062399O632578P989626M293601l333844q887157n648101M756793J1189292
$$ -24062399 -17429821 -9440195 -5146594 -8480438 -17367595 -23015696 -18258903 -7069611
1507g069611N778438m890983p603460j03697O519694L754872l686228o502469
$$ -7069611 -1291173 -6182156 -13785616 -13889313 -7369619 -3614747 -7300975 -13803444
1499a3803444l620597p56166q8765J763310N634487N699327k747667j3576779
$$ -13803444 -17424041 -18180207 -18268972 -16505662 -10871175 -5171848 -7919515 -21496294
1491b1496294j3326747K503435K0131099K1053302N006951q601793n627962N126870
$$ -21496294 -34823041 -32319606 -12188507 8864795 13871746 5269953 -358009 4768861
1483D768861O661453j549657n626696j76419N030254K445597k320018j769553
$$ 4768861 11430314 9880657 4253961 4077542 9107796 11553393 9233375 7463822
1475G463822J812262K457749M71135l94046j92403j544875n232658j0571010j5298230
$$ 7463822 9276084 11733833 12204968 11810922 11618519 10073644 4840986 -5730024 -21028254
1466b1028254j2995735J494637J9943797K3332735M635732j8053165k0906317
$$ -21028254 -34023989 -32529352 -12585555 10747180 15382912 -2670253 -23576570
1459b3576570k637855J5932829J7602158M599643r622823j4438053p156021O726240
$$ -23576570 -26214425 -10281596 7320562 11920205 2297382 -12140671 -19296692 -12570452
1451a2570452J5409653R940319m931077j4240267j0239496j204894R91275l099276
$$ -12570452 2839201 12779520 7848443 -6391824 -16631320 -17836214 -16844939 -19944215
1443a9944215l319773M033709J1031855J0263811M943413K307375K186874p83819
$$ -19944215 -23263988 -19230279 -8198424 2065387 7008800 9316175 11503049 10719230
1435A0719230o062134o725053p15952N577681P298936O340452L080030o926135
$$ 10719230 4657096 -2067957 -2783909 2793772 10092708 16433160 19513190 12587055
1427A2587055k0728328k2927206n247081J6095969J7887231J358635j0237047
$$ 12587055 -8141273 -31068479 -36315560 -20219591 -2332360 -973725 -11210772
1420a1210772n198708L225257J354145m353726j194508Q238867J0817974K037896
$$ -11210772 -16409480 -13184223 -11830078 -16183804 -17378312 -9139445 1678529 3716425
1412C716425r951059j5191657r655556L314220J3691214J2165307J587861n228150
$$ 3716425 -6234634 -21426291 -31081847 -27767627 -14076413 -1911106 -323245 -5551395
1404e551395l059898q24440n171576q407664k163714O668402O218603p88671j405467
$$ -5551395 -8611293 -9435733 -14607309 -23014973 -25178687 -18510285 -12291682 -13080353 -14485820
1395a4485820O849622J2886309R539758K897403J831910O047236P377756p53431
$$ -14485820 -7636198 5250111 14789869 17687272 19519182 25566418 32944174 32190743
1387C2190743j5565970k5016031j8959741k394229Q094311M304792m653841p734594
$$ 32190743 16624773 -8391258 -27350999 -29745228 -21650917 -17346125 -21999966 -29734560
1379b9734560o182757m755149K73170J2093376K0913670J5105287l21510j0356824
$$ -29734560 -35917317 -40672466 -40399296 -28305920 -7392250 7713037 7391527 -2965297
1371b965297j1064077j0064432r640148m711453L723573Q026969O876862N479319
$$ -2965297 -14029374 -24093806 -33733954 -38445407 -34721834 -26694865 -19818003 -14338684
1363a4338684L763025j666731n320312J275232J1820762J1235002Q05338k111641
$$ -14338684 -10575659 -12242390 -17562702 -16287470 -4466708 6768294 7573632 5461991
1355E461991O552852R593332k073162j3143325r756593k268548n325462j1437333
$$ 5461991 12014843 21608175 19535013 6391688 -3364905 -5633453 -10958915 -22396248
1347b2396248n087717Q182561R417458k759230j0809493o603071l30191J008691
$$ -22396248 -27483965 -19301404 -9883946 -12643176 -23452669 -30055740 -30385931 -29377240
1339b9377240M094021J1734166J2551578m61424j3843035r866886Q077993J9518631
$$ -29377240 -25283219 -13549053 -997475 -1458899 -15301934 -25168820 -17090827 2427804
1331B427804J3606992p1211p615761o718881k816188J454867N881720P198620
$$ 2427804 16034796 15963585 8347824 1628943 -1187245 267622 6149342 13347962
1323A3347962K226009n184931p483712l605239L53324O08395q32963k327421m037777
$$ 13347962 15573971 10389040 2905328 -699911 -346587 261808 -571155 -2898576 -6936353
1314f936353k164826P732448J8053416J2550146r158703k3111295j0815842J2360600
$$ -6936353 -9101179 -1368731 16684685 29234831 20076128 -3035167 -13851009 -1490409
1306a490409J6471024j170750j4220762o954163O329489P733772J467494R06984
$$ -1490409 14980615 13809865 -410897 -7365060 -1035571 6698201 8165695 9072679
1298I072679M959139K758915o258847j1316622o208570M126469J1203054J0029467
$$ 9072679 14031818 16790733 10531886 -784736 -6993306 -2866837 8336217 18365684
1290A8365684J121058q563610r801931j619014N814258L764922l708889o572661
$$ 18365684 19486742 10923132 1121201 -497813 5316445 9081367 5372478 -1200183
1282a200183l006868j43825k617659o351799m143838N092878J2704299P176926
$$ -1200183 -4207051 -4350876 -6968535 -13320334 -17464172 -12371294 333005 7509931
1274G509931j1553979k6441170j9587537N198096K4643146K2815125O602371q127076
$$ 7509931 -4044048 -30485218 -50072755 -44874659 -20231513 2583612 9185983 1058907
1266A058907j4608412j3835654o557316L991331R531579O644200L356111P367110
$$ 1058907 -13549505 -27385159 -33942475 -29951144 -20419565 -13775365 -10419254 -3052144
1258c052144J3463249J1255363M60255r782863j2568048p244862L039667J0956550
$$ -3052144 10411105 21666468 22126723 12343860 -224188 -7469050 -4429383 6527167
1250F527167Q074662m290424j3253666j0483428l157776j345335l111541j820717
$$ 6527167 14601829 10311405 -2942261 -13425689 -16583465 -17928800 -21040341 -22861058
1242b2861058O79128J21883J038707Q461772J5325018J2550569N583361N391093
$$ -22861058 -22181930 -22060047 -21021340 -12559568 2765450 15316019 20899380 26290473
1234B6290473Q573534L840915n834760p044715n49588j429093j2447739j7705786
$$ 26290473 34864007 38704922 32870162 25825447 25275859 23846766 11399027 -6306759
1226f306759q684669K192839K572586j776285k82791N046149P163242P722181
$$ -6306759 -14991428 -12798589 -10226003 -12002288 -12285079 -7238930 -75688 7646493
1218G646493J1268444J3917231R233278j50949o399769p708865p854216q351767
$$ 7646493 18914937 32832168 42065446 41914497 35514728 27805863 19951647 11599880
1210A1599880p745769n477897j448615M675793R931181Q531614j51122q646269
$$ 11599880 3854111 -1623786 -3072401 1603392 11534573 20066187 19915065 11268796
1202A1268796j0052563n559352j064261r19560o023097j2304610j1219421M40636
$$ 11268796 1216233 -4343119 -5407380 -6326940 -12350037 -24654647 -35874068 -35433432
1194c5433432J1833819R587561k111505o303365N35157L845046k560498m871583
$$ -35433432 -23599613 -14012052 -16123557 -22426922 -21891765 -18046719 -20607217 -25478800
1186b5478800N068482J1870092J641040j1229695m709098J4349656J9622485O308508
$$ -25478800 -20410318 -8540226 -6899186 -18128881 -22837979 -8488323 11134162 17442670
1178A7442670l789359M88375L502642p672561k0348476j7137280l198679M090614
$$ 17442670 13653311 14141686 17644328 9971767 -10376709 -27513989 -30712668 -26622054
1170b6622054J901986J222648N240890N538046o77012m640481j190581J939511
$$ -26622054 -24720068 -23497420 -18256530 -12718484 -13395496 -18035977 -19226558 -17287047
1162a7287047l275763j1400017j0989886j711787N185713L378671k68434K416141
$$ -17287047 -20562810 -31962827 -42952713 -44664500 -39478787 -36100116 -36368550 -33952409
1154c3952409P934642P221866P72042j627620L562999P706328L448997l769785
$$ -33952409 -26017767 -18795901 -18023859 -19651479 -16088480 -8382152 -4933155 -8702940
1146h702940m281493J248883M049517J253708j169763L95798J645072r35348k768516
$$ -8702940 -12984433 -11735550 -7686033 -6432325 -7602088 -7206290 -5561218 -6496566 -9265082
1137i265082J727176Q869305R550410K723257j923992K343347Q666847N904297
$$ -9265082 -7537906 1331399 10881809 13605066 11681074 14024421 22691268 28595565
1129B8595565m430104r407826l956857J040576m109440j1587563p696072M514966
$$ 28595565 24165461 14757635 10800778 11841354 7731914 -3855649 -11551721 -7036755
1121g036755Q112343k483739j3119524j0855332r12008M403613L498823K885804
$$ -7036755 1075588 -1408151 -14527675 -25383007 -26295015 -21891402 -18392579 -15506775
1113a5506775L910438K328560k216420m806225k086418M938133J2806780J6243509
$$ -15506775 -11596337 -9267777 -11484197 -16290422 -18376840 -13438707 -631927 15611582
1105A5611582J0640093j594209j1178895j2711775j0447095r248708o602553K11596
$$ 15611582 26251675 24657466 13478571 766796 -9680299 -18929007 -25531560 -25319964
1097b5319964O191609O272812M940515Q844202J4696224J4268922P386346K06657
$$ -25319964 -19128355 -12855543 -7915028 929174 15625398 29894320 37280666 37487323
1089C7487323n429978j0674185j1778324n134413K821114K813979k452205k998903
$$ 37487323 32057345 21383160 9604836 4470423 7291537 10105516 7653311 4654408
1081D654408J323400K166037p69351j93626K140732l070545j2383464j0072372
$$ 4654408 5977808 8143845 7374494 7180868 9321600 6251055 -6132409 -16204781
1073a6204781N071021J2963577K651634q835616k819183J1333616J1480415k921832
$$ -16204781 -11133760 1829817 4481451 -4354165 -7173348 4160268 15640683 12718851
1065A2718851j2095269o669157K287957L639460j84782k521137k131175r6888
$$ 12718851 623582 -6045575 -3757618 -118158 -302940 -2824077 -4955252 -5052140
1057e052140K722071K851135k041329n704621J07879J0405992J0138498l733193
$$ -5052140 -2330069 521066 -1520263 -7224884 -7117005 3288987 13427485 9694292
1049I694292j5194433j0863497J597694N932871L70509k986389J957840P644010
$$ 9694292 -5500141 -16363638 -14765944 -8833073 -8462564 -11448953 -9491113 -1847103
1041a847103N934257m16532l158104K07144M877219N765351K607692r92394j517441
$$ -1847103 4087154 3670622 512518 719662 5596881 11362232 13969924 12977530 11460089
1032A1460089R58993K147620k390338j1134147j6137748j1462881j389930L648602
$$ 11460089 12419082 14566702 12176364 1042217 -15095531 -26558412 -27948342 -24299740
1024b4299740J80679l813787n52925O040407O570511J005672j334628K971509
$$ -24299740 -24119061 -27932848 -28485773 -22445366 -15874855 -14869183 -16203811 -13232302
1016a3232302N710147O74693n556058l777126L241772N327568J63882n521987
$$ -13232302 -7522155 -6847462 -12403520 -16180646 -12938874 -7611306 -7447424 -12969411
1008a2969411p611842p191825k667708Q747049K0002108J7546456J267068j0689457
$$ -12969411 -20581253 -27773078 -30440786 -21693737 -1691629 15854827 17121895 6432438
1000F432438n580763N747480N535053m806929r951277o510813n935258j1617526
$$ 6432438 851675 6599155 12134208 7327279 -2623998 -9134811 -15070069 -26687595
992b6687595j1539572J38601J0304157O350353l929015m995990K572538N514281
$$ -26687595 -38227167 -38088566 -27784409 -21434056 -25363071 -30359061 -27786523 -22272242
984b2272242K95827l119021Q52333N872034O384883N682739O846049N650566j599198
$$ -22272242 -21976415 -25095436 -24243103 -18371069 -11986186 -6303447 542602 6193168 4593970
975D593970j0238607j2788950p739917N38543O211257M735137l051580q426741
$$ 4593970 -5644637 -18433587 -26173504 -25634961 -19423704 -14688567 -17740147 -26166888
967b6166888l291791P729111J2036900P141069L336536N465150N010804l008601
$$ -26166888 -29458679 -21729568 -9692668 -2551599 784937 6250087 11260891 8252290
959H252290q538152k603251O149417M196908n790057j0562681p078614l643006
$$ 8252290 -285862 -2889113 3260304 7457212 1667155 -8895526 -15974140 -19617146
951a9617146m170713m654634k869465K2626M429749Q325572M099247q180328j2287680
$$ -19617146 -23787859 -28442493 -31311958 -31289332 -26859583 -18534011 -14434764 -22615092 -34902772
942c4902772K644587J9719169J4851330n303063j1762124J153376P964863m155717
$$ -34902772 -32258185 -12539016 2312314 -2990749 -14752873 -13599497 -5634634 -9790351
934i790351j4146361l724142J2058022J1022978j546451p450441o767265r554835
$$ -9790351 -23936712 -27660854 -15602832 -4579854 -6126305 -13576746 -20344011 -29898846
926b9898846j0306437K402481J9484134K1183665Q780107J206578K399944k292024
$$ -29898846 -40205283 -37802802 -18318668 2864997 11645104 12851682 15251626 12959602
918A2959602j5775800k0701456p808779Q804416J3639103R353118N344871K387806
$$ 12959602 -2816198 -23517654 -31326433 -22522017 -8882914 470204 5815075 8202881
910H202881j450409k472147J111428L282173J9006l805189l583272j794841l76682
$$ 8202881 6752472 4280325 5391753 8673926 8692932 4887743 1304471 -490370 -867052
901h67052L335295P554742M543581n095887q910595j896774L363561k912246r380879
$$ -867052 2468243 10022985 14566566 9470679 560084 -1336690 2026871 -885375 -10266254
892a0266254p48391J5720453J8764150M633483p450274k750547J0729254J5920561
$$ -10266254 -11014645 4705808 23469958 28103441 20653167 17902620 28631874 44552435
884D4552435P657287n668806j3946282j3330846o786661q66101R643k451196l785284
$$ 44552435 52209722 46540916 32594634 19263788 12477127 11611026 11620669 9169473 5384189
875E384189l121637k704168k497787m49946K167802J476790j885168k122508K595876
$$ 5384189 2262552 -441616 -2939403 -3389349 -1221547 255243 -1629925 -3752433 -1156557
866a156557N390332o03666j1719825j6956263j1277963j543374K339020o71434
$$ -1156557 4233775 3630109 -8089716 -25045979 -36323942 -37867316 -35528296 -36199730
858c6199730k657939K145756R691999J1478162N317820k512269n358242k975833
$$ -36199730 -38857669 -36711913 -27019914 -15541752 -10223932 -12736201 -18094443 -21070276
850b1070276O31278L081430N025807P106340P953737N893738K018602K96627K931068
$$ -21070276 -20438998 -17357568 -12331761 -5225421 2728316 8622054 10640656 10937283 13868351
841A3868351N747893J421740j0633457k0504648j7403299j479604J6654395K5688396
$$ 13868351 19616244 21037984 10404527 -10100121 -27503420 -28983024 -12328629 13359767
833A3359767K0107582J832225j8296558k4685249j1679566P177265J3408274O186487
$$ 13359767 33467349 35299574 17003016 -7682233 -19361799 -12184534 1223740 7410227
825G410227N19311L284296M542855l336381j1893756j0843500m890350m535004
$$ 7410227 7929538 11213834 15756689 12420308 526552 -10316948 -15207298 -19742302
817a9742302p866793m635347N565396J2071452R436434L878973K243396L683059
$$ -19742302 -27609095 -32244442 -26679046 -14607594 -5171160 -1292187 951209 4634268
809D634268M577356M289875L138238J38100m406118p668008p439667m064219R72091
$$ 4634268 9211624 13501499 16639737 16777837 12371719 4703711 -2735956 -6800175 -5828084
800e828084N762395P763573N663082R62141m233359r097219j1718962q558263
$$ -5828084 -65689 7697884 13360966 14323107 10089748 992529 -10726433 -19284696
792a9284696j99132N972033M010146k595008o426347o213938n021110k024063
$$ -19284696 -19483828 -13511795 -9501649 -12096657 -18523004 -24736942 -29758052 -31782115
784c1782115N239556J2343173J1552349M457656J448037O220514R912849M917336
$$ -31782115 -26542559 -14199386 -2647037 1810619 3258656 9479170 19392019 24309355
776B4309355l580430o120482k961030j846035m805297n250995Q61324P136574
$$ 24309355 20728925 14608443 11647413 9801378 4996081 -254914 606410 7742984
768G742984M052756p877914j6624259j1943046K487943J3548514J3785750P154304
$$ 7742984 11795740 3917826 -12706433 -24649479 -22161536 -8613022 5172728 12327032
760A2327032k7859o614754j1975121j1127389j401293J0355574J4428410R735530
$$ 12327032 12299173 5684419 -6290702 -17418091 -18819384 -8463810 5964600 15700130
752A5700130K729982k347647n710067p277766o696573o032793o016102k578883
$$ 15700130 18430112 16082465 10372398 3094632 -3601941 -9634734 -15650836 -18229719
744a8229719N707767J0736303M760828o093887r132742l582233M81792L05147
$$ -18229719 -12521952 -1785649 2975179 -3118708 -12251450 -15833683 -15351891 -15046744
736a5046744L088865R174449Q314770j985588q889586l138435O512121P075071
$$ -15046744 -11957879 -2783430 5531340 3545752 -5343834 -8482269 -1970148 5104923
728E104923m71992o531153p966706p716940o014221j805936K130700L875852P042436
$$ 5104923 4632931 -1898222 -9864928 -17581868 -23596089 -25402025 -23271325 -19395473 -12353037
719a2353037J3184161J5693727R756627K116388J187216L060528j682983j1424764
$$ -12353037 831124 16524851 26281478 28397866 29585082 32645610 30962627 19537863
711A9537863j5472713j0455333l586591j50923J966711M681441N853936M632031
$$ 19537863 4065150 -6390183 -9976774 -10127697 -8160986 -3479545 2374391 7006422
703G006422L329057K532580J14125m268810q415841j0719719r972767m551190
$$ 7006422 10335479 12868059 12982184 8713374 297533 -10422186 -20394953 -24946143
695b4946143L424013O978755L454472K81069M114699R227863O215424k361041
$$ -24946143 -21522130 -14543375 -11088903 -10807834 -6693135 2534728 8750152 6389111
687F389111o511546n511797o851646j0096848o355811M701054J1317594O950747
$$ 6389111 -122435 -5634232 -12485878 -22582726 -28938537 -24237483 -12919889 -5969142
679e969142j079338m389065l579741j326329K895604O157796J936491p259073
$$ -5969142 -7048480 -11437545 -15017286 -16343615 -13448011 -7290215 -5353724 -12612797
671a2612797q881782N61779P124138l24719j2119799j1783397K40845R353967
$$ -12612797 -21494579 -20932800 -13808662 -14133381 -26253180 -38036577 -37795732 -28441765
663b8441765P707393L38570n799853p801093m332516K828322O775157L594557
$$ -28441765 -20734372 -20395802 -26195655 -33996748 -38329264 -35500942 -28725785 -25131228
655b5131228k97217K581042Q075546O961799N86302j732542J195166J585135k254797
$$ -25131228 -25428445 -22847403 -14771857 -7810058 -7223756 -8956298 -7761132 -6175997 -8430794
646h430794k944364J917716N005977K167964j159114q72058q98220l667910m192903
$$ -8430794 -11375158 -9457442 -4451465 -2283501 -3442615 -4314673 -5212893 -8880803 -13073706
637a3073706j73526J733472k408230m855282J765631J1141186J2544486P198655
$$ -13073706 -13247232 -11513760 -13921990 -18777272 -17011641 -5870455 6674031 13872686
629A3872686L818887K642464k925973j0894018j0918431j473389N846308L032900
$$ 13872686 17691573 20334037 17408064 6514046 -4404385 -5877774 -31466 3001434
621C001434m021238o605506m844801k566178O09847N154304P129644N081729M659149
$$ 3001434 -1019804 -7625310 -12470111 -15036289 -14426442 -9272138 -2142494 2939235 7598384
612G598384Q812423J0375356L483178m297830k542577M487067L978816m655346
$$ 7598384 16410807 26786163 30269341 25971511 23428934 27916001 31894817 27239471
604B7239471r387143n520976j286292j553558q92269K825166K670421l030223
$$ 27239471 17852328 12331352 11045060 9491502 8599233 11424399 14094820 11064597
596A1064597n043817j22991J101279o222804q744513L121504J4677458P414163
$$ 11064597 6020780 5897789 6999068 776264 -7968249 -4846745 9830713 17244876
588A7244876j0584392j6444539p575209j180443k438294P61498J0066595J0554749
$$ 17244876 6660484 -9784055 -17359264 -18539707 -20978001 -20216503 -10149908 404841
580D04841r74894p257342o80221K573873o995146j1803074K414859J7189574Q591227
$$ 404841 -570053 -7827395 -8507616 -5933743 -12928889 -24731963 -22317104 -5127530 3463697
571C463697j1752926j3114911N492856J4902123L228865p815771j018854J0099270
$$ 3463697 -8289229 -21404140 -15911284 -1009161 2219704 -5596067 -6614921 3484349
563C484349O890737m658177p419067j276059Q00167l891714n753990p45305M268066
$$ 3484349 10375086 5716909 -1702158 -2978217 -2178050 -6069764 -11823754 -12569059 -8300993
554h300993L918198R42880j050359k941735n713620o636830l079210K738222N389602
$$ -8300993 -4382795 -3439915 -4490274 -7432009 -13145629 -19782459 -22861669 -20123447 -14733845
545a4733845K246286l200940m916585j632890J154021j512587o719338p114875
$$ -14733845 -12487559 -15688499 -20605084 -22237974 -21083953 -22596540 -29315878 -36430753
537c6430753k40845R516758J6794345J8445186J2728662J465127p955750r320908
$$ -36430753 -36671598 -27154840 -10360495 8084691 20813353 22278480 14322730 5001822
529E001822n739234m187438l439322L096341J2764632J3874298L745199n363709
$$ 5001822 -737412 -4924850 -8364172 -5267831 7496801 21371099 25116298 19752589
521A9752589m315027K4034j947702o660483n466309o22684o34627m486909l377776
$$ 19752589 15437562 15461596 13513894 6853411 1387102 764418 129791 -4357118 -7734894
512g734894L765926Q541838O882500L641036J937956j836492r135675j4027797
$$ -7734894 -3968968 4572870 11455370 15096406 17034362 15197870 6062195 -7965602
504g965602j1380285m005203K432154O340954Q179575O580969J480795k356620
$$ -7965602 -19345887 -23351090 -20918936 -14577982 -6398407 182562 1663357 -693263
496f93263l97323M355738L912964m297548j3095658j3537396n478225K460771
$$ -693263 -1090586 3265152 7178116 2880568 -10215090 -23752486 -29230711 -26769940
488b6769940L557616O67475R06246N071563P183498M383117J360607K303823L703599
$$ -26769940 -23212324 -22544849 -21638603 -16567040 -9383542 -5000425 -3639818 -1335995 2367604
479B367604m1023p134683r829208m242823N191140J0528348P379009j022512n162478
$$ 2367604 2326581 -4808102 -14637310 -18880133 -13688993 -3160645 4218364 3195852 -1966626
470a966626J742473J3637473J5603244K233598j3498937j6075887o790177J163456
$$ -1966626 -224153 13413320 29016564 31250162 17751225 1675338 -5114839 -3951383
462c951383K287820K267596L973544K925636j475760k409472K055245L658613
$$ -3951383 -1663563 604033 4577577 7503213 6027453 3617981 5673226 9331839
454I331839k858033j0373828j0507296o187231m624916m429959J87152O859352
$$ 9331839 6473806 -3900022 -14407318 -20594549 -25219465 -29649424 -29462272 -22602920
446b2602920P766444L206057J562749M818232M358458n011410j5214078j4969584
$$ -22602920 -14836476 -11630419 -10067670 -5249438 -890980 -5902390 -21116468 -36086052
438c6086052m496266N991765R585440Q506492P422931O518171L255499j960255
$$ -36086052 -40582318 -34590553 -25005113 -16498621 -9075690 -2557519 697980 -1262275
430a262275m850785k068187M347015Q237242N336128k380756q896469j0290776
$$ -1262275 -6113060 -8181247 -3834232 4403010 9739138 7358382 -1538087 -11828863
422a1828863p565913l530619J032050O541546J1255134J1401256N535026k674270
$$ -11828863 -19394776 -22925395 -21893345 -15351799 -4096665 7304591 12839617 10165347
414A0165347p289684n489898L19074N210546O056008L680462J256370M09367n71537
$$ 10165347 2875663 -2614235 -2295161 2915385 8971393 12651855 13908225 14317592 13746055
405A3746055l370941n304656j755462O048715R992954N215795k547876n073919
$$ 13746055 10375114 5070458 3314996 9363711 19356665 24572460 22024584 16950665
397A6950665l893721o613881j2149184r790121L712789J5598410J2739643n36610
$$ 16950665 13056944 6443063 -5706121 -15496242 -11783453 3814957 16554600 16017990
389A6017990q648509n079779K102842L704120J94198k059748O71901O520106R963250
$$ 16017990 7369481 2289702 4392544 8096664 8290862 6231114 6903015 13423121 23386371
380B3386371O317458k746013r248291p953689l259195k364363m287099k583025
$$ 23386371 29703829 26957816 17709525 9755836 6496641 4132278 -154821 -2737846
372b737846K600145L779027j687016p033395o394610k275322P75034K940319M907997
$$ -2737846 -137701 3641326 1954310 -5079085 -11473695 -13749017 -12973983 -10033664 -5125667
363e125667L238791l726643r804361p695754N65808O183915N387331K511487J237604
$$ -5125667 -1886876 -5613519 -15417880 -23113634 -22547826 -16363911 -10976580 -8465093 -7227489
354g227489q48517o011921r407510m047729P882960J4476894Q231535l206825
$$ -7227489 -8076006 -14087927 -23495437 -27543166 -19660206 -5183312 3048223 -158602
346a58602o459531r02428O93325q163952j7046976j4041088l294499K911952L484321
$$ -158602 -6618133 -7520561 -6827236 -14991188 -32038164 -46079252 -49373751 -46461799 -42977478
337d2977478P159962J4702841J6647242J0002620L824102M110848M868196k67353
$$ -42977478 -35817516 -21114675 -4467433 5535187 9359289 13470137 18338333 18070980
329A8070980p624335j0907336j0254174p715669j829727O835387J2012008R852702
$$ 18070980 10446645 -460691 -10714865 -18430534 -20260261 -13424874 -1412866 8439836
321H439836M252512o69522n583621q942954m957339M967895R185888K199730o300926
$$ 8439836 12692348 12022826 6439205 -2503749 -7461088 -2493193 6692695 8892425 2591499
312B591499p464124o486203q865729o667802O067167J6180656R184606m770099
$$ 2591499 -4872625 -11358828 -20224557 -26892359 -20825192 -4644536 4540070 -230029
304b30029m926823N888126O011320p533356j3183889j406266R077133K679575
$$ -230029 -5156852 731274 6742594 -790762 -13974651 -15380917 -6303784 -3624209
296c624209q274265n677500N625000R144677L518300n07521q42752l774073q139137
$$ -3624209 -11898474 -17575974 -11950974 -2806297 712003 204482 -638270 -4412343 -12551480
287a2551480o242913J739630Q082919J0497734J2409012J2124331M583244o361821
$$ -12551480 -18794393 -17054763 -8971844 1525890 13934902 26059233 30642477 24280656
279B4280656j0002465m841590j431968o264640j2690647j1870547m535359K663234
$$ 24280656 14278191 9436601 8004633 1739993 -10950654 -22821201 -27356560 -24693326
271b4693326N947602N150978J092038l386511l914576l3787L254350K657755J766691
$$ -24693326 -18745724 -13594746 -12502708 -15889219 -19803795 -19837582 -16583232 -13925477 -12158786
262a2158786N187564J0465313J0683333M060781l528926o125264m129819j589612
$$ -12158786 -6971222 3494091 14177424 18238205 14709279 8584015 4454196 2864584
254B864584L188J927133L449625J289640m497309q048702n077400j73722j159410
$$ 2864584 2867772 4794905 8244530 9534170 5036861 -3011841 -8089241 -8262963 -9422373
245i422373o952490p929738k28683P287185N170235k792349m696112L068489J1623002
$$ -9422373 -16374863 -24304601 -24533284 -17246099 -12075864 -14868213 -19564325 -16495836 -4872834
236d872834J1952230N388224l06290j130479l5777j555493n667551p509044l158556
$$ -4872834 7079396 12467620 12161330 11030851 10995074 9439581 3772030 -3737014 -6895570
227f895570M608852P945878K487901p140948j2198308r211686k537070J657794
$$ -6895570 -2286718 5659160 8147061 1006113 -11192195 -20403881 -22940951 -21283157
219b1283157J541111l16726p07605J615423N889878J0078631J1303046P214926
$$ -21283157 -19742046 -20058772 -20766377 -19150954 -13261076 -3182445 8120601 15335527
211A5335527r89628p501286p018796j662391J131459n93469l7787O478486J0611272
$$ 15335527 14345899 6844613 -174183 -1836574 -705115 -1298584 -1336371 5142115 15753387
202A5753387L499137q205927r629907j28326M922317k213349r808538n678850
$$ 15753387 19252524 11046597 1416690 1288364 6210681 3997332 -5811206 -11490056
194a1490056M112159O159004J85347l716531k246665n66138l64453J234186K465476
$$ -11490056 -7377897 -1218893 -1033546 -4750077 -6996742 -7562880 -7927333 -6693147 -4227671
185d227671j259324o371409l698776O381518J2240556P418741j004415m205768
$$ -4227671 -5486995 -11858404 -15557180 -9175662 3064894 10483635 9479220 5273452
177E273452k880752k101450k723433l255212m060500m553651j413055N688354
$$ 5273452 2392700 291250 -2432183 -5687395 -9747895 -14301546 -15714601 -10026247
169a0026247J1170751J0599009O287980K173271j927091o593782q405603m799313
$$ -10026247 1144504 11743513 18031493 20204764 18277673 11683891 3278288 -1521025
161a521025L93512J714451m54312k013006j812879j280441k86620J220005O9887
$$ -1521025 -1127513 586938 132626 -1880380 -3693259 -4973700 -5260320 -4040315 -3970428
152c970428n609823j0685663q474937j021712L119664J690609J771984P651311
$$ -3970428 -9580251 -20265914 -28740851 -29762563 -26642899 -24952290 -23180306 -15528995
144a5528995J2986038J0210991K373792j403952L87878L63487m846923q086457
$$ -15528995 -2542957 7668034 10041826 8637874 9025752 9389239 4542316 -3544141
136c544141k278406P768150J0536854K706683p551068j2042075j0772717p071026
$$ -3544141 -5822547 1945603 12482457 15189140 7638072 -4404003 -15176720 -22247746
128b2247746j380781N600049R098642N971411Q91396K10880K010960m09972o519127
$$ -22247746 -23628527 -18028478 -8929836 -2958425 -2067029 -1856149 154811 -255161 -6774288
119f774288q509242l863823P67911P52320j2979K015960K975075j37084j561488
$$ -6774288 -15283530 -19147353 -18379442 -17627122 -17640101 -15624141 -12649066 -12786150 -14347638
110a4347638M018828R789177N068777p068819j1883145l735443N986478N654093
$$ -14347638 -10328810 -539633 4529144 -2539675 -14422820 -18158263 -12171785 -6517692
102f517692j239015l932081m12782K769102K421856J358471M72983k901508p306026
$$ -6517692 -7756707 -11688788 -12101570 -9332468 -6910612 -5552141 -5079158 -7980666 -15286692
93a5286692n813643L687508J2770555J2230542L807194l231198m687095m533518
$$ -15286692 -21100335 -17412827 -4642272 7588270 11395464 8164266 3477171 -1056347
85a056347o064907o312676j561558N811339R441229O425508K78753l463535l574367
$$ -1056347 -7121254 -13433930 -14995488 -9184149 257080 6682588 6961341 3497806 -76561
76g6561m266427q895044j3221052q951404M076126J4327088J2277016L256402
$$ -76561 -4342988 -13238032 -26459084 -35410488 -31334362 -17007274 -4730258 -1473856
68a473856q38304J092563P59230k527655j3087Q610725J0101469j713185j3056173
$$ -1473856 -2312160 -1219597 -460367 -2988022 -3001109 5609616 15711085 13997900 941727
59I41727r292481L297011Q255732L629989O66221K910792L190138j87681p66286
$$ 941727 -8350754 -5053743 3201989 6831978 7498199 10408991 13599129 13411448 12645162
50A2645162J320291k163973j0869600j2867789m024372L749486J261129l716632
$$ 12645162 13965453 11801480 931880 -11935909 -15960281 -12210795 -10949666 -14666298
42a4666298m24971P615187J0276899P199656M901795L692185r80042p844862j0949733
$$ -14666298 -15091269 -7476082 2800817 10000473 14902268 18594453 17614411 9769549 -1180184
33a180184r366427o982827m456337O27490O987891J0153998Q668327M311796j479783
$$ -1180184 -10546611 -17529438 -21985775 -21358285 -14370394 -4216396 4451931 8763727 7283944
24G283944o268277n773644p80073L8876p502631j2867083l928645J2821425J8291874
$$ 7283944 1015667 -4757977 -5538050 -5499174 -13001805 -25868888 -29797533 -16976108 1315766
15A315766P196921m913235m524828K501094L426731j719169k966078K722366P573467
$$ 1315766 8512687 3599452 -925376 1575718 5002449 3283280 317202 3039568 10613035
6A0613035M939284k537998p783222p465274l766669p19042
$$ 10613035 15552319 13014321 5231099 -2234175 -6000844 -6719886
0f719886
$$ -6719886
$$ Imaginary data points
##PAGE= N=2
##DATA TABLE= (X++(I..I)), XYDATA
65535I77771l89788J141946M093247M764357P22624n305119p563025l373378L560047
$$ 977771 587983 1729929 5823176 10587533 11310157 6005038 -1557987 -4931365 -1371318
65526a371318O385802J941931n701815r233389n788130L70559L209079J541005
$$ -1371318 5014484 6956415 1254600 -7978789 -13766919 -13396360 -10187281 -8646276
65518h646276o48838O57068N147771Q426878O356136r3208m951786l835986P18310
$$ -8646276 -9295114 -8638046 -3490275 4936603 11292739 11199531 6247745 2411759 3130069
65509C130069L206239K748554K098303N27622m961941j0626334p266295N202301
$$ 3130069 6336308 9084862 11183165 11710787 6748846 -3877488 -11143783 -5941482
65501e941482J3066886O014852p638455j1860364m385842K732273J648121k830668
$$ -5941482 7125404 13140256 5501801 -6358563 -10744405 -8012132 -6364011 -9194679
65493i194679l839688j766933Q5309J670244L807524M467963J473211l538781
$$ -9194679 -13034367 -14801300 -14715991 -13045747 -9238223 -4770260 -3297049 -6835830
65485f835830o362789m311042J348305N758228M415622j203556l981214J1586
$$ -6835830 -13198619 -17509661 -16161356 -10403128 -5987506 -7191062 -11172276 -11160690
65477a1160690N744441O296841K594616M72615O30699j225931n068089n109842
$$ -11160690 -5416249 880592 3475208 3947823 4578522 3352591 -1715498 -6825340
65469f825340Q80102P231716P821601L374601q13015j258646J000442K108904
$$ -6825340 -5945238 1286478 9108079 12482680 11669665 10411019 11411461 13520365
65461A3520365j30914k422733N10071O516367N681774n398481j5179487j1558812
$$ 13520365 13389451 10966718 11476789 17993156 23674930 18276449 3096962 -8461850
65453h461850K76253N349605R80102j604893K943579O837214M367042Q65483J148574
$$ -8461850 -8185597 -2835992 -1855890 -3460783 -517204 6320010 10687052 11552535 12701109
65444A2701109R67802l215794o429218m756060l289512o262521p915559k556298
$$ 12701109 13668911 10453117 4023899 -732161 -4021673 -10284194 -18199753 -20756051
65436b0756051L920065L156030j076496R07280P688654Q298032J29702o311244
$$ -20756051 -16835986 -13679956 -14756452 -13849172 -6160518 2137514 2267216 -4044028
65428d044028k968653M893466P668002M306855P40716l64826j884678m878794
$$ -4044028 -7012681 -2119215 5548787 9855642 10596358 10231532 8346854 3468060
65420C468060m882293J058246O980037L805301p009322j2698100o068641L816389
$$ 3468060 -1414233 -355987 6624050 10429351 3420029 -9278071 -15346712 -11530323
65412a1530323N104785P83459J666686O301605L045835p793497j0819532K8908
$$ -11530323 -6425538 -5642079 -3975393 2326212 5372047 -2421450 -13240982 -13212074
65404a3212074R683542M227769q184425j0962609l396222K549599K658277L044756
$$ -13212074 -3528532 699237 -7485188 -18447797 -21844019 -19294420 -16636143 -13591387
65396a3591387N828157N987699K117159q80323m98601O46918Q54485P61117l10633
$$ -13591387 -7763230 -1775531 341628 -538695 -1037296 -390378 464107 1225224 914591
65387I14591k490697j778831M308332R857952P380860o70384n545797n014162
$$ 914591 -1576106 -3354937 953395 10811347 18192207 17521823 11976026 6961864
65379F961864l438442j445664L731890Q582454N691744k967158o382972j005049
$$ 6961864 3523422 2077758 5809648 14392102 20083846 17116688 10733716 9728667
65371I728667L635338O9569n980462n602199j72780K178486j166388n034610m323918
$$ 9728667 13364005 13433574 7453112 1850913 1678133 3856619 2690231 -2344379 -6668297
65362f668297K78606L765986K311302j935207k472100K727196O474280J426409
$$ -6668297 -6389691 -2623705 -312403 -2247610 -4719710 -1992514 4481766 5908175
65354E908175q305869j1674032o035868J14986O35373n67677J710949N215579
$$ 5908175 -2397694 -14071726 -20107594 -19992608 -19357235 -19924912 -18213963 -12998384
65346a2998384M971411J329717j444810j068450J633816M346827L783256j784492
$$ -12998384 -8026973 -6697256 -8142066 -9210516 -7576700 -3229873 553383 -1231109
65338a231109q448937q993917j641776O907098R228927M923740q19038l124974
$$ -1231109 -9680046 -18673963 -20315739 -13408641 -4179714 744026 -75012 -3199986
65330c199986o11205M076984N708864J371482n419999q253126n189524L88546
$$ -3199986 -3811191 265793 5974657 7346139 1926140 -6326986 -11516510 -11127964
65322a1127964M886755O312975K933487m164994q548840m994238K235310M512063
$$ -11127964 -6241209 71766 3005253 -1159741 -9708581 -14702819 -12467509 -7955446
65314g955446J391974J73240L267835N035719K291964j133467k303241k646251
$$ -7955446 -6563472 -6390232 -3122397 1913322 4205286 3071819 768578 -1877673
65306a877673j306875N166397J3076348J1910719r4852j0299691q424107n16301
$$ -1877673 -3184548 1981849 15058197 26968916 26874064 16574373 8150266 7633965
65298G633965J604319k599688m937755k774752j302723l769422o941977n913753
$$ 7633965 9238284 6638596 1700841 -1073911 -2376634 -6146056 -13088033 -19001786
65290a9001786O60753Q890581J1610969N585825k528004l368713J353361J102485
$$ -19001786 -18341033 -9450452 2160517 7746342 5218338 1849625 3202986 4305471
65282D305471n538164o989383J774133Q704365L649600l699831J436121J4467067
$$ 4305471 -1232693 -8222076 -6447943 2256422 5906022 2206191 3642312 18109379
65274A8109379J7480512N646362p986388j3246127j3786470j5192300j4883102
$$ 18109379 35589891 41236253 33249865 20003738 6217268 -8975032 -23858134
65267b3858134q742376R06721Q610475J1564057R646477M517264m0326j214709
$$ -23858134 -32600510 -31693789 -23083314 -11519257 -1872780 2644484 2604158 1389449
65259A389449q24131j898965k939346n30728L956236N916539M394017J940073
$$ 1389449 565318 -1333647 -4272993 -4803721 -847485 5069054 9463071 11403144
65251A1403144o79480l967929n872006m382103j922760j500837j344375P12548
$$ 11403144 10723664 6755735 883729 -3498374 -5421134 -6921971 -8266346 -7553798
65243g553798J611350r57630j757058L781348R173913N593678k759428m278557
$$ -7553798 -5942448 -6900078 -8657136 -4875788 4298125 9891803 7132375 2853818
65235B853818J542103M478987J235915j388742j222039l764052q395691o444917
$$ 2853818 4395921 8874908 10110823 8722081 7500042 3735990 -4659701 -11104618
65227a1104618K933005Q992498O313024J845306J40417l708425r852351q065319
$$ -11104618 -8171613 820885 7133909 8979215 9119632 5411207 -4441144 -12506463
65219a2506463M168552J2587615O813644l042984l292162K115531J952783j661439
$$ -12506463 -8337911 4249704 11063348 8020364 4728202 6843733 8796516 7135077
65211G135077K09900M547479J907862m938870n614829j551641k912415q157628
$$ 7135077 7344977 11892456 13800318 8861448 3246619 1694978 -1217437 -9375065
65203i375065n216048O072993J0675161J403794j0431344j2507405o019355K254326
$$ -9375065 -14591113 -8518120 2157041 3560835 -6870509 -19377914 -25397269 -23142943
65195b3142943R479450J2933002Q935479J488122M50167N605585M827945n702848
$$ -23142943 -13663493 -730491 8204988 9693110 10143277 15748862 20576807 14873959
65187A4873959j3046602p849473M96491M35853k804378O70205N236206n38744
$$ 14873959 1827357 -6022116 -5525625 -5089772 -7894150 -7223945 -1987739 -2526483
65179b526483j0883514q996063N618266J4635174P927791l438205n962895j008879
$$ -2526483 -13409997 -22406060 -16787794 -2152620 5775171 2336966 -3625929 -4634808
65171d634808L403643N878772Q257624Q118666L499408j096306j108536L84566
$$ -4634808 -1231165 4647607 12905231 21023897 24523305 23426999 22318463 22703029
65163B2703029j946217o539224p336340k584676L502496N619321J192562p075607
$$ 22703029 20756812 14217588 6881248 4296572 7799068 13418389 14610951 7535344
65155G535344j0779373l759724P200814P578177m687016j3482005o508550O118064
$$ 7535344 -3244029 -7003753 197061 7775238 3088222 -10393783 -16902333 -10784269
65147a0784269O329903n587154j2639871o048841N140249R655415P081408L217082
$$ -10784269 -4454366 -10041520 -22681391 -28730232 -23589983 -13934568 -6853160 -3636078
65139c636078K355200O341942J2691975J2787958J352953j1983915j1968199R581
$$ -3636078 -1280878 5061064 17753039 30540997 31893950 19910035 7941836 7951417
65131G951417O129988j463127q804487k412433R909688J2147611L818477k740103
$$ 7951417 14081405 12618278 3813791 1401358 11311046 23458657 27277134 24537031
65123B4537031k293853l24566J664J649427M734391M370627q36053n670107n380011
$$ 24537031 22243178 21918612 21920276 23569703 28304094 32674721 31838668 26168561 20788550
65114B0788550j109528K039352o09876q889965j5169100j0487181L056524J1762354
$$ 20788550 19679022 21718374 21108498 12218533 -2950567 -13437748 -10381224 1381130
65106A381130P149703l025902o565503k477360K651060O305024Q660818O644012
$$ 1381130 8530833 5504931 -1060572 -3537932 -886872 5418152 14078970 20722982
65098B0722982r4416l866748m93605J337382n453779j1347071n269158M210468
$$ 20722982 20628566 16761818 16268213 17605595 12151816 804745 -4464413 -253945
65090b53945K235307n211305j093886J0397636Q872820n041539p987129M763212
$$ -253945 1981362 -3229943 -4323829 6073807 14946627 9905088 1917959 6681171
65082F681171Q300548q398695j9320499l022341J9668138J7089391m528757j4505581
$$ 6681171 14981719 6583024 -12737475 -15759816 3908322 20997713 16468956 1963375
65074A963375o080788Q41823j892269j751425N229836N832357m299981j0784485
$$ 1963375 -4117413 -3275590 -5167859 -6919284 -1689448 4142909 -157072 -10941557
65066a0941557m738336L427376L150731o31886p9586K096253J264121Q87415M762608
$$ -10941557 -15679893 -12252517 -9101786 -9733672 -9813258 -7717005 -6452884 -5565469 -802861
65057h02861Q815650Q489874O178636M857579K159806l145390o037555k683644
$$ -802861 8012789 16502663 22681299 27538878 29698684 26553294 20515739 17832095
65049A7832095K754064L869139J88813l792806m147310q22531J348082l128556
$$ 17832095 20586159 24455298 24644111 20851305 16703995 15881464 17229546 14100990
65041A4100990j0784603r389623M067416J3373999M830388q455474m033744J2239887
$$ 14100990 3316387 -6073236 -2005820 11368179 16198567 7743093 3709349 15949236
65033A5949236J1832670j0347595k3964224r075204J2642753J1629397o318076
$$ 15949236 27781906 17434311 -6529913 -15605117 -2962364 8667033 2348957
65026B348957j4530515p427816j250014j962233L71523P481839P875373j339170
$$ 2348957 -12181558 -19609374 -20859388 -22821621 -22450098 -14968259 -7092886 -8432056
65018h432056p796107l779082L305624N025985L000051J605541J087503J462806
$$ -8432056 -16228163 -20007245 -16701621 -11675636 -8675585 -7070044 -5982541 -4519735
65010d519735L626996M835301K144451k53699K563110M857777j534430r749395
$$ -4519735 -892739 3942562 6087013 5833314 8396424 13254201 11719771 1970376
65002A970376n295812Q651730J2054753j562332j4094946j0003887K832514R485646
$$ 1970376 -3325436 5326294 17381047 15818715 1723769 -8280118 -5447604 4038042
64994D038042R099664P298655K073561p923212j2916460n961820J983597k436947
$$ 4038042 13137706 20436361 22509922 14586710 1670250 -4291570 -2307973 -4744920
64986d744920j2022114r572847L524695Q719230j58376p567796p28485J2245704
$$ -4744920 -16767034 -26339881 -22815186 -14095956 -14254332 -21822128 -22550613 -10304909
64978a0304909J6013282Q643678N57818l82124L967282O378415K009673o308898
$$ -10304909 5708373 14352051 14909869 14527745 18495027 24873442 26883115 20574217
64970B0574217j0294651o190046j9647J495381R68020L948241P061477L251426
$$ 20574217 10279566 4089520 4069873 5565254 6533274 10481515 17542992 20794418
64962B0794418l911252m063466K084678K725379m880474q809118k408946M441483
$$ 20794418 16883166 12819700 14904378 17629757 12749283 3940165 1531219 5972702
64954E972702K532708j149655L331259J0389468P500325m165555j1714256j0054491
$$ 5972702 8505410 7355755 10687014 21076482 28576807 24411252 12696996 2642505
64946B642505o345694n577915l848987J884916P090608O391444P91248m552940
$$ 2642505 -3703189 -9281104 -13130091 -11245175 -4154567 2236877 3028125 -1524815
64938a524815n554060j295029N049511P419042L051631l216963m877262k208874
$$ -1524815 -7078875 -8373904 -3324393 4094649 7146280 3929317 -947945 -3156819
64930c156819J64999J806378N649905R883636Q537243R69867o278195q475597
$$ -3156819 -2991820 -1185442 4464463 14348099 22885342 23855209 17577014 9101417
64922I101417p050876l770664K025276P629221N795436n435668j6736489j7081853
$$ 9101417 2050541 -1720123 305153 7934374 13729810 8294142 -8442347 -25524200
64914b5524200o893181L177387N534994L609776N571747J2239296J4277619M048743
$$ -25524200 -32417381 -29239994 -23705000 -20095224 -14523477 -2284181 11993438 16042181
64906A6042181j1153424j4334923n99806J3554259J0715074l427937q510784O03393
$$ 16042181 4888757 -9446166 -10045972 3508287 14223361 10795424 2284640 2888033
64898B888033P529678J087039p138542j605106J2239742J5349395K203737j2681278
$$ 2888033 10417711 11504750 4366208 2761102 15000844 30350239 32553976 19872698
64890A9872698j5115948p386666j213409k002442m824707l195184K037939L813549
$$ 19872698 4756750 -2629916 -3843325 -5845767 -10670474 -13865658 -11827719 -8014170
64882h014170j254316o512109k968848O998781J0146180l63832j4272112j6473932
$$ -8014170 -9268486 -15780595 -18749443 -11750662 -1604482 -1968314 -16240426 -32714358
64874c2714358n830152N016339O768414L562569M901778J2297982J6908894R911844
$$ -32714358 -38544510 -33528171 -26759757 -23197188 -18295410 -5997428 10911466 20823310
64866B0823310n953015j7065075j3159676Q66841J1270438J1693336O790791J053559
$$ 20823310 14870295 -2194780 -15354456 -14487615 -3217177 8476159 15266950 16320509
64858A6320509o190090j2617297j0817138n12812O506201J872662o522978o210295
$$ 16320509 10130419 -2486878 -13304016 -13816828 -7310627 -5437965 -11960943 -18171238
64850a8171238J853612O947347N069049J081355j927188m483949m118997K276498
$$ -18171238 -16317626 -9370279 -4301230 -3219875 -5147063 -9631012 -13750009 -11473511
64842a1473511R978172R981857J447246p281829r794418o666309r03636M187951
$$ -11473511 -1495339 8486518 9933764 2651935 -7142483 -13808792 -14712428 -10524477
64834a0524477M538378L79800q15483N702347J3015415J2465816O907841K618345
$$ -10524477 -5986099 -5606299 -6421782 -719435 12295980 24761796 31669637 34287982
64826C4287982m989028k1111077l2424343k0001929Q216196K1081216O598819
$$ 34287982 29298954 8187877 -24236466 -44238395 -36022199 -14940983 -8342164
64819h342164j1300199q694928O081924J0763030K304332o286406r405832r919093
$$ -8342164 -19642363 -28337291 -22255367 -11492337 -9188005 -15474411 -24880243 -34799336
64811c4799336n342663P940061K1126977K0825384Q480472k308054n568243o203969
$$ -34799336 -40141999 -32201938 -11074961 9750423 18230895 15922841 10354598 4150629
64803D150629n837614n29751P141022P994179N98085o242985p501868p040929
$$ 4150629 -1686985 -2216736 4924286 12918465 13516550 7273565 -228303 -7269232
64795g269232o501477j242552Q086135J1151237K287886q874667q989079J736003
$$ -7269232 -13770709 -15013261 -6927126 4224111 6511997 -2362670 -11351749 -9615746
64787i615746J0854559R545000J052890o110195q430937q586615q221640l821069
$$ -9615746 1238813 10783813 11836703 5726508 -2704429 -11291044 -19512684 -23333753
$$ [...]
##END NTUPLES=NMR SPECTRUM
##END=
