##TITLE=31Pdec_ABPB2307
 CDCl3, 24 sc
 24.7.2019
##JCAMPDX= 6.0         $$ Bruker NMR JCAMP-DX V2.0
##DATA TYPE= NMR SPECTRUM
##DATA CLASS= NTUPLES
##ORIGIN= UXNMR, Bruker Analytische Messtechnik GmbH
##OWNER= root
$$ XWIN-NMR		Version 3.5
$$ Wed Jul 24 14:39:25 2019 Russian Standard Time (UT+4h)  she@DPX200
##.OBSERVE FREQUENCY= 81.013821
##.OBSERVE NUCLEUS= ^31P
##.ACQUISITION MODE= SIMULTANEOUS
##.ACQUISITION SCHEME= undefined
##.AVERAGES= 24
##.DIGITISER RES= 17
##SPECTROMETER/DATA SYSTEM= spect
##.PULSE SEQUENCE= zgpg30
##.SOLVENT NAME= CDCl3
##.SHIFT REFERENCE= (INTERNAL, CDCl3, 0, 182.463)
##AUDIT TRAIL= $$ (NUMBER, WHEN, WHO, WHERE, WHAT)
$$ ##TITLE= Audit trail, XWIN-NMR		Version 3.5
$$ ##JCAMPDX= 5.01
$$ ##ORIGIN= Bruker BioSpin GmbH
$$ ##OWNER= she
$$ F:/spectra/data/she/nmr/P31/1/pdata/1/auditp.txt
$$ ##AUDIT TRAIL=  $$ (NUMBER, WHEN, WHO, WHERE, WHAT)
(   1,<2019-07-24 14:38:22.07 +0400>,<she>,<DPX200>,
      <created by zg, POWCHK disabled, PULCHK disabled
       configuration hash MD5:
       00 E9 B6 7A A2 85 ED C7 34 08 36 98 17 FE 4E 26
       data hash MD5: 32K
       12 D9 4E A2 F9 6F B2 02 D7 4B 48 37 FF 82 63 2D>)
(   2,<2019-07-24 14:38:26.06 +0400>,<she>,<DPX200>,
      <Start of raw data processing
       efp BC_mod = 2 LB = 1 FT_mod = 6 PKNL = 1 PHC0 = -2494.284 PHC1 = -28.60071 SI = 64K 
       data hash MD5: 64K
       A2 58 1F D8 CB BD BF 48 21 24 0E 39 62 5C 0E 44>)
(   3,<2019-07-24 14:38:50.93 +0400>,<she>,<DPX200>,
      <pk PHC0 = 44.37069 PHC1 = -105 
       data hash MD5: 64K
       F2 85 53 BB FA DD EE E2 EA 77 13 C2 ED E3 16 AC>)
(   4,<2019-07-24 14:38:54.56 +0400>,<she>,<DPX200>,
      <abs ABSG = 5 
       data hash MD5: 64K
       39 09 96 35 50 EB 5E 90 DE 8F EC CD 32 E4 6E 90>)
$$ ##END=
$$ 
$$ hash MD5
$$ E3 56 0A 82 81 0D 03 EC 44 06 86 23 C4 D2 27 1B
##$RELAX= 
##$RELAX= 
##$RELAX= 
##$RELAX= 
##$RELAX= 
##$RELAX= 
##$RELAX= 
##$RELAX= 
$$ Bruker specific parameters
$$ --------------------------
##$DU= <F:/spectra>
##$EXPNO= 1
##$NAME= <P31>
##$PROCNO= 1
##$TYPE= <nmr>
##$USER= <she>
##$AMP= (0..31)
100 100 100 100 100 100 100 100 100 100 100 100 100 100 100 100 100 100 
100 100 100 100 100 100 100 100 100 100 100 100 100 100 
##$AQSEQ= 0
##$AQ_mod= 1
##$AUNM= <au_zg>
##$AUTOPOS= <>
##$BF1= 81.014009
##$BF2= 200.13
##$BF3= 200.13
##$BF4= 200.13
##$BF5= 200.13
##$BF6= 200.13
##$BF7= 200.13
##$BF8= 200.13
##$BYTORDA= 1
##$CFDGTYP= 0
##$CFRGTYP= 5
##$CHEMSTR= <none>
##$CNST= (0..31)
1 1 145 1 1 1 1 1 1 1 1 1 1 1 1 1 1 1 1 1 1 1 1 1 1 1 1 1 1 1 1 1 
##$CPDPRG= <waltz16>
##$CPDPRG1= <>
##$CPDPRG2= <waltz16>
##$CPDPRG3= <>
##$CPDPRG4= <mlev>
##$CPDPRG5= <mlev>
##$CPDPRG6= <mlev>
##$CPDPRG7= <mlev>
##$CPDPRG8= <mlev>
##$CPDPRGB= <>
##$CPDPRGT= <>
##$D= (0..31)
0 1 0 0 0 0 0 0 0 0 0 0.03 2e-05 3e-06 0 0 0 0 0 0 0 0 0 0 0 0 0 0 0 0 
0 0 
##$DATE= 1563964701
##$DBL= (0..7)
120 120 120 11 120 120 24 19 
##$DBP= (0..7)
150 150 150 150 150 150 150 150 
##$DBP07= 0
##$DBPNAM0= <>
##$DBPNAM1= <>
##$DBPNAM2= <>
$$ [...]
##$SUBNAM3= <"">
##$SUBNAM4= <"">
##$SUBNAM5= <"">
##$SUBNAM6= <"">
##$SUBNAM7= <"">
##$SUBNAM8= <"">
##$SUBNAM9= <"">
##$SW= 369.568048894756
##$SWIBOX= (0..15)
0 1 3 0 0 0 0 0 0 0 0 0 0 0 0 0 
##$SW_h= 29940.119760479
##$TD= 32768
##$TD0= 1
##$TE= 0
##$TE2= 300
##$TE3= 300
##$TEG= 300
##$TL= (0..7)
0 120 53 12 22 120 120 120 
##$TP= (0..7)
150 150 150 150 150 150 150 150 
##$TP07= 0
##$TPNAME0= <>
##$TPNAME1= <>
##$TPNAME2= <>
##$TPNAME3= <>
##$TPNAME4= <>
##$TPNAME5= <>
##$TPNAME6= <>
##$TPNAME7= <>
##$TPOAL= (0..7)
0.5 0.5 0.5 0.5 0.5 0.5 0.5 0.5 
##$TPOFFS= (0..7)
0 0 0 0 0 0 0 0 
##$TUNHIN= 0
##$TUNHOUT= 0
##$TUNXOUT= 0
##$USERA1= <user>
##$USERA2= <user>
##$USERA3= <user>
##$USERA4= <user>
##$USERA5= <user>
##$V9= 5
##$VALIST= <valist>
##$VCLIST= <CCCCCCCCCCCCCCC>
##$VD= 0
##$VDLIST= <DDDDDDDDDDDDDDD>
##$VPLIST= <PPPPPPPPPPPPPPP>
##$VTLIST= <TTTTTTTTTTTTTTT>
##$WBST= 1024
##$WBSW= 4
##$XGAIN= (0..3)
0 0 0 0 
##$XL= 0
##$YL= 0
##$YMAX_a= 14402
##$YMIN_a= -15417
##$ZGOPTNS= <>
##$ZL1= 120
##$ZL2= 120
##$ZL3= 120
##$ZL4= 120
##$ABSF1= 182.463
##$ABSF2= -187.1042
##$ABSG= 5
##$ABSL= 3
##$ALPHA= 0
##$AQORDER= 0
##$ASSFAC= 0
##$ASSFACI= 0
##$ASSFACX= 0
##$ASSWID= 0
##$AUNMP= <proc_1d>
##$AZFE= 0.1
##$AZFW= 0.5
##$BCFW= 0
##$BC_mod= 2
##$BYTORDP= 0
##$COROFFS= 0
##$CY= -3
##$DATMOD= 1
##$DC= 0
##$DFILT= <>
##$DTYPP= 0
##$F1P= 0
##$F2P= 0
##$FCOR= 1
##$FTSIZE= 65536
##$FT_mod= 6
##$GAMMA= 0
##$GB= 0
##$INTBC= 1
##$INTSCL= 5.30512e-09
##$ISEN= 30
##$LB= 1
##$LEV0= 0
##$LPBIN= 0
##$MAXI= 10000
##$MC2= 0
##$MEAN= 0
##$ME_mod= 0
##$MI= 50
##$NCOEF= 0
##$NC_proc= -5
##$NLEV= 6
##$NOISF1= 182.463
##$NOISF2= 159.3651
##$NSP= 0
##$NTH_PI= 0
##$NZP= 0
##$OFFSET= 182.463
##$PC= 4
##$PHC0= -2449.913
##$PHC1= -133.6007
##$PH_mod= 1
##$PKNL= yes
##$PPARMOD= 0
##$PSCAL= 0
##$PSIGN= 0
##$REVERSE= no
##$SF= 81.0140089999434
##$SI= 65536
##$SIGF1= 159.3651
##$SIGF2= -187.1042
##$SINO= 113.3802
##$SIOLD= 16384
##$SREGLST= <1H.CDCl3>
##$SSB= 0
##$STSI= 65536
##$STSR= 0
##$SW_p= 29940.119760479
##$SYMM= 0
##$S_DEV= 0
##$TDeff= 32768
##$TDoff= 0
##$TI= <>
##$TILT= no
##$TM1= 0
##$TM2= 0
##$TOPLEV= 0
##$USERP1= <user>
##$USERP2= <user>
##$USERP3= <user>
##$USERP4= <user>
##$USERP5= <user>
##$WDW= 1
##$XDIM= 65536
##$YMAX_p= 349449397
##$YMIN_p= -21318284
$$ End of Bruker specific parameters
$$ ---------------------------------
##NTUPLES= NMR SPECTRUM
##VAR_NAME=  FREQUENCY,     SPECTRUM/REAL,   SPECTRUM/IMAG
##SYMBOL=    X,             R,               I
##VAR_TYPE=  INDEPENDENT,   DEPENDENT,       DEPENDENT
##VAR_FORM=  AFFN,          ASDF,            ASDF
##VAR_DIM=   65536,         65536,           65536
##UNITS=     HZ,            ARBITRARY UNITS, ARBITRARY UNITS
##FACTOR=    0.456856943014862, 1,           1
##FIRST=     14782.0589164792, 0,            0
##LAST=      -15158.0608439998, 0,           0
##MIN=       -15158.0608439998, -21318284,   0
##MAX=       14782.0589164792, 349449397,    0
$$ Real data points
##PAGE= N=1
##DATA TABLE= (X++(R..R)), XYDATA
$$ [...]
$$ plain form
40868 1525908 1762318 1061169 -244805 -680186 257259 1264532 1192814 658831 760952
40859 760952 1180358 785915 -431713 -1257914 -916440 148313 1102757 1511633 1293259
40850 1293259 647298 146410 303451 919822 1319167 1239886 993945 746720 265782 -440158
40840 -440158 -815903 -444843 337155 849248 832593 537436 273412 147903 78459 -176835
40830 -176835 -832710 -1685335 -2110847 -1770178 -1146840 -995883 -1380760 -1737844 -1831559 -1973943
40820 -1973943 -2126785 -1597777 -246623 659857 -187471 -2134775 -3032259 -1903856 -148814
40811 -148814 376160 -434370 -1342779 -1605296 -1413712 -965216 -215587 485540 485368 -253373
40801 -253373 -1023840 -1313449 -1259972 -1095990 -813199 -513116 -409375 -308573 202102 849494
$$ packed form
40868A525908K36410p01149j305974m35381R37445J007273p1718n33983J02121
40859G60952M19406l94443j217628q26201L41474J064753R54444M08876k18374
40850A293259o45961n00888J57041O16371L99345p9281k45941k47225m80938p05940
40840d40158l75745L71060P81998N12093j6655k95157k64024j25509o9444k55294
40830a76835o55875q52625m25512L40669O23338J50957l84877l57084r3715j42384
40820a973943j52842N29008J351154R06480q47328j947304q97484J128403J755042
40811a48814N24974q10530r08409k62517J91584M48496P49629P01127j72p38741
40801b53373p70467k89609N3477J63982K82791L00083J03741J00802N10675O47392
$$ plain form
40791 849494 789082 10445 -247694 828904 2243372 2350633 984549 -470425 -927999
40782 -927999 -648972 -425125 -485296 -461406 28453 980037 1920506 2188120 1578320 698789
40772 698789 379769 748967 1174139 1057241 363814 -556977 -1290006 -1505031 -1176111 -708367
40762 -708367 -559479 -746768 -1007020 -1312259 -1777872 -2136362 -1898379 -1154563 -639706 -742903
40752 -742903 -969207 -736555 -249490 -120306 -467793 -910776 -1216406 -1385671 -1220346 -446655
40742 -446655 628294 1151530 708495 -91722 -320769 224864 967462 1327731 1219969
40733 1219969 859245 424523 -2580 -349414 -492257 -259069 411619 1209572 1528951
40724 1528951 1080540 343259 72809 355974 507060 -10350 -923685 -1589137 -1741034
$$ packed form
40791H49494o0412p78637k58139J076598J414468J07261j366084j454974m57574
40782i27999K79027K23847o0171K3890M89859R51584R40469K67614o09800q79531
40772F98789l19020L69198M25172j16898o93427r20791p33029k15025L28920M67744
40762g08367J48888j87289k60252l05239m65613l58490K37983P43816N14857j03197
40752g42903k26304K32652M87065J29184l47487m42983l05630j69265J65325P73691
40742d46655J074949N23236m43035q00217k29047N45633P42598L60269j07762
40733A219969l60724m34722m27103l46834j42843K33188O70688P97953L19379
40724A528951m48411p37281k70450K83165J51086n17410r13335o65452j51897
$$ plain form
40715 -1741034 -1528689 -1103485 -563235 -171328 -236542 -735886 -1282739 -1494643 -1274585 -791539
40705 -791539 -298355 113965 627907 1370745 1946959 1693901 610685 -396865 -550699
40696 -550699 -80859 344827 613264 981302 1299484 1210128 899722 840638 920320 677007
40686 677007 298068 403575 811929 608685 -333311 -1017007 -907678 -739933 -1133883 -1488852
40676 -1488852 -1105130 -471585 -413832 -699638 -591221 -200641 -123087 -145703 428209 1363097
40666 1363097 1627420 961497 196371 -106689 -274473 -554567 -552716 -58499 394118 283605
40656 283605 -191387 -577812 -821716 -1080014 -1315985 -1404764 -1294008 -882171 -137975 559057
40646 559057 717066 509802 667039 1368031 1860557 1509499 644972 -33684 -360664 -537910
$$ packed form
40715a741034K12345M25204N40250L91907o5214m99344n46853k11904K20058M83046
40705g91539M93184M12320N13942P42838N76214k53058j083216j007550j53834
40696e50699M69840M25686K68437L68038L18182q9356l10406n9084P9682k43313
40686F77007l78939J05507M08354k03244r41996o83696J09329J67745l93950l54969
40676a488852L83722O33545N7753k85806J08417L90580P7554k2616N73912R34888
40666A363097K64323o65923p65126l03060j67784k80094J851M94217M52617j10513
40656B83605m74992l86425k43904k58298k35971q8779J10756M11837P44196O97032
40646E59057J58009k07264J57237P00992M92526l51058q64527o78656l26980j77246
$$ plain form
40636 -537910 -547570 -305140 -86104 -237839 -622104 -778084 -505883 53837 723976 1299743
40626 1299743 1444791 1022061 461666 397850 896974 1312717 947053 -301323 -1886014
40617 -1886014 -3012991 -3145882 -2355326 -1260613 -559796 -563388 -1108097 -1777421 -2174750
40608 -2174750 -2132453 -1761982 -1276667 -793839 -381486 -194945 -385001 -909161 -1560821 -2072692
40598 -2072692 -2073481 -1234911 203069 1315445 1382555 745323 280011 206386 67482 -216237
40588 -216237 -108929 560973 1152371 1072314 477609 -178356 -691228 -886955 -518806 177457
40578 177457 427617 -68670 -596386 -430339 124513 303031 33241 -183978 -218184 -368186
40568 -368186 -608108 -481007 194297 1018861 1516314 1620837 1622602 1815929 2149962 2145847
$$ packed form
40636e37910r660K42430K19036j51735l84265j55980K72201N59720O70139N75767
40626A299743J45048m22730n60395o3816M99124M15743l65664j248376j584691
40617a886014j126977j32891P90556J094713P00817l592n44709o69324l97329
40608b174750M2297L70471M85315M82828M12353J86541j90056n24160o51660n11871
40598b072692p89Q38570J437980J112376O7110o37232m65312p3625j38904k83719
40588b16237J07308O69902N91398q0057n94705o55965n12872j95727L68149O96263
40578A77457K50160m96287n27716J66047N54852J78518k69790k17219l4206j50002
40568c68186k39922J27101O75304Q24564M97453J04523J765J93327L34033m115
$$ plain form
40558 2145847 1374289 92451 -939661 -1374495 -1532576 -1612777 -1327668 -673394 -324267
40549 -324267 -672399 -1112828 -969379 -537023 -414162 -366763 173679 896034 961408 355858
40539 355858 -145317 -257812 -394924 -591939 -282885 635813 1426880 1497474 1055407 580281
40529 580281 317618 439154 972416 1371224 861377 -535692 -1908116 -2513926 -2333953
40520 -2333953 -1559655 -339735 820259 1247399 959128 607322 408685 -20122 -583327
40511 -583327 -502314 381662 1088850 868851 226570 -14144 167572 435755 804926 1163826
40501 1163826 925264 259 -637020 -264434 429867 470807 130558 186298 325370 -306242
40491 -306242 -1387780 -1766313 -1375078 -1312071 -1915448 -2229433 -1707284 -1044727 -771186 -313199
$$ packed form
40558B145847p71558j281838j032112m34834j58081q0201K85109O54274L49127
40549c24267l48132m40429J43449M32356J22861M7399N40442P22355O5374o05550
40539C55858n01175j12495j37112j97015L09054R18698P91067P0594m42067m75126
40529E80281k62663J21536N33262L98808n09847j397069j372424o05810J79973
40520b333953P74298J219920J159994M27140k88271l51806j98637m28807n63205
40511e83327Q1013Q83976P07188k19999o42281k40714J81716K68183L69171L58900
40501A163826k38562r25005o37279L72586O94301M0940l40249N5740J39072o31612
40491c06242j081538l78533L91235O3007o03377l13985N22149O62557K73541M57987
$$ plain form
40481 -313199 726567 1435059 768158 -810192 -1852380 -1711536 -999754 -545819 -608373
40472 -608373 -949477 -1093454 -637214 226897 673427 188626 -621562 -642436 437883 1833768
40462 1833768 2559056 2233640 1145595 -29771 -602098 -350471 314662 864205 1180703
40453 1180703 1346681 1208292 617537 -89527 -406950 -348788 -250227 32530 977751 2332832
40443 2332832 3000172 2407893 1348222 899871 1050580 1075358 866023 989269 1513646
40434 1513646 1691278 1070948 232535 -10701 320054 541220 252730 -297425 -619296
40425 -619296 -412781 272704 1006667 1201489 632461 -323733 -1125371 -1569993 -1687914 -1436182
40415 -1436182 -880305 -464018 -607175 -1097711 -1333733 -1128284 -791745 -442161 153601
$$ packed form
40481c13199J039766P08492o66901j578350j042188J40844P11782M53935o2554
40472f08373l41104j43977M56240Q64111M46530m84801q10188k0874J080319J395885
40462A833768P25288l25416j088045j175366n72327K51627O65133N49543L16498
40453A180703J65978j38389n90755p07064l17423N8162R8561K82757R45221J355081
40443B332832O67340n92279j059671m48351J50709K4778k09335J23246N24377
40434A513646J77632o20330q38413k43236L30755K21166k88490n50155l21871
40425f19296K06515O85485P33963J94822n69028r56194q01638m44622j17921K51732
40415a436182N55877M16287j43157m90536k36022K05449L36539L49584N95762
$$ plain form
40406 153601 913299 1261739 965885 596390 698291 987162 955630 860613 1305951 2020167
40396 2020167 1967836 848330 -339036 -632547 -321630 -236173 -394266 -205914 258743
40387 258743 224003 -426723 -694395 115807 1242949 1459304 723499 10028 -222079 -427286
40377 -427286 -864179 -1095707 -879869 -663311 -731868 -677045 -291544 -218063 -916687 -1646943
40367 -1646943 -1446043 -626547 -201555 -147833 498915 1857844 2803858 2615255 1851469
40358 1851469 1172956 410747 -565031 -1073949 -585937 284092 612611 438342 374652 466789
40348 466789 337638 104456 221950 604004 755638 668572 766036 982916 701378 -278864
40338 -278864 -1372896 -1980088 -2097637 -2039159 -1998403 -1996321 -1884847 -1389722 -521286 142763
$$ packed form
40406A53601P59698L48440k95854l69495J01901K88871l1532r5017M45338P14216
40396B020167n2331j119506j187366k93511L10917Q5457j58093J88352M64657
40387B58743l4740o50726k67672Q10202J127142K16355p35805p13471k32107k05207
40377d27286m36893k31528K15838K16558o8557N4823L85501P3481o98624p30256
40367a646943K00900Q19496M24992N3722O46748J358929R46014j88603p63786
40358A851469o78513p62209r75778n08918M88012Q70029L28519j74269o3690R2137
40348D66789j29151k33182J17494L82054J51634q7066R7464K16880k81538r80242
40338b78864j094032o07192j17549N8478M0756K082J11474M95125Q68436O64049
$$ plain form
40328 142763 50631 -530776 -847351 -714337 -620838 -771212 -730306 -218639 387487 673685
40318 673685 778651 997592 1217463 1155344 876350 698131 743099 873811 977532 1129267
40308 1129267 1533257 2341114 3378438 4064793 3864339 2875804 1757135 1053808 845984
40299 845984 1007232 1419732 1855418 2008377 1791087 1348789 764001 99509 -262992 145616
40289 145616 1097969 1594853 940302 -418676 -1476950 -1835180 -1879214 -1959955 -1877713 -1306231
40279 -1306231 -427105 142265 62547 -285758 -274642 120704 268938 -205261 -832249 -938833
40269 -938833 -563329 -267507 -239285 -126735 295933 824168 1211028 1402808 1377804 1209603
40259 1209603 1285097 1939963 2820661 3120974 2540960 1534201 576918 -233747 -787624
$$ packed form
40328A42763r2132n81407l16575J33014R3499j50374M0906N11667O06126K86198
40318F73685J04966K18941K19871o2119k78994j78219M4968J30712J03721J51735
40308A129267M03990Q07857J037324O86355k00454r88535j118669p03327k07824
40299H45984J61248M12500M35686J52959k17290m42298n84788o64492l62501M08608
40289A45616R52353M96884o54551j358978j058274l58230m4034q0741Q2242N71482
40279a306231Q79126N69370p9718l48305J1116L95346J48234m74199o26988j06584
40269i38833L75504K95822K8222J12550M22668N28235L86860J91780k5004j68201
40259A209603P5494O54866Q80698L00313n80014j006759r57283q10665n53877
$$ plain form
40250 -787624 -838436 -494544 -241792 -228454 -65985 450577 1005080 1357302 1638755 1793354
40240 1793354 1424905 564795 -114190 -298115 -546637 -1279999 -1950305 -1880598 -1315431 -916296
40230 -916296 -757119 -576175 -494699 -612708 -332821 912492 2482013 3045729 2249446
40221 2249446 1045470 386625 360289 626600 951140 1167625 1201535 1224532 1351300 1316318
40211 1316318 976737 851732 1387254 1918170 1375550 27448 -587320 252912 1454004
40202 1454004 1678398 1007918 378906 116383 -116418 -358948 -237534 277149 675916
40193 675916 567549 122771 -204502 -131768 295630 779442 936198 498540 -546533 -1879265
40183 -1879265 -2817313 -2615900 -1199739 461112 1169516 792355 323913 542640 1071991
$$ packed form
40250g87624n0812L43892K52752J3338J62469N16562N54503L52222K81453J54599
40240A793354l68449q60110o78985j83925k48522p33362o70306O9707N65167L99135
40230i16296J59177J80944Q1476j18009K79887J245313J569521N63716p96283
40221B249446j203976o58845k6336K66311L24540K16485L3910K2997J26768l4982
40211A316318l39581j25005N35522N30916n42620j348102o14768Q40232J201092
40202A454004K24394o70480o29012k62523k32801k42530J21414N14683L98767
40193F75916j08367m44778l27273P2734M27398M83812J56756m37658j045073j332732
40183a879265r38048K01413J416161J660851P08404l77161m68442K18727N29351
$$ plain form
40174 1071991 1036527 244549 -645277 -880178 -234432 885203 1664022 1459220 506222
40165 506222 -143455 238185 1116005 1295678 398463 -729663 -1167851 -1015934 -1024642 -1431509
40155 -1431509 -1658784 -1202739 -404858 -63703 -474758 -1152534 -1438140 -1118070 -479373
40146 -479373 -34558 -176043 -773513 -1087076 -463906 776259 1549094 1255175 413785
40137 413785 -125885 -110649 260131 845230 1449957 1664283 1380437 1125515 1318816 1518760
40127 1518760 988988 -279781 -1678827 -2764063 -3316791 -3060620 -2122681 -1397677 -1507575
40118 -1507575 -1691427 -793873 844099 1700672 1265396 614102 581747 689699 377033
40109 377033 64337 266971 651890 752988 784713 984375 930452 331163 -205483 -64924
$$ packed form
40174A071991l5464p91978q89826k34901O45746J119635P78819k04802r52998
40165E06222o49677L81640Q77820J79673q97215j128126m38188J51917q708m06867
40155a431509k27275M56045P97881L41155m11055o77776k85606L20070O38697
40146d79373M44815j41485n97470l13563O23170J240165P72835k93919q41390
40137D13785n39670J5236L70780N85099O04727K14326k83846k54922J93301J99944
40127A518760n29772j268769j399046j085236n52728K56171R37939P25004j09898
40118a507575j83852Q97554J637972Q56573m35276o51294l2355J07952l12666
40109C77033l12696K02634L84919J01098L1725J99662n3923n99289n36646J40559
$$ plain form
40099 -64924 271659 -94743 -1097652 -1809428 -1656147 -883842 -96004 158531 -278416 -781954
40089 -781954 -411517 719711 1214129 217199 -1214379 -1443436 -339389 943311 1694065
40080 1694065 1973023 1632234 414731 -961399 -1103164 330715 2097560 2839806 2364991
40071 2364991 1318671 353227 -138756 -107344 84688 104784 176815 681799 1364380 1581315
40061 1581315 1236782 773001 358698 -107227 -304813 213225 997656 1010045 162761 -464418
40051 -464418 -276251 -13038 -435970 -1089457 -1085804 -454483 9078 -188489 -873708 -1548014
40041 -1548014 -1702396 -1196006 -615363 -748579 -1437080 -1606990 -795303 124769 271633
40032 271633 15963 161154 557883 503750 79326 48338 589792 1065205 1049880 799682
$$ packed form
40099f4924L36583l66402j002909p11776J53281P72305P87838K54535m36947n03538
40089g81954L70437J131228M94418r96930j431578k29057J104047J282700P50754
40080A694065K78958l40789j217503j376130j41765J433879J766845P42246m74815
40071B364991j046320r65444m91983L1412J92032K0096P2031N04984O82581K16935
40061A581315l44533m63781m14303m65925j97586N18038P84431J2389q47284o27179
40051d64418J88167K63213m22932o53487L653O31321M63561j97567o85219o74306
40041a548014j54382N06390N80643j33216o88501j69910Q11687R20072J46864
40032B71633k55670J45191L96729n4133m24424l0988N41454M75413j5325k50198
$$ plain form
40022 799682 635556 577826 676858 1014894 1224822 690236 -477797 -1254065 -921710 -64260
40012 -64260 163960 -474643 -1079495 -863556 -103374 423269 571069 883868 1585953 2104627
40002 2104627 1852028 997045 46667 -883738 -1763184 -2011695 -1100894 312613 872482
39993 872482 324981 -137732 326869 1078981 1219507 954451 889662 798756 186069 -470442
39983 -470442 -222494 838750 1662259 1753306 1624877 1734331 1922128 2019584 2141388 2204208
39973 2204208 1945562 1574989 1612728 1924700 1775187 1065000 585267 670199 583816 -138862
39963 -138862 -664062 -60907 1141939 1613794 1044676 315020 49654 9488 -46058 156026
39953 156026 759486 1341753 1499099 1354437 1149628 810270 318060 109056 568271 1310430
$$ packed form
40022G99682j64126n7730R9032L38036K09928n34586j168033p76268L32355Q57450
40012f4260K28220o38603o04852K15939P60182N26643J47800L12799P02085N18674
40002B104627k52599q54983r50378r30405q79446k48511R10801J413507N59869
39993H72482n47501m62713M64601P52112J40526k65056o4789r0906o12687o56511
39983d70442K47948J061244Q23509R1047j28429J09454J87797R7456J21804O2820
39973B204208k58646l70573L7739L11972j49513p10187m79733Q4932q6383p22678
39963a38862n25200O03155J202846M71855n69118p29656k65366m0166n5546K02084
39953A56026O03460N82267J57346j44662k04809l39358m92210k09004M59215P42159
$$ plain form
39943 1310430 1473241 735886 -329434 -969010 -976887 -613242 -138533 287782 426430 47819
39933 47819 -733131 -1454855 -1773020 -1771254 -1678200 -1444267 -843469 68393 873272 1213301
39923 1213301 1068008 568522 -161204 -819007 -919650 -356396 208433 -14788 -901668
39914 -901668 -1480860 -1193656 -628501 -668654 -1281526 -1653742 -1333599 -669277 -129176 223875
39904 223875 417644 287048 -145857 -433778 -283565 -70795 -300205 -774257 -840771 -377283
39894 -377283 26994 -84964 -516616 -865738 -1043987 -1155908 -1226271 -1257610 -1274235 -1161403
39884 -1161403 -766237 -292117 -238233 -759263 -1421865 -1782152 -1834185 -1682089 -1225709 -520639
39874 -520639 -28264 -45683 -197575 43592 608817 1074415 1359653 1620364 1688337 1278579
$$ packed form
39943A310430J62811p37355j065320o39576p877L63645M74709M26315J38648l78611
39933D7819p80950p21724l18165J766R3054K33933O00798R11862Q04879L40029
39923A213301j45293m99486p29726o57803j00643N63254N64829k23221q86880
39914i01668n79192K87204N65155m0153o12872l72216L20143O64322N40101L53051
39904B23875J93769j30596m32905k87921J50213K12770k29410m74052o6514M63488
39894c77283M04277j11958m31652l49122j78249j11921p0363l1339j6625J12832
39884a161403L95166M74120N3884n21030o62602l60287n2033J52096M56380P05070
39874e20639M92375j7419j51892K41167N65225M65598K85238K60711O7973m09758
$$ plain form
39864 1278579 642537 342611 400645 345229 130664 256260 794009 1062501 633224 -15869
39854 -15869 -326829 -519213 -986574 -1339334 -874784 207653 873980 562750 -260237 -935896
39844 -935896 -1296320 -1291850 -675272 413956 1098561 700610 -270207 -801402 -867918 -1334155
39834 -1334155 -2285110 -2513678 -1270853 321198 564726 -573780 -1587531 -1615988 -1355092
39825 -1355092 -1623203 -2155075 -2350745 -2291759 -2266805 -1974953 -1049000 61624 536413 232086
39815 232086 -408522 -1180701 -2079632 -2688172 -2475188 -1670392 -1087644 -1067050 -1245988 -1298116
39805 -1298116 -1164758 -632571 466692 1605633 1983822 1697115 1590569 1834093 1689867
39796 1689867 971267 571527 969805 1305234 744535 -180680 -569594 -676356 -1310775
$$ packed form
39864A278579o36042k99926N8034n5416k14565J25596N37749K68492m29277o49093
39854a5869l10960j92384m67361l52760M64550J082437O66327l11230q22987o75659
39844i35896l60424M470O16578J089228O84605l97951r70817n31195o6516m66237
39834a334155r50955k28568J242825J592051K43528j138506j013751k8457K60896
39825a355092k68111n31872j95670N8986K4954K91852R25953J110624M74789l04327
39815B32086o40608p72179q98931o08540K12984Q04796N82748K0594j78938n2128
39805a298116J33358N32187J099263J138941L78189k86707j06546K43524j44226
39796A689867p18600l99740L98278L35429n60699r25215l88914j06762o34419
$$ plain form
39787 -1310775 -2297737 -2736308 -2460192 -2085398 -1797783 -1224388 -438763 22541 193623
39778 193623 639682 1247831 1177647 332072 -211038 254990 1052905 1266114 1002754 764703
39768 764703 374349 -474810 -1155704 -726353 569584 1432252 1173118 397382 -103589
39759 -103589 -335014 -690690 -1245690 -1868669 -2542762 -3137487 -3220430 -2539367 -1468561 -590097
39749 -590097 -1287 598076 1268404 1683879 1605505 1156920 580249 -5721 -519519 -800182
39739 -800182 -696469 -214786 401262 697972 323595 -470485 -871719 -435728 203825 80047
39729 80047 -758885 -1343073 -1261901 -1158403 -1396214 -1222120 -62391 1160290 1174031 343081
39719 343081 134963 721378 636725 -775181 -2009866 -1384460 681454 2431368 3048917
$$ packed form
39787a310775r86962m38571K76116L74794K87615N73395P85625M61304J71082
39778A93623M46059O08149p0184q45575n43110M66028P97915K13209k63360k38051
39768G64703l90354q49159o80894M29351J295937Q62668k59134p75736n00971
39759a03589k31425l55676n55000o22979o74093n94725q2943O81063J070806Q78464
39749e90097N88810N99363O70328M15475p8374m48585n76671n85970n13798k80663
39739h00182J03713M81683O16048K96710l74377p94080m01234M35991O39553j23778
39729H0047q38932n84188Q1172J03498k37811J74094J159729J222681J3741q30950
39719C43081k08118N86415q4653j411906j234685O25406K065914J749914O17549
$$ plain form
39710 3048917 2970609 2433472 1124340 -678331 -1845372 -1723586 -928920 -397718 -266409
39701 -266409 -110233 235253 599115 895588 1146506 1245236 1072250 762830 570230 512104
39691 512104 391211 142790 -62306 -107879 -151213 -411948 -787711 -850901 -346119 407930
39681 407930 829384 779300 678203 819065 892137 467876 -289144 -754234 -579978 30309
39671 30309 700178 1184810 1346029 1192892 979823 947307 939069 607847 41495 -205821
39661 -205821 132874 590470 517963 -141597 -874022 -1224532 -1148862 -813108 -307984 357232
39651 357232 1079061 1551584 1361857 287871 -1371918 -2772136 -3039340 -2073446 -804379
39642 -804379 -314420 -567711 -417398 777867 2025062 1922468 718017 64992 637629
$$ packed form
39710C048917p8308n37137j309132j802671j167041J21786P94666N31202J31309
39701b66409J56176L45486L63862K96473K50918R8730j72986l09420j92600n8126
39691E12104j20893k48421k05096m5573m3334k60735l75763o3190N04782P54049
39681D07930M21454n0084j01097J40862P3072m24261p57020m65090J74256O10287
39671C0309O69869M84632J61219j53137k13069l2516q238l31222n66352k47316
39661b05821L38695M57596p2507o59560p32425l50510P5670L35754N05124O65216
39651C57232P21829M72523j89727j073986j659789j400218k67204R65894J269067
39642h04379M89959k53291J50313J195265J247195j02594j204451o53025N72637
$$ plain form
39633 637629 1239784 841618 256823 718096 1752129 1913772 1098972 566375 814942
39624 814942 1008678 676608 450255 612854 306490 -1025631 -2508904 -3029142 -2696841
39615 -2696841 -2277711 -1933554 -1431991 -974301 -886875 -956675 -889302 -942170 -1285881 -1281495
39605 -1281495 -372863 746325 949600 372766 140771 520680 556937 -299566 -1315018
39596 -1315018 -1605659 -1266531 -945624 -1005590 -1507736 -2377692 -3141163 -3046160 -1942634 -674403
39586 -674403 -200944 -619168 -1331280 -1824626 -1947174 -1703501 -1166903 -508752 85425 475207
39576 475207 545494 321904 60709 -56009 -236726 -717630 -1187308 -1106267 -584363 -305497
39566 -305497 -467317 -484329 -13913 403264 166467 -484208 -899561 -902195 -710998 -373948
$$ packed form
39633F37629O02155l98166n84795M61273J034033J61643q14800n32597K48567
39624H14942J93736l32070k26353J62599l06364j332121j483273n20238L32301
39615b696841M19130L44157N01563M57690Q7426o9800O7373n2868l43711M386
39605a281495R08632J119188K03275n76834k31995L79909L6257q56503j015452
39596a315018k90641L39128L20907n9966n02146q69956p63471R5003J103526J268231
39586f74403M73459m18224p12112m93346j22548K43673N36598O58151N94177L89782
39576D75207P0287k23590k61195j16718j80717m80904m69678Q1041N21904K78866
39566c05497j61820j7012M70416M17177k36797o50675m15353k634J91197L37050
$$ plain form
39556 -373948 149146 599323 646585 331448 -122712 -664699 -1157007 -1139835 -465449 134937
39546 134937 -131280 -887212 -994193 -201314 491426 369440 47353 415341 1176153 1222050
39536 1222050 234385 -835308 -952692 -125761 845405 1335436 1318306 1089475 950014
39527 950014 1120144 1601529 1991774 1711212 664475 -481773 -969581 -809405 -638543
39518 -638543 -763446 -793860 -373841 180091 324912 68664 -123319 -32961 129800 186708
39508 186708 208882 227809 95468 -228581 -503440 -469797 -136191 295054 669815 963922
39498 963922 1172150 1159792 693304 -218646 -1025062 -1018386 -214532 520312 572083 417961
39488 417961 792747 1352343 1053860 -134114 -875689 -198232 1236680 2159607 2304255
$$ packed form
39556c73948N23094M50177M7262l15137m54160n41987m92308J7172O74386O00386
39546A34937k66217p55932j06981P92879O92740j21986l22087L67988P60812M5897
39536A222050r87665j069693j17384Q26931R71166M90031j7130k28831j39461
39527I50014J70130M81385L90245k80562j046737j146248m87808J60176J70862
39518f38543j24903l0414M20019N53932J44821k56248j91983R0358J62761N6908
39508A86708K2174J8927j32341l24049k74859L3643L33606M31245L74761K94107
39498I63922K08228j2358m66488r11950q06416O676Q03854P34844N1771j54122
39488D17961L74786N59596k98483j187974p41575O77457J434912R22927J44648
$$ plain form
39479 2304255 2249950 2181642 1746397 951279 299623 -8579 -242861 -413795 -148762 482821
39469 482821 778881 433636 90131 344776 776890 630764 30669 -261670 -77116 -34223
39459 -34223 -544415 -1356274 -2145830 -2832530 -3155096 -2695094 -1662951 -975662 -1097347 -1418573
39449 -1418573 -1310893 -1138126 -1455874 -1778063 -1195255 43506 728437 519811 428566
39440 428566 1127996 1866385 1690480 861800 245170 -35692 -428280 -927035 -1178161 -1304235
39430 -1304235 -1663310 -1964141 -1615597 -904027 -752293 -1152991 -949277 378949 1714234
39421 1714234 1787982 891403 269518 370453 632369 701662 874809 1299049 1572013 1402076
39411 1402076 1088324 1021941 1083913 857273 252335 -325487 -398176 83210 659875 827321
$$ packed form
39479B304255n4305o8308m35245p95118o51656l08202k34282j70934K65033O31583
39469D82821K96060l45245l43505K54645M32114j46126o00095k92339J84554M2893
39459c4223n10192q11859p89556o86700l22566M60002J032143O87289j21685l21226
39449a418573J07680J72767l17748l22189N82808J238761O84931k08626r1245
39440D28566O99430P38389j75905q28680o16630k80862l92588m98755k51126j26074
39430a304235l59075l00831L48544P11570J51734m00698K03714J328226J335285
39421A714234P3748q96579o21885J00935K61916O9293J73147M24240K72964j69937
39411A402076l13752o6383O1972k26640o04938n77822p2689M81386N76665J67446
$$ plain form
39401 827321 589720 412583 567920 760471 559263 -49561 -757686 -1321080 -1591915 -1472294
39391 -1472294 -1197451 -1341520 -2033613 -2429954 -1612997 92128 1379776 1559107 1206934
39382 1206934 1117648 1329733 1508384 1648250 1899018 2104626 1993933 1589951 1093538 605348
39372 605348 238722 215954 547572 883295 959457 899979 800554 391211 -492218 -1431543
39362 -1431543 -1883991 -1867987 -1739957 -1534848 -1046201 -375475 164268 599325 1183552 1753125
39352 1753125 1768427 1117970 406858 274955 775336 1525264 2105557 2191901 1657013 737509
39342 737509 -139172 -797143 -1336060 -1679402 -1475981 -642418 298367 697168 466956 99923
39332 99923 68988 335639 422243 -65199 -958968 -1615582 -1545013 -882034 -170342 174970
$$ packed form
39401H27321k37601j77137J55337J92551k01208o08824p08125n63394k70835J19621
39391a472294K74843j44069o92093l96341Q16957J705125J287648J79331l52173
39382A206934q9286K12085J78651J39866K50768K05608j10693m03982m96413m88190
39372F05348l66626k2768L31618L35723P6162n9478r9425m09343q83429r39325
39362a431543m52448J6004J28030K05109M88647O70726N39743M35057N84227N69573
39352A753125J5302o50457p11112j31903N00381P49928N80293Q6344n34888r19504
39342G37509q76681o57971n38917l43342K03421Q33563R40785L98801k30212l67033
39332I9923l0935K66651Q6604m87442q93769o56614P0569O62979P11692L45312
$$ plain form
39322 174970 96513 -190282 -342024 -180865 -14904 -336051 -969739 -1008773 -47171 1016430
39312 1016430 1092836 418818 90425 332318 270740 -545335 -1437158 -1674686 -1363098 -902052
39302 -902052 -359091 226654 628127 889782 1332073 1801268 1681379 970111 456456 410523
39292 410523 100780 -769005 -1198244 -368206 926800 1392394 1043801 782004 809033 706751
39282 706751 595703 868131 1046276 266211 -1152666 -1868624 -1314740 -240942 558039
39273 558039 931577 739043 -253647 -1557878 -2095162 -1491386 -404455 563749 1321851
39264 1321851 1576594 850170 -456786 -1115640 -615016 282930 813184 971763 741982
39255 741982 -156757 -1250808 -1357348 -334462 481271 360193 355535 1386555 2495171
$$ packed form
39322A74970p8457k86795j51742J61159J65961l21147o33688l9034R61602J063601
39312A016430P6406o74018l28393K41893o1578q16075q91823k37528L11588M61046
39302i02052N42961N85745M01473K61655M42291M69195j19889p11268n13655m5933
39292D10523l09743q69785m29239Q30038J295006M65594l48593k61797K7029j02282
39282G06751j11048K72428J78145p80065j418877p15958N53884J073798P98981
39273E58039L73538j92534r92690j304231n37284O03776J086931R68204P58102
39264A321851K54743p26424j306956o58854N00624Q97946N30254J58579k29781
39255G41982q98739j094051j06540J022886Q15733j21078m658J031020J108616
$$ plain form
39246 2495171 2360988 1427174 983754 1023411 655183 6793 15241 696543 1223826 1457713
39236 1457713 1838576 2004976 1209282 33307 -83826 807746 1068164 93150 -743005
39227 -743005 -441634 38324 -426152 -1222495 -1184413 -556027 -388333 -743484 -865636 -652564
39217 -652564 -659125 -877856 -689491 23357 704560 1075259 1369524 1568632 1276433 580015
39207 580015 270093 801199 1540752 1487687 489954 -574329 -723233 200542 1447006
39198 1447006 2073117 1742509 865197 36888 -498684 -812577 -953157 -823713 -302413
39189 -302413 609091 1656327 2342833 2287401 1632715 876044 269409 -289514 -727539 -646884
39179 -646884 37963 765695 1024714 1018125 1165370 1260949 753187 -257293 -948136 -811783
$$ packed form
39246B495171j34183r33814m43420L9657l68228o48390Q448O81302N27283K33887
39236A457713L80863J66400p95694j175975j17133Q91572K60418r75014q36155
39227g43005L01371M79958m64476p96343L8082O28386J67694l55151j22152K13072
39217f52564o561k18731J88365P12848O81203L70699K94265J99108k92199o96418
39207E80015l09922N31106P39553n3065r97733j064283j48904R23775J246464
39198A447006O26111l30608q77312q28309n35572l13893j40580J29444N21300
39189c02413R11504J047236O86506n5432o54686p56671o06635n58923m38025Q0655
39179f46884O84847P27732K59019o589J47245R5579n07762j010480o90843J36353
$$ plain form
39169 -811783 -242258 102141 71206 -135212 -531669 -1296173 -2250297 -2807905 -2568473 -1726797
39159 -1726797 -757825 98831 826815 1291247 1300744 1030280 975412 1305157 1613995 1554743
39149 1554743 1321313 1123983 599369 -636764 -2088288 -2759818 -2420035 -1816481 -1576762
39140 -1576762 -1557032 -1402752 -1086520 -680214 -214628 24780 -287384 -778768 -583828 394672
39130 394672 1199481 1211849 1000887 1200211 1394341 963956 323657 303733 794638 1049333
39120 1049333 988007 1142026 1508803 1517644 1063981 597364 222305 -304795 -696141 -318835
39110 -318835 599821 1007056 538663 5257 19995 142310 -102836 -292394 107027 743972
39100 743972 924022 640394 402031 441090 666005 1016543 1322698 1174307 450599 -360876
$$ packed form
39169h11783N69525L44399l0935k06418l96457p64504r54124n57608K39432Q41676
39159a726797R68972Q56656P27984M64432R497k70464n4868L29745L08838n9252
39149A554743k33430j97330n24614j236133j451524o71530L39783O03554K39719
39140a576762J9730J54280L16232M06306M65586K39408l12164m91384J94940R78500
39130C94672Q04809J2368k10962J99324J94130m30385o40299j9924M90905K54695
39120A049333o1326J54019L66777Q841m53663m66617l75059n27100l91346L77306
39110c18835R18656M07235m68393n33406J4738J22315k45146j89558L99421O36945
39100G43972J80050k83628k38363L9059K24915L50538L06155j48391p23708q11475
$$ plain form
39090 -360876 -837032 -1200305 -1712423 -1947750 -1364722 -295975 367552 345888 164367 243963
39080 243963 419950 410359 246681 132126 222751 574780 1010671 1089325 539333 -303241
39070 -303241 -769033 -537468 138461 741862 826531 268800 -557864 -1084967 -1235233 -1467503
39060 -1467503 -1917778 -2039082 -1517901 -926737 -806426 -719173 -131478 308906 -384724 -1693437
39050 -1693437 -2023768 -1082557 -359329 -788870 -1342061 -758983 535295 1346615 1587769
39041 1587769 1929927 2213722 1674131 557686 97420 660380 1104921 441447 -788618
39032 -788618 -1374603 -1002216 -322590 94552 217646 155847 -107618 -523117 -862340 -921907
39022 -921907 -713637 -418509 -212207 -128283 -73974 -351 1634 -135635 -292209 -340408 -406509
$$ packed form
39090c60876m76156l63273n12118k35327N83028J068747O63527k1664j81521P9596
39080B43963J75987r591j63678j14555R0625L52029M35891P8654n49992q42574
39070c03241m65792K31565O75929O03401Q4669n57731q26664n27103j50266k32270
39060a467503m50275j21304N21181N91164J20311Q7253N87695M40384o93630j308713
39050a693437l30331R41211P23228m29541n53191N83078J294278Q11320K41154
39041A587769L42158K83795n39591j116445m60266N62960M44541o63474j230065
39032g88618n85985L72387O79626M17142J23094o1799k63465m15499l39223n9567
39022i21907K08270K95128K06302Q3924N4309P3623J985j37269j56574m8199o6101
$$ plain form
39011 -406509 -682002 -997625 -945312 -551094 -468986 -1180337 -2181718 -2377340 -1359686 -4173
39001 -4173 466007 -88810 -559307 1467 1113846 1450291 561567 -597398 -1041338 -954732
38991 -954732 -985235 -962086 -255670 845925 1214022 487965 -378548 -557548 -436855 -704691
38981 -704691 -1152397 -1175332 -863722 -704176 -605600 -154571 414974 472900 113329 58482
38971 58482 415767 519139 187536 114908 584881 754340 -101620 -1362724 -1876905 -1503735
38961 -1503735 -1036695 -900474 -746275 -266162 284135 455972 53715 -781512 -1563814
38952 -1563814 -1658322 -923781 -48622 222685 76666 278989 892620 1044007 169647 -1106624
38942 -1106624 -1726840 -1448841 -951361 -906371 -1297319 -1592090 -1352771 -653934 20097 277615
$$ packed form
39011d06509k75493l15623N2313L94218Q2108p11351j001381j95622J017654J355513
39001d173M70180n54817m70497N60774J112379L36445q88724j158965m43940Q6606
38991i54732l0503K3149P06416J101595L68097p26057q66513j79000J20693k67836
38981g04691m47706k2935L11610J59546R8576M51029N69545N7926l59571n4847
38971E8482L57285J03372l31603p2628M69973J69459q55960j261104n14181L73170
38961a503735M67040J36221J54199M80113N50297J71837m02257q35227p82302
38952a563814r4508P34541Q75159K71307j46019K02323O13631J51387q74360j276271
38942a106624o20216K77999M97480M4990l90948k94771K39319O98837O74031K57518
$$ plain form
38932 277615 156003 -112145 -492727 -1045585 -1539531 -1562205 -1073653 -523933 -308193 -359368
38922 -359368 -364286 -130812 339172 892464 1260287 1275590 1087050 924756 710336 252832
38912 252832 -232072 -306272 -49513 -14015 -272799 -191371 487075 1009233 665965 -70016
38902 -70016 -229553 196113 363783 1983 -203639 213919 784555 917925 755095 694740
38892 694740 582345 32968 -666790 -669360 305837 1435213 1662252 876394 -49716 -295709
38882 -295709 131012 688612 1041507 1239743 1353248 1346879 1342957 1586847 1973051 1992948
38872 1992948 1457902 935777 1030769 1460403 1392192 637288 -64748 -84617 276402 292455
38862 292455 -218855 -802451 -1053171 -1030564 -1014461 -1143460 -1385076 -1679572 -1968824 -2148033
$$ packed form
38932B77615j21612k68148l80582n52858m93946k2674M88552N49720K15740n1175
38922c59368m918K33474M69984N53292L67823J5303j88540j62294k14420m57504
38912B52832m84904p4200K56759L5498k58784Q1428O78446N22158l43268p35981
38902g0016j59537M25666J67670l61800k05622M17558N70636J33370j62830o0355
38892F94740j12395n49377o99758k570R75197J129376K27039p85858r26110k45993
38882b95709M26721N57600L52895J98236J13505o369l922K43890L86204J9897
38872A992948n35046n22125R4992M29634o8211p54904p02036j9869L61019J6053
38862B92455n11310n83596k50720K2607J6103j28999k41616k94496k89252j79209
$$ plain form
38852 -2148033 -2120815 -1901267 -1544566 -978804 -128449 680064 761265 -82690 -975768 -855026
38842 -855026 41727 314378 -693071 -1886352 -1891160 -860296 8063 247082 359542
38833 359542 512669 205002 -573256 -931337 -312897 659085 1073961 803758 198703 -622718
38823 -622718 -1572532 -2217732 -2252091 -1954531 -1632135 -1056127 -63673 752990 739685 229005
38813 229005 67755 329543 389119 164473 301355 997344 1576164 1553935 1318065 1306404
38803 1306404 1227678 694480 106683 211334 1018528 1743920 1772972 1271718 858629 952625
38793 952625 1422721 1712279 1389071 665478 188700 231939 404904 334180 231999 450968
38783 450968 835999 998140 976489 1065911 1130222 733752 3525 -287269 237354 947732
$$ packed form
38852b148033K7218K19548L56701N65762Q50355Q08513Q1201q43955q93078J20742
38842h55026Q96753K72651j007449j193281m808J030864Q68359K39019J12460
38833C59542J53127l07667p78258l58081O18440R71982M14876k70203o05055q21421
38823f22718r49814o45200l4359K97560L22396N76008R92454Q16663j3305n10680
38813B29005j61250K61788N9576k24646J36882O95989N78820k2229k35870j1661
38803A306404p8726n33198n87797J04651Q07194P25392K9052n01254m13089R3996
38793I52625M70096K89558l23208p23593m76778M3239J72965p0724j02181K18969
38783D50968L85031J62141k1651Q9422O4311l96470p30227k90794N24623P10378
$$ plain form
38773 947732 1041262 616885 421550 692767 805179 206779 -684221 -868155 9887 1111020
38763 1111020 1238227 99734 -1480106 -2575363 -3043564 -3224721 -3129334 -2431171 -1192918
38754 -1192918 -59750 440750 400498 154249 -188374 -559666 -696509 -520881 -452522 -830716
38744 -830716 -1245865 -1048654 -413599 -194951 -652377 -1061713 -885039 -616048 -922007 -1501323
38734 -1501323 -1513675 -821986 -30638 568491 1234823 1849723 1614246 186714 -1429812
38725 -1429812 -1795834 -654898 863956 1595770 1428612 997581 744497 574128 247433
38716 247433 -211703 -560382 -628573 -464808 -233786 -30150 227087 732638 1535231 2275715
38706 2275715 2365798 1672882 897109 868362 1476861 1802748 1417368 904453 739467 416730
$$ packed form
38773I47732R3530m24377j95335K71217J12412n98400q91000j83934Q78042J101133
38763A111020J27207j138493j579840j095257m68201j81157R5387O98163J238253
38754a192918J133168N00500m0252k46249l42623l71292j36843J75628O8359l78194
38744h30716m15149J97211O35055K18648m57426m09336J76674K68991l05959n79316
38734a501323j2352O91689P91348N99129O66332O14900k35477j427532j616526
38725a429812l66022J140936J518854P31814j67158m31031k53084j70369l26695
38716B47433m59136l48679o8191J63765K31022K03636K57237N05551Q02593P40484
38706B275715R0083o92916p75773k8747O08499L25887l85380n12915j64986l22737
$$ plain form
38696 416730 -535212 -1286461 -613189 1128660 2173204 1621049 356186 -617127 -1446896
38687 -1446896 -2356370 -2564384 -1467526 -54940 194099 -632362 -1188485 -941111 -634989
38678 -634989 -784976 -1015903 -1060284 -1199915 -1399838 -1118021 -404753 -152980 -708477 -1167045
38668 -1167045 -690702 297031 903943 1019213 1066883 1177418 1330741 1708004 2169523 2020868
38658 2020868 1112449 515877 1125252 2173474 2293556 1595581 1349377 1828371 1941066
38649 1941066 1130255 218171 -55059 -66715 -288710 -364695 3147 176229 -492561 -1514043
38639 -1514043 -1934751 -1658711 -1272332 -993368 -661868 -438108 -590802 -765939 -366327
38630 -366327 370205 517907 -220357 -1104080 -1417682 -1228187 -864640 -361555 195205 385821
$$ packed form
38696D16730r51942p51249O73272J741849J044544n52155j264863r73313q29769
38687a446896r09474k08014J096858J412586K49039q26461n56123K47374L06122
38678f34989j49987k30927m4381j39631j99923K81817P13268K51773n55497m58568
38668a167045M76343R87733O06912J15270M7670J10535J53323L77263M61519j48655
38658B020868r08419n96572O09375J048222J20082o97975k46204M78994J12695
38649A941066q10811r12084k73230j1656k21995p5985L67842J73082o68790j021482
38639a514043m20708K76040L86379K78964L31500K23760j52694j75137L99612
38630c66327P36532J47702p38264q83723l13602J89495L63547N03085N56760J90616
$$ plain form
38620 385821 39511 -339145 -273352 -113838 -515041 -1277274 -1406614 -458213 762872 1188976
38610 1188976 791609 432238 607622 921849 904060 782229 1017132 1423533 1369402 782592
38600 782592 340583 514549 985438 1286017 1490160 1823848 2036956 1762585 1254820 1155116
38590 1155116 1614302 2178558 2475010 2480096 2175615 1544342 933886 804031 1007429 950618
38580 950618 633586 825970 1857523 2886813 2907522 2010892 1092924 680417 633940 737390
38570 737390 942152 1110293 1045557 787144 516071 251099 -37702 -181902 -63723 72625
38560 72625 -17717 -122140 12952 30707 -583159 -1472371 -1616657 -717140 333843 639864
38550 639864 318027 -22805 -202979 -342630 -274353 263834 1032099 1439179 1266017 847195
$$ packed form
38620C85821l46310l78656O5793J59514m01203p62233j29340R48401J221085M26104
38610A188976l97367l59371J75384L14227j7789j21831K34903M06401n4131n86810
38600G82592m42009J73966M70889L00579K04143L33688K13108k74371n07765r9704
38590A155116M59186N64256K96452N086l04481o31273o10456j29855K03398n6811
38580I50618l17032J92384J031553J029290K0709q96630r17968m12507m6477J03450
38570G37390K04762J68141o4736k58413k71073k64972k88801j44200J18179J36348
38560G2625r0342j04423J35092J7755o13866q89212j44286Q99517J050983L06021
38550F39864l21837l40832j80174j39651O8277N38187P68265M07080j73162m18822
$$ plain form
38540 847195 531507 273763 -184162 -897353 -1517982 -1523182 -813493 -74254 -171984 -1041647
38530 -1041647 -1600030 -1069661 31001 664385 658390 694291 1146599 1679380 2003615 2307667
38520 2307667 2712912 2904465 2640105 2167054 1775113 1321714 597927 -143998 -456373
38511 -456373 -261128 256603 1064425 2061831 2638570 2183783 1120923 689635 1336010
38502 1336010 1973608 1443071 197267 -302185 384432 1245142 1498800 1640343 2295308
38493 2295308 2964984 2809004 2080830 1729060 1863196 1729378 1163539 890932 1133893
38484 1133893 1093459 392262 -8910 792190 2095967 2467073 1663347 698342 288690
38475 288690 248817 283723 376704 355416 -15750 -412030 -278559 111235 -135952 -1045085
$$ packed form
38540H47195l15688k57744m57925p13191o20629n200P09689P39239r7730q69663
38530a041647n58383N30369J100662O33384n995L5901M52308N32781L24235L04052
38520B307667M05245J91553k64360m73051l91941m53399p23787p41925l12375
38511d56373J95245N17731Q07822R97406N76739m54787j062860m31288O46375
38502A336010O37598n30537j245804m99452O86617Q60710K53658J41543O54965
38493B295308O69676j55980p28174l51770J34136j33818n65839k72607K42961
38484A133893m0434p01197m01172Q01100J303777L71106q03726r65005m09652
38475B88690l9873L4906R2981k1288l71166l96280J33471L89794k47187r09133
$$ plain form
38465 -1045085 -1496335 -874661 -26279 96772 -108398 318104 1284400 1839961 1659989
38456 1659989 1330751 1216363 954770 244214 -590890 -1081407 -1130328 -801837 -60296 937184
38446 937184 1584471 1268727 89298 -1052284 -1223858 -401696 439624 383965 -335840
38437 -335840 -694989 -355263 -147260 -721672 -1415247 -1212309 -339665 101424 -122470 -151493
38427 -151493 336228 459142 -383231 -1377927 -1465319 -912248 -778412 -1274712 -1652077 -1510278
38417 -1510278 -1200817 -884275 -166611 987322 1767140 1480350 518349 -131860 13519
38408 13519 779988 1934074 3324781 4522788 4906578 4275169 3062014 1845725 906545
38399 906545 307280 77185 132540 234048 223066 195291 327071 639542 1015073 1325498
$$ packed form
38465a045085m51250O21674Q48382J23051k05170M26502R66296N55561j79972
38456A659989l29238j14388k61593p10556q35104m90517m8921L28491P41541R97480
38446I37184O47287l15744j179429j141582j71574Q22162Q41320n5659p19805
38437c35840l59149L39726K08003n74412o93575K02938Q72644M41089k23894k9023
38427a51493M87721J22914q42373r94696q7392N53071J33836m96300l77365J41799
38417a510278L09461L16542P17664J153933P79818k86790r62001o50209J45379
38408A3519P66469J154086J390707J198007L83790o31409j213155j216289r39180
38399I06545n99265k30095N5355J01508j0982k7775J31780L12471L75531L10425
$$ plain form
38389 1325498 1489508 1547675 1696546 2023559 2188587 1714887 714098 -98696 -355274
38380 -355274 -518798 -994050 -1261513 -624372 505159 986837 565600 132310 208726 207534
38370 207534 -326484 -727334 -268408 537918 692350 270078 161791 525139 628199 219313
38360 219313 -82080 3382 -114218 -741422 -1177089 -844798 -396156 -805944 -1845747 -2405489
38350 -2405489 -2128469 -1775445 -1881336 -1930080 -1273591 -254135 194488 -178872 -648503
38341 -648503 -548477 -146436 -176609 -732789 -1088290 -702687 26420 357387 238882 225764
38331 225764 506550 690359 667933 956382 1778216 2403874 2031013 925376 21928 -323985
38321 -323985 -443454 -398766 168188 1118612 1635665 1365784 1054156 1525767 2552702 3277097
$$ packed form
38389A325498J64010N8167J48871L27013J65028m73700j000789q12794k56578
38380c55274j63524m75252k67463O37141J129531M81678m21237m33290P6416j192
38370B07534n34018m00850M58926Q06326J54432m22272j08287L63348J03060m08886
38360B19313l01393Q5462j17600o27204m35667L32291M48642m09788j039803n59742
38350b405489K77020L53024j05891m8744O56489J019456M48623l73360m69631
38341f48503J00026M02041l0173n56180l55501L85603P29107L30967j18505j3118
38331B25764K80786J83809k2426K88449Q21834O25658l72861j105637r03448l45913
38321c23985j19469M4688N66954R50424N17053k69881l11628M71611J026935P24395
$$ plain form
38311 3277097 3323858 2902205 2184936 1302088 727522 907181 1543251 1937813 2028653 2334335
38301 2334335 2829982 2794163 2086069 1650324 2136645 2791775 2541398 1581229 930504 811915
38291 811915 583583 136887 175012 893703 1438830 1109267 265823 -398162 -704812 -628427
38281 -628427 74696 1163291 1561622 621123 -733373 -1031322 -126348 855665 1225695
38272 1225695 1423964 1988763 2727355 3151628 3105742 2748406 2370524 2294443 2504168 2422601
38262 2422601 1569966 333285 -518407 -905215 -1244724 -1369490 -707723 369192 572737
38253 572737 -493396 -1613349 -1641112 -916116 -275491 353925 1334968 2062781 1633706
38244 1633706 463018 -5318 745036 1640401 1525803 553970 -245004 -244371 252297 498865
$$ packed form
38311C277097M6761m21653p17269q82848n74566J79659O36070L94562R0840L05682
38301B334335M95647l5819p08094m35745M86321O55130k50377r60169o50725j18589
38291H11915k28332m46696L8125P18691N45127l29563q43444o63985l06650P6385
38281f28427P03123J088595L98331r40499j354496k97949R04974R82013L70030
38272A225695J98269N64799P38592M24273m5886l57336l77882p6081K09725q1567
38262B422601q52635j236681q51692l86808l39509j24766O61767J076915K03545
38253E72737j066133j119953k7763P24996O40625O29416R81043P27813m29075
38244A633706j170688m68336P50354Q95365j14598r71833p98974O33M96668K46568
$$ plain form
38234 498865 134457 -418940 -471319 11698 397401 458554 816507 1818965 2634146 2298019
38224 2298019 1210616 601241 757162 860276 537344 433527 996372 1701111 1911898
38215 1911898 1689028 1302356 740722 261199 672352 2263492 3901996 4067871 2712660
38206 2712660 1412969 1556170 2831000 3740961 3370752 2334838 1902176 2423915 3036082
38197 3036082 2950651 2436541 2102302 1815427 1161774 584145 939513 1952682 2318870
38188 2318870 1648301 1108937 1515368 1918233 1103078 -372398 -921259 -258153 363619
38179 363619 204044 21888 620055 1470555 1538144 860070 467022 916583 1646906 1921992
38169 1921992 1832347 1943647 2289607 2329349 1908788 1597724 1737557 1776465 1210563 710725
$$ packed form
38234D98865l64408n53397n2379M83017L85703O1153L57953J002458Q15181l36127
38224B298019j087403o09375J55921J03114l22932j03817N62845P04739K10787
38215A911898k22870l86672n61634m79523M11153J591140J638504J65875j355211
38206B712660j299691J43201J274830R09961l70209j035914m32662N21739O12167
38197C036082q5431n14110l34239k86875o53653n77629L55368J013169L66188
38188B318870o70569n39364M06431M02865q15155j475476n48861O63106O21772
38179C63619j59575j82156N98167Q50500O7589o78074l93048M49561P30323K75086
38169A921992q9645J11300L45960L9742m20561l11064J39833L8908n65902m99838
$$ plain form
38159 710725 1332810 2746387 3368245 2493050 1217853 739354 740193 272069 -582803 -983845
38149 -983845 -764515 -499577 -369248 -8306 523328 605070 107679 -210494 305786 1361547
38139 1361547 2121576 2050504 1180364 -29122 -906601 -1011066 -551943 -127490 102
38130 102 74351 307630 582475 766878 948006 1220511 1530258 1801903 1944696 1717725
38120 1717725 934401 -135296 -893252 -1032687 -770826 -451877 -221420 -100031 -35759
38111 -35759 157411 583217 957809 882043 476037 365656 913786 1784680 2401842 2561832
38101 2561832 2468767 2395290 2439309 2489169 2401986 2280301 2407720 2762192 2888220 2544348
38091 2544348 2128578 2043524 2054744 1881430 1968182 2775839 3635928 3460215 2517122 2225497
$$ packed form
38159G10725O22085J413577O21858q75195j275197m78499Q39m68124q54872m01042
38149i83845K19330K64938J30329L60942N31634Q1742m97391l18173N16280J055761
38139A361547P60029p1072q70140j209486q77479j04465M59123M24453J27592
38130A02P4249K33279K74845J84403J81128K72505L09747K71645J42793k26971
38120A717725p83324j069697p57956j39435K61861L18949K30457J21389O4272
38111c5759J93170M25806L74592p5766m06006j10381N48130Q70894O17162J59990
38101B561832r3065p3477M4019M9860q7183j21685J27419L54472J26028l43872
38091B544348m15770q5054J1220j73314Q6752Q07657Q60089j75713r43093k91625
$$ plain form
38081 2225497 2998840 3672300 3566883 3677599 4854386 6087253 5999430 5161239 5262424
38072 5262424 6368348 6724539 5458168 3941556 3865737 5120064 6392819 7034527 7344279
38063 7344279 7455554 7005328 6005112 5243216 5405192 6208870 6878628 7282406 8039170
38054 8039170 9422225 10764017 11404610 11809280 13051755 15345827 17859517 20032654
38046 20032654 22268549 25086133 28426742 32265604 37139279 43416111 50685271 58624309
38038 58624309 67949703 79695280 94002558 110557368 129978423 153942304 184093743
38031 184093743 221189431 263959236 306780625 338953641 349449397 334777110 301907040
38024 301907040 262607126 225306012 192497373 163885110 139443730 119336545 102906959
$$ packed form
38081B225497P73343O73460j05417J10716J176787J232867q7823q38191J01185
38072E262424J105924L56191j266371j516612p5819J254327J272755O41708L09752
38063G344279J11275m50226j000216p61896J61976Q03678O69758M03778P56764
38054H039170J383055J341792O40593M04670J242475K294072K513690K173137
38046B0032654K235895K817584L340609L838862M873675O276832P269160P939038
38038E8624309R325394J1745577J4307278J6554810J9421055K3963881L0151439
38031A84093743L7095688M2769805M2821389L2173016J0495756j4672287l2870070
38024C01907040l9299914l7301114l2808639k8612263k4441380k0107185j6429586
$$ plain form
38017 102906959 89053544 77164012 67150402 58932506 52258580 46747971 41857512
38010 41857512 37114940 32648637 29177423 27103733 25786165 24116346 21822472 19836596
38002 19836596 19178683 19678551 20069276 19322776 17659271 16152944 15536082 15574854 15512036
37993 15512036 14880723 13846373 12902989 12314168 11851881 11155382 10347744 10024631 10404273
37984 10404273 10768395 10225734 8942695 8043362 8168789 8705248 8737469 8223387 7709557
37975 7709557 7299469 6638279 5802451 5427365 5750956 6173329 6168964 6158231 6909556 8317560
37965 8317560 9392847 9471260 8891115 8341046 8059722 7964067 8075817 8322452 8247087 7538453
37955 7538453 6708040 6582288 7119897 7434554 7148748 6972101 7539981 8370229 8590354
$$ packed form
38017A02906959j3853415j1889532j0013610q217896o673926n510609m890459
38010D1857512m742572m466303l471214k073690j317568j669819k293874j985876
38002A9836596o57913M99868L90725p46500j663505j506327o16862L8772o2818
37993A5512036o31313j034350r43384n88821m62287o96499q07638l23113L79642
37984A0404273L64122n42661j283039q99333J25427N36459L2221n14082n13830
37975G709557m10088o61190q35828l75086L23591M22373m365j0733P51325J408004
37965H317560J075287P8413n80145n50069k81324r5655J11750K46635p5365p08634
37955G538453q30413j25752N37609L14657k85806j76647N67880Q30248K20125
$$ plain form
37946 8590354 8171301 7707209 7365743 6911546 6565344 6902692 7831095 8497892 8413377 7940520
37936 7940520 7447690 6744299 5757946 5070651 5186958 5736589 5994337 5864435 5791890 5946568
37926 5946568 6061331 5960942 5764364 5621277 5640424 5973241 6538620 6746199 6003564 4587747
37916 4587747 3576301 3699910 4541269 5079921 4830460 4200965 3813693 3741321 3540019
37907 3540019 2919501 2157789 1762896 1875364 2174383 2278625 2044445 1563678 1125592
37898 1125592 1105342 1562566 1981286 1787443 1145264 817882 1158787 1696494 1857753 1615938
37888 1615938 1217126 788886 537208 822438 1621791 2345487 2592793 2635250 2730546 2554078
37878 2554078 1949421 1624686 2143470 2633055 1687300 -473877 -1918571 -1359681 403494
$$ packed form
37946H590354m19053m64092l41466m54197l46202L37348R28403O66797q4515m72857
37936G940520m92830p03391r86353o87295J16307N49631K57748j29902p2545J54678
37926E946568J14763j00389j96578j43087J9147L32817N65379K07579p42635j415817
37916D587747j011446J23609Q41359N38652k49461o29495l87272p2372k01302
37907C540019o20518p61712l94893J12468K99019J04242k34180m80767m38086
37898A125592k0250M57224M18720j93843o42179l27382L40905N37707J61259k41815
37888A615938l98812m28240k51678K85230P99353P23696K47306M2457R5296j76468
37878B554078o04657l24735N18784M89585r45755k161177j444694N58890J763175
$$ plain form
37869 403494 1809396 2343597 2393128 2144121 1593538 1235018 1711264 2751102 3220359
37860 3220359 2466375 1114774 271133 295287 695988 1016919 1358214 1886589 2190593
37851 2190593 1596344 166663 -1063975 -1176825 -419076 234401 368121 433040 796096
37842 796096 1109457 900809 350925 90415 414171 995019 1293303 1073997 582973 288495
37832 288495 367268 480161 238475 -192621 -287283 68807 426332 470859 401453 417576
37822 417576 311106 -88258 -462629 -433693 -153730 -4805 113370 714724 1959139 3299281
37812 3299281 3926961 3399008 1934463 309985 -669433 -820455 -572660 -180484 673469
37803 673469 2097375 3208426 2873903 1216696 -306931 -543601 162353 654609 369101
$$ packed form
37869D03494J405902N34201M9531k49007n50583l58520M76246J039838M69257
37860C220359p53984j351601q43641K4154M00701L20931L41295N28375L04004
37851B190593n94249j429681j230638j12850P57749O53477J33720O4919L63056
37842G96096L13361k08648n49884k60510L23756N80848K98284k19306m91024k94478
37832B88495P8773J12893k41686m31096r4662L56090L57525M4527o9406J6123
37822D17576j06470l99364l74371K8936K79963J48925J18175O01354J244415J340142
37812C299281O27680n27953j464545j624478r79418j51022K47795L92176Q53953
37803F73469J423906J111051l34523j657207j523627k36670P05954M92256k85508
$$ plain form
37794 369101 -300337 -682603 -465594 143679 539735 150468 -927524 -1863472 -1988550
37785 -1988550 -1601325 -1462669 -1616814 -1325563 -299803 648382 627869 -101655 -520092
37776 -520092 -249115 77915 -175503 -895879 -1600145 -1981372 -1839881 -1040382 88056
37767 88056 796342 794095 646651 851398 1057295 843978 709136 1297746 1987251 1450805
37757 1450805 -327526 -1783803 -1825405 -1058433 -499304 -143423 440117 1010233 1110724
37748 1110724 998284 1162937 1372987 1096588 495724 112000 -94779 -471983 -754705
37739 -754705 -447884 72356 -57938 -735264 -915801 -220982 521212 542664 -50069 -945877
37729 -945877 -2043706 -2843920 -2540464 -1299087 -434334 -624331 -907195 -275515 660084
$$ packed form
37794C69101o69438l82266K17009O09273L96056l89267j077992r35948j25078
37785a988550L87225J38656j54145K91251J025760R48185k0513p29524m18437
37776e20092K70977L27030k53418p20376p04266l81227J41491P99499J128438
37767H8056P08286k247j47444K04747K05897k13317j34842N88610O89505n36446
37757A450805j778331j456277m1602P66972N59129L55881N83540N70116J00491
37748A110724j12440J64653K10050k76399o00864l83724k06779l77204k82722
37739g54705L06821N20240j30294o77326j80537O94819P42194K1452n92733q95808
37729i45877j097829q00214L03456J241377Q64753j89997k82864O31680R35599
$$ plain form
37720 660084 672066 -138204 -627658 -434531 -284087 -609002 -980550 -966867 -627325 -77453
37710 -77453 595725 915467 352945 -782637 -1571676 -1729372 -1825704 -2119848 -2080336 -1393128
37700 -1393128 -573523 -85248 376624 1131876 1716700 1530908 780470 98097 -349880
37691 -349880 -696623 -721455 -166569 523652 582906 -29312 -660576 -964157 -1105656 -987335
37681 -987335 -169734 1131537 1752532 835441 -1067805 -2611496 -3049428 -2631835 -1970427
37672 -1970427 -1508667 -1426257 -1571270 -1506337 -964365 -238950 136661 28604 -233794 -326849
37662 -326849 -161281 269231 899470 1437527 1533554 1185218 733033 432956 303484 382506
37652 382506 744373 1152922 1098297 417674 -426818 -935409 -1147281 -1363881 -1612118 -1749550
$$ packed form
37720F60084J1982q10270m89454J93127J50444l24915l71548J3683L39542N49872
37710g7453O73178L19742n62522j135582p89039j57696r6332k94144L9512O87208
37700a393128Q19605M88275M61872P55252N84824j85792p50438o82373m47977
37691c49880l46743k4832N54886O90221N9254o12218o31264l03581j41499J18321
37681i87335Q17601J301271O20995r17091j903246j543691m37932M17593O61408
37672a970427M61760Q2410j45013O4933N41972P25415L75611j08057k62398r3055
37662c26849J65568M30512O30239N38057R6027l48336m52185l00077j29472P9022
37652C82506L61867M08549n4625o80623q44492n08591k11872k16600k48237j37432
$$ plain form
37642 -1749550 -1817974 -1824616 -1408091 -326348 825896 1094031 458460 -64118 99008 216080
37632 216080 -574573 -1816190 -2267649 -1616192 -810294 -674361 -956934 -951974 -412393 460779
37622 460779 1377418 1913021 1591298 527777 -327757 -126322 876448 1711794 1906038
37613 1906038 1754867 1503973 941685 2745 -769262 -754826 -14900 772945 1026163 769638
37603 769638 561437 960551 1900359 2609259 2439762 1766735 1628374 2353271 3050331 2773951
37593 2773951 1728902 847267 542994 496965 463186 582059 857808 957071 740719 537044
37583 537044 646116 903829 924471 485358 -439145 -1642836 -2517511 -2371269 -1272000
37574 -1272000 -242257 -201544 -929717 -1470177 -1351787 -925611 -599199 -325732 7475
$$ packed form
37642a749550o8424o642M16525J081743J152244K68135o35571n22578J63126J17072
37632B16080p90653j241617m51459O51457Q05898J35933k82573M960N39581Q73172
37622D60779R16639N35603l21723j063521q55534K01435J002770Q35346J94244
37613A906038j51171k50894n62288r38940p72007J4436P39926P87845K53218k56525
37603G69638k08201L99114R39808P08900j69497o73027j38361P24897O97060k76380
37593B773951j045049q81635l04273m6029l3779J18873K75749R9263k16352k03675
37583E37044J09072K57713K0642m39113r24503j203691q74675J46242J099269
37574a272000J029743M0713p28173n40460J18390M26176L26412K73467L33207
$$ plain form
37565 7475 197248 86827 14364 469775 1354116 1936959 1658458 753426 -54360 -302839
37555 -302839 -65531 337329 565286 249729 -777001 -2024859 -2486173 -1611708 39403
37546 39403 1444460 2178575 2433256 2280694 1619131 787982 432276 530115 276989 -683999
37536 -683999 -1571890 -1522936 -775631 -170840 83763 409960 898531 1140871 962996 647549
37526 647549 387419 90995 -218137 -325011 -210985 -77708 17352 115996 36448 -368918
37516 -368918 -717183 -496359 63380 235303 -61829 -198479 -47843 -286215 -1070043 -1390219
37506 -1390219 -473872 933564 1546464 1229293 806125 641328 436582 194007 296306
37497 296306 608602 502267 -29087 -171761 473281 1247745 1432845 1184731 986557 808586
$$ packed form
37565G475J89773j10421p2463M55411Q84341N82843k78501r05032q07786k48479
37555c02839K37308M02860K27957l15557j026730j247858m61314Q74465J651111
37546C9403J405057P34115K54681j52562o61563q31149l55706R7839k53126r60988
37536f83999q87891M8954P47305O04791K54603L26197M88571K42340j77875l15447
37526F47549k60130k96424l09132j06874J14026J33277R5060R8644p9548m05366
37516c68918l48265K20824N59739J71923k97132j36650J50636k38372p83828l20176
37506a390219R16347J407436O12900l17171m23168j64797k04746k42575J02299
37497B96306L12296j06335n31354j42674O45042P74464J85100k48114j98174j77971
$$ plain form
37487 808586 442835 169343 334747 558267 159332 -673880 -907904 -48919 1104721
37478 1104721 1439644 835446 85984 -214354 -202647 -183202 -14426 630601 1569054 2057120
37468 2057120 1587095 541309 -206923 -297857 -181095 -321186 -491256 -216715 345873
37459 345873 557792 319854 283336 753749 1009707 313999 -815081 -1144196 -417358 325712
37449 325712 253245 -239641 -362955 -51915 305533 688613 1279490 1816458 1822911 1332964
37439 1332964 802027 442475 195375 144042 307373 240384 -360537 -791339 -45967 1540726
37429 1540726 2397383 1791648 803625 684133 1165299 1196454 649798 345437 766366 1606437
37419 1606437 2369935 2684469 2226984 1080623 52852 -47433 597819 1124958 1167986
$$ packed form
37487H08586l65751k73492J65404K23520l98935q33212k34024Q58985J153640
37478A104721L34923o04198p49462l00338J1707J9445J68776O45027R38453M88066
37468B057120m70025j045786p48232r0934J16762j40091j70070K74541N62588
37459C45873K11919k37938l6518M70413K55958o95708j129080l29115P26838P43070
37449C25712p2467m92886j23314L11040L57448L83080N90877N36968O453m89947
37439A332964n30937l59552k47100n1333J63331o6989o00921m30802P45372J586693
37429A540726Q56657o05735r88023j19492M81166L1155n46656l04361M20929Q40071
37419A606437P63498L14534m57485j146361j027771j00285O45252N27139M3028
$$ plain form
37410 1167986 1096127 1177857 1222760 1089875 891152 596000 41021 -559246 -706739 -365382
37400 -365382 -39018 54830 302141 954478 1632523 1869827 1684573 1330404 949483 780207
37390 780207 1209341 2173766 2895194 2699658 1847746 1107101 732317 375289 -107437 -308985
37380 -308985 140940 1006166 1660273 1707488 1260524 713651 375809 306448 386164 437854
37370 437854 282708 -199399 -975558 -1861971 -2627046 -3006470 -2704854 -1700549 -593432
37361 -593432 -206864 -604333 -947915 -686355 -357232 -617855 -1004565 -597975 337944 514497
37351 514497 -472928 -1481758 -1451066 -732632 -243873 -152750 -148176 -338674 -992360 -1778638
37341 -1778638 -2115272 -2062351 -2132035 -2357491 -2271401 -1760395 -1253515 -993504 -725764 -272045
$$ packed form
37410A167986p1859Q1730M4903j32885j98723k95152n54979o00267j47493L41357
37400c65382L26364R3848K47311O52337O78045K37304j85254l54169l80921j69276
37390G80207M29134R64425P21428j95536q51912p40645l74784l57028m82726k01548
37380c08985M49925Q65226O54107M7215m46964n46873l37842o9361P9716N1690
37370D37854j55146m82107p76159q86413p65075l79424L01616J004305J107117
37361e93432L86568l97469l43582K61560L29123k60623l86710M06590R35919J76553
37351E14497r87425j008830L0692P18434M88759R1123M574j90498o53686p86278
37341a778638l36634N2921o9684k25456Q6090N11006N06880K60011K67740M53719
$$ plain form
37331 -272045 78656 -19659 -479244 -863942 -778870 -165143 559621 701961 -37598 -1069682
37321 -1069682 -1410840 -749007 261324 839927 908722 906348 1034395 1012880 578600 -41146
37311 -41146 -363034 -299770 -304761 -712750 -1185704 -1162219 -707313 -404334 -378175 -52538 809766
37300 809766 1391048 740809 -847321 -2005915 -1859487 -956187 -502200 -972049 -1680740
37291 -1680740 -1647360 -743553 122259 31591 -866851 -1553870 -1348672 -568667 30229 38741
37281 38741 -497011 -1279484 -1817525 -1673739 -942923 -187463 269068 585971 814931 663110
37271 663110 158821 -63610 385333 1038062 1277201 1115517 797422 292428 -177505 159508
37261 159508 1490946 2604185 2285139 1088414 553731 990392 1334692 1071417 897992
$$ packed form
37331b72045L50701r8315m59585l84698Q5072O13727P24764J42340p39559j032084
37321a069682l41158O61833J010331N78603O8795k374J28047k1515m34280o19746
37311d1146l21888O3264m991m07989m72954K3485M54906L02979K6159L25637Q62304
37300H09766N81282o50239j588130j158594J46428R03300M53987m69849p08691
37291a680740L3380R03807Q65812r0668q98442o87019K05198P80005N98896Q512
37281C8741n35752p82473n38041J43786P30816P55460M56531L16903K28960j51821
37271F63110n04289k22431M48943O52729K39139j61684l18095n04994m69933L37013
37261A59508J331438J113239l19046j196725n34683M36661L44300k63275j73425
$$ plain form
37252 897992 1314877 1871572 2176501 2465393 2697097 2205842 869262 -349653 -699240
37243 -699240 -630450 -819855 -1028168 -732828 -208074 -84175 -300737 -335297 -145266 -124465
37233 -124465 -354439 -567642 -690034 -865178 -1104203 -1378056 -1838139 -2490606 -2893261 -2638024
37223 -2638024 -1909180 -1147981 -459054 186133 493375 199524 -318992 -394158 56656 496318
37213 496318 519576 183791 -286100 -629401 -485350 260015 1057219 1148167 566640 256160
37203 256160 957583 2221919 2772840 1847081 106311 -889748 -283562 1057303 1428794
37194 1428794 242152 -1328023 -1810953 -1071694 -122811 266358 234058 293703 648974
37185 648974 1077397 1252057 1168575 1246676 1768493 2275002 2057314 1340621 1234669 2128038
$$ packed form
37252H97992M16885N56695L04929K88892K31704m91255j336580j218915l49587
37243f99240O8790j89405k08313K95340N24754J23899k16562l4560J90031K0801
37233a24465k29974k13203j22392j75144k39025k73853m60083o52467m02655K55237
37223b638024P28844P61199O88927O45187L07242k93851n18516p5166M50814M39662
37213D96318K3258l35785m69891l43301J44051P45365P97204R0948n81527l10480
37203B56160P01423J264336N50921r25759j740770r96059O06186J340865L71491
37194A428794j186642j570175m82930P39259R48883L89169l2300N9645L55271
37185F48974M28423J74660q3482P8101N21817N06509k17688p16693j05952Q93369
$$ plain form
37175 2128038 2915817 2506351 1432250 1046821 1555722 1892267 1408130 673239 462398
37166 462398 768523 1079702 1045982 646411 131583 -71619 230065 648304 623925 118968
37156 118968 -475624 -953136 -1316365 -1358359 -828226 33762 684964 947423 962423 653182
37146 653182 -79609 -746843 -673958 -65000 116866 -547065 -1485181 -2101253 -2379395 -2340663
37136 -2340663 -1767348 -832673 -220777 -178640 -151747 184543 258786 -439004 -1366839 -1611269
37126 -1611269 -1129503 -626303 -478411 -407423 -61226 578245 1253311 1562939 1251188 649423
37116 649423 496043 960225 1233192 571535 -587748 -1122939 -624825 263988 776151
37107 776151 734249 388991 86708 179217 818205 1665366 2090112 1810573 1170219 683091
$$ packed form
37175B128038P87779m09466j074101l85429N08901L36545m84137p34891k10841
37166D62398L06125L11179l3720l99571n14828k03202L01684M18239k4379n04957
37156A18968n94592m77512l63229m1994N30133Q61988O51202K62459J5000l09241
37146F53182p32791o67234P2885O08958J81866o63931r38116o16072k78142L8732
37136b340663N73315R34675O11896M2137K6893L36290P4243o97790r27835k44430
37126a611269M81766N03200J47892P0988L46197O39471O75066L09628l11751o01765
37116F49423j53380M64182K72967o61657j159283n35191M98114Q88813N12163
37107G76151m1902l45258l02283R2509O38988Q47161M24746k79539o40354m87128
$$ plain form
37097 683091 431564 16820 -910047 -2111963 -2847711 -2587939 -1580731 -557153 21166
37088 21166 191705 115541 -131118 -420042 -636511 -887628 -1234946 -1285285 -629831 296777
37078 296777 522061 -107958 -627379 -337516 265867 440033 321987 413344 550082 227035
37068 227035 -434390 -878056 -1050252 -1362408 -1815871 -1870120 -1203377 -77336 1030340
37059 1030340 1726836 1768135 1284306 821468 760101 887942 915574 1032037 1400506 1507706
37049 1507706 765269 -485263 -1315283 -1375547 -1022264 -551456 -141316 -286301 -1248967
37040 -1248967 -2181034 -1919587 -734805 -129360 -677944 -1276792 -975461 -338166 -264160
37031 -264160 -520190 -380560 89650 385971 577072 967846 1237550 934182 469450 565619
$$ packed form
37097F83091k51527m14744r26867j201916p35748K59772J007208J023578N78319
37088B1166J70539p6164k46659k88924k16469k51117l47318n0339O55454R26608
37078B96777K25284o30019n19421K89863O03383J74166j18046R1357J36738l23047
37068B27035o61425m43666j72196l12156m53463n4249O66743J126041J107676
37059A030340O96496M1299m83829m62838o1367J27841K7632J16463L68469J07200
37049A507706p42437j250532q30020o0264L53283M70808M10140j44985r62666
37040a248967r32067K61447J184782O05445n48584n98848L01331O37295P4006
37031b64160k56030J39630M70210K96321J91101L90774K69704l03368m64732R6169
$$ plain form
37021 565619 924999 549430 -618964 -1443292 -1185969 -415372 17011 59070 40790 -100314
37011 -100314 -537023 -980640 -1055084 -957495 -1120095 -1370853 -1062402 -66944 904452 1144345
37001 1144345 701587 99727 -318841 -471665 -258111 375090 1178501 1770903 2053912
36992 2053912 2147505 1954481 1222369 142412 -584980 -585264 -332476 -423165 -626663 -230940
36982 -230940 748838 1323168 695772 -723579 -1752152 -1685601 -917342 -409092 -663198
36973 -663198 -1208637 -1168101 -390720 244463 -23970 -643671 -330853 1108605 2250944
36964 2250944 1761854 134445 -872872 -314165 1038982 1876142 1834827 1498643 1310054
36955 1310054 1059251 506430 10642 110545 654149 857832 314777 -525569 -1094540 -1434768
$$ packed form
37021E65619L59380l75569j168394q24328K57323P70597M32383M2059j8280j41104
37011a00314m36709m43617p4444R7589j62600k50758L08451R95458R71396K39893
37001A144345m42758o01860m18568j52824K13554O33201Q03411N92402K83009
36992B053912R3593j93024p32112j079957p27392k84K52788r0689k03498L95723
36982b30940R79778N74330o27396j419351j028573O6551P68259N08250k54106
36973f63198n45439M0536P77381O35183k68433o19701L12818J439458J142339
36964B250944m89090j627409j007317N58707J353147Q37160m1315l36184j88589
36955A310054k50803n52821m95788R9903N43604K03683n43055q40346n68971l40228
$$ plain form
36945 -1434768 -1822877 -2142052 -2206286 -2314990 -2717829 -2776465 -1614365 370358 1637806
36936 1637806 1454167 785949 750830 1047686 721692 -139383 -470032 228742 1295537
36927 1295537 1901986 1950582 1817944 1716942 1567112 1245196 807054 545894 768589 1370008
36917 1370008 1777543 1564081 1014107 827400 1311160 2053949 2338976 1770405 642939
36908 642939 -202360 -123735 574748 913833 394507 -498430 -1139489 -1562781 -1985108 -2069550
36898 -2069550 -1378794 -266773 439754 538268 525776 627563 492132 -38747 -545226 -657162
36888 -657162 -521550 -400698 -301853 -282179 -648178 -1452623 -2094043 -1831006 -624367 747811
36878 747811 1372009 949518 18136 -519938 -229444 484571 930491 903481 667744 379396
$$ packed form
36945a434768l88109l19175o4234j08704m02839n8636J162100J984723J267448
36936A637806j83639o68218l5119K96856l25994q61075l30649O98774J066795
36927A295537O06449M8596j32638j01002j49830l21916m38142k61160K22695O01419
36917A370008M07535k13462n49974j86707M83760P42789K85027n68571j127466
36908F42939q45299P8625O98483L39085n19326q92937o41059m23292m22327q4442
36898b069550O90756J112021P06527R8514j2492J01787j35431n30879n06479j11936
36888f57162J35612J20852R8845J9674l65999q04445o41420K63037J206639J372178
36878G47811O24198m22491r31382n38074K90494P14015M45920k7010k35737k88348
$$ plain form
36868 379396 -16627 -376203 -357090 57542 435543 421161 77318 -326373 -522128 -268316
36858 -268316 378617 798757 346630 -721783 -1365678 -966808 46217 888604 1166984
36849 1166984 786876 -184910 -1201961 -1423282 -708618 86654 284064 303444 837502
36840 837502 1633126 1840414 1228232 291644 -616201 -1485601 -2111226 -2137668 -1691230 -1321426
36830 -1321426 -1257767 -1302513 -1449452 -1906278 -2375580 -2050776 -701032 764021 1229624
36821 1229624 552091 -509381 -1234524 -1491885 -1559939 -1718547 -1977122 -2079462 -1825162
36812 -1825162 -1358372 -979627 -750235 -538985 -360959 -303917 -196608 173409 523053 329567
36802 329567 -263989 -420212 249445 1104586 1414686 1306963 1261243 1171687 616322 -238499
$$ packed form
36868C79396l96023l59576J9113M14632L78001j4382l43843m03691j95755K53812
36858b68316O46933M20140m52127j068413o43895L98870J013025Q42387K78380
36849A166984l80108r71786j017051k21321P14664P95272J97410J9380N34058
36840H37502P95624K07288o12182r36588r07845q69400o25625k6442M46438L69804
36830a321426O3659m4746j46939m56826m69302L24804J349744J465053M65603
36821A229624o77533j061472p25143k57361o8054j58608k58575j02340K54300
36812a825162M66790L78745K29392K11250J78026N7042J07309L70017L49644j93486
36802C29567n93556j56223O69657Q55141L10100j07723m5720q9556n55365q54821
$$ plain form
36792 -238499 -767387 -863360 -1108812 -1857743 -2669953 -2851657 -2234191 -1297684 -747670 -952665
36782 -952665 -1526536 -1523122 -384484 1312158 2361901 2164253 1179723 293584 101620
36773 101620 654879 1367974 1262467 -46446 -1548192 -1700044 -267812 1366676 1968949
36764 1968949 1763328 1581462 1530162 1265501 1001100 1297443 2071997 2638829 2653507 2334205
36754 2334205 1842652 1164252 582064 533670 884342 988183 614132 208834 85831 -26566
36744 -26566 -386927 -755902 -817496 -633580 -406476 -192694 -75349 -212682 -516180 -683716
36734 -683716 -675543 -668673 -467971 340212 1437073 1784306 1012142 14186 -392017 -595657
36724 -595657 -1234484 -1865512 -1620925 -711391 -187279 -423361 -830471 -948609 -891742 -774050
$$ packed form
36792b38499n28888r5973k45452p48931q12210j81704O17466R36507N50014k04995
36782i52665n73871L414J138638J696642J049743j97648r84530q86139j91964
36773A01620N53259P13095j05507j308913j501746j51852J432232J634488O02273
36764A968949k05621j81866n1300k64661k64401K96343P74554N66832J4678l19302
36754B334205m91553o78400n82188m8394L50672J03841l74051m05298j23003j12397
36744b6566l60361l68975o1594J83916K27104K13782J17345j37333l03498j67536
36734f83716Q173O870K00702Q08183J096861L47233p72164r97956m06203k03640
36724e95657o38827o31028K44587R09534N24112k36082m07110j18138N6867J17692
$$ plain form
36714 -774050 -594250 -653062 -1198452 -1690124 -1345513 -402683 167308 223211 548976 1194149
36704 1194149 1062633 -245194 -1406816 -1129661 -25927 312862 -491451 -1392704 -1555014
36695 -1555014 -1188222 -818125 -554142 -237625 173807 516118 534994 170305 -210309 -167771
36685 -167771 142262 144069 -185931 -191030 330197 635366 187391 -478572 -704002 -772370
36675 -772370 -1180705 -1525992 -1152722 -413633 -182692 -456261 -547257 -395359 -504421 -753328
36665 -753328 -538185 -71371 -203670 -803442 -717386 239443 649587 -398596 -1757389
36656 -1757389 -1771686 -512993 610698 881654 805006 901619 1002809 813353 460618 297148
36646 297148 507561 944743 1168515 810242 96327 -258032 86132 655504 869728 800970
$$ packed form
36714g74050J79800n8812n45390m91672L44611R42830N69991N5903L25765O45173
36704A194149j31516j307827j161622K77155J103734L38789q04313r01253j62310
36695a555014L66792L70097K63983L16517M11432L42311J8876l64689l80614M2538
36685a67771L10033J807l30000n099N21227L05169m47975o65963k25430o8368
36675g72370m08335l45287L73270P39089K30941k73569r0996J51898j09062k48907
36665g53328K15143M66814j32299n99772Q6056R56829M10144j048183j358793
36656a757389j4297J258693J123691K70956p6648R6613J01190j89456l52735j63470
36646B97148K10413M37182K23772l58273p13915l54359L44164N69372K14224o8758
$$ plain form
36636 800970 847197 1009596 989692 770050 601638 542049 445737 339417 415283 658591
36626 658591 780052 547815 31543 -459543 -639996 -581312 -750973 -1433990 -2151897 -2118380
36616 -2118380 -1334792 -661235 -608594 -695794 -346765 220124 483751 404216 144956 -404475
36606 -404475 -1130430 -1264343 -321491 908067 1238091 707672 351478 500975 428074 -183747
36596 -183747 -523333 95565 1086248 1339719 650148 -178452 -397835 -56403 211554 -114825
36586 -114825 -885116 -1353215 -952531 32652 792749 909193 637518 379730 299012 428443
36576 428443 703054 837343 581689 127304 -143054 -258493 -514628 -780017 -597752 -50701
36566 -50701 200445 -4447 89318 1051726 2311660 2819758 2293939 1337534 620717 406058
$$ packed form
36636H00970M6227J62399j9904k19642j68412n9589r6312j06320P5866K43308
36626F58591J21461k32237n16272m91086j80453N8684j69661o83017p17907L3517
36616b118380P83588O73557N2641q7200L49029N66889K63627p9535k59260n49431
36606d04475p25955j33913R42852J229558L30024n30419l56194J49497p2901o11821
36596a83747l39586O18898R90683K53471o89571q28600k19383L41432K67957l26379
36586a14825p70291m68099M00684R85183P60097J16444k71675k57788q0718J29431
36576D28443K74611J34289k55654m54385k70358j15439k56135k65389J82265N47051
36566e0701K51146k04892R3765R62408J259934N08098n25819r56405p16817k14659
$$ plain form
36556 406058 670333 1226771 1742274 1899139 1569491 839201 44896 -273356 153872 852707
36546 852707 1038259 593728 125918 -39445 -272761 -806689 -1175532 -934907 -374372 -19344
36536 -19344 83647 108091 2369 -161967 39986 609248 665255 -413472 -1839352 -2344661
36526 -2344661 -1926383 -1600211 -1595297 -1044911 321843 1390560 1182691 302442 91007
36517 91007 836250 1561119 1370630 396866 -568180 -950208 -829559 -725267 -1014966 -1535378
36507 -1535378 -1808478 -1639304 -1325580 -1254022 -1463948 -1651643 -1464468 -792881 76365 631049
36497 631049 625816 347436 226758 325749 447609 569245 791897 980612 879989 546557
36487 546557 253112 2699 -411384 -878699 -1013192 -784081 -604948 -683740 -767880 -653606
$$ packed form
36556D06058K64275N56438N15503J56865l29648p30290p94305l18252M27228O98835
36546H52707J85552m44531m67810j65363k33316n33928l68843K40625N60535L55028
36536a9344J02991K4444j05722j64336K01953N69262N6007j078727j425880n05309
36526b344661M18278L26172M914N50386J366754J068717k07869q80249k11435
36517I1007P45243P24869j90489r73764r65046l82028J20649J04292k89699n20412
36507a535378k73100J69174L13724P1558k09926j87695J87175O71587Q69246N54684
36497F31049n233k78380j20678R8991J21860J21636K22652J88715j00623l33432
36487E46557k93445k50413m14083m67315j34493K29111J79133p8792q4140J14274
$$ plain form
36477 -653606 -431276 -69632 668923 1629682 2136722 1833409 1180215 723666 326427 -406110
36467 -406110 -1325289 -1900108 -1912687 -1508359 -803646 47026 615238 611388 447747 839812
36457 839812 1829135 2672251 2752380 2184897 1454308 859726 450857 163804 -156956 -616568
36447 -616568 -1005192 -923494 -353939 109323 -130846 -909563 -1406382 -1089414 -360631 -66185
36437 -66185 -448393 -882343 -732799 -116445 474772 955604 1498909 1805203 1303142 208180
36427 208180 -410675 -37136 484040 125040 -878143 -1472200 -1291541 -893919 -678934
36418 -678934 -437296 -40091 186970 2333 -412970 -849554 -1268614 -1418844 -841681 394290
36408 394290 1439401 1565022 999641 495434 366033 386700 432587 700590 1274030 1848106
$$ packed form
36477f53606K22330L61644P38555R60759N07040l03313o53194m56549l97239p32537
36467d06110r19179n74819j2579M04328P04713Q50672N68212l850j63641L92065
36457H39812R89323Q43116Q0129n67483p30589n94582m08869k87053l20760m59612
36447f16568l88624Q1698N69555M63262k40169p78717m96819L16968P28783K94446
36437f6185l82208m33950J49544O16354N91217M80832N43305L06294n02061j094962
36427B08180o18855L73539N21176l59000j003183n94057J80659L97622K14985
36418f78934K41638L97205K27061j84637m15303m36584m19060j50230N77163J235971
36408C94290J045111J25621n65381n04207j29401K0667M5887K68003N73440N74076
$$ plain form
36398 1848106 2036738 1786218 1398104 1219592 1331514 1486356 1353837 846371 172623
36389 172623 -405944 -763468 -856952 -661224 -267154 67283 125858 5317 71170 538769
36379 538769 1084600 1022183 74929 -1065112 -1285720 -318671 858550 1161869 644936
36370 644936 196233 248433 389597 208467 -132344 -345760 -472204 -583301 -512400 -252571
36360 -252571 -211034 -607623 -940285 -596055 182669 525348 107991 -473288 -645954 -638798
36350 -638798 -963736 -1505105 -1643724 -1180116 -625171 -454586 -491362 -304168 81003 257351
36340 257351 73258 -234825 -495285 -720878 -746255 -309480 305091 318693 -418444 -918975
36330 -918975 -325245 741787 931625 42312 -789538 -790621 -441692 -352215 -195382 567263
$$ packed form
36398A848106J88632k50520l88114j78512J11922J54842j32519n07466o73748
36389A72623n78567l57524r3484J95728L94070L34437N8575j20541O5853M67599
36379E38769N45831o2417r47254j140041k20608R67049J177221L03319n16933
36370F44936m48703N2200J41164j81130l40811k13416j26444j11097P0901K59829
36360b52571M1537l96589l32662L44230P78724L42679m17357n81279j72666P156
36350f38798l24938n41369j38619M63608N54945J70585l6776J87194L85171J76348
36340B57351j84093l08083k60460k25593k5377M36775O14571J3602p37137n00531
36330i18975N93730J067032J89838q89313q31850j083L48929Q9477J56833P62645
$$ plain form
36320 567263 1558152 1911117 1532733 1165967 1218645 1161266 302516 -1177367 -2228453 -1955817
36310 -1955817 -594919 625924 735666 45719 -333429 102892 784243 1010716 772460
36301 772460 389294 -88735 -688383 -1152366 -1256611 -1196776 -1243186 -1299043 -1194804 -1075535
36291 -1075535 -1019141 -615405 466589 1711814 2201201 1741155 988266 507182 274730
36282 274730 125034 101470 195316 150748 -268933 -1014027 -1760634 -2031423 -1478397 -323198
36272 -323198 691702 1110019 1235232 1412518 1275401 386702 -712568 -993615 -373030
36263 -373030 258418 449192 637596 997093 874011 -121476 -1307380 -1821439 -1666282
36254 -1666282 -1289094 -748414 33516 712762 947633 1012428 1304502 1542612 1137343 140032
$$ packed form
36320E67263R90889L52965l78384l66766N2678n7379q58750j479883j051086K72636
36310a955817J360898J220843J09742o89947l79148M36321O81351K26473k38256
36301G72460l83166m78029n99648m63983j04245N9835m6410n5857J04239J19269
36291a075535N6394M03736J081994J245225M89387m60046p52889m81084k32452
36282B74730j49696k3564R3846m4568m19681p45094p46607k70789N53026J155199
36272c23198J014900M18317J25213J77286j37117q88699j099270k81047O20585
36263c73030O31448J90774J88404L59497j23082r95487j185904n14059J55157
36254a666282L77188N40680P81930O79246K34871O4795K92074K38110m05269r97311
$$ plain form
36244 140032 -827773 -1431189 -1801809 -2003444 -1926471 -1643282 -1334800 -951165 -433181 -82848
36234 -82848 -130329 -147019 377862 1026987 904431 96013 -317634 63310 314327 -266392
36224 -266392 -958624 -801689 -194125 -230789 -895190 -1100846 -438321 266478 329121 98650
36214 98650 53649 -71589 -601900 -1066392 -831271 -146622 248315 285909 502182 942196
36204 942196 1023343 589056 264062 470342 798262 737303 413901 163861 -53359 -285539
36194 -285539 -161187 513848 1135734 997667 329447 -87470 -119789 -272108 -576073 -419042
36184 -419042 352841 1010921 977271 594280 442913 464778 242347 -267989 -741669 -931751
36174 -931751 -772366 -346168 -29105 -284523 -982085 -1316362 -788451 105328 566427 475332
$$ packed form
36244A40032r67805o03416l70620k01635P6973K83189L08482L83635N17984L50333
36234h2848m7481j6690N24881O49125j22556q08418m13647L80944K51017n80719
36224b66392o92232J56935O07564l6664o64401k05656O62525P04799O2643k30471
36214I8650m5001j25238n30311m64492K35121O84649L94937L7594K16273M40014
36204I42196Q1147m34287l24994K06280L27920o0959l23402k50040k17220k32180
36194b85539J24352O75035O21886j38067o68220m16917l2319j52319l03965J57031
36184d19042P71883O58080l3650l82991j51367K1865k22431n10336m73680j90082
36174i31751J59385M26198L17063k55418o97562l34277N27911Q93779M61099r1095
$$ plain form
36164 475332 209026 -103767 -521580 -793357 -626414 -290843 -271098 -408937 -111226 582362
36154 582362 881814 350373 -542631 -1172131 -1387017 -1118867 -124668 1324562 2130226
36145 2130226 1534104 269584 -261813 180600 517028 72587 -447145 -117815 827158
36136 827158 1475234 1594910 1663337 1734334 1220334 -12315 -1124836 -1298160 -688492 15345
36126 15345 470167 640139 394834 -215321 -658610 -580757 -458903 -874713 -1449338 -1403353
36116 -1403353 -964558 -1120482 -1938793 -2310677 -1661782 -766170 -352793 -33697 629570
36107 629570 1044016 604778 -8998 252530 1111006 1363527 683849 -136736 -592874 -932098
36097 -932098 -1150794 -645147 774138 2323447 3082495 2866450 2094764 1314707 952429
$$ packed form
36164D75332k66306l12793m17813k71777J66943L35571J9745j37839K97711O93588
36154E82362K99452n31441q93004o29500k14886K68150R94199J449230Q05664
36145B130226n96122j264520n31397M42413L36428m44441n19732L29330R44973
36136H27158O48076J19676O8427P0997n14000j232649j112521j73324O09668P03837
36126A5345M54822J69972k45305o10155m43289P7853J21854m15810n74625M5985
36116a403353M38795j55924q18311l71884O48895Q95612M13377L19096O63267
36107F29570M14446m39238o13776K61528Q58476K52521o79678q20585m56138l39224
36097i32098k18696N05647J419285J549309P59048k16045p71686p80057l62278
$$ plain form
36088 952429 1011645 966382 446264 -77591 62881 556133 464698 -237255 -489626 246886
36078 246886 1195045 1497624 1336279 1240243 1099341 609016 77905 -19633 88027 -210671
36068 -210671 -947127 -1532266 -1505201 -840141 266039 1413408 1999189 1703763 896659
36059 896659 209765 -133772 -262440 -226801 -74401 -105762 -514645 -881987 -550908 482850
36049 482850 1475870 1768855 1375059 734841 241653 86685 261696 547631 648593 461477
36039 461477 179669 108721 381977 801780 961512 635344 54722 -340451 -415765 -419080
36029 -419080 -554249 -725334 -741320 -538475 -173827 169644 212551 -80150 -264069 66133
36019 66133 590145 617540 96625 -388980 -681894 -1287123 -2266282 -2748963 -2101949 -904174
$$ packed form
36088I52429N9216m5263n20118n23855J40472M93252r1435p01953k52371P36512
36078B46886R48159L02579j61345r6036j40902m90325n31111r7538J07660k98698
36068b10671p36456n85139K7065O65060J106180J147369N85781k95426q07104
36059H96659o86894l43537j28668L5639J52400l1361m08883l67342L31079J033758
36049D82850R93020K92985l93796o40218m93188j54968J75011K85935J00962j87116
36039D61477k81808p0948K73256M19803J59732l26168n80622l95173p5314l315
36029d19080j35169j71085j5986K02845L64648L43471M2907k92701j83919L30202
36019F6133N24012K7395n20915m85605k92914o05229r79159m82681O47014J197775
$$ plain form
36009 -904174 -118926 148739 415713 853998 1273739 1647034 1916901 1660183 715532 -173034
35999 -173034 -177483 366998 401446 -270991 -707781 -186980 930521 1827582 2055784 1602876
35989 1602876 747221 15256 -206502 -123574 -185875 -352047 -242735 60858 85677 -102398
35979 -102398 210332 1298530 2415640 2636691 1857708 717327 -91442 -257838 17993
35970 17993 194612 12860 -78638 415778 1046616 802696 -406795 -1415816 -1251416 -254832
35960 -254832 612915 950370 926861 668339 229244 -144902 -241541 -183025 -174966 -191366 -166062
35949 -166062 -177525 -189637 -1240 255818 43438 -738127 -1297829 -911804 12445 449733
35939 449733 100180 -424539 -625538 -649270 -755299 -868964 -865087 -839497 -848296 -693340 -214094
$$ packed form
36009i04174P85248K67665K66974M38285M19741L73295K69867k56718r44651q88566
35999a73034m449N44481L4448o72437m36790N20801J117501Q97061K28202m52908
35989A602876q55655p31965k21758Q2928o2301j66172J09312L03593K4819j88075
35979a02398L12730J088198J117110K21051p78983j140381q08769j66396K75831
35970A7993J76619j81752r1498M94416O30838k43920j209491j009021J64400R96584
35960b54832Q67747L37455k3509k58522m39095l74146r6639N8516Q059j6400K5304
35949a66062j1463j2112J88397K57058k12380p81565n59702L86025R24249M37288
35939D49733l49553n24719k00999k3732j06029j13665L877K5590q799J54956M79246
$$ plain form
35928 -214094 401070 791143 795029 533209 238726 112660 232843 470935 557059 361032
35918 361032 109560 195470 695593 1169383 1080816 403579 -348898 -705063 -650432 -423171
35908 -423171 -172665 23379 76773 67830 271446 735989 1081886 1032014 869333 976370
35898 976370 1210992 1240954 1214015 1435255 1559723 895946 -458404 -1539589 -1740374 -1454939
35888 -1454939 -1311828 -1373414 -1326749 -949205 -217363 557973 682372 -196777 -1303015 -1463847
35878 -1463847 -707507 -203994 -459441 -681956 -316521 20975 -170049 -240699 396743 1077682
35868 1077682 1073171 1062860 2027457 3318569 3375787 2072812 857330 614360 808921 864774
35858 864774 994138 1274776 1146098 431951 -89622 206995 823078 875647 281561 -337218
$$ packed form
35928b14094O15164L90073L886k61820k94483j26066J20183K38092Q6124j96027
35918C61032k51472Q5910N00123M73790q8567o77237p52477l56165N4631K27261
35908d23171K50506J96044N3394q943K03616M64543L45897m9872j62681J07037
35898I76370K34622K9962k6939K21240J24468o63777j354350j081185k00785K85435
35888a454939J43111o1586M6665L77544P31842P75336J24399q79149j106238j60832
35878a463847P56340N03513k55447k22515L65435L37496j91024p0650O37442O80939
35868A077682m511j0311R64597J291112N7218j302975j215482k42970J94561N5853
35858H64774J29364K80638j28678p14147n21573K96617O16083N2569n94086o18779
$$ plain form
35848 -337218 -547743 -439984 -286858 -178093 86219 729411 1457058 1464846 476347 -514907
35838 -514907 -307105 829895 1440918 916889 257081 474904 1154696 1174075 218447 -1027719
35828 -1027719 -1786535 -1795312 -1304840 -819431 -628637 -497498 -147584 57899 -430751 -1229110
35818 -1229110 -1276709 -465847 -13160 -672108 -1526722 -1370482 -507302 -172605 -663175 -1117612
35808 -1117612 -959160 -556154 -385665 -345399 -112917 339211 764698 846243 347583 -621719
35798 -621719 -1507950 -1764262 -1372413 -729785 -181155 118202 117806 -45973 -95384 -10476
35788 -10476 -119700 -527123 -814121 -656424 -314631 -73080 316452 1017338 1423839 934453
35778 934453 65558 -204346 -54766 -667531 -2304705 -3654575 -3567009 -2520723 -1723970
$$ packed form
35848c37218k10525J07759J53126J08765K64312O43192P27647P788r88499r91254
35838e14907K07802J137000O11023n24029o59808K17823O79792J9379r55628j246166
35828a027719p58816q777M90472M85409J90794J31139L49914K05483m88650p98359
35818a229110m7599Q10862M52687o58948q54614J56240Q63180L34697m90570m54437
35808a117612J58452M03006J70489M0266K32482M52128M25487Q1545m98660r69302
35798f21719q86231k56312L91849O42628N48630K99357l96j63779m9411Q4908
35788a0476j09224m07423k86998J57697L41793K41551L89532P00886M06501m89386
35778I34453q68895k69904J49580o12765j637174j349870Q7566J046286P96753
$$ plain form
35769 -1723970 -1513232 -1450452 -1462168 -1895401 -2576540 -2701332 -1858541 -598498 220703 244923
35759 244923 -353839 -1213713 -1874117 -1906940 -1341349 -743318 -511920 -307218 350522 1083163
35749 1083163 979602 52677 -440045 329382 1430689 1369588 195039 -655715 -528011
35740 -528011 -366660 -1028621 -1904360 -1954622 -1285728 -775481 -675078 -552792 -322259 -343158
35730 -343158 -550234 -374709 309954 866481 757743 232034 -63450 205196 847526 1345068
35720 1345068 1225945 527402 -157908 -364309 -303446 -373377 -400034 51180 795387 1165202
35710 1165202 1001380 812917 890944 953328 808497 694357 730707 654927 375251 228218
35700 228218 394414 554220 398502 36632 -301538 -488283 -278471 535562 1540993
$$ packed form
35769a723970K10738O2780j1716m33233o81139j24792Q42791J260043Q19201K4220
35759B44923n98762q59874o60404l2823N65591N98031K31398K04702O57740P32641
35749A083163j03561r26925m92722P69427J101307o1101j174549q50754J27704
35740e28011J61351o61961q75739n0262O68894N10247J00403J22286K30533k0899
35730c43158k07076J75525O84663N56527j08738n25709k95484K68646O42330M97542
35720A345068j19123o98543o85310k06401O0863o9931k6657M51214P44207L69815
35710A165202j63822j88463P8027O2384j44831j14140L6350p5780k79676j47033
35700B28218J66196J59806j55718l61870l38170j86745K09812Q14033J005431
$$ plain form
35691 1540993 1922113 1546096 1188780 1377950 1723981 1771554 1720710 1775244 1579305 990767
35681 990767 662620 1038347 1456598 1178088 649236 649722 752041 -32980 -1369329 -1793458
35671 -1793458 -849118 296414 601751 308972 35810 -102092 -4880 624813 1385527
35662 1385527 1135988 -367703 -1737853 -1748016 -1006179 -804820 -1067889 -750200 162750
35653 162750 502277 -217495 -1050548 -1032142 -325917 418770 977306 1338061 1303900 862360
35643 862360 436318 276429 67490 -381321 -527732 208377 1456719 2240310 2145230 1578017
35633 1578017 994033 500049 213542 354635 774880 910590 481833 -145412 -539425
35624 -539425 -767543 -1088377 -1434866 -1585381 -1591459 -1644771 -1733438 -1831529 -2188063 -2883543
$$ packed form
35691A540993L81120l76017l57316J89170L46031M7573n0844N4534j95939n88538
35681I90767l28147L75727M18251k78510n28852M86J02319p85021j336349m24129
35671a793458R44340J145532L05337k92779k73162j37902R7212O29693P60714
35662A385527k49539j503691j370150j0163P41837K01359k63069L17689R12950
35653A62750L39527p19772q33053J8406P06225P44687N58536L60755l4161m41540
35643H62360m26042j59889k08939m48811j46411P36109J248342P83591r5080n67213
35633A578017n83984m93984k86507J41093M20245J35710m28757o27245l94013
35624e39425k28118l20834l46489j50515o078n3312q8667r8091l56534o95480
$$ plain form
35614 -2883543 -3252923 -2452112 -703271 685332 828720 244993 -26758 247177 570997
35605 570997 694197 817492 985975 953023 717392 672928 1055235 1567653 1675271 1081600
35595 1081600 -21611 -939343 -898917 118486 1162042 1402107 1184462 1325207 1626863
35586 1626863 1140645 -74798 -722739 -255574 140659 -615525 -1766591 -1960644 -1340641
35577 -1340641 -978963 -868453 -172855 755618 473894 -1130220 -2259425 -1778734 -854720
35568 -854720 -1007279 -1802012 -1789918 -835900 -76308 -77453 -415515 -821989 -1422349 -1879424
35558 -1879424 -1551464 -689122 -397337 -1094257 -1890613 -1815264 -894996 238284 1045601
35549 1045601 1131905 419905 -386314 -333566 368999 335785 -1018783 -2350568 -2061328 -416707
$$ packed form
35614b883543l69380Q00811J748841J388603J43388n83727k71751K73935L23820
35605E70997J23200J23295J68483l2952k35631m4464L82307N12418J07618n93671
35595A081600j103211r17732M0426J017403J043556K40065k17645J40745L01656
35586A626863m86218j215443o47941M67165L96233p56184j151066j94053O20003
35577a340641L61678J10510O95598R28473k81724j604114j129205M80691R24014
35568h54720j52559p94733J2094R54018P59592j145l38062m06474o00360m57075
35558a879424L27960Q62342K91785o96920p96356P5349R20268J133280Q07317
35549A045601Q6304p12000q06219N2748P02565l3214j354568j331785K89240J644621
$$ plain form
35539 -416707 989537 1395219 1385770 1479353 1382855 845197 282832 136499 255858 317032
35529 317032 342412 419214 325951 -116877 -584533 -567807 -72499 320850 116689 -553652
35519 -553652 -1088838 -1055029 -652350 -521723 -1052328 -1949933 -2562951 -2516100 -1901137 -1035290
35509 -1035290 -303233 -94959 -504372 -1060778 -1092233 -441321 418345 967696 1020672 537631
35499 537631 -448251 -1531357 -2024496 -1702660 -1130727 -888633 -798113 -405919 46435 -147154
35489 -147154 -954459 -1399513 -901777 -202586 -387281 -1392949 -2191476 -2250740 -1995635 -1779657
35479 -1779657 -1316754 -537578 -159619 -644864 -1202598 -811697 114372 218572 -709282
35470 -709282 -1379421 -1035702 -598346 -1081699 -1936922 -1972523 -1152112 -343691 175160 725454
$$ packed form
35539d16707J406244M05682r449R3583r6498n37658n62365j46333J19359O1174
35529C17032K5380P6802r3263m42828m67656J6726M95308L93349k04161o70341
35519e53652n35186L3809M02679J30627n30605q97605o13018M6851O14963Q65847
35509a035290P32057K08274m09413n56406l1455O50912Q59666N49351N2976m83041
35499E37631r85882j083106m93139L21836N71933K42094R0520L92194M52354j93589
35489a47154q07305m45054M97736O99191j84695j005668p98527n9264K55105K15978
35479a779657M62903P79176L77959m85245n57734L90901R26069J04200r27854
35470g09282o70139L43719M37356m83353q55223l5601Q20411Q08421N18851N50294
$$ plain form
35460 725454 1071100 605230 -318956 -563335 30703 275135 -498550 -1318763 -1007434 161707
35450 161707 1023558 1049592 521610 -255960 -1070629 -1499205 -1284147 -806311 -575041 -517167
35440 -517167 -341271 -227166 -446284 -646798 -352950 71399 -105834 -651668 -519694 541955
35430 541955 1518668 1593298 1194092 1086451 1180348 899407 200689 -469634 -907015 -1192693
35420 -1192693 -1222401 -808615 -174078 202342 253644 392072 842644 1280283 1251808 716327
35410 716327 80543 -157194 170365 661628 641786 -51242 -718569 -613022 12116 202494
35400 202494 -311986 -688085 -242442 460895 401725 -411172 -1008803 -905275 -691025 -1017470
35390 -1017470 -1651518 -1891295 -1459891 -628067 181477 566557 277271 -431375 -867372
$$ packed form
35460G25454L45646m65870r24186k44379N94038K44432p73685q20213L11329J169141
35450A61707Q61851K6034n27982p77570q14669m28576K15058M77836K31270N7874
35440e17167J75896J14105k19118k00514K93848M24349j77233n45834J31974J061649
35430E41955R76713P4630l99206j07641R3897k80941o98718o70323m37381k85678
35420a192693k9708M13786O34537L76420N1302J38428M50572M37639k8475n35481
35410G16327o35784k37737L27559M91263j9842o93028o67327J05547O25138J90378
35400B02494n14480l76099M45643P03337n9170q12897n97631J03528K14250l26445
35390a017470o34048k39777M31404Q31824Q09544L85080k89286p08646m35997
$$ plain form
35381 -867372 -691892 -335774 -257936 -215430 167782 523908 229989 -465541 -706723 -355825
35371 -355825 -97897 -137275 156808 965036 1424183 928112 116823 -209637 -376381 -1075266
35361 -1075266 -1934466 -1981609 -1242038 -757247 -1051190 -1576783 -1756901 -1618595 -1194679 -234140
35351 -234140 1053889 1704790 1027512 -461638 -1552411 -1530225 -637561 316731 601430
35342 601430 136565 -403686 -333026 195406 494459 427945 492693 717927 372801 -781844
35332 -781844 -1784512 -1743211 -1167152 -1141170 -1632982 -1659355 -928502 -196562 105847 493770
35322 493770 1265617 1723060 1296470 714552 1070845 2091483 2397752 1496148 464836
35313 464836 301897 535420 218600 -389896 -245235 587471 671049 -787173 -2607554
$$ packed form
35381h67372J75480L56118P7838M2506L83212L56126k93919o95530k41182L50898
35371c55825K57928l9378K94083Q08228M59147m96071q11289l26460j66744o98885
35361a075266q59200m7143P39571M84791k93943n25593j80118J38306M23916R60539
35351b34140J288029O50901o77278j489150j090773K2186Q92664R54292K84699
35342F01430m64865n40251P0660N28432K99053o6514O4748K25234l45126j154645
35332g81844j002668M1301N76059K5982m91812k6373P30853P31940L02409L87923
35322D93770P71847M57443m26590n81918L56293J020638L06269r01604j031312
35313D64836j62939K33523l16820o08496J44661Q32706Q3578j458222j820381
$$ plain form
35304 -2607554 -3038829 -1888212 -456323 276695 495695 674180 776659 607687 293959
35295 293959 41216 -167303 -341134 -338030 -228783 -419892 -1048728 -1544912 -1194740 -6617
35285 -6617 1285802 1973644 1889298 1305889 592313 -48189 -642477 -1248319 -1719726 -1852862
35275 -1852862 -1751018 -1736283 -1831577 -1703019 -1274960 -984985 -1130411 -1339306 -1107222 -588699
35265 -588699 -387672 -709976 -1166712 -1334001 -1082500 -401513 632647 1621972 1993717
35256 1993717 1606840 973516 663606 630036 346158 -401786 -1062608 -844734 308589
35247 308589 1499519 1825618 1364571 870663 624641 132431 -946711 -2181197 -3000857
35238 -3000857 -3425283 -3695573 -3621383 -2904032 -1847636 -1120269 -916844 -900171 -857444 -841096
$$ packed form
35304b607554m31275J150617J431889P33018K19000J78485J02479j68972l13728
35295B93959k52743k08519j73831L104J09247j91109o28836m96184L50172J188123
35285f617J292419O87842q4346n83409p13576o40502n94288o05842m71407j33136
35275a852862J01844J4735r5294J28558M28059K89975j45426k08895K32084N18523
35265e88699K01027l22304m56736j67289K51501O80987J034160R89325L71745
35256A993717l86877o33324l09910l3570k83878p47944o60822K17874J153323
35247C08589J190930L26099m61047m93908k46022m92210j079142j234486q19660
35238c000857m24426k70290P4190P17351J056396P27367K03425J6673M2727J6348
$$ plain form
35228 -841096 -743736 -386746 -64144 -323160 -1035271 -1337454 -807944 -120559 -86940 -508469
35218 -508469 -542666 51081 630970 601477 93858 -433456 -863531 -1358955 -1825682 -1868268
35208 -1868268 -1381218 -826395 -602154 -378414 422488 1533155 1911301 1177195 324471
35199 324471 419827 1068938 929172 -483036 -2254895 -3253840 -3105345 -2035427 -569972
35190 -569972 441196 286038 -765163 -1634773 -1714589 -1414725 -1259290 -1156906 -911034
35181 -911034 -718166 -670261 -442380 -29576 -90268 -843922 -1303322 -539175 788822 1215528
35171 1215528 480062 -344708 -576951 -588125 -651741 -356105 401690 880423 594623 158684
35161 158684 352979 980720 1350759 1354465 1295923 1084053 470885 -116931 124602 1201619
$$ packed form
35228h41096R7360L56990L22602k59016p12111l02183N29510O87385L3619m21529
35218e08469l4197N93747N79889k9493n07619n27314m30075m95424m66727m2586
35208a868268M87050N54823K24241K23740Q00902J110667L78146p34106q52724
35199C24471R5356O49111j39766j412208j771859r98945J48495J069918J465455
35190e69972J011168j55158j051201q69610p9816K99864J55435J02384K45872
35181i11034J92868M7905K27881M12804o0692p53654m59400P64147J327997M26706
35171A215528p35466q24770k32243j1174o3616K95636P57795M78733k85800m35939
35161A58684J94295O27741L70039L706n8542k11870o13168n87816K41533J077017
$$ [...]
##END NTUPLES=NMR SPECTRUM
##END=
