##TITLE=31Pdec_ABPA2401X
 CDCl3, 64 sc
 25.1.2023
##JCAMPDX= 6.0         $$ Bruker NMR JCAMP-DX V2.0
##DATA TYPE= NMR SPECTRUM
##DATA CLASS= NTUPLES
##ORIGIN= UXNMR, Bruker Analytische Messtechnik GmbH
##OWNER= root
$$ XWIN-NMR		Version 3.5
$$ Wed Jan 25 14:40:12 2023 Russian Standard Time (UT+4h)  she@DPX200
##.OBSERVE FREQUENCY= 81.013821
##.OBSERVE NUCLEUS= ^31P
##.ACQUISITION MODE= SIMULTANEOUS
##.ACQUISITION SCHEME= undefined
##.AVERAGES= 64
##.DIGITISER RES= 16
##SPECTROMETER/DATA SYSTEM= spect
##.PULSE SEQUENCE= zgpg30
##.SOLVENT NAME= CDCl3
##.SHIFT REFERENCE= (INTERNAL, CDCl3, 0, 248.564)
##AUDIT TRAIL= $$ (NUMBER, WHEN, WHO, WHERE, WHAT)
$$ ##TITLE= Audit trail, XWIN-NMR		Version 3.5
$$ ##JCAMPDX= 5.01
$$ ##ORIGIN= Bruker BioSpin GmbH
$$ ##OWNER= she
$$ F:/spectra/data/she/nmr/P31/1/pdata/1/auditp.txt
$$ ##AUDIT TRAIL=  $$ (NUMBER, WHEN, WHO, WHERE, WHAT)
(   1,<2023-01-25 14:39:20.84 +0400>,<she>,<DPX200>,
      <continue with go, POWCHK disabled, PULCHK disabled
       configuration hash MD5:
       00 E9 B6 7A A2 85 ED C7 34 08 36 98 17 FE 4E 26
       data hash MD5: 32K
       62 3D 52 87 32 68 96 0A A0 CE 9E 47 AD 0D 94 0D>)
(   2,<2023-01-25 14:39:26.09 +0400>,<she>,<DPX200>,
      <Start of raw data processing
       efp BC_mod = 2 LB = 1 FT_mod = 6 PKNL = 1 PHC0 = -11026.66 PHC1 = 206.2578 SI = 64K 
       data hash MD5: 64K
       EB C4 8C 0A 3F EE A3 23 1A 1C 77 6E B4 A6 BA B2>)
(   3,<2023-01-25 14:39:42.70 +0400>,<she>,<DPX200>,
      <pk PHC0 = 3.79965 PHC1 = -17.4 
       data hash MD5: 64K
       C1 42 FD 25 F9 DF 25 B5 65 9A 15 1D F9 1F 51 89>)
(   4,<2023-01-25 14:39:48.17 +0400>,<she>,<DPX200>,
      <abs ABSG = 5 
       data hash MD5: 64K
       5F 73 8F B4 F7 89 79 CE DD D7 C3 F0 BD 6A 7B BA>)
$$ ##END=
$$ 
$$ hash MD5
$$ B1 97 75 3E 3D 89 7C EF 17 70 76 24 EE 02 7F CF
##$RELAX= 
##$RELAX= 
##$RELAX= 
##$RELAX= 
##$RELAX= 
##$RELAX= 
##$RELAX= 
##$RELAX= 
##$RELAX= 
$$ Bruker specific parameters
$$ --------------------------
##$DU= <F:/spectra>
##$EXPNO= 1
##$NAME= <P31>
##$PROCNO= 1
##$TYPE= <nmr>
##$USER= <she>
##$AMP= (0..31)
100 100 100 100 100 100 100 100 100 100 100 100 100 100 100 100 100 100 
100 100 100 100 100 100 100 100 100 100 100 100 100 100 
##$AQSEQ= 0
##$AQ_mod= 1
##$AUNM= <au_zg>
##$AUTOPOS= <>
##$BF1= 81.014009
##$BF2= 200.13
##$BF3= 200.13
##$BF4= 200.13
##$BF5= 200.13
##$BF6= 200.13
##$BF7= 200.13
##$BF8= 200.13
##$BYTORDA= 1
##$CFDGTYP= 0
##$CFRGTYP= 5
##$CHEMSTR= <none>
##$CNST= (0..31)
1 1 145 1 1 1 1 1 1 1 1 1 1 1 1 1 1 1 1 1 1 1 1 1 1 1 1 1 1 1 1 1 
##$CPDPRG= <waltz16>
##$CPDPRG1= <>
##$CPDPRG2= <waltz16>
##$CPDPRG3= <>
##$CPDPRG4= <mlev>
##$CPDPRG5= <mlev>
##$CPDPRG6= <mlev>
##$CPDPRG7= <mlev>
##$CPDPRG8= <mlev>
##$CPDPRGB= <>
##$CPDPRGT= <>
##$D= (0..31)
0 1 0 0 0 0 0 0 0 0 0 0.03 2e-05 3e-06 0 0 0 0 0 0 0 0 0 0 0 0 0 0 0 0 
0 0 
##$DATE= 1674643083
##$DBL= (0..7)
120 120 120 11 120 120 24 19 
##$DBP= (0..7)
150 150 150 150 150 150 150 150 
##$DBP07= 0
##$DBPNAM0= <>
##$DBPNAM1= <>
$$ [...]
##$SUBNAM3= <"">
##$SUBNAM4= <"">
##$SUBNAM5= <"">
##$SUBNAM6= <"">
##$SUBNAM7= <"">
##$SUBNAM8= <"">
##$SUBNAM9= <"">
##$SW= 501.771253377433
##$SWIBOX= (0..15)
0 1 3 0 0 0 0 0 0 0 0 0 0 0 0 0 
##$SW_h= 40650.406504065
##$TD= 32768
##$TD0= 1
##$TE= 0
##$TE2= 300
##$TE3= 300
##$TEG= 300
##$TL= (0..7)
0 120 53 12 22 120 120 120 
##$TP= (0..7)
150 150 150 150 150 150 150 150 
##$TP07= 0
##$TPNAME0= <>
##$TPNAME1= <>
##$TPNAME2= <>
##$TPNAME3= <>
##$TPNAME4= <>
##$TPNAME5= <>
##$TPNAME6= <>
##$TPNAME7= <>
##$TPOAL= (0..7)
0.5 0.5 0.5 0.5 0.5 0.5 0.5 0.5 
##$TPOFFS= (0..7)
0 0 0 0 0 0 0 0 
##$TUNHIN= 0
##$TUNHOUT= 0
##$TUNXOUT= 0
##$USERA1= <user>
##$USERA2= <user>
##$USERA3= <user>
##$USERA4= <user>
##$USERA5= <user>
##$V9= 5
##$VALIST= <valist>
##$VCLIST= <CCCCCCCCCCCCCCC>
##$VD= 0
##$VDLIST= <DDDDDDDDDDDDDDD>
##$VPLIST= <PPPPPPPPPPPPPPP>
##$VTLIST= <TTTTTTTTTTTTTTT>
##$WBST= 1024
##$WBSW= 4
##$XGAIN= (0..3)
0 0 0 0 
##$XL= 0
##$YL= 0
##$YMAX_a= 2877
##$YMIN_a= -5019
##$ZGOPTNS= <>
##$ZL1= 120
##$ZL2= 120
##$ZL3= 120
##$ZL4= 120
##$ABSF1= 248.5645
##$ABSF2= -253.2056
##$ABSG= 5
##$ABSL= 3
##$ALPHA= 0
##$AQORDER= 0
##$ASSFAC= 0
##$ASSFACI= 0
##$ASSFACX= 0
##$ASSWID= 0
##$AUNMP= <proc_1d>
##$AZFE= 0.1
##$AZFW= 0.5
##$BCFW= 0
##$BC_mod= 2
##$BYTORDP= 0
##$COROFFS= 0
##$CY= -3
##$DATMOD= 1
##$DC= 0
##$DFILT= <>
##$DTYPP= 0
##$F1P= 0
##$F2P= 0
##$FCOR= 1
##$FTSIZE= 65536
##$FT_mod= 6
##$GAMMA= 0
##$GB= 0
##$INTBC= 1
##$INTSCL= 6.047779e-11
##$ISEN= 30
##$LB= 1
##$LEV0= 0
##$LPBIN= 0
##$MAXI= 10000
##$MC2= 0
##$MEAN= 0
##$ME_mod= 0
##$MI= 50
##$NCOEF= 0
##$NC_proc= -9
##$NLEV= 6
##$NOISF1= 182.463
##$NOISF2= 159.3651
##$NSP= 0
##$NTH_PI= 0
##$NZP= 0
##$OFFSET= 248.5645
##$PC= 4
##$PHC0= -11022.86
##$PHC1= 188.8578
##$PH_mod= 1
##$PKNL= yes
##$PPARMOD= 0
##$PSCAL= 0
##$PSIGN= 0
##$REVERSE= no
##$SF= 81.0140089999694
##$SI= 65536
##$SIGF1= 159.3651
##$SIGF2= -187.1042
##$SINO= 113.3802
##$SIOLD= 16384
##$SREGLST= <1H.CDCl3>
##$SSB= 0
##$STSI= 65536
##$STSR= 0
##$SW_p= 40650.406504065
##$SYMM= 0
##$S_DEV= 0
##$TDeff= 32768
##$TDoff= 0
##$TI= <>
##$TILT= no
##$TM1= 0
##$TM2= 0
##$TOPLEV= 0
##$USERP1= <user>
##$USERP2= <user>
##$USERP3= <user>
##$USERP4= <user>
##$USERP5= <user>
##$WDW= 1
##$XDIM= 65536
##$YMAX_p= 225276765
##$YMIN_p= -313236938
$$ End of Bruker specific parameters
$$ ---------------------------------
##NTUPLES= NMR SPECTRUM
##VAR_NAME=  FREQUENCY,     SPECTRUM/REAL,   SPECTRUM/IMAG
##SYMBOL=    X,             R,               I
##VAR_TYPE=  INDEPENDENT,   DEPENDENT,       DEPENDENT
##VAR_FORM=  AFFN,          ASDF,            ASDF
##VAR_DIM=   65536,         65536,           65536
##UNITS=     HZ,            ARBITRARY UNITS, ARBITRARY UNITS
##FACTOR=    0.620285442955139, 1,           1
##FIRST=     20137.2065510682, 0,            0
##LAST=      -20513.1999529968, 0,           0
##MIN=       -20513.1999529968, -313236938,  0
##MAX=       20137.2065510682, 225276765,    0
$$ Real data points
##PAGE= N=1
##DATA TABLE= (X++(R..R)), XYDATA
$$ [...]
39618B1983070K038003Q212824p81371j0033836q773542k912130j038900j908663
39610F785455o1620N319076J0913518J3119031R916361K768651l779969p082913
39602C7897590q167373o594305q9081O966701M228695p896909j2633732M75060
39594A4186646J6856764J6242597L058281j428684O879723J0476996Q15153q746698
39586E8340778o615811N63685M221790P936347J3229702Q778677j0215648k5962560
39578E0276960k0035588j765886M485797n698959j3909870q273825L242416R740751
39570A8061796J0427616P377476J13637p744494q579232k169747L194676L850377
39562B4532105M209140N022676J067253o023982o749500q32104j05664o722703
$$ plain form
39618 21983070 24021073 32233897 31452526 21418690 12645148 9733018 8694118 6785455
39610 6785455 6723835 12042911 22956429 36075460 45991821 48760472 44980503 37897590
39602 37897590 29730217 23135912 23046831 30013532 34242227 26345318 13711586 14186646
39594 14186646 31043410 47286007 50344288 48915604 55795327 66272323 67087476 58340778
39586 58340778 51724967 52288652 56510442 64446789 77676491 86455168 76239520 50276960
39578 50276960 30241372 28475486 32961283 27262324 13352454 5078629 8321045 18061796
39570 18061796 28489412 35866888 35980525 28236031 19656799 17487052 20681728 24532105
39562 24532105 28741245 33763921 34831174 28807192 22057692 21225588 21119924 14397221
39554A4397221n385738J0300859K0537360P123736j4523875j5135409L370329
39547B0684483R747757q146193k4080717j3660604Q769711J2083598o538219j9908956
39539b1049140j0056638J0179125J8152635R910790r5016k83508N882614Q099529
39531B0740391L331603j935398k082092j39601j958399n989774n367548L29719
39523F928901L308605J12885k025970L218753J0445113J1126666P304926O494032
39515D6913911O608462j165313j4111035j6624124k834854J1577223R966466k083291
39507C8247445o862335j852462r78046q961954j1765719K33269J3720604R770874
39499C1551676q565009k0177994j4164385m97521P569544Q337042N484795l54303
$$ plain form
39554 14397221 9011483 19312342 39849702 46973438 32449563 17314154 20684483
39547 20684483 30432240 22286047 -1794670 -15455274 -6685563 5398035 -1140184 -21049140
39539 -21049140 -31105778 -20926653 -2774018 7136772 7041756 6758248 12640862 20740391
39531 20740391 24071994 22136596 20054504 19914903 17956504 11966730 6599182 6928901
39523 6928901 10237506 10350391 8324421 11543174 21988287 33114953 40419879 46913911
39515 46913911 53522373 52357060 38246025 21621901 18787047 30364270 40330736 38247445
39507 38247445 31385110 29532648 28554602 19592648 7826929 8060198 21780802 31551676
39499 31551676 22986667 2808673 -11355712 -11853233 -4283689 4053353 9538148 9183845
39491I183845o684615n645415N172962J4744417J0988796k724425j2243320j0791030
39483B001215l451049M172994J1150893J4530399Q367108n905798j6200944j3402809
39475A262009l598374k31758o499447j2280324r068824j635293k64015m774771
39467c7090797m164765N801842J3273622O949269m089493j075154J4808897K0676942
39459A5090363N667530j1252500r799724J207379P91573q897844q569664K636633
39451a3126254M789104p717382j5285099n641247O628602N657278j361003r53193
39443b7009194L322531K302895J261818Q682412J6134562J0140153l393320p041324
39435D400533P33452N914436L647843K700231N728548M566456k337564n213921
$$ plain form
39491 9183845 2499230 -3146185 2026777 16771194 27759990 25035565 12792245 2001215
39483 2001215 -1449834 2723160 13874053 28404452 36771560 30865762 14664818 1262009
39475 1262009 -2336365 -2568123 -9067570 -21347894 -30416718 -32052011 -32316026 -37090797
39467 -37090797 -41255562 -35453720 -22180098 -15230829 -19320322 -20395476 -5586579 15090363
39459 15090363 20757893 9505393 -294331 913048 1704621 -7193223 -15762887 -13126254
39451 -13126254 -8337150 -16054532 -31339631 -36980878 -30352276 -24694998 -26056001 -27009194
39443 -27009194 -23686663 -21383768 -20121950 -11439538 4695024 14835177 11441857 4400533
39435 4400533 5133985 11048421 14696264 17396495 23125043 27691499 25353935 20140014
39427B0140014Q2173N080768K773929l858464r952190j3153904r030816M070482
39419c848008J4824521R307877o634539j2483794l362786L770254p82011n337442
39411d545928q49244K640782k685116m944313N689051J5420955Q178663o031518
39403A2873332p681746j061152m630347j5449444j2357817O169424J6185352N715809
39395b36589p891525p542136l11347R39410j89627M253538Q080841K539747m723547
39386e081235m81540J1178132J4113125M731167m677710o173900m824648n491013
39378C292378m274573K230452R036937R757064N119100j27174l982765o637819
39370A4413600o747839k907144K159462K522185m094584j1096883p646139Q267668
$$ plain form
39427 20140014 20222187 25302955 28076884 24218420 14266230 1112326 -7918490 -3848008
39419 -3848008 10976513 20284390 13649851 1166057 -2196729 1573525 791514 -4545928
39411 -4545928 -5395172 -2754390 -5439506 -10383819 -4694768 10726187 18904850 12873332
39403 12873332 5191586 4130434 -499913 -15949357 -28307174 -22137750 -5952398 -236589
39395 -236589 -8128114 -15670250 -15981597 -15042187 -15231814 -10978276 -2897435 -357688 -5081235
39386 -5081235 -5562775 5615357 19728482 24459649 19781939 13608039 8783391 3292378
39378 3292378 -982195 1248257 10285194 20042258 25161358 25034184 21051419 14413600
39370 14413600 7665761 4758617 6918079 9440264 5345680 -5751203 -13397342 -5129674
39362e129674K3093306K0297688Q52952j5993989j5892183n567215J05765j077881
39354F88769q13615K704149K858912k026309n862727o093424o444042o668741
39346b1657028r84048R779123J5202448R480351m76215n918786o449201m699488
39338e722844m58545M013836K475090m461566o484035M66061N311703j241533
39330f101833j0624764r490837m63393M434772M477751Q261077J4822105J3645962
39322A8960840L269809n488865o119884k485302K368868Q931559J1482848J671211
39314C2591084j4295452j7767228l009265J3861248J7678485J1551360M285198
39307D4895430l733248j1924408j2243718l969826k129789j5267611k6507852
$$ plain form
39362 -5129674 17963632 38261320 39114272 23120283 7228100 1660885 1766650 688769
39354 688769 -124846 2579303 5438215 3411906 -2450821 -8544245 -14988287 -21657028
39346 -21657028 -22641076 -12861953 2340495 11820846 11344631 5425845 -1023356 -5722844
39338 -5722844 -6181389 -2167553 307537 -4154029 -10638064 -10172003 -4860300 -6101833
39330 -6101833 -16726597 -26217434 -26680827 -22246055 -17768304 -9507227 5314878 18960840
39322 18960840 22230649 16741784 10621900 8136598 10505466 19437025 30919873 32591084
39314 32591084 18295632 528404 -2480861 11380387 29058872 40610232 44895430
39307 44895430 41162182 29237774 16994056 13024230 10894441 -4373170 -30881022
39300c0881022j5476096R318596K0646029J0909119q14262j89114M855399L278208
39292A646857q89485O22130M727336L618749j511223l784634j964604Q27973N184994
39283H478093J2223366J4671931K534388j9661629l1096182j7646094Q638166
39276b1857961K2185752J4245159K49708m211716j796661r76100J044662Q459483
39268A7342326J0201487o143510k7634090k6715907j583794J7571438J0728718
39261f233332o065551r263814o03557N627821Q494290J2351394R159048o898851
39253F567448j9497484j0590964Q388721J2154110J136485k898977L978730M334362
39245C572431m981669o198588M650315Q038147l427189r545395K419260J4584107
$$ plain form
39300 -30881022 -46357118 -37038522 -16392493 -5483374 -6297636 -6486750 -1631351 1646857
39292 1646857 757372 1379502 6106838 9725587 8214364 4429730 2465126 3293099 8478093
39283 8478093 20701459 35373390 37907778 18246149 -12850033 -30496127 -21857961
39276 -21857961 327791 14572950 14822658 10610942 8814281 7838181 8882843 17342326
39268 17342326 27543813 21400303 -6233787 -32949694 -34533488 -16962050 -6233332
39261 -6233332 -12298883 -21562697 -22166254 -16538433 -8044143 4307251 13466299 6567448
39253 6567448 -12930036 -23521000 -15132279 -2978169 -1841684 -4740661 -761931 3572431
39245 3572431 -1409238 -7607826 -2957511 5080636 1653447 -7891948 -5472688 9111419
39237I111419Q999239k882798l031934J790804l623252j1817686n611182Q315554
39229A250164P331604r200649j6705925k887348J4366065J4081851j45598r959180
39221a869016q385979m519750o288041q821412k969018R684583J7328143J4529468
39213H688978R963434J0790165Q221787p489337k3870799j8359863O043521J9859910
39205A3847796Q545212p553749o427086L964930M570273k784499m181736j047054
39197H934087n000887j3035772j0920422J905894J1358665J1298944Q698612O830270
39189B0069391J058307p249921q714462j131954N821791L800019n666294j5764641
39181g777764j8880065r264573Q832980J9554834J2941164n35283m773465j109225
$$ plain form
39237 9111419 18110658 15227860 12195926 13986730 10363478 -1454208 -7065390 1250164
39229 1250164 8581768 -618881 -17324806 -20212154 -5846089 8235762 8090164 -1869016
39221 -1869016 -10254995 -14774745 -21062786 -29884198 -32853216 -23168633 -5840490 8688978
39213 8688978 18652412 29442577 37664364 30175027 6304228 -12055635 -6012114 13847796
39205 13847796 22393008 14839259 8412173 12377103 16947376 14162877 9981141 8934087
39197 8934087 3933200 -9102572 -20022994 -18117100 -6758435 4540509 13239121 20069391
39189 20069391 21127698 13877777 5163315 4031361 9853152 13653171 7986877 -7777764
39181 -7777764 -26657829 -35922402 -27089422 -7534588 5406576 4871293 97828 -1011397
39173a011397j643688n637997j693033Q708304J0151493j917116j3556817j3805403
39165b0405654p739935l189691O36110N174568O322867L098830K104191P354685
39157f644029J3851252J5208727J0296665N86899j1072170j8310563j6193142
39150a2276361q413170k045774K380466P182228R170080O234233N805215J2488188
39142B0525105J4392040n7101j7996099j6959697j04228Q279496J737498j119618
39134H697396Q249190J4268509O587406l337376o108546r501053j6851577j5232828
39126a3228879n52661R395986M299601M00530J0310628J6779545J304693k0522891
39118H186552k0371831j20546J4401143J2877426O919752L957494N56789k254968
$$ plain form
39173 -1011397 -2655085 -8293082 -9986115 -1277811 8873682 6956566 -6600251 -20405654
39165 -20405654 -28145589 -31335280 -30699170 -25524602 -19201735 -16102905 -13998714 -6644029
39157 -6644029 7207223 22415950 32712615 33299514 22227344 3916781 -12276361
39150 -12276361 -20689531 -22735305 -20354839 -13172611 -4002531 2231702 8036917 20525105
39142 20525105 34917145 34860044 16863945 -95752 -199980 8079516 9817014 8697396
39134 8697396 16946586 31215095 37802501 34465125 28356579 18855526 2003949 -13228879
39126 -13228879 -13781540 -4385554 -85953 314577 10625205 27404750 28709443 8186552
39118 8186552 -12185279 -12305825 2095318 14972744 21892496 25849990 26406779 24151811
39110B4151811n04984p94105j0369937j7824453o930567J3190175J6570691n65864
39102A6922767j3900536p992088L973501M517263m310498j0904068j1623589q332370
39094c1649618q75835Q644784J2989784Q377888l88195p083446r849096q172740
39086b8006474j451911P744109J4766634J6943137J2248153r81139j6191748j8672179
39078a3601418m645123Q099328L122413r429272q557431M116065R052799K610059
39070i232580M61866P025822Q504816J261579O8982R055070J0879912k167851
39062B5857616j1802677n423162J99882j0966837k2021625r178649J5339873J8608095
39054F12516j658782j3721875j320709J4114362J0278270l126424m790671L761062
$$ plain form
39110 24151811 23646827 22852722 12482785 -5341668 -12272235 917940 17488631 16922767
39102 16922767 3022231 -4969857 -996356 3520907 -789591 -11693659 -23317248 -31649618
39094 -31649618 -32525453 -23880669 -10890885 -2512997 -2901192 -9984638 -19833734 -28006474
39086 -28006474 -29458385 -21714276 -6947642 9995495 22243648 21262509 5070761 -13601418
39078 -13601418 -18246541 -10147213 -7024800 -16454072 -25011503 -20895438 -11842639 -9232580
39070 -9232580 -8770714 -1744892 6759924 8021503 8090485 17145555 28025467 25857616
39062 25857616 14054939 8631777 8831659 -2135178 -24156803 -33335452 -17995579 612516
39054 612516 -1046266 -14768141 -16088850 -1974488 8303782 5177358 386687 4147749
39046D147749M908071l835319p035923J253847O914472m83341q238370J640458
39038g28356K2346185K6701451L705157k4026909k8052093q963346Q702527R949058
39030I633674K691933j217537k608790p172422j2470708j1014950q56414J2268941
39022a0746273J9595542J4062446l629368k1023550k2442360n581226J4938772
39015a4826017K3249568J7104623N811519j099641j213530J49439m149976j2892738
39007A2133247j5200142n704909M393590K551356m083264Q94725J4231744J5204684
38999B4421031o95897j2865287q472814j513075n452641q712248K550124J5175601
38991D434794P991727j0951287j3590070N163470J9799875J2596659k965159n189884
$$ plain form
39046 4147749 9055820 5220501 -1815422 -561575 6352897 5869556 -2368814 -728356
39038 -728356 21617829 48319280 52024437 27997528 -54565 -9017911 -315384 9633674
39030 9633674 12325607 11108070 8499280 1326858 -11143850 -22158800 -23015214 -10746273
39022 -10746273 8849269 22911715 19282347 -1741203 -24183563 -29764789 -14826017
39015 -14826017 8423551 25528174 31339693 30240052 29026522 29175961 25025985 12133247
39007 12133247 -3066895 -8771804 -4378214 -1826858 -5910122 -5015397 9216347 24421031
38999 24421031 23725134 10859847 2387033 873958 -4578683 -13290931 -10740807 4434794
38991 4434794 12426521 1475234 -12114836 -6951366 12848509 25445168 22480009 17290125
38983A7290125O447133J5537141J2151812K089495l502182j824669j134132q963805
38975C8090918j8671983j5599083K95819R875195J679828r626507o105486M349061
38967D287762K144653r400611q803810O583221J5040025N938542m789580l520936
38959G479266K75154m590898r259468j567337J0543359J0509342j709652j1806814
38951a27048j1123521j534709J1499333J8316533P184216j8209086l2626635j8025096
38943d4646013Q857075J6968973L648822n512885J888239R260548K948966m649624
38935a1235899J516325J1860730Q295951m258421n073357P711868J2152516l598974
38927A7370739k1533000j8652306J249385J4466654R454698k428646p162365n131790
$$ plain form
38983 17290125 23737258 39274399 51426211 53515706 50013524 48188855 47054723 38090918
38975 38090918 19418935 3819852 4115671 13990866 15670694 6044187 -61299 4287762
38967 4287762 6432415 -2968196 -11772006 -5188785 9851240 15789782 11000202 7479266
38959 7479266 7754420 3163522 -6095946 -7663283 2880076 13389418 11679766 -127048
38951 -127048 -11250569 -12785278 -1285945 17030588 24214804 6005718 -26620917 -44646013
38943 -44646013 -35788938 -18819965 -15171143 -20684028 -18795789 -9535241 -6586275 -11235899
38935 -11235899 -9719574 2141156 10437107 6178686 1105329 8817197 20969713 17370739
38927 17370739 -4162261 -22814567 -21565182 -7098528 2356170 -72476 -7234841 -12366631
38919a2366631l479432k468514J707190O585520N867846O47230o99706M650014
38911D43517Q456705K558080r002081j3678556m982830R933454J7683859J2295387
38903B3707535M91769o918503p276815o527599q128471p966232l406851q1591
38895a6106758k466616l919894L325536J2414054R688033k677001p530455N76841
38887f696260O276688j060056r086972l335079P591483O214793l631841k797725
38879f524969J0065344J4625588J971410j0032395m400750R527033J1983309J391700
38871B8606270q054101q906542n211464o3735O197318P753791j446159j3550495
38863E324883j2510698K436031J2350399M224645j0285135j1120303K997192J4405808
$$ plain form
38919 -12366631 -15846063 -18314577 -16607387 -10021867 -4154021 -3506791 -4206497 443517
38911 443517 8900222 11458302 2456221 -11222335 -16205165 -6271711 11412148 23707535
38903 23707535 24199304 17280801 10003986 3476387 -4652084 -12618316 -16025167 -16106758
38895 -16106758 -18573374 -22493268 -19167732 -6753678 2934355 257354 -7273101 -6696260
38887 -6696260 -419572 -1479628 -10566600 -13901679 -6310196 -95403 -3727244 -6524969
38879 -6524969 3540375 18165963 20137373 10104978 5704228 15231261 27214570 28606270
38871 28606270 20552169 11645627 6434163 6370428 12567746 20321537 18875378 5324883
38863 5324883 -7185815 -4749784 7600615 11825260 1540125 -9580178 -6582986 7822822
38855G822822J0116911m122302j3328882r711545J892742J0642161J0058789L319774
38847A6690470j648067j937264j429859k584471k432519K6791r57163q728803
38839c000885j5245404r883248M849150J4836391J1453704q3123r519256j1498088
38831a8090759n966199M091300J2977330J5605446J2279313O582303l14185p848018
38823A9316531j1015658n565815K752914L760386k274284n725746l890575l570789
38815f213036n532760j460078Q256696R812856j506550r747475k550696P219461
38807a721582J487989j2694066j3780834k16683Q195896K336910m509121n49348
38799b1450839P997850J0798102P944123L099111m364899j2424746j3281828n219387
$$ plain form
38855 7822822 17939733 13817431 488549 -9222996 -7330254 3311907 13370696 16690470
38847 16690470 15042403 13105139 11675280 9090809 6658290 6685081 5727918 -3000885
38839 -3000885 -18246289 -28129537 -23280387 -8443996 3009708 2926585 -6592671 -18090759
38831 -18090759 -24056958 -19965658 -6988328 8617118 20896431 27478734 27164549 19316531
38823 19316531 8300873 2735058 5487972 9248358 6974074 1248328 -2642247 -6213036
38815 -6213036 -11745796 -13205874 -4949178 4863678 3357128 -6390347 -8941043 -1721582
38807 -1721582 -233593 -12927659 -26708493 -26925176 -18729280 -16392370 -20901491 -21450839
38799 -21450839 -13452989 -2654887 5289236 8388347 4023448 -8401298 -21683126 -26902513
38791b6902513K462616L527294L536212O954659O730105k637863j1038462n105553
38783b2473505J0536329J7738582R290424k872550n641465j106144m7059n093872
38775C30740p496252o54242Q897657R200479q7519o290028k426544J853983l237493
38766I0781q434744K196959K2609541K6927856M989478k0628010k3045732m580374
38758A25755J0140451O698007o090098j2317091o953592L182727R222873Q227555
38750A2236587L373408j991120p512839j0928763n661687Q881920J9280646J2255472
38742B9933624n285394j4146573j0081314o816428j0422420r973348J03142P811830
38734a8876881L857011l415015m722010m283297n124356J473859J6184921K0213941
$$ plain form
38791 -26902513 -24439897 -20912603 -17376391 -10421732 -3691627 -6329490 -17367952 -22473505
38783 -22473505 -11937176 5801406 15091830 12219280 6577815 5471671 5424612 330740
38775 330740 -7165512 -7819754 1077903 10278382 10190863 3900835 1474291 3328274 90781
38766 90781 -8343963 -6147004 16462537 43390393 48379871 27751861 4706129 125755
38758 125755 10266206 16964213 10874115 -1442976 -8396568 -5213841 4009032 12236587
38750 12236587 15609995 13618875 6106036 -4822727 -10484414 -1602494 17678152 29933624
38742 29933624 24648230 10501657 420343 -6396085 -16818505 -26791853 -26688711 -18876881
38734 -18876881 -15019870 -18434885 -23156895 -27440192 -32564548 -31090689 -14905768 5308173
38726E308173L480468j3257242p689609Q388819R377150j856053k966606O092998
38718F878098M803735p625131r050529N420286J3808900N497626k640890N54017
38710A7646112J428053r225114j5469006m016596J0425556Q768061k113605m158092
38702C285369J683562J662721n139376p597668j985392N666107J0390261Q909841
38694A6875425j879657j5167215j4012148N626534K3058179J8693813K25361j2270852
38686B1149440j4536660j3549203p936501N092655J3837753P000150l725336p34021
38678F598277P391505r94670k0354619k2918620m571987P792980J572124k605022
38670b8090032R375358J8593121P087285q973657o276924O308300M419260j0063624
$$ plain form
38726 5308173 8788641 -4468601 -12158210 -3769391 5607759 3751706 785100 6878098
38718 6878098 11681833 4056702 -4993827 426459 14235359 19732985 17092095 17646112
38710 17646112 19074165 9849051 -5619955 -9636551 789005 9557066 7443461 3285369
38702 3285369 4968931 6631652 1492276 -6105392 -8090784 -2424677 7965584 16875425
38694 16875425 14995768 -171447 -14183595 -8557061 14501118 33194931 33420292 21149440
38686 21149440 6612780 -6936423 -14872924 -9780269 4057484 11057634 7332298 6598277
38678 6598277 13989782 12995112 -7359507 -30278127 -34850114 -27057134 -25485010 -28090032
38670 -28090032 -18714674 -121553 6965732 -2007925 -8284849 -1976549 2442711 -7620913
38662g620913j4268027l654186L760231R18079J336728J1194065J6758593Q376848
38654A6801418l147562m992297j336866k394136o782361o922551l303015j853626
38646a3930996k668702j261156K447220M362794L019401K70508k257850l018838
38638a3037619l25897L718108L268042l148893r028244q434485l138118K760324
38630b7366782R010774J4843911J5343751Q969479K324111L25768j341965o063072
38622A6045975p318569q27358L330737m477978j3952059q449006O567340R800992
38614G20074j880245q622756o56103P143549K581649m031125n46896N900450M392263
38605E000860K82404K212238L567305l823025r857213j281091J2700048J2223669
$$ plain form
38662 -7620913 -21888940 -25543126 -21782895 -20864816 -19528088 -8334023 8424570 16801418
38654 16801418 13653856 8661559 7324693 4930557 -1851804 -8774355 -12077370 -13930996
38646 -13930996 -16599698 -17860854 -15413634 -11050840 -8031439 -7760931 -10018781 -13037619
38638 -13037619 -13363516 -9645408 -6377366 -9526259 -18554503 -26988988 -30127106 -27366782
38630 -27366782 -18356008 -3512097 11831654 20801133 23125244 23451012 22109047 16045975
38622 16045975 8727406 7900048 11230785 6752807 -7199252 -15648258 -9080918 720074
38614 720074 -1160171 -9782927 -10439030 -3295481 -713832 -4744957 -5291853 608597 5000860
38605 5000860 5283264 7495502 11062807 7239782 -2617431 -3898522 8801526 21025195
38597B1025195j746909r745551m291767L221976M745103M126957L155664j532309
38589A8958359o285321l386150K728117K81074q179447q406739l9228J828406
38581b500929n799943p318870L489748J1245327N053595l650179j971424L888526
38573B435851L063864o42045J215783N087283L195524k193642m539218l929547
38565C693853k659694j69765P340q456938j8649047j2577682R793006K2530150
38557f488777J0005529p431919l828667J2774207J4987410j515416j5677405j4542731
38549a1717769n205858L155117P589052M078304q189665j7266627j1553016O44739
38541c8465723L331322P1967P157659K2240643K4408850P560489j0023177j4422062
$$ plain form
38597 21025195 19278286 9532735 5240968 8462944 13208047 17335004 20490668 18958359
38589 18958359 12673038 9286888 12015005 12296079 4116632 -4290107 -4329335 -2500929
38581 -2500929 -8300872 -15619742 -12129994 -884667 4168928 518749 -1452675 2435851
38573 2435851 5499715 4857670 6073453 11160736 14356260 12162618 7623400 3693853
38565 3693853 1034159 864394 871734 -7585204 -26234251 -38811933 -29018927 -6488777
38557 -6488777 3516752 -3915167 -7743834 5030373 20017783 18502367 2824962 -11717769
38549 -11717769 -16923627 -13768510 -6179458 -2101154 -10290819 -27557446 -39110462 -38465723
38541 -38465723 -35134401 -35062434 -27904775 -5664132 18744718 26305207 16282030 1859968
38533A859968j1960045r321068j13794J7013511K5717063J2802071j0323550k1047355
38525D626801j3015296O26864O029140J985507k484071J123318J0465409J2839148
38517B2196820Q18800j5121084j8209711p368939L348967N804193N166196N891333
38509B526575M356785j511045p684400j2044018j5237418j2100687L746536K3784022
38501a4163650K8221419J1576271q646753j4858077q490565m99548M294790O261321
38493C695208N644891M800852O136579M707440m999710j3627043n692456J2599233
38485A3264994J5879033j438762j2445948Q53956J6774913P445186j5811958j9626933
38477D894481j89795J3419766N109529q354724p924168K194108Q360546P340481
$$ plain form
38533 1859968 -10100077 -19421145 -19534939 -2521428 23195635 35997706 25674156 4626801
38525 4626801 -8388495 -7761631 -1732491 253016 -2231055 -1107737 9357672 22196820
38517 22196820 23015620 7894536 -10315175 -17684114 -14335147 -8530954 -3364758 2526575
38509 2526575 6883360 5372315 -2312085 -14356103 -29593521 -41694208 -37947672 -14163650
38501 -14163650 14057769 25634040 16987287 2129210 -6361355 -6860903 -2566113 3695208
38493 3695208 9340099 14140951 20277530 24984970 19985260 6358217 665761 13264994
38485 13264994 29144027 27705265 15259317 16113273 32888186 40333372 24521414 4894481
38477 4894481 4704686 18124452 23233981 14879257 6955089 9149197 17509743 24850224
38469B4850224K440343m810167r858367n343375N198330O785584m402507j1045293
38461C814772K79811J5889098J3308261m703290j3603731l331836Q027928K363612
38453B2044625j2665946j6770397n685719O062033O508292j299574p445438o297735
38445a5549859J521539J0982765J4816398R219044j539347r898423j2912551j1162941
38437a4523375m215267N161273P278140k560303j2419741q237175L335940M626150
38429b1554358k466928Q09608J4112869J3396024p101305j8506195k493604J5748929
38421h054960P332403j2224971r398589J1293541J7360065L634223m363249J160664
38413F739127N93254j1161107j3682363o00689P663421K451458J967586J3446418
$$ plain form
38469 24850224 27290567 22480400 12622033 7278658 12476988 19262572 14860065 3814772
38461 3814772 4094583 19983681 33291942 28588652 14984921 11653085 19681013 22044625
38453 22044625 9378679 -7391718 -13077437 -7015404 -507112 -1806686 -9252124 -15549859
38445 -15549859 -14028320 -3045555 11770843 20989887 19450540 9552117 -3360434 -14523375
38437 -14523375 -18738642 -13577369 -6299229 -8859532 -21279273 -29516448 -26180508 -21554358
38429 -21554358 -24021286 -23211678 -9098809 4297215 -2804090 -21310285 -23803889 -8054960
38421 -8054960 -722557 -12947528 -22346117 -11052576 6307489 9941712 5578463 6739127
38413 6739127 7332381 -3828726 -17511089 -18111778 -10448357 -7996899 -6029313 7417105
38405G417105J5910448q31762j3883427o017512M808828l81779p586124J332105
38397G67882J2294016L769489j3506643j4912906l013631K746985K807441R927019
38389H79652J6596927N785228j2612084j1831994P083158J4856826P57600j2038603
38381I476710m749985J1009298J5261087N579014q545021j9303282k0516699r341786
38373b1130664N367731R592211L374107Q38651Q242968J5272400J1487093n93618
38365C2450879j1763366j5264963q642735L759892J0564357M889959n955258j0737359
38357f98594q658502l807024N297729J6636567J5906687l981214k3396062j8458536
38349b1158949L120492J3003216M883346p41453N981292J0562430L081477n606623
$$ plain form
38405 7417105 23327553 22495791 8612364 2594852 7403680 7021901 -564223 767882
38397 767882 13061898 16831387 3324744 -11588162 -14601793 -11854808 -9047367 879652
38389 879652 17476579 23261807 10649723 -1182271 5900887 20757713 21515313 9476710
38381 9476710 4726725 15736023 30997110 36576124 28031103 8727821 -11788878 -21130664
38373 -21130664 -15762933 -6170722 -2796615 -1957964 6285004 21557404 33044497 32450879
38365 32450879 20687513 5422550 -3220185 539707 11104064 15994023 10038765 -698594
38357 -698594 -9357096 -13164120 -7866391 8770176 24676863 20695649 -2700413 -21158949
38349 -21158949 -18038457 -5035241 -151895 -893348 5087944 15650374 18731851 13125228
38341A3125228n425924k306488k474889j473438K267971J497559m111997m437769
38333c339747J561619J687481o620185r268245m20833N812474n17625q912770
38325b0017831q325330m433886l767725Q80076J3806932K2004679J4227795K89182
38317A4663892n032954m181117o327876p214498K109319J5389915J7659103O138544
38309C3204328q964282j8580866j8609667p757234P353102J3735552Q891747N228300
38301A4500980P755045K841752j6111116k8705363j4893165J0567289J6469397
38294g575181O86137r124684J518561J5972303J5242883K794811o489112n587130
38286G438588L039366J2119074J1465495k697738j7535590j5529297Q90667J0621704
$$ plain form
38341 13125228 7699304 5392816 2917927 1444489 3712460 5210019 1098022 -3339747
38333 -3339747 -1778128 -90647 -6710832 -15979077 -16399910 -10587436 -11105061 -20017831
38325 -20017831 -28343161 -32777047 -36544772 -35664696 -21857764 146915 14374710 14663892
38317 14663892 9630938 5449821 -878055 -8092553 -5983234 9406681 27065784 33204328
38309 33204328 24240046 5659180 -12950487 -20707721 -13354619 380933 9272680 14500980
38301 14500980 22256025 25097777 8986661 -19718702 -34611867 -24044578 -7575181
38294 -7575181 -6889044 -16013728 -14495167 1477136 16720019 19514830 13025718 7438588
38286 7438588 10477954 22597028 34062523 31364785 13829195 -1700102 -809435 9812269
38278I812269L401917p046431n894530J357487P57649p617172j1313576m132319
38270b0674706P205216J2787540Q901679o83865q022900p263681p97621L008930
38262e539408J44212m342612l962822P95308M327423K988050j889519n251545
38254a2730913j746422Q062942J4335946O928350r738861j7500483n494702J4589864
38246c294279K1108857P727406j0647711j6413281p372987M692745Q215807K018834
38238F035391n697960o304797K87621N755660M198825O57154L672602J0565480
38230A9169976Q690425n648102j8453536j5305629m07624J0859588J2669755J0246995
38222B1821848M923768o636999j8100628j5689576k88348Q875515J564322p820864
$$ plain form
38278 9812269 13214186 6167755 273225 1630712 2388361 -5228811 -16542387 -20674706
38270 -20674706 -13469490 -681950 8219729 7535864 -487036 -7750717 -8548338 -5539408
38262 -5539408 -5395196 -9737808 -13700630 -12905322 -8577899 -5589849 -7479368 -12730913
38254 -12730913 -14477335 -6414393 7921553 14849903 5111042 -12389441 -17884143 -3294279
38246 -3294279 17814578 25541984 14894273 -1519008 -8891995 -4199250 4016557 6035391
38238 6035391 337431 -5967366 -5679745 75915 4274740 4931894 8604496 19169976
38230 19169976 27860401 22212299 3758763 -11546866 -11954490 -1094902 11574853 21821848
38222 21821848 26745616 20108617 2007989 -13681587 -13969935 -5094420 -3530098 -11350962
38214a1350962m088438M140203Q27190q374516n112712R582554J5265321M136367
38206E025007q224835q020546l6170O535465J1188820J2985829N028914j1106233
38198A3376251j9553117j1260600P39496O80717n338300k46268J4618595J9184164
38190A2200938M420515j3462497j4943776k452142N571549O15924o339757k473971
38182a6863217Q301117J1467248K785328o653550p484839m074699l934932m453817
38174b0911361K53752N994312L980119l629455n857329L3742M821453J777934
38166a3536833m582003n834641J258019J2687966J8156078P771445j3755837k4752981
38158b2588787j0232512J6160958K7270960J6051026q47012r639976j1233876
$$ plain form
38214 -11350962 -15439400 -11299197 -10472007 -18846523 -23959235 -14376681 888640 5025007
38206 5025007 -3199828 -11220374 -11256544 -4721079 6467741 19453570 24482484 13376251
38198 13376251 -6176866 -17437466 -16697970 -16017253 -21355553 -21601821 -6983226 12200938
38190 12200938 16621453 3158956 -11784820 -14236962 -8665413 -8049489 -14389246 -16863217
38182 -16863217 -8562100 2905148 5690476 -963074 -8447913 -12522612 -16457544 -20911361
38174 -20911361 -20657609 -14663297 -10683178 -14312633 -20169962 -20136220 -15314767 -13536833
38166 -13536833 -18118836 -23953477 -22695458 -10007492 8148586 15920031 2164194 -22588787
38158 -22588787 -32821299 -16660341 10610619 26661645 25814633 16174657 4940781
38151D940781p320990M481833J7307767J6091462o54566j5768609j6645007q861366
38143f428695j595712M185740O864088Q73206r460048r409753L519017J2526268
38135A074111O943526j672750m09893M153023P767r173189j2040047p672383j543451
38126b0333286O734553J7693196K2575604J3546479k476925j1668731j0169205
38119A5901685m585051j255988k041999n065566n018192O89248M866970l73325
38111C117782q244929n723494L324909L073563n023051k263144J2652407J6330623
38103A7244666r15850j6509128j0697540N463960J4527268J9219314K4160354
38096E2493044J6664946r055865l0501033k6336868q602267j60707P44480O644586
$$ plain form
38151 4940781 -2380209 2101624 19409391 35500853 34846287 19077678 2432671 -6428695
38143 -6428695 -8024407 -3838667 3025421 3898627 -5561421 -14971174 -11452157 1074111
38135 1074111 8017637 6344887 5934994 10088017 10095784 922595 -11117452 -18789835 -20333286
38126 -20333286 -13598733 4094463 26670067 40216546 37739621 26070890 15901685
38119 15901685 11316634 10060646 8018647 2953081 -2065111 -1375863 3491107 3117782
38111 3117782 -5127147 -10850641 -7525732 -4452169 -9475220 -11738364 914043 17244666
38103 17244666 16328816 -180312 -10877852 -5413892 9113376 28332690 52493044
38096 52493044 69157990 60102125 29601092 3264224 -5338043 -5498750 -4754270 1890316
38088A890316J1198991L585212m409395K930566J4076918R109479m176458n450294
38080B8755335o6170p553072k2273142k1004284l031526J0775527J3134405J3062740
38072A1799813J0409260n42465r363357l210708O059685M46603r788000n103141
38064G07690L623539n200898j8044904o734103J6202716J4727751n368508n532554
38056e619271J3376030J0591594j7235758k4326788K920585J8830841j868828
38049c331595k0175608k740603K1917589J7958015K154153M171419J0797611k350004
38041B8400977j9728212j4115808L708511P770932K275301K776040j44100j6286629
38033e342988k2902579q20192K2937856J5148551o068357l110849J4769133J0846751
$$ plain form
38088 1890316 13089307 16674519 12265124 15195690 29272608 38382087 34205629 28755335
38080 28755335 28689165 21136093 -1137049 -22141333 -25172859 -14397332 -1262927 11799813
38072 11799813 22209073 21666608 12303251 9092543 15152228 15598831 5810831 707690
38064 707690 4331229 -869669 -18914573 -25648676 -9445960 5281791 -86717 -5619271
38056 -5619271 7756759 18348353 1112595 -23214193 -20293608 -1462767 -3331595
38049 -3331595 -23507203 -26247806 -4330217 13627798 15781951 19953370 30750981 28400977
38041 28400977 8672765 -5443043 -1734532 6036400 8311701 11087741 10943641 -5342988
38033 -5342988 -28245567 -29065759 -6127903 9020648 2952291 -158558 14610575 25457326
38025B5457326j1240410j5629806O64231O676878l702030n497449O039464Q734009
38017A1502213r40322l679638N05765o280937j6147931l711909K0012955J6173114
38009A7433310j3105553k1484091L246699J6516207n616737k4198027m711976
38002c1920168K4618368K1732136l496931j4568296o748611J008097N788804J2788939
37994I202338J0233845r605970k3706504r357399J5330074J7731816J122382p585578
37986C365004m902551o432991q123492N930012K3764950J6594782j0912780k2526806
37978c243872o828996P423287N83763j0584576p992101n66217k96037O31015R228085
37969a1645649J3337053M441005k859594M309778J1892562J971379j4573838j3954082
$$ plain form
38025 25457326 14216916 -1412890 -748659 5928219 2226189 -3271260 2768204 11502213
38017 11502213 10561891 6882253 7388018 1107081 -15040850 -18752759 1260196 17433310
38009 17433310 4327757 -17156334 -13909635 2606572 -3010165 -27208192 -31920168
38002 -31920168 -7301800 14430336 10933405 -3634891 -10383502 -9375405 -3586601 9202338
37994 9202338 19436183 9830213 -13876291 -23233690 -7903616 9828200 10950582 3365004
37986 3365004 -1537547 -7970538 -16094030 -10164018 13600932 30195714 19282934 -3243872
37978 -3243872 -10072868 -2649581 -2065818 -12650394 -20642495 -21208712 -21504749 -20873734 -11645649
37969 -11645649 1691404 6132409 3272815 7582593 19475155 21446534 6872696 -7081386
37961g081386K407714J1234335L481297p124190j0088209r899250r479486k786048
37953b9335223R544588J4252900M394391q041240q019197K448913R120227N126428
37945e08213k402950l348615L543674J0180252Q465538l23191o991465o519571
37937B095459m594105p486957j0313959m121916Q048299J3231664P102055o01720
37929C358820j569030J172793K822965N177164R149607Q809868O77738q858082
37921B0741843j2609303j1625035q761545k221251O759097R523290K916627k974789
37913A748934o67407J669633m030382q530698j180810P624449J947441r474292
37905a0893132m968956J1248688J2283484n595470j2453036P153991K5684150
$$ plain form
37961 -7081386 -4673672 6560663 10041960 2917770 -7170439 -17069689 -26549175 -29335223
37953 -29335223 -19790635 -5537735 -1143344 -9184584 -17203781 -14754868 -5634641 -508213
37945 -508213 -2911163 -6259778 -2716104 7464148 15929686 15606495 8615030 2095459
37937 2095459 -2498646 -9985603 -20299562 -24421478 -16373179 -3141515 3960540 3358820
37929 3358820 1789790 2962583 5785548 10962712 20112319 28922187 29599925 20741843
37921 20741843 8132540 -3492495 -12254040 -14475291 -7716194 1807096 4723723 1748934
37913 1748934 1081527 2751160 -1279222 -9809920 -10990730 -3366281 -1418840 -10893132
37905 -10893132 -15862088 -4613400 7670084 2074614 -10378422 -3224431 22459719
37898B2459719J4081470j2175020j6665333L215560J5686573L657913j4500338
37891A5760544j6846158o892664j075699l170726l395623M133211J2830835J2033201
37883A3376921K53330j1363944j0718633K98359P877858N009350Q2872J963160
37875F779273N717909K138008o080815q890421m681342j81550J962210M251557
37867A014829N581854K870934j56436K682189P631284M692083n862146j2440116
37859F014475r330372l438783j003997Q09812M294053M288815j787360n986906
37851f140263q79803P602772P833005l98104n639152q69830Q373002J3159682
37843B3041309J1288977N291382l249400j1678838j2917110k479658J1454586
$$ plain form
37898 22459719 36541189 24366169 7700836 10916396 26602969 30260882 15760544
37891 15760544 -1085614 -7978278 -9053977 -12224703 -15620326 -11487115 1343720 13376921
37883 13376921 13630251 2266307 -8452326 -8153967 -276109 4733241 4816113 6779273
37875 6779273 12497182 14635190 8554375 -336046 -5017388 -5198938 -3236728 1014829
37867 1014829 6596683 9467617 9311181 11993370 19624654 24316737 18454591 6014475
37859 6014475 -3315897 -6754680 -7758677 -6948865 -2654812 1634003 -153357 -6140263
37851 -6140263 -7020066 582706 8415711 8017607 2378455 1508625 9881627 23041309
37843 23041309 34330286 39621668 36372268 24693430 11776320 9296662 20751248
37836B0751248J3784623J668546r962082q019104J013499K076333n746715j0109000
37828E457348o328764k792330l910910k515194N091821R696345L477806o382435
37820A793687p918636q41395N817861O338276J016711p701594j4642789j3281531
37812b9419410m170572L829167N661210N686150O752310M562156o26351K35784
37804g489556P968089Q029151o265203j7388913q142931R497455J1596473l86806
37796b582241m145888N408489R156258k357685j3058169q225483L041362M422824
37788h340533l017060n476241K866894J3666242J4643443J749852j4542326j5952172
37780a4401901K420790K0239360J4000062j0474492k3883834j3127879L660220
$$ plain form
37836 20751248 34535871 36204417 26242335 18223231 19236730 21313063 15566348 5457348
37828 5457348 -871416 -3663746 -7574656 -10089850 -4998029 4698316 8176122 1793687
37820 1793687 -6124949 -6966344 -1148483 5189793 6206504 -1495090 -16137879 -29419410
37812 -29419410 -33589982 -29760815 -24099605 -18413455 -11661145 -7098989 -7725340 -7489556
37804 -7489556 478533 8507684 2242481 -15146432 -23289363 -13791908 -2195435 -2582241
37796 -2582241 -6728129 -1319640 7836618 5478933 -7579236 -15804719 -12763357 -8340533
37788 -8340533 -11357593 -16833834 -13966940 -300698 14342745 16092597 1550271 -14401901
37780 -14401901 -11981111 8258249 22258311 11783819 -12100015 -25227894 -21567674
37773b1567674P325451L075199M285582Q540724O284780J117037L063176Q117957
37765B0242232K340950j4796021k6037773j7980463K841479J8566587J8453399
37758C630390O484544n448504r771159q867565q140724o304272J305372J0974380
37750a6137538J2192023L614943l378557k540039k650668j0588076j5760276n294488
37742d0542676J2862928J8478266P572779m222554o958032p639520j1918152j1836472
37734d4203433j748884P899525O668109L373266J1989055K4473334J8407160o864404
37726A9993728k2477896p902624J9699746K8070267J0736160j0871814j9237831
37719A8009736j6575092j0611205k915432M629795O710156M133515M633031Q464306
$$ plain form
37773 -21567674 -14242223 -11167024 -6881442 1659282 7944062 9061099 12124275 20242232
37765 20242232 22583182 7787161 -18250612 -36231075 -33389596 -14823009 3630390
37758 3630390 10114934 4666430 -5104729 -13972294 -22113018 -28417290 -27111918 -16137538
37750 -16137538 -3945515 -330572 -3709129 -6249168 -8899836 -19487912 -35248188 -40542676
37742 -40542676 -27679748 -9201482 -1628703 -5851257 -12809289 -20448809 -32366961 -44203433
37734 -44203433 -45952317 -38052792 -31384683 -28011417 -16022362 8450972 26858132 19993728
37726 19993728 -2484168 -10386792 9312954 37383221 48119381 37247567 18009736
37719 18009736 1434644 -9176561 -12091993 -7462198 -752042 3381473 8014504 16478810
37711A6478810N178348q209836j7754826j1006183M682788J2903717R738192L771954
37703A5782964N46094j784152m554289o057048n433444k697317K446846P250503
37695E500157O397606M15821l092289j536175j988057p508353r209942j012751
37687a2033983P750242N564528l990488r327573o996518p9291R963979J8126633
37679H977529J3361236m896069j8523941j4120994k947917p06769j295622P380774
37671a2771773J4968255M342589j3191113j0354005J1282680K1377834P884681
37664B3539148p581703p605932j981505l076725n799164m185488l736853n595117
37656a6023339j161396P414403N503474n307550m011859J1795297J4909580o340285
$$ plain form
37711 16478810 21657158 13447322 -4307504 -15313687 -10630899 2272818 12011010 15782964
37703 15782964 16329058 14544906 9990617 3933569 -1499875 -4197192 -1750346 5500157
37695 5500157 11897763 12313584 9221295 7685120 5697063 -1811290 -11021232 -12033983
37687 -12033983 -4283741 1280787 -2709701 -12037274 -19033792 -19113083 -9149104 8977529
37679 8977529 22338765 17442696 -1081245 -15202239 -18150156 -18856925 -20152547 -12771773
37671 -12771773 2196482 6539071 -6652042 -17006047 -5723367 15654467 23539148
37664 23539148 15957445 8351513 6370008 3293283 -2505881 -6691369 -10428222 -16023339
37656 -16023339 -17184735 -9770332 -4266858 -9574408 -13586267 -1790970 13118610 6778325
37648F778325k2823436r615344J2042609R265547r398688j1831461L450871J0314506
37640a1817071L191243K322110J2128189J2547741k372574j1794430m741091J160243
37632F24360p499304j4930240l323745J5713370J9050546P428114L09281L323410
37624B0695792L478834m625920q899118j227082P837943N359419m573117r103508
37616H943243o462667m384118l216481L620570J2247869R169761m503498p795532
37608G619147Q831989K3673998J3903329q157493j3250784p80342L134124q833476
37600B6140492j4030508r21815J0120016J942394j0747686p951965K514839J565168
37592H630935q284298j0677593m220339k60628l21015K386650N286830J078855
$$ plain form
37648 6778325 -16045111 -25660455 -13617846 -4352299 -13750987 -25582448 -22131577 -11817071
37640 -11817071 -8625828 -6303718 5824471 18372212 15999638 4205208 -535883 624360
37632 624360 -6874944 -21805184 -25128929 -9415559 9634987 17063101 17372382 20695792
37624 20695792 24174626 19548706 10649588 9422506 17260449 22619868 18046751 8943243
37616 8943243 2480576 -1903542 -5120023 -1499453 10748416 19918177 15414679 7619147
37608 7619147 16451136 40125134 54028463 45870970 32620186 31839844 34973968 26140492
37600 26140492 12109984 11188169 21308185 23250579 12502893 4550928 7065767 8630935
37592 8630935 346637 -10330956 -14551295 -14811923 -15132938 -12746288 -7459458 -6380603
37584f380603m877750j799359N747149L983862n718991q197634M03493P619480
37576i220353O007809K285128K441906K902904O4270l800926o786188q939988
37568a5045438p062718J431435J0013650R575752K511906j032686R08842K319335
37560C620078K876546O969160J0303904L425770j0355373j6291309j0016324k889987
37552a2357535k238617j838783K692866M405654j192192o030967k305430N212922
37544a3652082Q372992P593062O047598J290285p324686j0869966k130579J0370740
37536c02636J1373441j97360j0034005q054612P58454O953046Q490012P268694
37528A6255034J972251p353133j2540389n767985O143929P577300k932009q196157
$$ plain form
37584 -6380603 -11258353 -13057712 -7310563 -3326701 -9045692 -17243326 -16839833 -9220353
37576 -9220353 -3212544 -927416 1514490 4417394 4481664 680738 -6105450 -15045438
37568 -15045438 -22108156 -20676721 -10663071 -1087319 1424587 391901 1300743 3620078
37560 3620078 6496624 13465784 23769688 27195458 16840085 548776 -9467548 -12357535
37552 -12357535 -14596152 -16434935 -13742069 -9336415 -10528607 -16559574 -18865004 -13652082
37544 -13652082 -5279090 2313972 8361570 9651855 2327169 -8542797 -10673376 -302636
37536 -302636 11070805 10873445 839440 -7215172 -6456718 496328 8986340 16255034
37528 16255034 18227285 10874152 -1666237 -7434222 -1290293 6287007 3354998 -4841159
37520d841159J932320J3422047R582461j871051k327049M848014o80387j9424196
37512F41000k6999877j2000827O626345J1033383Q879149J1192185R420866m804472
37504C987752j6916124j0485727M234444P338218J757637L206698R149490N625494
37496G897882l359061k309679N274399K482569p862274o278487O944657R856553
37488A2646559k436239q409808K154727J0971031M108542n244142k375987M426464
37480A5841147K443322k343290J212687Q768433J0221617O528115K121797n865851
37472C8927977j6577029j7589149l521408J0285400Q497196j595239m288235p77258
37464A3362255k147450o314788j727979J0581275J6765020J0697916L74421n396234
$$ plain form
37520 -4841159 -2908839 10513208 20095669 18224618 15897569 20745583 20065196 641000
37512 641000 -26358877 -38359704 -31733359 -20699976 -11820827 -628642 8792224 3987752
37504 3987752 -12928372 -23414099 -19179655 -11841437 -10083800 -6877102 2272388 7897882
37496 7897882 4538821 2229142 7503541 9986110 2123836 -4154651 2790006 12646559
37488 12646559 10210320 1800512 3955239 14926270 19034812 13790670 11414683 15841147
37480 15841147 18284469 15941179 17153866 25922299 36143916 42672031 44793828 38927977
37472 38927977 22350948 4761799 1240391 11525791 20022987 18427748 14139513 13362255
37464 13362255 11214805 4900017 3172038 13753313 30518333 41216249 41590670 36194436
37456C6194436n067142o44585M084203L727211k006945n467738k268556Q07682
37448B9358566k749776p859306p894996o845620r090017o951088N529489J5396350
37440H893602P457678p822275o473407J0454260J6259355J055339j1614976k971803
37432A5237773J0023698J838621k0628275k8493633j3331734N509798J3370780
37425a6472972J5770316J8199088J3697640N03475p360744j445140M360066m693419
37417B2558310j7932424j4482871L051824J2652091P651228L435395P314470O717106
37409C0965129m191504r948819j32158J0086612L871039r265208r900370k57067
37401A1227654K986744j696925j484478N487261Q116954L705476P15020R10498
$$ plain form
37456 36194436 31127294 30482709 34566912 38294123 36287178 30819440 28550884 29358566
37448 29358566 26608790 18749484 10854488 4008868 -5081149 -12032237 -6502748 8893602
37440 8893602 16351280 8529005 2055598 12509858 28769213 29824552 18209576 15237773
37432 15237773 25261471 27100092 6471817 -22021816 -35353550 -29843752 -16472972
37425 -16472972 -702656 17496432 31194072 31697547 24336803 22891663 27251729 22558310
37417 22558310 4625886 -9856985 -6805161 5846930 13498158 16933553 24248023 30965129
37409 30965129 26773625 16824806 16692648 26779260 30650299 21385091 11484721 11227654
37401 11227654 14214398 12517473 11032995 16520256 24637210 28342686 29057706 29968204
37393B9968204j942468o036578l212749L449956K608957m928229p909975n969399
37385F027719q210483j0965982j069317J6406691J9488619M125582q142288n525097
37377A2135444k502948r366543j1888572J798243J7378446J6939894O145578m86899
37369C0152643l895107j0188094j2259361k846502P551016O514434J349199M722731
37361B1100959J0654428O150312l824288n052015J166435L837311M599272J1399627
37353E0032041J6927213P804200q792235j2268392j214794M751059l104665j1449878
37345D2684549r252458k631139M71918K592295O657932Q091431M131366L23325
37337E3069219K293911Q590350J3476436J0455097m292592k3760756l0827069
$$ plain form
37393 29968204 28025736 21989158 18776409 22226365 24835322 19907093 11997118 6027719
37385 6027719 -2182764 -13148746 -14218063 2188628 21677247 25802829 17660541 12135444
37377 12135444 9632496 265953 -11622619 -9824376 7554070 24493964 30639542 30152643
37369 30152643 26257536 16069442 3810081 963579 8514595 15029029 16378228 21100959
37361 21100959 31755387 37905699 34081411 29029396 30195831 34033142 38632414 50032041
37353 50032041 66959254 74763454 65971219 53702827 52488033 57239092 54134427 42684549
37345 42684549 33432091 30800952 31272870 33865165 40523097 48614528 52745894 53069219
37337 53069219 55363130 63953480 77429916 87885013 83592421 59831665 29004596
37330B9004596j7944146M68310P969684R440025J7421592K4896902J5599022l728728
37322H3127257q891405L047192Q081469n969238k1048528j8901739o266286J789420
37314C4968142L256557J607552m218857r553252k033753J6482796K4004861R456153
37306G3970199q043891q174999k37357l685145j2859198p242676J1440151J9434676
37298F4601760P115464q899352j2819704q678044o754735p752589p829390o879737
37290A2103673m761265J343971J0134073J4630899J2059416Q226967P971090P913922
37282F9622746L179746m086070p450040m162684K442643O125050K686275n007471
37274F3350195p580803M52689J1595944J3211554M720215j023355L919156J1139801
$$ plain form
37330 29004596 11060450 11528760 19498444 28938469 46360061 71256963 86855985 83127257
37322 83127257 74235852 77283044 85364513 79395275 58346747 39445008 33178722 34968142
37314 34968142 38224699 39832251 35613394 26060142 24026389 40509185 64514046 73970199
37306 73970199 65926308 57751309 57513952 53828807 40969609 33726933 45167084 64601760
37298 64601760 71717224 62817872 49998168 41320124 34565389 26812800 18983410 12103673
37290 12103673 7342408 8686379 18820452 33451351 45510767 53737734 61708824 69622746
37282 69622746 72802492 68716422 61266382 57103698 59546341 65671391 68357666 63350195
37274 63350195 55769392 56222081 67818025 81029579 85749794 84726439 88645595 99785396
37266I9785396Q460841k498105r204149n588022J492497L293950R8484j335269
37258I4505623K773108R293211J2299040R518708N132088N807391J2265481J5701415
37250A67296065O746322j0629584j9038039o403341J7745546L1021248K3149680
37243B09887897N671923m774748n007885k116822O15370M722443P130620J794207
37235B17923005p836337r157733J848536J2506000R993294j821115j0690593j4119998
37227A98645059j7490394j8556998q825171Q365138J5732250M358220j3069301
37220A69158803j9094146j2278514k747938L625227N471565j043309j4644323
37213A28447365k0257084n789249J4175959J1489994j5309973l4299285k2694661
$$ plain form
37266 99785396 108246237 105748132 96543983 90955961 92448458 95742408 95840892 94505623
37258 94505623 97278731 106571942 118870982 128389690 133521778 139329169 151594650 167296065
37250 167296065 174042387 163412803 144374764 137971423 155716969 186738217 209887897
37243 209887897 215559820 210785072 205777187 203660365 204275735 208998178 216128798 217923005
37235 217923005 210086668 200928935 202777471 215283471 225276765 223455650 212765057 198645059
37227 198645059 181154665 162597667 153772496 162137634 177869884 182228104 169158803
37220 169158803 150064657 137786143 135038205 138663432 144134997 143091688 128447365
37213 128447365 108190281 102401032 116576991 128066985 112757012 78457727 55763066
37206E5763066K937935J2859593L884715n730475q556742j2369856j8010604j5947006
37198A4830626n627223J406753Q66972J175663N920031P128730J108499m281201
37190B2528850m400013n666421j1443359j3226137m286790Q742392J5470804J3385135
37182B1104461M584442p967953j5854907r786729M958754J1112480L925563k066197
37174A0009914J695606L796030m502843j1475567n828635J896128j795234q190134
37166a4394735k156159R472372R406323J88223k187035K342319J207118l132495
37158G45931L110990J5163883J2407377o201474j7342720r938218J83843O48729
37150a221659J221343R844718J4334521M299498q402425q526723j218276l56773
$$ plain form
37206 55763066 58701001 71560594 75445309 69714834 61158092 48788236 30777632 14830626
37198 14830626 9203403 10610156 11477128 12652791 18572822 25701552 26810051 22528850
37190 22528850 18128837 12462416 1019057 -12207080 -16493870 -7751478 7719326 21104461
37182 21104461 25688903 17720950 1866043 -7920686 -2961932 8150548 12076111 10009914
37174 10009914 11705520 15501550 10998707 -476860 -6305495 -4409367 -6204601 -14394735
37166 -14394735 -16550894 -7078522 2327801 2516024 328989 2671308 3878426 745931
37158 745931 3856921 19020804 31428181 25226707 7883987 -2054231 -1870388 -1221659
37150 -1221659 -316 9844402 24178923 28478421 20075996 11549273 10330997 9974224
37142I974224o052351r328782q252465n235975J472988J0456492J1630887J262812
37134E927830p543532k810879P298753P196123k962424j0733721j0648028o462082
37126b0737960m25359P045496J2184193J2679160J1537146Q465386k103577j5612067
37118A3032418j4932026L078208J4739158K199047j6296118j2820859O153114
37111d847058J1120831k655763j1073674l770530K474643j585128j616469J0019363
37103a933785J6616225N895384p695073p558314j137326k148770m988276J499024
37095a450911R666716N775762l819677k658209P051566Q675729m37424p285047
37087A5518505p483649q805808j0771100l708327Q801895R481372l706015r814672
$$ plain form
37142 9974224 3921873 -5406909 -13659374 -18895349 -17422361 -6965869 4665018 5927830
37134 5927830 -1615702 -4426581 2872172 10068295 7105871 -3627850 -14275878 -20737960
37126 -20737960 -21163319 -14117823 -1933630 10745530 22282676 30748062 28644485 13032418
37118 13032418 -1899608 1178600 15917758 18116805 1820687 -11000172 -4847058
37111 -4847058 6273773 3618010 -7455664 -11226194 -8751551 -10336679 -11953148 -1933785
37103 -1933785 14682440 20577824 12882751 5324437 4187111 2038341 -2949935 -1450911
37095 -1450911 8215805 13991567 10171890 7513681 14565247 23240976 22803552 15518505
37087 15518505 8034856 -770952 -11542052 -15250379 -6448484 3032888 -673127 -10487799
37079a0487799L044607J7220725J1553526p557027j7664300j1529188J88990R128586
37071f101880J4084706J0534165n700018k3753963k3657402j954481K0966768
37064a5582105K4780941J1024310m106238r886471p142477p17037N760631R337681
37056A3469235Q031771K774083k720787m352462o97145M659857N258945q67523
37048B5555974p773885r395190p956447q518768q139770q1457J1664806J3854537
37040I209800L519755n427056j914929O046634M377509n587177j0081383l026683
37032b883530Q066817J4336904J3482712O370864m422362j2379404j2300778q385087
37024A886136q522099j0490715m193048J0537122J9808361J4415262K439988m043436
$$ plain form
37079 -10487799 -7443192 9777533 21331059 13774032 -3890268 -15419456 -15230466 -6101880
37071 -6101880 7982826 18516991 12816973 -10936990 -34594392 -36548873 -15582105
37064 -15582105 9198836 20223146 16116908 6230437 -912040 -1629077 4131554 13469235
37056 13469235 21501006 24275089 21554302 17201840 16504695 21164552 26423497 25555974
37048 25555974 17782089 8386899 430452 -8088316 -16228086 -16309543 -4644737 9209800
37040 9209800 12729555 7302499 5387570 11434204 15811713 10224536 143153 -2883530
37032 -2883530 5183287 19520191 33002903 39373767 34951405 22572001 10271223 1886136
37024 1886136 -6635963 -17126678 -21319726 -10782604 9025757 23441019 25881007 21837571
37016B1837571n710299r782739j4142579j0026815J749708R323301O322319L29539
37008i9994J070769P431259J1175842Q563176K737268k754966p556148j2024427
37000H542779j4899239j4237879r357698k184753K838718K290600j298576q74823
36992b9180871N949719J2161988J0246979L036316q15623l45371k212196o463557
36984g622616l698929Q212242J5687693P749484n833472p918176K83866K831689
36976I691781l688363n013157M972348J1611569K593769j1221634j1958645j370491
36968d382823M219548l37412m354071r46111L509200K298772p32518J775288R654061
36959A0703934J5281618J1237906k731661j6909907j7885264l627615R907053
$$ plain form
37016 21837571 16127272 6344533 -7798046 -17824861 -16075153 -6751852 -429533 -99994
37008 -99994 970775 8402034 19577876 28141052 30878320 28123354 20567206 8542779
37000 8542779 -6356460 -20594339 -29952037 -32136790 -29298072 -27007472 -28306048 -29180871
36992 -29180871 -23231152 -11069164 -822185 2214131 1398508 1053137 -1159059 -7622616
36984 -7622616 -11321545 -3109303 12578390 20327874 14494402 6576226 6860092 9691781
36976 9691781 6003418 990261 5962609 17574178 20167947 8946313 -3012332 -4382823
36968 -4382823 -163275 -500687 -4854758 -5800869 -2291669 7103 -725415 1049873 10703934
36959 10703934 25985552 37223458 34491797 17581890 -303374 -3930989 5976064
36952E976064N539373j2241036k0617683o902847J5403522K3950358J3783943
36945B4891694p73973o445879m817940m808936p983205p531950j024519L297446
36937e197262j527393q072289l486382R525458J3586086K393983q092104l210593
36929d080496Q216263Q767153l99384m190249P19511L566167O69421j98930K271430
36920A5340886m84234q498809r803017j668712K638670k835720m466398P425988
36912b351346J9025389J3461555j811322o977121q88436q4044j0276198j8296274
36904h197797j3774765k400772N991559R131612Q226421L972917O95805L639753
36896G284733Q261277L509011r385310j3760633j168552J3394344J1368852l171276
$$ plain form
36952 5976064 11515437 -725599 -21343282 -28246129 -12842607 11107751 24891694
36945 24891694 24117721 17671842 12853902 8044966 61761 -7470189 -8494708 -5197262
36937 -5197262 -6724655 -14796944 -18283326 -8757868 4828218 7222201 -869903 -4080496
36929 -4080496 4135767 12902920 12503536 8313287 9032798 12598965 13268386 13069456 15340886
36920 15340886 14856652 6357843 -3445174 -5113886 -2475216 -5310936 -9777334 -2351346
36912 -2351346 16674043 30135598 28324276 21347155 20458719 20374675 10098477 -8197797
36904 -8197797 -21972562 -24373334 -18381775 -9250163 -1023742 2949175 3644980 7284733
36896 7284733 15546010 19055021 9669711 -4090922 -5259474 8134870 19503722 16332446
36888A6332446j1127142o543451j400842l635642o689094m379332j369797j894580
36880b0707434p40854N347272Q385598K712251j809096N591566J6090160J2468617
36872B7338080l040061j1181241o086513k795922r493674j3118224l485380O953107
36864a4909828L219840o959721o606201K287684M223529k158665k687703P280924
36856a6310141J5391905J2030301J679925q190524j5229097j6090020o221707
36849c2939358R296018J6484323R423944k546914p937414m699722L031439J0139787
36841B52103J0900789L886718k863076j723672J063805m819523j2820889o961461
36833a3085206Q862952J1471362n184296j7697791r680759K297253k148229j2246184
$$ plain form
36888 16332446 5205304 -1338147 -2738989 -6374631 -13063725 -17443057 -18812854 -20707434
36880 -20707434 -21448288 -16101016 -7715418 -5003167 -6812263 -1220697 14869463 27338080
36872 27338080 24298019 13116778 7030265 4234343 -5259331 -18377555 -21862935 -14909828
36864 -14909828 -11689988 -18649709 -25255910 -22968226 -18744697 -20903362 -23591065 -16310141
36856 -16310141 -918236 11112065 12791990 4601466 -10627631 -26717651 -32939358
36849 -32939358 -23643340 -7159017 2264927 -281987 -8219401 -12919123 -9887684 252103
36841 252103 11152892 15039610 12176534 10452862 11516667 6697144 -6123745 -13085206
36833 -13085206 -4222254 7249108 2064812 -15632979 -25313738 -23016485 -25164714 -37410898
36825c7410898n324285J2829903J6103126J287756o324091O178131J9303872J2511519
36817A9155033n021286j0279854j32212P687719K331942o656689n712860L412170
36809D783963P498514J173922n576599j925969P587368Q836252j542230j0960634
36801I874587q569047J172226Q276318J1785276J5378864J5208466M659509j0710523
36793D7075676j5774935o155135M294847J706224r617047j4553343q397958j745581
36785c167252l518506p712240l494223O249125O952816n532515j5847585r546110
36777c5616490O233467J4053095J1772979J1325516J4362309Q391997q286394
36770B2236479j7192799o835077O553929J904322j4057823j6720921j071463J1758779
$$ plain form
36825 -37410898 -42735183 -29905280 -13802154 -12514398 -18838489 -12660358 6643514 19155033
36817 19155033 14133747 3853893 3721681 11409400 13741342 7084653 1371793 4783963
36809 4783963 12282477 13456399 7879800 5953831 13541199 22377451 20835221 9874587
36801 9874587 1305540 2477766 10754084 22539360 37918224 53126690 57786199 47075676
36793 47075676 31300741 25145606 29440453 31146677 21529630 6976287 -1421671 -3167252
36785 -3167252 -6685758 -14397998 -17892221 -11643096 -4690280 -10222795 -26070380 -35616490
36777 -35616490 -29383023 -15329928 -3556949 7768567 22130876 30522873 22236479
36770 22236479 5043680 -1791397 4762532 6666854 -7390969 -24111890 -25183353 -13424574
36762a3424574P330969k272664j705J0033181J1541619K452299l437969J56938
36754A2378094J950478q108146k1270388k1591955r059710J332275K260670K281864
36746c9826818Q078124J2319872P925862K631447O334085J2278195O722373o771570
36738I691570r938299K494699J3790156Q899526n564531j2172334m995085N782195
36730G987897P278402k110141j0801827p099684M596827P490715l043563r906131
36722e607505k85552J1263364L978043j4451416j7580948M2707J7356103J9795521
36714A4510317J3125418L941658p536921j2995638k016863J3127218P810576j3696031
36706A6269734j9171583M5782J3597350L231664p470135K487044J2632012k069953
$$ plain form
36762 -13424574 -6093605 -8366269 -8367974 1665207 13206826 15659125 12221156 12378094
36754 12378094 14328572 6220426 -15049962 -36641917 -45701627 -44369352 -42108682 -39826818
36746 -39826818 -31748694 -19428822 -11502960 -8871513 -2537428 9740767 16463140 9691570
36738 9691570 -246729 2247970 16038126 24937652 19373121 7200787 2205702 7987897
36730 7987897 15266299 13156158 2354331 -4745353 -148526 7342189 4298626 -5607505
36722 -5607505 -5893057 5370307 9348350 -5103066 -22684014 -22641307 -5285204 14510317
36714 14510317 27635735 31577393 24040472 11044834 9027971 22155189 29965765 16269734
36706 16269734 -2901849 -2856067 10741283 13972947 6502812 8989856 21621868 19551915
36698A9551915k4429544k1372370L561719J9889812J7515456J0679231O079306
36691C1475525j056264p359230o046334l546634p264106p891831K216965P853280
36683H381371n011701j9817341j3766044M103932J0865089R114583J3429929J4595783
36675B1895601k449650k0117040j1923523P968748O570597q152605k841292J4502452
36667E453288N028497k4191291k1906603J7266162L4417253K577856k6283790
36660g638628p999751K1631707J0891670k2228297k5876980O16919J6485197J0523751
36652c594412O141313R443964L938597r214829j0623396J4441M047661j065268
36644i11929r68884M465578J664075p892243r973557n181394m692713l508749
$$ plain form
36698 19551915 -4877629 -26249999 -22688280 -2798468 14716988 25396219 31475525
36691 31475525 30419261 23060031 17013697 13467063 6202957 -1688874 528091 8381371
36683 8381371 3369670 -16447671 -30213715 -26109783 -15244694 -6130111 7299818 21895601
36675 21895601 19445951 -671089 -12594612 -4625864 1944733 -6207872 -9049164 5453288
36667 5453288 10481785 -13709506 -35616109 -18349947 16067306 18645162 -7638628
36660 -7638628 -15638379 5993328 16884998 -5343299 -31220279 -30603360 -14118163 -3594412
36652 -3594412 2546901 11990865 15929462 6714633 -3908763 -3894322 153339 -911929
36644 -911929 -1880813 2584765 4248840 -3643403 -13616960 -18798354 -23491067 -26999816
36636b6999816J0682741K6462553K0291958k488327j2726408m358455q12394j0509211
36628d57359j2879289J212398J0609270J329140q535456j276804R730640M525239
36620D257779r394949j1473311j146743O518942P084384P044799O013366p83587
36612H120680p263098l110442O557503N934645o813510j5740618j0519259N41108
36604b2292991N417722M112458K896591K466347J59449k080488l76003L408316
36596f288599L866417N64532j768620p36775J867064N014689Q651846Q944640
36588B0115194J342736r564724j1906347k681637O292920M872385j245513j409383
36580E815631K636362J643237m476838p621597n698130k940054J156689Q847352
$$ plain form
36636 -26999816 -16317075 10145478 30437436 27949109 15222701 10864246 10051852 -457359
36628 -457359 -13336648 -12124250 -1514980 -185840 -8721296 -9998100 -267460 4257779
36620 4257779 -5137170 -16610481 -17757224 -11238282 -4153898 2890901 8904267 8120680
36612 8120680 857582 -2252860 4304643 10239288 3425778 -12314840 -22834099 -22292991
36604 -22292991 -16875269 -12762811 -9866220 -7399873 -7240424 -9320912 -9696915 -6288599
36596 -6288599 -2422182 -1857650 -3626270 -4363045 -2495981 2518708 11170554 20115194
36588 20115194 21457930 11893206 -13141 -2694778 3598142 8470527 7225014 5815631
36580 5815631 8451993 10095230 5618392 -2003205 -7701335 -10641389 -9484700 -637348
36572f37348J1750945j576546k3248483k8197666n775145K4007639L3756654J8143537
36564B8223587o390102k1596569k0178485o890024O067085R722479P382598P534265
36556C874834Q984282L602447o445607q295636J363571R315867M765771o568114
36548A0597415j3085343j1438788n004924J758854L459798j938186o770445k215668
36540b4637287O632545P256327N80190p82783M857162O062276J34379k927872
36532b825063p60629j441885l281545M100156J4641189R029585j0437638j7712022
36524h687852n271019L004454n636506j0900828J588931J2840318N503755m858861
36516a2417608j49915P718337L077791k851450K236031L520542j0458396j7739511
$$ plain form
36572 -637348 11113597 9537051 -13711432 -41909098 -47684243 -23676604 10080050 28223587
36564 28223587 21833485 236916 -19941569 -26831593 -20764508 -11042029 -3659431 3874834
36556 3874834 12859116 16461563 10015956 1720320 3083891 12399758 17165529 10597415
36548 10597415 -2487928 -13926716 -18931640 -17172786 -13712988 -15651174 -22421619 -24637287
36540 -24637287 -18004742 -10748415 -10168225 -10951008 -6093846 -31570 102809 -2825063
36532 -2825063 -3585692 -5027577 -8309122 -4208966 10432223 19461808 9024170 -8687852
36524 -8687852 -13958871 -10954417 -16590923 -27491751 -25902820 -13062502 -7558747 -12417608
36516 -12417608 -12567523 -4849186 -1771395 -4622845 -2386814 1133728 -9324668 -27064179
36508b7064179l03190J6857620N896922j1999159k901778J6375225O362203k2054267
36500a8830603k3728804J642434J0378712o443799j0147795J1384436K0743345
36493a5002074M27011j4310264J582740K0006807J1403984o437921o135117K033439
36485f431395k370849q033731M052182K0149999J5172598l932595j0566632m58206
36477G581371R062078J0268069Q151765K160776r971394j7819716r980214N925092
36469E377827J3360150J0124993N303952J094170o041503j2761175j2099650m722765
36461c64001L125797P107194M332840n046286j1717856n931807M475635K366362
36453a652122q927196p080668J1164821K0371450P068493q060289n964814Q19897
$$ plain form
36508 -27064179 -27367369 -10509749 -4612827 -16611986 -19513764 -3138539 3223664 -18830603
36500 -18830603 -42559407 -40916973 -30538261 -36982060 -47129855 -35745419 -15002074
36493 -15002074 -14575063 -28885327 -27302587 -7295780 4108204 -2329717 -8464834 -6431395
36485 -6431395 -8802244 -16835975 -12783793 7366206 22538804 18606209 8039577 7581371
36477 7581371 16643449 26911518 35063283 37224059 27252665 9432949 -547265 5377827
36469 5377827 18737977 28862970 34166922 35261092 29219589 16458414 4358764 -364001
36461 -364001 2761796 9868990 14201830 9155544 -2562312 -8494119 -4018484 -1652122
36453 -1652122 -10579318 -17659986 -6495165 13876285 20944778 12884489 6919675 7739572
36445G739572l634495p427570M211185J6100027P616274q169313m617019J2141636
36437B3960297J3119498m254389j2886937j770249Q478998J569311j1159471j2832613
36429D224445m977495O69581o93875n631410p998297k536273Q413768J2998308
36421D468752M441814o431925n567759K287445J437162p960282q868230N247170
36413a0945853J8593297J4681313j699835j1329155l788731J1131422J4387404
36406C1029862m92688j8333672k0228608q495819k387433p980671q782147O248543
36398b9422633K2154404J8954192M68207j2841068j0952726o90606P505617P516413
36390B691800o73651q006738l812101P140365Q075509k527415n486128O811532
$$ plain form
36445 7739572 4105077 -3322493 888692 16988719 24604993 16435680 11818661 23960297
36437 23960297 37079795 32825406 19938469 18168220 26647218 28216529 17057058 4224445
36429 4224445 -753050 -83469 -777344 -6408754 -14407051 -16943324 -8529556 4468752
36421 4468752 8910566 2478641 -3089118 -801673 635489 -7324793 -16193023 -10945853
36413 -10945853 7647444 22328757 20628922 9299767 5511036 16642458 31029862
36406 31029862 30537174 12203502 -8025106 -16520925 -18908358 -26889029 -35671176 -29422633
36398 -29422633 -7268229 11685963 12154170 -686898 -11639624 -12330230 -4824613 2691800
36390 2691800 2018149 -5988589 -9800690 -2660325 5415184 2887769 -2598359 4213173
36382D213173J4757964M433962o996479j461449O389996n094464k2981346j8106917
36374b4845560N858759J7296631O373814m292022L66258Q778713Q845506N826113
36366B4208212O481712O970117L315913k707130j0456366j7794565j4514962L118150
36358a378919J6487802O275580j4435577j5448280M121912J4510379K735364r850371
36350C017890n468013M321721L954911o28630J770582N872541J385584q074684
36342F151902j2128880r353281n091780k280305j662416k885049j602198N550440
36334b3301567J2406185J0411857K736677j520447l377157q187259r212643K038811
36326a8005543J3320764M968121j5282806j8945540j034346J2008137N513456
$$ plain form
36382 4213173 18971137 23405099 16408620 14947171 21337167 16242703 -6738643 -24845560
36374 -24845560 -18986801 -1690170 4683644 391622 757880 9536593 18382099 24208212
36366 24208212 30689924 37660041 40975954 38268824 27812458 10017893 -4497069 -1378919
36358 -1378919 15108883 21384463 6948886 -8499394 -4377482 10132897 12868261 3017890
36350 3017890 -2450123 1871598 5826509 5197879 6968461 12841002 14226586 6151902
36342 6151902 -5976978 -15330259 -20422039 -22702344 -24364760 -27249809 -28852007 -23301567
36334 -23301567 -10895382 -483525 2253152 732705 -2644452 -10831711 -20044354 -18005543
36326 -18005543 -4684779 283342 -14999464 -33945004 -34979350 -22971213 -17457757
36319a7457757k607860L813721J2783022Q553874j968587n385829m105747n047599
36311a1422762l863035L154084P671102M910750M661851J2275051J5018347K857848
36303C5263236j2196096j3283962k520840O227867O534833O4417r222460j2289364
36295a422369j407671J2617247Q109802j3513277k3385372p077681J2872355J2610172
36287e96794J166052j688854P61049m205325r606908q50789J5394435K0081030
36279B0453896J0623503j174483j0733563j9258792k0134389p788359P638889
36272b0373298J2949650J0498449P997158K379959q177281j1009994R08176J0228234
36264E401053L45548j4792719j1883575M096123J1759605J0368193J3396038J5234269
$$ plain form
36319 -17457757 -20065617 -16251896 -3468874 5085000 3116413 -2269416 -6375163 -11422762
36311 -11422762 -15285797 -12131713 -4460611 450139 5111990 17387041 32405388 35263236
36303 35263236 23067140 9783178 7262338 13490205 20025038 20089455 10866995 -1422369
36295 -1422369 -2830040 9787207 17897009 4383732 -19001640 -26079321 -13206966 -596794
36287 -596794 569258 -1119596 -358547 -4563872 -14170780 -15021569 372866 20453896
36279 20453896 31077399 29902916 19169353 -89439 -20223828 -28012187 -20373298
36272 -20373298 -7423648 3074801 11071959 13451918 5274637 -5735357 -4827181 5401053
36264 5401053 5746601 -9046118 -20929693 -16833570 -5073965 5294228 18690266 33924535
36256C3924535j22316k1973487k1459020J387090J4267018K159972j2483416q713662
36248a3013286L432840N806413P118k619720n21409J915102M175102N678497L020784
36239G881441k817188o423772p034132p119657l928620M424068Q913546K238440
36231c865874m180708L625148J4688970P166169j3288788j8578332l098026P565692
36223i965749l70890q351759l37336J0349176O125391o082757r410682k420074
36215b0464680O167207J2466977J3667313M886703q100994r417750K120949O815845
36207H141570m860337j4805636o339525Q935147J2013308O222493M717386M090199
36199A8114605n157330j3674466n241239J2468486J4881319k511255j7286071
$$ plain form
36256 33924535 33802219 11828732 -9630288 -8243198 6023820 8183792 -4299624 -13013286
36248 -13013286 -9580446 -3774033 -3766915 -6386635 -6908044 -4992942 -817840 4860657 7881441
36239 7881441 5064253 -1359519 -8393651 -15513308 -19441928 -15017860 -6104314 -3865874
36231 -3865874 -8046582 -4421434 10267536 17433705 4144917 -14433415 -17531441 -9965749
36223 -9965749 -10336639 -18688398 -19025734 -8676558 -2551167 -8633924 -18044606 -20464680
36215 -20464680 -14297473 -1830496 11836817 16723520 8622526 -795224 1325725 8141570
36207 8141570 3281233 -11524403 -17863928 -8928781 3084527 9307020 14024406 18114605
36199 18114605 12957275 -717191 -5958430 6510056 21391375 18880120 1594049
36192A594049j3364402j243437J843857l623662m961052J669621O587497K110172
36184i387357m826167j298028J1571253J6602825M987843p469029l025782P139559
36176A4295117k491061k7848769l4166429p145482K2811829K4361498Q367897
36169a815400L809044J0648988O532416j0807201j9362483r399976L380196N297350
36161a1717066K717290N399927R548923O870153j027421n780747l553219J854451
36153D312291L717249q04947o019946l030606O492996Q567857l552963j5548012
36145e866081r516624R602733J8972301Q209745q437842j2505245k870561P579519
36137E167945R076508K926626m500006j0352253j5189389j5547142l945047J6949717
$$ plain form
36192 1594049 -11770353 -13013790 -11169933 -14793595 -19754647 -18085026 -11497529 -9387357
36184 -9387357 -14213524 -15511552 -3940299 12662526 17650369 10181340 7155558 14295117
36176 14295117 11804056 -16044713 -50211142 -57356624 -34544795 -10183297 -1815400
36169 -1815400 1993644 12642632 19175048 8367847 -10994636 -20394612 -17014416 -11717066
36161 -11717066 -8999776 -3599849 5949074 12819227 11791806 6011059 2457840 4312291
36153 4312291 8029540 7224593 1204647 -1825959 4667037 13234894 9681931 -5866081
36145 -5866081 -15382705 -5779972 13192329 21402074 12964232 458987 -2411574 5167945
36137 5167945 14244453 17171079 12671073 2318820 -12870569 -28417711 -32362758 -15413041
36129a5413041K7377526J2391970j2110481j5036522N517030J6789901j41804
36122A9374579k1309091j7469763J926816Q424377R98819J127656J0868518J0140121
36114A4082032m524053j1041655J509216J5097391J2369301O36070o359210j0201960
36106A1567132j6171990j6481210k988032J3575941J4387906j560673j5869953
36099a3540879j4011107k59173J1141332J2334010O707317J116689k423931n523163
36091d458905o987294l984829L32017q06901n177102k378054P401220R159317
36083f900531k746933j1533083m036344N600991q14199j2310146n915915J2235040
36075b6421120J4816990p24927q283683J630197P877472l45705l575576R882235
$$ plain form
36129 -15413041 11964485 24356455 12245974 -2790548 2726482 19516383 19374579
36122 19374579 -1934512 -19404275 -17477459 -9053082 -8054263 -6926607 3941911 14082032
36114 14082032 9557979 -1483676 25540 15122931 27492232 28128302 21769092 11567132
36106 11567132 -4604858 -21086068 -24074100 -10498159 3889747 2329074 -13540879
36099 -13540879 -27551986 -27811159 -16669827 -4335817 2371500 3488189 1064258 -4458905
36091 -4458905 -11446199 -15431028 -15099011 -15905912 -21083014 -23461068 -16059848 -6900531
36083 -6900531 -9647464 -21180547 -25216891 -19615900 -20430099 -32740245 -38656160 -26421120
36075 -26421120 -11604130 -12329057 -20612740 -18982543 -11105071 -11450776 -15026352 -5144117
36067e144117J8579297M609408j1997124n066212J2609994R195222j4001145k4334876
36059a5549553p864718J3242634J5914989L387494q543766j2104660p174752L835484
36051a4856848J3292231J2011308J522306n960766l324808L502490N401408J87753
36043A1775074q445712j4710495j2587333j206154J0812837J3149413O423760
36036E211390Q08905K208192O371505O827029K319209m204807q914659r402105
36028A224659p502870p957917j0436093p091069N881686J8862299J9446077R338021
36020B1764793J224601N46154N79387l932610q349819o662131j029807J662364
36012E802932r92086m204470j284769Q379706J6086561J1834201k341732j2178375
$$ plain form
36067 -5144117 13435180 18044588 6047464 981252 13591246 22786468 8785323 -15549553
36059 -15549553 -23414271 -10171637 5743352 9130846 587080 -11517580 -18692332 -14856848
36051 -14856848 -1564617 10446691 11968997 6008231 2683423 6185913 11587321 11775074
36043 11775074 3329362 -11381133 -23968466 -25174620 -14361783 -1212370 5211390
36036 5211390 6020295 8228487 14599992 21427021 23746230 19541423 10626764 1224659
36028 1224659 -6278211 -14236128 -24672221 -31763290 -25881604 -7019305 12426772 21764793
36020 21764793 22989394 23535548 24114935 20182325 11832506 5170375 4140568 5802932
36012 5802932 4810846 606376 -678393 7701313 23787874 35622075 33280343 21101968
36004B1101968q461399J359815M774414R88841k491897m403788r449538j5977523
35996a2559107j5621763o060331M933361R328025N941748j569590p031757m056977
35988b6696391O411299J3562743R926181L002033L452861O836734J497028q713600
35980I278888p784109N235593J1742747K543249o940786j260637J0444026Q885708
35972C2144679o156326j6183789r523517N463990J2045323K988681j2328275j6171883
35964g721117j971605J4096092J0122272j1417760k3834473j1711386R233941
35957b3204036J7425604J4185234J1929682Q706121l809215j6514293j1945916
35950c226819N833345J4475758P468938J543376N791135P328679k892147j2328995
$$ plain form
36004 21101968 12640569 14000384 18774798 19763639 17271742 12867954 3418416 -12559107
35996 -12559107 -28180870 -34241201 -29307840 -19979815 -14038067 -15607657 -22639414 -26696391
35988 -26696391 -20285092 -6722349 3203832 6205865 9658726 16495460 17992488 9278888
35980 9278888 1494779 6730372 18473119 21016368 14075582 12814945 23258971 32144679
35972 32144679 25988353 9804564 281047 5745037 17790360 20779041 8450766 -7721117
35964 -7721117 -9692722 4403370 14525642 3107882 -20726591 -32437977 -23204036
35957 -23204036 -5778432 8406802 20336484 29042605 25233390 8719097 -3226819
35950 -3226819 2606526 17082284 24551222 26094598 31885733 39214412 36322265 23993270
35942B3993270r231042m021617j0376087j9163308j1661541R621349K3224958
35935B385982J8079360L252505r422979j5916079j3738649j683465J1433068J1937178
35927F326921o30147j2071204j3162646q952440n265119P62517J0389573J5755337
35919f847208J1491783M502980L334918N810750N899383M823712N327057K385424
35911C6728799q167134j7083766j1468102M884578J4137946P934454l771154r139285
35903A4056336p900879m820008j092485J645803j600376j0191795j3374599l668386
35895b6946389J0483314J4695935P852972J577750K050307L090340q29814n099735
35887F874680m087770j665425m576319j0433829j1408143o903515k544895J902547
$$ plain form
35942 23993270 14762228 10740611 364524 -18798784 -30460325 -20838976 2385982
35935 2385982 20465342 23717847 14294868 -1621211 -15359860 -17043325 -5610257 6326921
35927 6326921 5696774 -6374430 -19537076 -28489516 -33754635 -32992118 -22602545 -6847208
35919 -6847208 4644575 9147555 12482473 18293223 24192606 29016318 34343375 36728799
35911 36728799 28561665 11477899 9797 4894375 19032321 26966775 23195621 14056336
35903 14056336 6155457 1335449 242964 1888767 288391 -9903404 -23278003 -26946389
35895 -26946389 -16463075 -1767140 6085832 7663582 9713889 12804229 11974415 6874680
35887 6874680 2786910 1121485 -3454834 -13888663 -25296806 -32200321 -34745216 -32842669
35879c2842669J1034460J8731036J0179377j3083485k5669853j0844303J1786439
35872c0708998J1619150p719023j3980647M085572K1383119J7781255O130231
35865H590659M061942M154967n899690j5477563j0100433p72637m298575q668522
35857b8409852P156714K8500044K0216096j4288078l1322461j2266240J0302059
35850b0111718P694784k753173M775218J8743523J3799685m796374j3825498j1174760
35842g648313r565208n939353Q966827K1234391R429944j5599774k1388443l229860
35834b3739789J0951998P124455K100357O930435P253040o079407j6413065r370857
35826b1242833K503171K383949l485875q95344O516925P035414L372977M914849
$$ plain form
35879 -32842669 -21808209 -3077173 7102204 -5981281 -31651134 -42495437 -30708998
35872 -30708998 -19089848 -26808871 -40789518 -36703946 -15320827 2460428 8590659
35865 8590659 12652601 16807568 10907878 -4569685 -14670118 -15442755 -19741330 -28409852
35857 -28409852 -21253138 7246906 27463002 13174924 -18147537 -30413777 -20111718
35850 -20111718 -12416934 -15170107 -10394889 8348634 22148319 17351945 3526447 -7648313
35842 -7648313 -17213521 -23152874 -14186047 7048344 16478288 878514 -20509929 -23739789
35834 -23739789 -12787791 -5663336 -3562979 3367456 10620496 4541089 -11871976 -21242833
35826 -21242833 -18739662 -16355713 -19841588 -20736932 -14220007 -7184593 -3811616 1103233
35818A103233P172409r99878j5739322k1691986j3568860M71114J2680213J9167258
35810a1405819J4587355j483452j6162525j5942365n606830n99764k950130k80092
35802c9843622J1457679K0333628J6743113N601521l994513r055016q146420J092435
35794e811195J3201945J4622513Q20459j4612839j6894271r198099n098182p355788
35786c0325457o257819K319061R527370P730848K295299K403939O460075N617528
35778b29156n11911j865633N687609J1117656L017024j1804619j5023276j659836
35770a1272142J2391588J1562376K25755o110534k682296J279114j247494n844893
35762a698526n687454j978011p29020l372257n450548l520205K15525J124441
$$ plain form
35818 1103233 8275642 7275764 -8463558 -30155544 -43724404 -43253290 -30573077 -11405819
35810 -11405819 3181536 1698084 -14464441 -30406806 -36013636 -36613400 -39563530 -39843622
35802 -39843622 -28385943 -8052315 8690798 14292319 10297806 1242790 -6903630 -5811195
35794 -5811195 7390750 22013263 22833722 8220883 -8673388 -17871487 -22969669 -30325457
35786 -30325457 -36583276 -34264215 -24736845 -17005997 -14710698 -12306759 -5846684 -229156
35778 -229156 -741067 -2606700 3080909 14198565 17215589 5410970 -9612306 -11272142
35770 -11272142 1119446 12681822 12907577 6797043 4114747 5393861 4146367 -1698526
35762 -1698526 -7385980 -9363991 -10093011 -13465268 -18915816 -22436021 -22220496 -21096055
35754b1096055j295943j861134L743685J1574128J2318438L501205n154038l152443
35746a422157O469009J0463714K662858q769574j3165303r764797m175671J520139
35738a6181782P941826J1128458N372782n702351r553800q72846Q975190N583857
35730F691334q746960j6733002p599806R894913J8109569R708283n865903j2137354
35722f678926j391035J5983268J9499895J927294j7542819j4012498Q917275K0501133
35714B7203587M496530j7257503j6703262l0271N413755m470776o848848O896923
35706a299865J4947772N62938k0047578k1982643o384194P350081J1136388J0952558
35698d764543R229626L575298k543152m766880q032179j5560020j5247430K820261
$$ plain form
35754 -21096055 -22391998 -24253132 -20509447 -8935319 3383119 6884324 1730286 -1422157
35746 -1422157 5046852 15510566 18173424 9403850 -3761453 -13526250 -17701921 -16181782
35738 -16181782 -8239956 2888502 8261284 2558933 -6994867 -7867713 1107477 6691334
35730 6691334 -2055626 -18788628 -26388434 -16493521 1616048 11324331 5458428 -6678926
35722 -6678926 -8069961 7913307 27413202 29340496 11797677 -2214821 6702454 27203587
35714 27203587 31700117 14442614 -2260648 -2290919 3122836 -1347940 -8196788 -1299865
35706 -1299865 13647907 14210845 -5836733 -27819376 -34203570 -26853489 -15717101 -4764543
35698 -4764543 4465083 8040381 5497229 730349 -7301830 -22861850 -38109280 -35289019
35690c5289019K1958516J7073738n080092j2069106M741190J7323371P469812
35683A6128410n128065K39489R143269k17792j5870536j2016737M814307O524278
35675C616623o648336o471354J0998153J3972489j0978751l0407852j3307540
35668c9226568J9893040K7815743Q267665n221209K726791J2177895M851857j0565294
35660B0719920j7209912j2426656k549409Q050347J4092321R214338k891071q204965
35652H794913o50817Q992253Q620127l52085r483750j4535239j3632452m435305
35644a6682355Q678880J3444035M483321p874817j1285072o526603j263154L116343
35636a3909422Q753076J2228601Q808977J466033l184072l879812k538979R63362
$$ plain form
35690 -35289019 -13330503 3743235 -1336857 -13405963 -8664773 8658598 16128410
35683 16128410 11000345 11239834 20383103 20165311 4294775 -7721962 -2907655 3616623
35675 3616623 -3031713 -9503067 1495086 15467575 4488824 -25919028 -39226568
35668 -39226568 -19333528 8482215 16749880 11528671 14255462 26433357 31285214 20719920
35660 20719920 3510008 -8916648 -11466057 -3415710 10676611 19890949 16999878 8794913
35652 8794913 8144096 17136349 25756476 25404391 15920641 1385402 -12247050 -16682355
35644 -16682355 -8003475 5440560 9923881 2049064 -9236008 -15762611 -17025765 -13909422
35636 -13909422 -5156346 7072255 15881232 17347265 14163193 10283381 7744402 8707764
35628H707764M362155R87296q630196j1598828n61875J1747824R797042q67823
35620A3943359l932065P7010k842253j1967390j0432390M671138J3720207N171739
35612H409355n366434j73109J2489150J2170794k113606j1964918p504442J010860
35604F957650J235654l981679l534351L955191P092551j858757j3111038r872401
35596a3117180P052509J6379946N259737j0288380q010681O286583P718903p192798
35588D088639j3631382K046236J9491776J4499651o447482j8914067j4899343
35581a3765972o281262j789506J686523P411381J2421349J2788984O950364l776596
35573A5645265j2343338j0038734L20308M508710j903324m651638N267004J2892767
$$ plain form
35628 8707764 13069919 14057215 5427019 -6171809 -6733684 5014140 14811182 13943359
35620 13943359 10011294 10088304 7246051 -4721339 -15153729 -10482591 3237616 8409355
35612 8409355 3042921 2869812 15358962 27529756 25416150 13451232 5946790 6957650
35604 6957650 8193304 4211625 677274 4632465 11725016 9866259 -3244779 -13117180
35596 -13117180 -6064671 10315275 15575012 5286632 -2724049 3562534 11281437 4088639
35588 4088639 -9542743 -7496507 11995269 26494920 20047438 1133371 -13765972
35581 -13765972 -20047234 -21836740 -20150217 -12738836 -317487 12471497 19421861 15645265
35573 15645265 3301927 -6736807 -6416499 -1907789 -3811113 -8462751 -3195747 9697020
35565I697020K680285j1839302o544905J1860418J2183794j1636114k7030562
35558b0629366j0211831J8485515K4923540P886959o735119o639838l371871n262530
35550a554541m052810N948234J4121055R762031m46775l870707k664747q152531
35542I089209j7756552j4942266L498133J6704432Q228548p382364m578285J3261385
35534F122240J6756466m385658k3114072j4219593P767376R880678j1537196k7464209
35526d0193968j7913297M583009J7370475J5772729R810936N161094r07873r416040
35518a5732935j5034404j2261428k425169O598666P849222K821841n15689J493860
35510b7206036L729190K012945J331326P154857J3584698J0516365L93547l996956
$$ plain form
35565 9697020 12377305 538003 -6006902 5853516 18037310 6401196 -20629366
35558 -20629366 -30841197 -12355682 12567858 20454817 13719698 7079860 3707989 -1554541
35550 -1554541 -5607351 340883 14461938 24223969 23777194 19906487 17241740 9089209
35542 9089209 -8667343 -23609609 -20111476 -3407044 4821504 -2560860 -7139145 6122240
35534 6122240 22878706 18493048 -4621024 -18840617 -11073241 -1192563 -12729759 -40193968
35526 -40193968 -58107265 -53524256 -36153781 -20381052 -10570116 -5409022 -6316895 -15732935
35518 -15732935 -30767339 -43028767 -45453936 -38855270 -31006048 -28184207 -28699896 -27206036
35510 -27206036 -23476846 -21463901 -20132575 -12977718 606980 11123345 11516892 7519936
35502G519936N98460K410890o263358j5462413j1829894O85719N678888j781440
35494a8443212p212523K848114K0294638K4463714R673325p055570r725067m237569
35486A0605850n718564j3422274j3881802n467570p09368k168690L223514J8008613
35478i530291K3436824Q772539p625155n385782N637541K978563j0947980j5098472
35470g762213n985058J31097j692428L3739O201969L308000q006356q282313P446468
35461a4607095J7622875Q119386n810337o799748j987551l865961n111183M913169
35453g526445J4836082P547472r109156j2954480k078073N449017K682399J70066
35445i83118J292076m075075j5737012j5642519M349513K4269610K0542151j477506
$$ plain form
35502 7519936 8118396 10529286 4265928 -11196485 -23026379 -22340660 -16661772 -18443212
35494 -18443212 -25655735 -22807621 -2512983 21950731 31624056 24568486 14843419 10605850
35486 10605850 4887286 -8534988 -22416790 -27884360 -28593728 -30762418 -27538904 -9530291
35478 -9530291 13906533 22679072 15053917 9668135 15305676 18284239 7336259 -7762213
35470 -7762213 -13747271 -13616174 -15308602 -15274863 -9072894 -5764894 -13771250 -22053563 -14607095
35461 -14607095 3015780 11135166 5324829 -1474919 -3462470 -7328431 -12439614 -7526445
35453 -7526445 7309637 14857109 5747953 -7206527 -9284600 -3835583 -1153184 -983118
35445 -983118 308958 -3766117 -19503129 -35145648 -30796135 -6526525 14015626 12538120
35437A2538120j4720423o199851Q447680Q362681n358355j3623756o108473O106137
35429a0556240P713393K72661k885775K077377N950760L990779L211524P895518
35421A7669997J0736437N637395k006824o011031r118035j2481590p524444Q717844
35413E619749K0904845J3907622m056138j3419774j1315652r163494q320749m73115
35405f316706R453948N291268j1229076j6851699j548367J4321088J0809394k091828
35397A838022k929233P306814J0175800J098463n038233J126388J0257667J0009829
35389C3845517J427437n779475o565667m191342m515292r373257j3805698j0524323
35381a9482100K49832Q028235L981098o575990r963108j845665P339645O015913
$$ plain form
35437 12538120 -2182303 -8382154 65526 8428207 3069852 -10553904 -16662377 -10556240
35429 -10556240 -2842847 -2570186 -5455961 -3378584 2572176 6562955 9774479 17669997
35421 17669997 28406434 34043829 32037005 26025974 16907939 4426349 -3098095 5619749
35413 5619749 26524594 40432216 36376078 22956304 11640652 2477158 -5843591 -6316706
35405 -6316706 3137242 8428510 -2800566 -19652265 -21200632 -6879544 3929850 1838022
35397 1838022 -1091211 6215603 16391403 17489866 12451633 13578021 23835688 33845517
35389 33845517 35272954 29493479 22927812 18736470 14221178 4847921 -8957777 -19482100
35381 -19482100 -19232268 -11204033 -7222935 -13798925 -23762033 -25607698 -18268053 -12252140
35373a2252140m545214j2049313o249434J0570613K4244278K1125836K847751
35366B3692377j3520933j4353913n424992k187366p061261p426687K720107J2148280
35358a1414388J0292615M280707O146965J0790315K654976j7064301k6879719
35351b1192830j4242555N854807J1871231M860702K445036R162431J0082675l567449
35343E274048j8099189j6007834p47779R173042N849645q61461j001053L121118
35335a3299463N594898P121221R721017R199388J601913p676100j0057052n934293
35327c728471j998908N57239M535646N212764n773230k2170230k3395159j632540
35319d8392889K2986903K5901535Q709148o215558n775696K816290P913595O373778
$$ plain form
35373 -12252140 -16797354 -28846667 -35096101 -24525488 -281210 20844626 23692377
35366 23692377 10171444 -4182469 -9607461 -11794827 -18856088 -26282775 -23562668 -11414388
35358 -11414388 -1121773 3158934 9305899 20096214 22751190 5686889 -21192830
35351 -21192830 -35435385 -29580578 -17709347 -12848645 -10403609 -1241178 8841497 5274048
35343 5274048 -12825141 -28832975 -29580754 -20407712 -14558067 -15419528 -16420581 -13299463
35335 -13299463 -7704565 -583344 9137673 18337061 19938974 12262874 2205822 -3728471
35327 -3728471 -5727379 -5170140 -634494 4578270 -1194960 -23365190 -46760349 -48392889
35319 -48392889 -25405986 495549 9204697 2989139 -2786557 29733 7943328 14317106
35311A4317106N92276n386299n958203k62440K585503m477783j1903426n493905
35303a5987171R081313J2250556K025530k250980O619396J0261098l015861j5539378
35295C444503q444404O904567Q322684j952440o903903p209396j4892372k2000144
35287d2730905q094934K0633891L1506483J1893281j2375792j6030558o408661
35280b1607195k098452k359882L008488J0212614Q777204J978668J104162N763160
35272D778767O201163O22957m271164o584707r787323j2286526q659548l84775
35264c0371156N193230O131749O708929P326348L030105o360163j2630568r007937
35256b9979463J243472R130326J0143087P414053N362815L138631k455499q367835
$$ plain form
35311 14317106 14909382 9523083 3564880 3302440 5887943 1410160 -10493266 -15987171
35303 -15987171 -6905858 5344698 7370228 5119248 11738644 21999742 18983881 3444503
35295 3444503 -4999901 1904666 10227350 8274910 1371007 -5838389 -20730761 -42730905
35287 -42730905 -50825839 -30191948 1314535 13207816 832024 -15198534 -21607195
35280 -21607195 -23705647 -26065529 -23057041 -12844427 -4067223 -2088555 -984393 4778767
35272 4778767 10979930 11602887 7331723 747016 -9040307 -21326833 -29986381 -30371156
35264 -30371156 -25177926 -19046177 -12337248 -5010900 -1980795 -8340958 -20971526 -29979463
35256 -29979463 -28735991 -19605665 -9462578 -2048525 3314290 6452921 3997422 -4370413
35248d370413o447443K943219O423647m158034j5688562r774318Q837714J6870153
35240e364037O246265n312566k718688N812386O292972P60745j572293j602555
35232B542229l888290l299032O061542J5708962J2108246k853875j4236115j3966087
35224a822420o468941K674841J1593460J6724521J3285164K136677j0285866j8000690
35216I836746j7532006q831882P66808L81626r668241j4142723k196398J6480243
35208b4905827K3735949J4726035r66547j2802533j4850404n633995P691010J2380526
35200f25786O325509K091480N808644N118397q735744k1210178j5341282n3754
35192b6622714M304834r17878J370906J1404725J2744557L106002k008451J577820
$$ plain form
35248 -4370413 -10817856 -7874637 -1450990 -5609024 -21297586 -31071904 -22234190 -5364037
35240 -5364037 882228 -4430338 -7149026 -1336640 4956332 5717077 4144784 2542229
35232 2542229 -1346061 -4645093 1416449 17125411 29233657 26379782 12143667 -1822420
35224 -1822420 -8291361 -5616520 5976940 22701461 35986625 38123302 27837436 9836746
35216 9836746 -7695260 -16527142 -15760334 -15378708 -25046949 -39189672 -41386070 -24905827
35208 -24905827 -1169878 13556157 12589610 -212923 -15063327 -20697322 -13006312 -625786
35200 -625786 5699723 7791203 13599847 18718244 9982500 -11227678 -26568960 -26622714
35192 -26622714 -22317880 -23235758 -21864852 -10460127 2284430 5390432 3381981 4959801
35184D959801K40105r597430j2369236q92571R758672P171764P86454L484576
35176C542135J0100096P498945n422480j8308710k1114114r753642R727351K0267095
35168c463324J0733495m946728l265008J2447795J3932041p550222k4860168j6206613
35160b3178732K652437O717222l5825R65409P818258N563684j960505L309193
35152A851141K0287703K6003988Q909765j5369798k5794691j8051520j906210
35145d069622J0371281J0215251j571630j3102601j3360089n047114J894681N100082
35137i569761P951376Q405719L105548j165619M715152J4578149J2836633j493553
35129C9363644j2234073r909265k984891j005772j234370J065890J944525k687465
$$ plain form
35184 4959801 5199906 -4397524 -16766760 -17659331 -7900659 -728895 57559 3542135
35176 3542135 13642231 21141176 15718696 -2590014 -23704128 -33457770 -23730419 -3463324
35168 -3463324 7270171 2323443 -941565 11506230 25438271 17888049 -6972119 -23178732
35160 -23178732 -20526295 -13809073 -13844898 -12879489 -5061231 502453 -1458052 1851141
35152 1851141 22138844 48142832 57052597 41682799 15888108 -2163412 -4069622
35145 -4069622 6301659 16516910 14945280 1842679 -11517410 -16564524 -14669843 -9569761
35137 -9569761 -1618385 6787334 9892882 8727263 13442415 28020564 40857197 39363644
35129 39363644 27129571 17220306 14235415 13229643 11995273 13061163 15005688 12318223
35121A2318223p512413n904766o70390J241147p96568k887060l947834m554595
35113a2714256k556476L541851R526191R590284L939350j955531m030697k220377
35105C120339J347707L187022l28778q491150j4179018j0359864R53221R285223
35097a5465298O817345k277845n595350L418475J6526869J8943167O798657q058348
35089B1107672j3112070r653475o782905o201226k725560J870949k077673j5344301
35081c2918589k3078933j3217551N609726J4716611J0175558O011790J2458296
35074b0243092K1636108J9589875N414171q282545j0983565m615263J115484k69783
35066C361390o268607q873269l741816M114729O076986J493149j398133J497147
$$ plain form
35121 12318223 4805810 -1098956 -1769346 -528199 -1324767 -4211827 -8159661 -12714256
35113 -12714256 -15270732 -11728881 -2202690 7387594 11326944 9371413 5340716 3120339
35105 3120339 4468046 7655068 7326290 -1164860 -15343878 -25703742 -24750521 -15465298
35097 -15465298 -8647953 -10925798 -16521148 -13102673 3424196 22367363 29166020 21107672
35089 21107672 7995602 -1657873 -8440778 -14642004 -17367564 -15496615 -17574288 -32918589
35081 -32918589 -55997522 -69215073 -63605347 -48888736 -38713178 -32701388 -20243092
35074 -20243092 1393016 20982891 26397062 18114517 7130952 2515689 3631173 3361390
35066 3361390 -2907217 -11780486 -15522302 -11407573 -5330587 -3837438 -5235571 -3738424
35058c738424K883866l622831j0140220m519532R041223J3087303K431996p546231
35050b122850m061922N141729O740692K609232K140857L078801l373197j3107374
35042b954032j2254186M40521J0079092O709701l468557j0582493j2202268r188390
35034c3420612k643165K046056R2009j761361O954884J9514019J6341430l750673
35026C372587j5683047k767911J7945788J9994674K898459j3721984j9492934
35019g454368j7846380j0298438L318916J3823482J1397034K769023J770385N604397
35011C084051K7261j3210325j5870087k891313Q947209Q292375M663411P253599
35003B96181P750022k114465j2037709q544916K801806P154413L466931J169491
$$ plain form
35058 -3738424 -854558 -4477389 -14617609 -19137141 -10095918 2991385 5423381 -2122850
35050 -2122850 -6184772 -1043043 5697649 8306881 10447738 13526539 10153342 -2954032
35042 -2954032 -15208218 -14767697 -4688605 2021096 -1447461 -12029954 -24232222 -33420612
35034 -33420612 -36063777 -34017721 -33925712 -35687073 -28732189 -9218170 7123260 3372587
35026 3372587 -12310460 -15078371 2867417 22862091 25760550 12038566 -7454368
35019 -7454368 -25300748 -35599186 -32280270 -18456788 -7059754 -4290731 -2520346 3084051
35011 3084051 3111312 -10099013 -25969100 -28860413 -19913204 -11620829 -6957418 296181
35003 296181 8046203 5931738 -6105971 -14650887 -11849081 -4694668 -1227737 -58246
34995e8246Q25999l860636q911112m223980N421357L258521j1263056j6479765
34987c5290918o16857J7005222J2603776n942260r911232P195243J9367553O545602
34979A0956129j5454003j7303124L011730J9349157J4042808k211103j0628592
34972A763002r064288o938820o263011j133964P932207J2073154P406392M72987
34964F247659k075138j319864o83295o232Q99785p52954n044795o293692j902563
34955a0931089P83238n222520j2609333o765259J2399134K6233378K0027939J493528
34947B5409016j0907795j1484331q852968p652121k195727Q890750J4222441M667789
34939A2097054j0567477j3608526j256188J1271669J0747310J291019m446173
$$ plain form
34995 -58246 767753 -3092883 -12003995 -16227975 -10806618 -7548097 -18811153 -35290918
34987 -35290918 -35907775 -18902553 -6298777 -12241037 -22152269 -14957026 4410527 10956129
34979 10956129 -4497874 -21800998 -18789268 559889 14602697 12391594 1763002
34972 1763002 -7301286 -14240106 -20503117 -21637081 -13704874 -1631720 5774672 6247659
34964 6247659 4172521 2852657 2169362 2163130 3062915 2309961 -2734834 -9028526 -10931089
34955 -10931089 -10147851 -15370371 -27979704 -34744963 -22345829 3887549 23915488 25409016
34947 25409016 14501221 3016890 -5836078 -13488199 -15683926 -6793176 7429265 12097054
34939 12097054 1529577 -12078949 -13335137 -2063468 8683842 9974861 5528688
34932E528688k791700j256487n660544j1748627j1717231m980748K063212N738643
34924b4824794Q430301J0309859N519888o159562j1016302J814905J8482228J3593528
34916A6150051j1467523k4079146n327072K0680423K1373589K782360m231253
34909A5881429N674195P646387q336095k0399228j1982455K137984K380975n679731
34901a2676539o192839m39607L13116k903522o12275O988654J1952877J2191829
34893H621694R756342L007645o609390q611048J641429J0615914M367357r282101
34885A3507842j2493924m115001K735229L614542M608331N507889M74344o493184
34877G346068n510374N58098l27993p468271p752574J290563P727416O499808
$$ plain form
34932 5528688 2736988 1480501 -4180043 -15928670 -27645901 -32626649 -30563437 -24824794
34924 -24824794 -16394493 -6084634 -564746 -6724308 -17740610 -15925705 2556523 16150051
34916 16150051 4682528 -19396618 -24723690 -4043267 17330322 20112682 15881429
34909 15881429 21555624 29202011 20865916 466688 -11515767 -9377783 -6996808 -12676539
34901 -12676539 -18869378 -19308985 -18995869 -21899391 -22511666 -15523012 -3570135 8621694
34893 8621694 18378036 21385681 14776291 6165243 7806672 18422586 22789943 13507842
34885 13507842 1013918 -3101083 -365854 3248688 7857019 13364908 13839252 7346068
34877 7346068 1835694 2393792 2065799 -5402472 -13155046 -11864483 -4137067 2362741
34869B362741N339357O401974J914761o979860p451592J800744N014384l428797
$$ plain form
34869 2362741 7702098 14104072 16018833 9038973 1587381 3388125 8402509 4973712
$$ [...]
##END NTUPLES=NMR SPECTRUM
##END=
