##TITLE=31Pdec_ABPA2401A
 D2O, 64 sc
 25.1.2023
##JCAMPDX= 6.0         $$ Bruker NMR JCAMP-DX V2.0
##DATA TYPE= NMR SPECTRUM
##DATA CLASS= NTUPLES
##ORIGIN= UXNMR, Bruker Analytische Messtechnik GmbH
##OWNER= root
$$ XWIN-NMR		Version 3.5
$$ Wed Jan 25 14:57:01 2023 Russian Standard Time (UT+4h)  she@DPX200
##.OBSERVE FREQUENCY= 81.013821
##.OBSERVE NUCLEUS= ^31P
##.ACQUISITION MODE= SIMULTANEOUS
##.ACQUISITION SCHEME= undefined
##.AVERAGES= 64
##.DIGITISER RES= 16
##SPECTROMETER/DATA SYSTEM= spect
##.PULSE SEQUENCE= zgpg30
##.SOLVENT NAME= D2O
##.SHIFT REFERENCE= (INTERNAL, D2O, 0, 248.564)
##AUDIT TRAIL= $$ (NUMBER, WHEN, WHO, WHERE, WHAT)
$$ ##TITLE= Audit trail, XWIN-NMR		Version 3.5
$$ ##JCAMPDX= 5.01
$$ ##ORIGIN= Bruker BioSpin GmbH
$$ ##OWNER= she
$$ F:/spectra/data/she/nmr/P31/1/pdata/1/auditp.txt
$$ ##AUDIT TRAIL=  $$ (NUMBER, WHEN, WHO, WHERE, WHAT)
(   1,<2023-01-25 14:56:04.17 +0400>,<she>,<DPX200>,
      <continue with go, POWCHK disabled, PULCHK disabled
       configuration hash MD5:
       00 E9 B6 7A A2 85 ED C7 34 08 36 98 17 FE 4E 26
       data hash MD5: 32K
       9E 04 63 07 1B B4 D6 60 92 3E 91 B0 58 B8 EC 9C>)
(   2,<2023-01-25 14:56:06.93 +0400>,<she>,<DPX200>,
      <Start of raw data processing
       efp BC_mod = 2 LB = 1 FT_mod = 6 PKNL = 1 PHC0 = -11022.86 PHC1 = 188.8578 SI = 64K 
       data hash MD5: 64K
       C6 52 8F BB 2C E9 78 2B B3 9F 4A 11 D9 0E 84 04>)
(   3,<2023-01-25 14:56:26.39 +0400>,<she>,<DPX200>,
      <pk PHC0 = -17.0259 PHC1 = 5.2 
       data hash MD5: 64K
       7D 78 E6 50 53 2C 89 9D 2E 7A 73 93 68 F3 79 A3>)
$$ ##END=
$$ 
$$ hash MD5
$$ 4B 95 6A 4C AB 78 1C D2 EC D8 93 93 F5 1F FD 39
##$RELAX= 
##$RELAX= 
##$RELAX= 
##$RELAX= 
##$RELAX= 
##$RELAX= 
##$RELAX= 
##$RELAX= 
##$RELAX= 
$$ Bruker specific parameters
$$ --------------------------
##$DU= <F:/spectra>
##$EXPNO= 1
##$NAME= <P31>
##$PROCNO= 1
##$TYPE= <nmr>
##$USER= <she>
##$AMP= (0..31)
100 100 100 100 100 100 100 100 100 100 100 100 100 100 100 100 100 100 
100 100 100 100 100 100 100 100 100 100 100 100 100 100 
##$AQSEQ= 0
##$AQ_mod= 1
##$AUNM= <au_zg>
##$AUTOPOS= <>
##$BF1= 81.014009
##$BF2= 200.13
##$BF3= 200.13
##$BF4= 200.13
##$BF5= 200.13
##$BF6= 200.13
##$BF7= 200.13
##$BF8= 200.13
##$BYTORDA= 1
##$CFDGTYP= 0
##$CFRGTYP= 5
##$CHEMSTR= <none>
##$CNST= (0..31)
1 1 145 1 1 1 1 1 1 1 1 1 1 1 1 1 1 1 1 1 1 1 1 1 1 1 1 1 1 1 1 1 
##$CPDPRG= <waltz16>
##$CPDPRG1= <>
##$CPDPRG2= <waltz16>
##$CPDPRG3= <>
##$CPDPRG4= <mlev>
##$CPDPRG5= <mlev>
##$CPDPRG6= <mlev>
##$CPDPRG7= <mlev>
##$CPDPRG8= <mlev>
##$CPDPRGB= <>
##$CPDPRGT= <>
##$D= (0..31)
0 1 0 0 0 0 0 0 0 0 0 0.03 2e-05 3e-06 0 0 0 0 0 0 0 0 0 0 0 0 0 0 0 0 
0 0 
##$DATE= 1674644085
##$DBL= (0..7)
120 120 120 11 120 120 24 19 
##$DBP= (0..7)
150 150 150 150 150 150 150 150 
##$DBP07= 0
##$DBPNAM0= <>
##$DBPNAM1= <>
##$DBPNAM2= <>
##$DBPNAM3= <>
##$DBPNAM4= <>
##$DBPNAM5= <>
##$DBPNAM6= <>
##$DBPNAM7= <>
##$DBPOAL= (0..7)
0.5 0.5 0.5 0.5 0.5 0.5 0.5 0.5 
##$DBPOFFS= (0..7)
$$ [...]
##$SUBNAM2= <"">
##$SUBNAM3= <"">
##$SUBNAM4= <"">
##$SUBNAM5= <"">
##$SUBNAM6= <"">
##$SUBNAM7= <"">
##$SUBNAM8= <"">
##$SUBNAM9= <"">
##$SW= 501.771253377433
##$SWIBOX= (0..15)
0 1 3 0 0 0 0 0 0 0 0 0 0 0 0 0 
##$SW_h= 40650.406504065
##$TD= 32768
##$TD0= 1
##$TE= 0
##$TE2= 300
##$TE3= 300
##$TEG= 300
##$TL= (0..7)
0 120 53 12 22 120 120 120 
##$TP= (0..7)
150 150 150 150 150 150 150 150 
##$TP07= 0
##$TPNAME0= <>
##$TPNAME1= <>
##$TPNAME2= <>
##$TPNAME3= <>
##$TPNAME4= <>
##$TPNAME5= <>
##$TPNAME6= <>
##$TPNAME7= <>
##$TPOAL= (0..7)
0.5 0.5 0.5 0.5 0.5 0.5 0.5 0.5 
##$TPOFFS= (0..7)
0 0 0 0 0 0 0 0 
##$TUNHIN= 0
##$TUNHOUT= 0
##$TUNXOUT= 0
##$USERA1= <user>
##$USERA2= <user>
##$USERA3= <user>
##$USERA4= <user>
##$USERA5= <user>
##$V9= 5
##$VALIST= <valist>
##$VCLIST= <CCCCCCCCCCCCCCC>
##$VD= 0
##$VDLIST= <DDDDDDDDDDDDDDD>
##$VPLIST= <PPPPPPPPPPPPPPP>
##$VTLIST= <TTTTTTTTTTTTTTT>
##$WBST= 1024
##$WBSW= 4
##$XGAIN= (0..3)
0 0 0 0 
##$XL= 0
##$YL= 0
##$YMAX_a= 9465
##$YMIN_a= -17735
##$ZGOPTNS= <>
##$ZL1= 120
##$ZL2= 120
##$ZL3= 120
##$ZL4= 120
##$ABSF1= 0
##$ABSF2= 0
##$ABSG= 0
##$ABSL= 0
##$ALPHA= 0
##$AQORDER= 0
##$ASSFAC= 0
##$ASSFACI= 0
##$ASSFACX= 0
##$ASSWID= 0
##$AUNMP= <proc_1d>
##$AZFE= 0.1
##$AZFW= 0.5
##$BCFW= 0
##$BC_mod= 2
##$BYTORDP= 0
##$COROFFS= 0
##$CY= -3
##$DATMOD= 1
##$DC= 0
##$DFILT= <>
##$DTYPP= 0
##$F1P= 0
##$F2P= 0
##$FCOR= 1
##$FTSIZE= 65536
##$FT_mod= 6
##$GAMMA= 0
##$GB= 0
##$INTBC= 1
##$INTSCL= 6.047779e-11
##$ISEN= 30
##$LB= 1
##$LEV0= 0
##$LPBIN= 0
##$MAXI= 10000
##$MC2= 0
##$MEAN= 0
##$ME_mod= 0
##$MI= 50
##$NCOEF= 0
##$NC_proc= -7
##$NLEV= 6
##$NOISF1= 182.463
##$NOISF2= 159.3651
##$NSP= 0
##$NTH_PI= 0
##$NZP= 0
##$OFFSET= 248.5645
##$PC= 4
##$PHC0= -11039.89
##$PHC1= 194.0578
##$PH_mod= 1
##$PKNL= yes
##$PPARMOD= 0
##$PSCAL= 0
##$PSIGN= 0
##$REVERSE= no
##$SF= 81.0140089999694
##$SI= 65536
##$SIGF1= 159.3651
##$SIGF2= -187.1042
##$SINO= 113.3802
##$SIOLD= 16384
##$SREGLST= <1H.CDCl3>
##$SSB= 0
##$STSI= 65536
##$STSR= 0
##$SW_p= 40650.406504065
##$SYMM= 0
##$S_DEV= 0
##$TDeff= 32768
##$TDoff= 0
##$TI= <>
##$TILT= no
##$TM1= 0
##$TM2= 0
##$TOPLEV= 0
##$USERP1= <user>
##$USERP2= <user>
##$USERP3= <user>
##$USERP4= <user>
##$USERP5= <user>
##$WDW= 1
##$XDIM= 65536
##$YMAX_p= 416288134
##$YMIN_p= -60944385
$$ End of Bruker specific parameters
$$ ---------------------------------
##NTUPLES= NMR SPECTRUM
##VAR_NAME=  FREQUENCY,     SPECTRUM/REAL,   SPECTRUM/IMAG
##SYMBOL=    X,             R,               I
##VAR_TYPE=  INDEPENDENT,   DEPENDENT,       DEPENDENT
##VAR_FORM=  AFFN,          ASDF,            ASDF
##VAR_DIM=   65536,         65536,           65536
##UNITS=     HZ,            ARBITRARY UNITS, ARBITRARY UNITS
##FACTOR=    0.620285442955139, 1,           1
##FIRST=     20137.2065510682, 0,            0
##LAST=      -20513.1999529968, 0,           0
##MIN=       -20513.1999529968, -60944385,   0
##MAX=       20137.2065510682, 416288134,    0
$$ Real data points
##PAGE= N=1
##DATA TABLE= (X++(R..R)), XYDATA
$$ [...]
41171 2104409 4588888 4127659 1070001 -1090003 347513 4168797 6493542 5047506
41163 5047506 1386993 -1438253 -2207446 -1392931 995834 5031639 8468008 7464168
41155 7464168 1137015 -6185793 -8904909 -5800188 -763377 1673720 769520 -328969
41147 -328969 1402026 4928110 6044458 2731593 -1845105 -3370084 -1947421 -879975
41139 -879975 -957386 204715 3149640 5154732 4858021 4218609 4278552 3135280 349859
41130 349859 -850162 1244745 3416743 2726761 1133207 867213 -568154 -5372543 -9105243
41121 -9105243 -6088454 1129016 4839520 3565564 3023437 5746791 7346072 4721770
41113 4721770 1146534 445847 1729480 2729648 3450095 3736617 1845662 -1702138 -3111924
41104 -3111924 -923822 1514358 1789196 2124541 4346634 5915829 4789529 3703157
41096 3703157 5094456 5911775 2698048 -1626425 -1809764 1455562 3142124 1958531
41088 1958531 952319 1208501 882537 228659 1898214 5719769 8269284 8431869 8654288
41079 8654288 9684195 8794356 4887079 1126419 398102 1667816 2869803 4109233
41071 4109233 5694533 5859703 3056940 -1413879 -5074713 -6806863 -6273303 -3172416
41063 -3172416 949529 2413703 -477493 -4549500 -5410260 -2829317 -165794 508021
41055 508021 136932 48767 186206 259485 641066 1409192 1759499 999896 -529207 -1766672
41045 -1766672 -1748582 -324164 1414940 1814918 427800 -1368528 -2228944 -2629083 -3721788
41036 -3721788 -5048951 -4910805 -2870454 -410141 1070499 1594140 1711429 1586907 1386967
41027 1386967 1388330 1327002 893486 1139916 3628542 7466152 9250822 7391212 4470351
41018 4470351 3306731 2703223 91598 -3198382 -3334497 -203916 2095181 1586432 866406
41009 866406 1754301 1986389 -67720 -1491462 656588 4218330 5519421 5228108 5944367
41000 5944367 6545878 4648725 2852595 5716134 10831778 10193597 1965450 -5891591
40992 -5891591 -6424415 -1972948 1691025 3444639 4426361 3112626 -1098268 -3449211
40984 -3449211 213659 5610541 5136290 -556941 -3215342 782348 5898684 6662797
40976 6662797 4908098 4738928 5598390 4602526 2293135 1591220 2754863 3232473 1880140
40967 1880140 228142 -426468 -724166 -1503295 -2056297 -1129400 911749 1835915 28814
40958 28814 -2895242 -3069059 1132488 6498911 8423411 6347945 3845022 3546266 4439757
40949 4439757 4721165 4751753 5566250 6235210 4845121 1476013 -1500195 -2057126 -359518
40940 -359518 2074311 4210261 6107321 7938889 8911997 7825268 4913563 2315926
40932 2315926 1957878 3606620 5794705 7671434 8687534 7714732 4707319 2428601
40924 2428601 3609789 6426594 6062361 1604425 -2012821 -835842 2460204 2765503
40916 2765503 118118 -778823 2214205 5898400 6787192 5570107 4929765 5339518 5235127
40907 5235127 4072185 2982966 2668995 2417203 1554958 745805 1314835 3818728 7483331
40898 7483331 10565529 11273409 9145835 5843922 3787765 3474271 2924075 566591 -2159024
40889 -2159024 -2410905 287136 3530756 5376624 6442726 8002186 9626759 10017304
40881 10017304 9080186 7732463 6280135 4369590 2241944 831696 694122 1665113
40873 1665113 3328255 5038889 5882027 5500922 4647933 4125356 3656993 2687842 1702496
40864 1702496 1611668 2301602 3041877 3989035 5923094 8566560 10447418 10643967 9811620
40855 9811620 9416248 10516272 12930389 14883964 14058760 10026185 5283419 3036057
40847 3036057 4375038 8097716 12113092 14127071 12553078 8385354 4876237 3799088
40839 3799088 3714588 3682564 5979353 11721360 16191311 13529345 5234990 -1157372 -1883893
40830 -1883893 -146803 1020438 3025226 6675729 8619205 6521281 3428624 3150783
40822 3150783 5007310 6765291 8796114 11095629 10313002 5170275 1340144 4572313
40814 4572313 11526264 14375265 12676557 12688583 15338420 13857596 5601544 -2090637
40806 -2090637 -2199950 2373665 4664178 3760716 3232583 3553941 2667615 1712721 3584943
40797 3584943 6538813 5331067 -608076 -5265574 -3865882 1243255 4327831 3126418
40789 3126418 261639 -418623 2312202 5865907 6318013 3045994 -34844 429547 2563034
40780 2563034 2795417 2487872 6175472 13240345 16859722 13136597 6407050 2621182
40772 2621182 1884482 1384177 1735621 5124827 9413944 9771691 5764227 1997406 1339211
40763 1339211 1718957 600064 -1004939 -514341 2734910 7185803 10430112 10410240 7142060
40754 7142060 3350987 1494202 738622 -520267 -282372 4599941 11645992 13658763
40746 13658763 8153967 1135892 -1190964 -76319 -74050 -1324931 -906705 713805 60258
40737 60258 -3223691 -5347550 -3909918 -979337 3586 -2016068 -5280637 -6721716 -4307282
40728 -4307282 413996 3176316 2263355 1122402 3152266 6146147 5778957 2766282
40720 2766282 1637672 3278597 4107442 2775378 2052560 2924974 2443076 -334803 -1530232
40711 -1530232 1226207 4244671 3461595 855563 721808 2473322 2054070 -1215024 -3994551
40702 -3994551 -4416407 -3947436 -3875395 -3719079 -3494229 -4302023 -6002996 -6931728 -6466337
40693 -6466337 -5551037 -4354263 -1978398 824945 1210458 -2162846 -6940830 -9775742
40685 -9775742 -9722637 -7757646 -4530837 -486977 2670919 2920908 724529 -751993 717852
40676 717852 3465968 3969030 1472942 -1141750 -1480144 -620588 -608443 -897907 132473
40667 132473 1379567 280483 -2189583 -1689990 3090573 7851752 8632814 7061552 6681117
40658 6681117 6854274 4359355 -469290 -3514889 -2717780 -548186 -38042 -1134242 -1818433
40649 -1818433 -816847 1392718 2780531 1116338 -3113971 -5683604 -2960231 3005120
40641 3005120 6549291 5643851 3877457 4506729 6038408 5609476 3770509 3094364 3877850
40632 3877850 4204416 3451429 2996667 3460763 3551951 2330428 1049143 1639730 3958556
40623 3958556 5547641 4417503 1576951 24577 1161484 3292301 4333510 4603482
40615 4603482 5324594 5649411 3888644 1231361 880054 2862383 3286294 505939 -1564261
40606 -1564261 533939 3475237 1562827 -3936050 -5502811 -294539 5037896 3583557
40598 3583557 -1849429 -2788959 2811766 8042385 7096172 2796456 1384761 3483867
40590 3483867 4485628 2348009 349975 1517838 4184586 4983850 3548820 1881760
40582 1881760 894846 128559 -198430 594201 1846282 2148421 1401104 308404 -1565530
40573 -1565530 -4700727 -6916287 -4935249 644855 4888880 4371517 973174 -1667960
40565 -1667960 -2861918 -3772709 -3928722 -1968879 1284110 3586549 4726907 6442827
40557 6442827 8895442 9904800 8235869 5344497 3064959 1611400 895467 1894943
40549 1894943 5080492 8623661 9825622 8007398 4991563 3020260 2898470 3827764
40541 3827764 4408228 3972575 3248418 3467723 4847873 6493055 7569479 7590764 5866815
40532 5866815 2459412 -117384 1445982 6605403 10215699 8616627 4734541 4303715
40524 4303715 8114682 11388846 10705724 8002679 6713656 7057182 7028470 5914700 4815885
40515 4815885 4931820 6711257 9484252 11009991 9053420 4409384 435130 -1326594
40507 -1326594 -2364668 -2811533 196110 6718392 10615646 7100691 924325 700624
40499 700624 6419878 9752318 7033859 4241483 6699110 11240569 12898379 12920860 14332439
40490 14332439 14760842 10767642 5771025 5898286 9682187 9707393 4376744 421991 2306296
40481 2306296 6208852 7393290 7390262 9679194 12827582 12751385 9131657 5308136 3304675
40472 3304675 2404522 1668772 1106079 1010783 2010402 4753984 8167207 9725569 9024187
40463 9024187 8895018 10925645 12325105 10176847 6711098 6685259 10738204 15109732 17414230
40454 17414230 18901454 20778207 21896973 21258051 20211715 20961576 24635983 31423891
40446 31423891 40725126 50510686 58241002 63050351 65668396 66113561 63295027 57176598
40438 57176598 49472996 41765758 34541743 28187127 23068470 18675391 14861812 13647914
40430 13647914 16698880 20841446 20070120 13502563 7437633 7005774 9400119 8868574
40422 8868574 5244581 2856386 2935628 2456198 191285 -1191414 -47886 1608807 2039588
40413 2039588 2560409 4224372 5036948 3353574 1589907 3210182 7315923 9399045
40405 9399045 7137017 2897766 453438 1240684 4000375 6335245 6334864 4108405 1983052
40396 1983052 2028207 3429727 3673191 2205881 1100733 1739713 2845054 2878155 2669159
40387 2669159 3951386 6320424 7602196 6987982 6054228 6396670 7648661 8394296 7999459
40378 7999459 6934716 6151834 6738882 9242934 12449896 13768901 12181879 10150037
40370 10150037 10763655 13164398 13115201 8932187 4528482 4621010 8568993 11590789 11203069
40361 11203069 9334977 8047462 6718872 4950176 5039254 8636144 12859398 13216590
40353 13216590 9814183 7303970 8263781 9846739 8530273 5570184 5069151 7801978
40345 7801978 9896960 8080687 4023436 2079872 3870376 6860143 8175622 8079621
40337 8079621 8783123 11042108 13445431 14570481 14174474 12268676 8829977 4952957
40329 4952957 2494982 1563599 -42618 -3585585 -7050486 -7617453 -5126484 -1336827
40321 -1336827 2810227 6879747 9177731 8303336 5957087 5170336 5848633 5180528 2590709
40312 2590709 750016 870967 744034 -850713 -1353372 1367883 5018615 6276659 5860481
40303 5860481 6578056 7907988 6586983 2221648 -1478802 -1704422 228135 1670713
40295 1670713 2267985 3413787 5653507 7983878 9055680 8361680 6700685 5717122 6506969
40286 6506969 8620908 10690870 11578490 10603772 7731236 4425959 3139204 4555124
40278 4555124 6307374 5892245 3836341 2362846 2175043 2666702 4019961 6308314 7499052
40269 7499052 5726459 3159127 3874242 7649843 9887188 8682555 7688939 9844991
40261 9844991 12427205 11850128 10153142 12095488 17324701 20116929 17005648 10871193
40253 10871193 6653905 6084149 7862329 10481762 13013720 14543289 14647348 14129111
40245 14129111 14375871 16077622 18711696 20839224 20985398 18971216 16343722 14708529
40237 14708529 13872473 12798129 12175786 14148893 18717366 22128836 20571723 14881704
40229 14881704 10010291 9717258 12925497 15735055 16173832 16019645 17949282 21851546
40221 21851546 25042970 26071409 26733984 29109875 31892790 32147867 30531074 31619267
40213 31619267 37629261 44637614 47741804 47932949 50273929 56420035 63362282 69817742
40205 69817742 79048730 93186876 108596071 119792135 124894476 124066664 115896345 100123825
40197 100123825 81957334 68129321 58992619 49612915 38770534 31171532 29296547
40190 29296547 28840380 25450358 21280953 20721080 23167657 24617138 23955658 22992200 21836711
40181 21836711 18965092 15325542 14122614 16300216 19529941 21670782 22200980 20538161
40173 20538161 16372731 11790907 9732046 9928734 9462912 7659890 7064351 8865447
40165 8865447 10814406 11010131 10672258 11464671 12609948 12433523 10840080 8918302 7875245
40156 7875245 9153296 13293831 17794042 18790498 16174481 14293793 16037477 19189399
40148 19189399 20672026 21185879 22541777 23129694 20165581 15047403 12277670 13243379
40140 13243379 14730216 14092025 12644474 12714544 13824880 13564203 10951708 7488391 5403879
40131 5403879 5731288 7827316 10276564 12322175 14409165 17084952 19572533 20042312
40123 20042312 17569969 13617454 11206334 12256035 15736963 19006577 21056383 23306735
40115 23306735 26593762 29114705 29186977 28514031 29780149 31785228 30703814 26601207
40107 26601207 24791684 28986440 36334648 41641443 44017627 46841385 53075924 62931964
40099 62931964 74191541 82297390 82035255 72332030 58525781 47356465 40620572 35878890
40091 35878890 31573427 28032288 24546042 19526408 13868003 10790886 11553124 13970642
40083 13970642 15875691 17483592 19364568 20404912 19282959 16573443 14130636 13050421
40075 13050421 12790094 11852436 9519052 7454791 8576842 13013762 16503327 15096770
40067 15096770 10501337 7857396 8745476 9962869 9563120 10069398 13813038 18396029
40059 18396029 19648572 17081534 13595184 11076376 9077289 7266504 6492698 7050448
40051 7050448 7708282 7028209 4733665 1850859 448215 2679608 8347359 13421163
40043 13421163 13074957 7242782 1638110 1740164 6664876 10636667 9951842 6426951
40035 6426951 3894607 3723496 5030856 7229576 10108951 12468778 13106353 12869495 13589105
40026 13589105 15114621 15598213 14702386 14074905 14358613 14446242 14418042 16217896 19907034
40017 19907034 22075402 20187109 16280306 14009873 13921526 14057864 13443779 12309558 10404927
40008 10404927 7910017 6722332 7929966 9121292 7246373 3250600 721957 667444
40000 667444 970044 561878 556685 1194158 1195651 650608 1230126 2772118 2779651 343169
39990 343169 -2218254 -2660575 -1236042 971797 3401059 4778594 3426858 164695
39982 164695 -1657530 -376968 2131271 3934802 5523771 7286563 7560392 5515068
39974 5515068 3427487 3468762 4315784 3653020 2212788 2381767 4139211 5389464 5484885
39965 5484885 5550712 5858701 5709846 5690728 7132684 8974556 7959048 3123146 -1971767
39956 -1971767 -3034556 90558 3667804 4437991 2496799 154694 -766909 -82103 1470289
39947 1470289 3152451 4472284 5265298 5893741 6872624 7924045 7904324 6136283 3352639
39938 3352639 923076 -240896 288425 2406873 4769755 5437462 4269556 3286777 3439689
39929 3439689 2858181 179175 -2455549 -2514260 -1339450 -1690130 -2414741 -9978 4923917
39920 4923917 7451879 5043963 318811 -3475700 -5282951 -4030075 1008750 6170063
39912 6170063 5568738 -24175 -2330278 2690227 8205471 6884427 2344085 3088852
39904 3088852 9033888 12412335 10186599 7034516 6109765 5112856 3048621 3190591 6313417
39895 6313417 7564200 4062100 266727 1279567 5048613 6071004 3662777 1517495
39887 1517495 1122278 631986 -590444 -862269 360487 1664370 2694519 4728430 7564959
39878 7564959 8781379 7290114 5359077 5637784 7689528 8841640 7584015 5053609
39870 5053609 3547296 4050271 4970697 3599725 -330236 -3131269 -1035941 4423280
39862 4423280 7370100 4974607 1404545 2151358 6307139 7826979 3957594 -1163485
39854 -1163485 -2189257 1166143 5162459 6896606 5982194 3261681 470816 123255
39846 123255 3109557 6833507 7966536 6598339 5328831 4773039 3000947 -292302
39838 -292302 -2277547 -998352 1595216 2314974 686599 -1287032 -1902440 -990358 405113
39829 405113 656557 -729174 -1422567 1539386 6849766 8990529 5363497 854774 2089328
39820 2089328 8693589 13841879 12905176 8017978 3794221 1891668 1163409 677642 572782
39811 572782 973784 1535938 1775304 1307595 255713 -286600 1117007 4689070 8862038
39802 8862038 11485374 11430695 9188823 6354727 4467251 3961262 4219445 4612518 5041814
39793 5041814 5464773 5740719 6232296 7584476 9431250 10403078 10095861 9858458 10676574
39784 10676574 11473644 10831278 9380995 8844167 9326870 9378313 8629840 8594889 10240421
39775 10240421 12013535 11426072 8376705 5852786 6557156 9270282 10046692 7478763
39767 7478763 4859922 5538462 8055207 8704348 7484452 7645891 9843113 11197789 10625656
39758 10625656 10335322 10737772 9000268 5159550 4573025 10415891 17941422 20547121
39750 20547121 17973249 14135525 10692024 8023505 8799243 13893635 17488266 13641384
39742 13641384 6096259 3755847 7233642 8546490 4779724 2647664 6413280 10196834
39734 10196834 7820907 3200008 3921197 9249483 11935547 9441699 6381078 6426540
39726 6426540 7779718 7486982 5807525 4816637 5399743 6781487 7443947 6144025 3331227
39717 3331227 1533201 3128114 7785370 12850608 15784711 15654929 13224425 10535829
39709 10535829 9609698 10688086 12348304 13618485 14868898 16353927 17334280 17112001
39701 17112001 15573584 12589719 8714545 6590102 9143327 15514991 21022517 22229331
39693 22229331 20146283 17731937 16563768 16956466 18993855 22103593 25359435 28830305
39685 28830305 32661068 34969742 33842841 31609399 33138092 39011647 44716345 47883623
39677 47883623 51336501 56737661 60598335 60125639 58052777 57337619 55710886 50552120
39669 50552120 44851180 42359701 40518862 34981412 28331325 26829759 30072009 31543332
39661 31543332 29042027 26961063 27545428 27246081 23626856 19363619 16914222 14959869
39653 14959869 12793826 12846335 15717794 17515494 15582094 12738698 12369263 13087072 12066050
39644 12066050 10470473 11507459 15213243 18720595 20164646 19582810 17630146 15829896
39636 15829896 16231215 18522022 19544341 17901961 16521273 17940302 19793588 18521930
39628 18521930 15232733 13631018 13660987 11873688 7737994 5045708 6179234 8579012
39620 8579012 8315943 4680002 43257 -2857983 -2560679 391889 3299168 3220640 -11008
39611 -11008 -3508638 -4464506 -2680641 217731 2944636 5288700 7271760 8196185 6892177
39602 6892177 3455601 526311 1277696 5386566 8663937 8087179 5572850 4797753 5889146
39593 5889146 6092544 4632550 3396045 2920846 1458266 -1093131 -1917499 260855 2569639
39584 2569639 2313210 1342615 3021905 6645935 8417092 7139692 5359662 4856492 4526286
39575 4526286 3568863 3485328 5187079 6742694 6205303 4752828 4666606 5676350 5848928
39566 5848928 5037398 4743665 5215996 5506934 6064312 8160391 10620673 10491408 7750324
39557 7750324 5921294 6624656 7109284 5427611 4415727 7010901 10551925 10255400 6646555
39548 6646555 4725999 6397437 8483771 8442631 7402279 6574381 5068577 2966016 2675899
39539 2675899 5131743 7935249 9251322 10170584 11059944 9404413 4513590 898068
39531 898068 2700760 7237278 8734274 6893602 6699883 10135868 13169036 12055793
39523 12055793 8448536 6202811 6022106 5608397 3558681 1098615 322932 1707726
39515 1707726 3516158 3860546 3237837 3621503 4560734 2776014 -2307522 -5453296 -1938118
39506 -1938118 4880897 7380785 4546518 3349566 8111183 14125705 14791968 10428320
39498 10428320 6027544 3796491 2601901 2572951 5159583 9077692 10533739 8153529
39490 8153529 4694341 3242863 4017370 5310796 5545940 4125535 2092844 1974117 4992137
39481 4992137 8496166 8537594 5370823 3849547 7233051 12753152 15020241 12435775
39473 12435775 8439302 7079748 8963167 11537754 12222982 10842950 9364953 9562827
39465 9562827 11150856 12382618 12162049 10997640 10005177 9664472 9702765 9706314 9630130 9819745
39455 9819745 10384162 10557943 9393445 7392472 6388674 7021263 7567600 6695200 6173603
39446 6173603 8661197 13440050 16989263 17855735 18137232 19361361 19828478 17881804 15419057
39437 15419057 15486476 17709789 18872432 17526242 15399878 14087849 12845053 10669730
39429 10669730 8713598 9048942 11851480 15138234 17022701 17180012 16148037 14322002
39421 14322002 12244046 11105787 11720015 12835233 11658888 7045052 1568509 -835506
39413 -835506 767648 3543514 4670962 4505114 5238221 7658959 10545378 12604349 13557972
39404 13557972 13406076 11985521 9770949 8241303 8662665 10664551 12473940 12613963
39396 12613963 11181607 9437983 8435750 8351863 8916769 9718858 9873657 8389922 5707447
39387 5707447 4038298 4864760 6622848 6515035 4432539 3102006 4012864 5390325 5278577
39378 5278577 4560600 5027251 5915938 4836912 1729801 -483395 219464 2117358 1961683
39369 1961683 -631737 -2229476 488112 6323200 10258312 9212743 5923286 5359633
39361 5359633 8079413 10010221 9122192 8685017 11717767 15341483 14490225 9708823 6855884
39352 6855884 8796463 11396248 9538097 4321948 1741510 5364480 12519107 17677829
39344 17677829 18172080 16019721 14702711 15017721 14741155 12131989 8490002 6487888
39336 6487888 6901724 8102096 8254302 7026276 5550553 5494417 7564372 10239863 10967937
39327 10967937 9435326 8239963 9052073 9840798 7987139 4689801 3625838 6061888
39319 6061888 9852021 12548240 12861156 9921429 4414638 131850 861491 5446784
39311 5446784 9141629 9968705 10015440 10120861 7968378 3216630 27445 1403275 4441369
39302 4441369 4723663 2815076 2629867 5116110 7477186 7959201 7861875 8587724 9489072
39293 9489072 9482534 9100253 9930778 12367199 14249368 12439859 6824994 1986856 2514238
39284 2514238 6814177 8843326 6598919 4807229 7197766 10442695 9552442 5877297
39276 5877297 4759297 7119692 8675013 7107664 5061669 5206501 6471597 6809249
39268 6809249 6685161 7895298 10566473 12721831 12189542 8824544 5468971 5682156 9090219
39259 9090219 10522228 6276926 -47816 -1333311 4039248 10652153 13641391 13811777
39251 13811777 13975551 14009133 12166995 8970747 6932806 7196878 8433706 8936445 8711349
39242 8711349 9336997 11835689 14585564 14149152 9201279 2904706 -24123 1973805
39234 1973805 6784920 11566010 14201666 13258042 9521002 6798406 7851152 9977441
39226 9977441 8362861 3636346 1590400 4579679 8029416 7595317 5292210 5285367 7321609
39217 7321609 8388152 8304740 9332554 11619380 13049612 13040375 13029426 13456963 13411441 13269079
39207 13269079 14673705 17376764 18618477 16508553 12306168 8832722 8044750 10239914
39199 10239914 13938271 16329341 15606618 13323350 12886776 15347977 18394520 20068565
39191 20068565 21474329 24390490 27701794 28250455 24914419 20215027 17601280 18146403
39183 18146403 20230832 21701788 21888228 21922272 23436724 26701109 29966933 31196272
39175 31196272 30649621 30952891 33951649 38322598 41412880 42684751 43572303 44330410 43618079
39166 43618079 41933484 42736373 48145964 55522450 60906600 64427633 69118174 74971831
39158 74971831 77947277 75922488 72543062 72917143 77133971 80470748 79726995 77314512
39150 77314512 78021399 82473875 85531057 82322989 74791484 69649398 69582518 69818242 65428911
39141 65428911 58708507 55359984 55569769 54186487 49448759 45854940 46606053 48151849
39133 48151849 45674459 40674669 38958053 42356626 45986788 43904693 35450607 25710278
39125 25710278 20708816 22056338 25797386 26865530 24631198 22972578 24787031 28050816
39117 28050816 28111782 22815304 14711645 8896159 8782124 13217446 17934142 20327804
39109 20327804 21533603 22804484 22447175 19226434 16302149 17232456 19618658 18199136
39101 18199136 13591760 11640288 13581414 13802968 9405339 5102087 5207824 7095379
39093 7095379 6888171 5807978 5982641 5541430 3512740 4254927 10419868 16325001 15845870
39084 15845870 12751953 14654612 19858400 19908799 13815411 9659026 11426644 13788598
39076 13788598 12109304 9013442 7837217 7186569 5743295 5753236 7781541 8146296 5696762
39067 5696762 5302473 10071061 15573272 16758796 15422368 15236231 14350274 9823153 5646985
39058 5646985 8423999 16613223 21631881 19712224 15931463 15388918 16548756 15729434
39050 15729434 13204102 11416002 10336609 8158545 5120794 3699557 5202210 7994668
39042 7994668 9392317 8454983 6565305 5466291 5227423 4793040 4260480 5023541 6955952
39033 6955952 7293866 4257148 711323 1675277 7981710 14514991 15737790 11736104
39025 11736104 7609385 7326294 9353076 8890353 3914100 -2162016 -4356317 -1547341
39017 -1547341 3301253 7506529 10998042 14161375 15940813 15545858 14309884 14019057
39009 14019057 14277796 13135801 9939308 6362437 4726250 5861145 8295325 9411016
39001 9411016 8206411 6918295 8547576 12629193 15387216 14748064 12938751 12705720
38993 12705720 13227436 12135386 9976383 9692414 12098153 14550571 14459799 12087425 9261138
38984 9261138 6962787 5215423 4463854 5823954 9550329 13566830 14541962 11533713
38976 11533713 8087109 8852654 13829366 18080391 18087516 16018950 15816099 17293973 17280399
38967 17280399 15543525 15876087 20631228 27082490 30771253 30725446 29730181 30371006 32338680
38958 32338680 33434326 32124669 28932037 26013728 25694869 28842618 33897042 37515998
38950 37515998 37091956 33228873 29154098 27123611 26228255 24589038 22510007 21708265
38942 21708265 22275025 22718019 22677465 22978057 22888239 20324017 15654923 12418506 12780262
38933 12780262 14793431 15724090 15498411 14939534 13337118 10501774 8937872 10673359
38925 10673359 13471861 13598003 11365082 10465041 12173939 13689818 12633561 10160640
38917 10160640 8556361 8031227 7281741 5920164 5120552 6171126 8817264 11179439
38909 11179439 11821975 11759792 13008034 14930228 14265707 9903233 5197267 3599609 4211978
38900 4211978 4116141 3081537 3001347 4218428 5498273 6467440 7212787 6802347 5161835
38891 5161835 4782436 7145155 9228970 7690407 4855129 5598578 9390223 11071600
38883 11071600 9210442 7587094 7785355 6703817 3205731 1002029 2039939 2714593
38875 2714593 315739 -1858784 -140332 3151635 3803363 2633730 3267524 5609560
38867 5609560 6530995 5230897 3365554 1458171 -444002 -199173 3567158 7251217
38859 7251217 5999941 1144773 -1230599 634190 1750267 -1650903 -6513455 -7820602
38851 -7820602 -5428073 -2936889 -1999216 -962443 1508355 4021191 4296901 2362812
38843 2362812 974948 2428628 5378185 6240103 4171213 2697157 4878916 8692160
38835 8692160 9645678 6827734 3582663 2695621 3644777 4605666 4639400 3535356 1592531
38826 1592531 -7570 -226778 321635 254345 -633161 -1794042 -3286567 -4579478 -3240747
38817 -3240747 2111246 8230492 10112517 7448918 4837220 5362040 7578589 9432129
38809 9432129 11190463 12998179 13159205 10988221 8493669 7184239 5804946 3211733
38801 3211733 909833 574905 1397427 2039602 2976694 4752918 6194717 6573734 7184162
38792 7184162 8462466 8253625 5837506 4833293 8191890 12554445 12258452 7745801
38784 7745801 5081543 7200594 10334884 10127647 7295347 5455146 6186256 8082156
38776 8082156 8956172 7768749 5518534 4533265 5738425 7263064 7516900 8312565 11805030
38767 11805030 15384706 14073347 8265138 4289838 5746926 8873408 9020160 7328065
38759 7328065 7197727 7706274 5459947 1093982 -1091213 375454 2272215 1739831 -308689
38750 -308689 -1621346 -1529231 -419993 1341455 2876748 3037091 2143671 1969615 3265756
38741 3265756 4741563 5093801 4573669 3959039 3503058 3568423 4713246 6293431 6597644
38732 6597644 5540334 5677070 8846176 12804422 13189231 8741030 3051054 771733
38724 771733 3077500 7352631 10705492 12868414 15211890 17443344 16808806 11626822
38716 11626822 4559586 425476 932780 3602063 6005637 8427706 11243939 12506521
38708 12506521 10721524 8326771 9365499 14153377 18753609 19654816 16909880 12915023
38700 12915023 10358082 11274043 15584650 20096855 21151310 18735078 15891068 14016906
38692 14016906 11726385 8974671 8645235 12096185 16385358 18572837 19878440 22301945
38684 22301945 23782021 21021073 15489798 11942650 11624806 11599100 10638903 10709396 11852105
38675 11852105 10948986 7598506 6164581 8863225 11369296 9409143 5804761 5826821
38667 5826821 8487861 8529419 5558038 4581716 7178237 8659004 6161561 3880742 6536845
38658 6536845 11761950 13463033 10367271 6822695 6187855 7481580 8597169 9339763
38650 9339763 10267565 10913630 10500750 9237850 8101691 8029907 9490836 11970687 13861681
38641 13861681 13898859 12819802 12569253 13746546 14989594 15154808 14866902 15323140 16689118
38632 16689118 18501287 20635431 22730661 23461724 21958654 19731040 19510163 21796828
38624 21796828 24061002 24108259 22754437 21938169 21704402 21194570 21570825 24812487 29374404
38615 29374404 30449013 26203291 20848054 18948644 19164064 17282228 13883124 14219671
38607 14219671 20081927 26256855 27119975 23518112 20534598 20660785 21956527 21709963
38599 21709963 19408396 16669597 16093489 19501617 25519226 29528419 27897456 22010884
38591 22010884 16642425 14815747 15842190 17841406 20058107 22435853 24587906 25788011
38583 25788011 25109044 21647254 15764826 10023003 7491315 8783803 11701626 13894682
38575 13894682 14906950 15573763 16506821 17454070 17401330 15317603 11635611 8800948 9122009
38566 9122009 11848994 13478890 11480670 7087854 4021455 4785823 8306555 10984626
38558 10984626 10273305 7382777 5865552 7292753 9482426 9787897 8714380 8663734 10200643
38549 10200643 11783184 12767439 14261798 16629457 18251230 17725693 15883623 14586096
38541 14586096 14313629 13791476 11823806 9213053 8595324 11571123 15925333 17419726
38533 17419726 15343408 14112265 17136701 21140012 20149584 14160986 9593643 10720414
38525 10720414 14676486 16379283 14833582 12373593 10480669 9069150 8259290 8441503
38517 8441503 9362732 10599406 12068129 13226474 13119025 11990008 11217568 10929113 9705018
38508 9705018 7517036 6527433 7618128 8614440 7701675 6177278 5783575 5777779 5149483
38499 5149483 5396256 7959864 10648368 10046196 6599914 4198422 5065090 7605996 9050910
38490 9050910 8175195 5789548 4102492 4831874 6838846 7290816 6271050 7294208 11146685
38481 11146685 12982083 9362244 4709465 5517535 10741050 14006139 13557145 13074723
38473 13074723 13370558 11018238 6164144 3979940 5989410 7254372 5549793 6162899
38465 6162899 12706178 19532506 19442547 13959938 9381559 6772414 3204183 -65394
38457 -65394 1266416 6290084 9341031 8884574 9029842 11302857 11591527 7286878 1649029
38448 1649029 -1526805 -2660883 -3162088 -2042944 1187408 4189327 5427815 6585000
38440 6585000 8437828 8228950 4775699 2374781 4893874 8952968 8414356 3768753
38432 3768753 1258188 3374182 6138009 6402804 6128688 7324624 7551116 3720641 -2674382
38423 -2674382 -7187193 -7337771 -3702253 1836950 6590862 7708378 4926726 1401910
38415 1401910 -347344 -1701671 -4672280 -7284201 -5989384 -1889867 -258528 -3090865
38407 -3090865 -5936478 -4005884 1503720 5645915 6262282 5464573 5535836 6123916 5701385
38398 5701385 3778921 979749 -1830102 -3790389 -4193222 -3003063 -892617 1555142
38390 1555142 4389427 7773592 11105858 12960073 12135634 8963989 5487636 3881206
38382 3881206 4420733 5311229 4815456 3265084 2561784 3849729 6129807 7255783 6103783
38373 6103783 3753465 2621861 4256749 7692880 10017981 8920811 4968751 1321646
38365 1321646 901690 3636299 6613241 7133610 5355755 3533131 3053653 3279232 3371453
38356 3371453 3805960 5068964 5906772 4479925 1105007 -1494538 -1004782 2126595 5266583
38347 5266583 6001397 4085449 1545176 719602 1906241 3433215 4205507 4917292 6058830
38338 6058830 6470720 5507979 5045805 6942727 9596852 9797572 7408988 5287068 4814916
38329 4814916 4680521 4227827 4655964 6119332 6772665 5799923 4647012 4368201 4603135
38320 4603135 5834014 9181746 13036718 13937000 12258669 12488502 15628059 16440582 11875460
38311 11875460 7203856 8554911 13416616 14832045 12185049 10844674 12481488 12949334
38303 12949334 10091568 7058102 6352206 6139316 4546042 3048899 3340119 4497703
38295 4497703 5267637 6018612 6781523 6278353 4350311 2664098 1963264 1405751 1347392
38286 1347392 3491536 7253035 9348715 8318794 6310107 5201557 4312961 3251640
38278 3251640 3438424 5050511 5821829 4771258 3906956 4357817 4124410 1776778 -802706
38269 -802706 -1529239 -862661 573462 3674312 7821580 9752734 8222019 6334902 6356640
38260 6356640 5957176 3116201 870475 2613927 5885472 5989428 3400633 2171948
38252 2171948 2732376 2074510 398975 1658099 6753735 11303237 11822480 10147058 9737603
38243 9737603 10642160 10394705 8124543 5696210 5180056 6286510 6743688 5415494 4277316
38234 4277316 5635867 7884752 7121426 3476149 1803500 4242136 6441666 4397652
38226 4397652 849923 419022 1998254 1516549 -356197 556857 4344225 6675759 5666045
38217 5666045 3644084 2317892 1416159 1910752 5107513 8422817 7702642 4290474 4098183
38208 4098183 8645608 12702625 12308001 9531202 7358018 5427348 3453441 3670395
38200 3670395 6573181 8447757 6294782 1738058 -2276615 -4839648 -5134688 -1792367
38192 -1792367 3121213 4256814 537337 -1934361 1662253 7807569 10350494 9230971
38184 9230971 8540743 9198756 8885610 6997903 4765548 2251044 -427253 -894984 2112616
38175 2112616 5281908 5105204 3568714 4619324 7116420 6879682 4188070 3183931
38167 3183931 4504677 4611069 2515464 1197349 1622480 1191256 -553262 -408085 2219585
38158 2219585 2958111 -598659 -4281500 -3374070 422701 2165849 1237232 1371113 4184388
38149 4184388 6612171 5270070 870122 -2772023 -3139462 -1481459 -614981 -803529 467761
38140 467761 3757290 5094433 957949 -5771739 -8735098 -6443450 -3412058 -2668023
38132 -2668023 -1927930 1133573 4429932 5207398 4617841 5164182 6378909 6553505 6498676
38123 6498676 7873887 9470597 8990057 7416245 7739525 9813410 10328871 8097064 5695106
38114 5695106 5002702 4476963 2478709 554500 1171203 3938842 6382373 7475956 8152148
38105 8152148 8637013 7614747 4786993 2498317 3238114 6255061 8372514 8193183 7743656
38096 7743656 9178857 11430629 11575308 8470454 3451197 -1625477 -5158879 -5653005
38088 -5653005 -3387206 -1669596 -3326365 -5986176 -4435346 1681681 6521726 6051943
38080 6051943 3294436 2810905 3913967 3480968 2309209 3311074 5102880 3242090
38072 3242090 -2166207 -5549112 -3775154 -368580 67988 -2195631 -3923004 -3714046
38064 -3714046 -2480005 -1322371 -1004954 -1837225 -2650977 -1694605 451458 1078545 -671655
38055 -671655 -2825794 -4499836 -7074597 -9692112 -8000523 -812698 5907508 6286476
38047 6286476 2729311 1718002 3908813 4551164 2464747 1708568 3779737 4789091
38039 4789091 2522937 597400 2483740 5995467 7175775 5958785 4444094 2736825
38031 2736825 310569 -969920 849597 3975151 4758743 2460280 -564700 -2290679
38023 -2290679 -2215723 -468867 1872130 2881842 2300407 2241339 3442858 3417396 1009165
38014 1009165 -325923 2372244 6158486 6694230 5476802 6604730 8363916 5351614
38006 5351614 -1433899 -4509959 -1331050 1788506 -28657 -3184415 -2997553 -1547436
37998 -1547436 -2503528 -3426807 35854 5711438 7487068 4492960 1432495 734396 353648
37989 353648 -731328 -482220 1823332 3833649 4003352 3494244 3159725 2109810 406128
37980 406128 -47319 1367424 2797028 3231897 4425708 7839754 11616566 12324517 8745087
37971 8745087 2992672 -1399188 -2242611 -334692 1782283 3148368 5188274 8203587
37963 8203587 9430612 7085782 4065525 4034659 5740126 5588440 4183812 4754260 6041505
37954 6041505 3536697 -1670198 -2693253 2136093 5374193 1705086 -3633426 -3399528
37946 -3399528 320768 521091 -2918070 -3894458 -846090 957364 -1940610 -6859711
37938 -6859711 -10150495 -10842180 -8003596 -267773 9714365 15145486 12367942 5138376
37930 5138376 -350547 -1608784 520201 4514303 7837794 7136645 1966456 -3534323
37922 -3534323 -5077518 -2601903 1528096 6149149 10545958 12431725 10234556 6416780
37914 6416780 5285627 7563924 9573634 8050993 4036406 1656412 3946797 9746698
37906 9746698 14303155 13794920 9694452 7237059 8960877 11814899 11881850 9519807 7600435
37897 7600435 6827042 5908963 5080299 6070257 8885907 11501357 12790294 13419718 13939008
37888 13939008 14203914 14444205 14678730 13614140 10756082 8951873 11342978 15791798
37880 15791798 16360169 11448227 6606641 7173766 11404186 13657674 11860354 8662306
37872 8662306 6978941 7793934 11513041 17967890 24573580 27187631 24264446 19057303
37864 19057303 16598025 18677699 22275518 23121045 20691245 18897367 21100426 25525500
37856 25525500 27611155 26408919 25722231 28230459 31668798 32824928 32648067 34374985
37848 34374985 38140458 40805009 40895270 40858482 43692478 49091046 53860500 55598356 55539332
37839 55539332 57349026 62304078 66331732 64196696 56903777 51777665 53637180 59017722
37831 59017722 61530662 59813114 56791465 53912392 50588734 47570326 46107608 44743712
37823 44743712 41501147 38345002 38457889 39679626 36441042 28624406 22466323 21234111
37815 21234111 21039072 18314314 15507720 15718392 16964328 16344824 15581577 17383491 19706555
37806 19706555 18889461 15962233 14660052 15151152 14864406 13874889 14060394 14041515 10717016
37797 10717016 5613660 3959906 6711516 8915612 7456434 5280545 5593988 6524072
37789 6524072 4978311 2437605 3043026 7680332 13170398 16359117 16551858 14726818
37781 14726818 12585391 11956259 13287085 14815410 14426889 12075074 9536019 8422273
37773 8422273 9364406 12222976 15583199 16549025 12997141 6602967 2178046 2774483 6097321
37764 6097321 7200787 4701217 2561743 4744120 9771679 12778585 12078430 10781671
37756 10781671 11703769 13835053 15135131 15850835 16874810 17256626 16113848 15279840 17142710
37747 17142710 20978118 24055320 25331999 25541842 24918946 23765722 24090467 27304045
37739 27304045 31031212 31688559 29809433 29295718 31604590 34357482 35859940 37286182
37731 37286182 39822109 43147718 47489395 53832218 61245128 67130533 70911500 74506231
37723 74506231 78751910 82636315 86238152 90480728 93511978 91707319 85129817 77479324
37715 77479324 69849344 60004286 49262402 43488053 43911123 43283915 36041778 26873561
37707 26873561 23351238 24492979 23348369 17948170 12870517 11561863 13287484 16623710
37699 16623710 20212475 20879340 16659659 11273616 10242767 12912761 13679663 10814128
37691 10814128 8253414 8306840 8581139 7415214 6726921 7461948 7202089 4674629 2359616
37682 2359616 2219315 2603864 1656390 307624 -214777 -461121 -357498 1748082 5451492
37673 5451492 7215040 5418998 3209847 3706610 5635911 6676716 7903983 11164918
37665 11164918 14447591 13890785 9147241 3385999 -1088268 -4224944 -6005122 -5704959
37657 -5704959 -3346462 -55105 2847630 4205071 3553904 2156235 1945516 2701394 2518852
37648 2518852 1877454 3887960 8695539 11487388 9222128 5833326 6597583 10225662
37640 10225662 11425566 9186846 7101625 6654588 5834349 4173168 3657317 4165108 3313824
37631 3313824 1750394 3171428 7451371 9217549 5905129 2125296 2470595 4570249
37623 4570249 3810087 1193797 1073579 3431194 4202902 2460994 1787827 4012349 6268179
37614 6268179 5588285 2711277 -178551 -2389903 -3823836 -3836568 -2709156 -2028540 -2089644
37605 -2089644 -1147947 1168108 2202716 323237 -1544594 607761 6178287 10721080
37597 10721080 11637448 10188772 8319184 6642944 5771880 6545313 8133605 8583487 8105294
37588 8105294 9072146 11678954 12748785 10797855 9190193 11257331 14766513 15064686
37580 15064686 12152043 10227997 10594733 9689184 5354462 979075 922424 4572097 7734565
37571 7734565 8269744 7640407 7712655 8533923 9247094 9273572 8254546 6217615 4262396
37562 4262396 4024253 5773141 7583020 7090533 4061585 741662 -564104 169612 1338906
37553 1338906 2261049 3703769 5600200 6009414 3712830 571741 -465101 1094683
37545 1094683 3407279 5038492 5628827 4842434 3238215 3434957 7279323 12118139 13368973
37536 13368973 11022530 9748950 11670783 13187493 10844348 6373392 3160901 1199109
37528 1199109 -1072987 -2758153 -2097137 -31563 1409069 2551654 4475592 5807590
37520 5807590 5010672 4348402 7215437 12323810 14890903 13341688 10641896 9000815
37512 9000815 7614834 6237754 6647467 9116855 10965122 10220495 7969311 6010373
37504 6010373 4922562 5180434 7092509 8820813 7732098 4578831 2820979 2977218
37496 2977218 1960438 -501404 162187 5936436 11375850 10468958 4890958 816977
37488 816977 281601 718184 1110581 3138220 6788127 9671198 10727861 10531656 8271166
37479 8271166 2968445 -2361848 -2968553 204332 619117 -4137308 -7861703 -4660148
37471 -4660148 1918913 3893816 494812 -1209236 2867955 8147743 8568319 4927480
37463 4927480 2380363 2385768 1937110 349644 1702190 8077745 13978244 11856093 2230134
37454 2230134 -6068025 -6514959 -1916041 1084439 936866 1110700 3349208 5540492 6130004
37445 6130004 6555723 8052998 9049249 7535170 4147195 1328014 697327 2303289 5096917
37436 5096917 7113411 6615190 4238256 2680182 3077334 3178355 659766 -3184675 -5117355
37427 -5117355 -4273792 -2438531 -638262 1679557 3749294 2758884 -2214220 -7435044
37419 -7435044 -8027742 -3725547 799050 1385648 -1412592 -3956202 -3867196 -1726096 613220
37410 613220 1907690 1795900 552862 -769503 -747808 1017576 3206432 4177091 3908284
37401 3908284 3848917 4830706 5885262 5510596 3674878 2108760 2673132 5570922 8998731
37392 8998731 10428359 8478099 3951426 -684264 -2892044 -1653534 1811367 4744277
37384 4744277 4905192 2504170 -74686 -700843 667993 2618211 3899548 3974824 3003258
37375 3003258 2187093 3073418 5155469 5249373 1318842 -3798763 -5183347 -2308741 362816
37366 362816 -10601 -950736 419862 2107476 456609 -3476598 -5007548 -2621335 387943
37357 387943 1321947 1260855 1806024 2155158 1209720 -177634 -981550 -1690379 -2378706 -1488278
37347 -1488278 1278634 3117202 1784389 -818568 -1535157 -646293 -506416 -1086310 -624568
37338 -624568 325501 -368520 -2059971 -2041791 -762994 -1661022 -4790388 -5437328 -1262828
37329 -1262828 3484278 3858837 760504 -1651411 -1924429 -1081963 853515 4060593 6594871
37320 6594871 6774248 6241351 6907733 6830972 3622819 132073 1117481 5048757 5508100
37311 5508100 1375618 -894313 2516873 6328334 3956337 -2735311 -6421532 -4371807
37303 -4371807 -630615 692231 -67803 -472363 499184 2285867 4312462 6690362 9561141
37294 9561141 11776985 10948770 6423979 1870483 2143417 6943603 10629729 9630999 6700566
37285 6700566 5662589 5490578 3167163 -293500 -1164641 901687 2386000 1306300
37277 1306300 -495277 -726247 616428 2184728 2614236 945625 -2142483 -3938921
37269 -3938921 -2808865 -962320 -1432803 -3171583 -2635290 85620 788586 -2430033 -6079696
37260 -6079696 -6199346 -3294583 -449193 966078 1533525 1563727 831708 -367257 -1422184
37251 -1422184 -2056262 -1935213 -478447 2235989 5171939 7358583 8384279 7792104 5142839
37242 5142839 886639 -3785810 -7821722 -10125781 -9437529 -6195448 -3615754 -4356372
37234 -4356372 -6600548 -6450682 -4106363 -4069183 -8278379 -12499086 -11451904 -5040945 2359072
37225 2359072 6672377 6375379 2076205 -3771385 -7740916 -7933873 -5390693 -2430091
37217 -2430091 -493212 28448 -711998 -1961898 -2885139 -3450286 -3832746 -3431362 -2112713
37208 -2112713 -1559107 -2908604 -3971873 -2168036 429728 -680715 -5031625 -6943089
37200 -6943089 -3878387 -79713 204435 -1672221 -2680750 -3098047 -4052973 -4004291 -1517844
37191 -1517844 1572166 3252083 4505551 6174196 6132758 3205633 333421 -97559 -393915
37182 -393915 -2712078 -4037057 -1163391 3044511 4205896 3762433 5254812 6511476
37174 6511476 3189868 -2135495 -2758713 1214998 3060081 628729 -926146 1334885
37166 1334885 3915283 4109174 3994059 4729230 3820850 925922 -106725 1976052 3186573
37157 3186573 1544774 804740 3459711 6041573 5314466 3496441 3200113 2619733 62104
37148 62104 -1991776 -1734593 -1668275 -2969054 -1975100 2583376 4931947 1176952 -2853469
37139 -2853469 -149289 6134891 8229210 6404549 6754811 9386564 9009139 5995429
37131 5995429 6404553 10411114 10819821 5446560 1693208 4803933 9392355 7843805
37123 7843805 1383381 -2616470 -603282 4526841 8389920 9186770 8324394 9034695 13003586
37114 13003586 17782911 19628035 18540469 17303322 16336925 14162343 12440560 14439931
37106 14439931 17843934 15992728 8451690 3376143 5860157 10664526 11259086 9698649
37098 9698649 11217687 14293926 13688852 10018103 8459927 9512137 8423471 3613979
37090 3613979 -944488 -2438196 -2546674 -2781581 -1430051 2920287 8365794 11889003
37082 11889003 12171368 9591082 5844765 3673847 4321981 5314222 3449532 -358484
37074 -358484 -2231738 -841220 1627013 3605177 5369790 6199060 4552731 1701324
37066 1701324 1084753 3115376 4520743 3755901 2866298 2815089 1613041 -1014195 -1856352
37057 -1856352 198333 1407324 -563483 -1990004 910008 5029118 4625882 -59133
37049 -59133 -3870888 -4750759 -5122182 -5987318 -5215247 -2265297 188401 509028 37765
37040 37765 -295948 -1558766 -3686017 -4332628 -2618398 -942164 -1082289 -1148995 1405789
37031 1405789 5892604 9678319 11669226 12418409 12145206 10747111 8919621 7449218
37023 7449218 5874483 3218097 -247011 -2787939 -2434131 1686681 8113585 12966021
37015 12966021 12766433 8116405 3185735 1041101 1156984 1897483 2892278 3754714 3152280
37006 3152280 1196582 464987 2324518 4448792 4715768 5268852 8940154 13301740 12986141
36997 12986141 7683688 3071376 2786784 3931808 2682628 440323 973820 4007245
36989 4007245 5723812 4811830 4176846 6010228 8190403 7303780 3437415 -190868 -1746782
36980 -1746782 -2662578 -4431300 -5540622 -3582005 413275 2323130 232144 -2814623
36972 -2814623 -2796191 200849 2783522 2990612 1968927 1336802 1114674 626501 -153557
36963 -153557 -683140 -384060 944259 2527672 2953357 2076169 1760477 3367108 5468416
36954 5468416 5878638 5072892 5371994 7331011 9254359 9764816 8442563 4724567 -678229
36945 -678229 -3792398 -689804 6809767 12436866 13078702 11231376 9244206 6058692
36937 6058692 1704163 5628 3148919 7380645 8115492 6215794 5176116 5056281
36929 5056281 3817550 2227671 2395018 3190832 2261436 1170130 3022321 5943447 5070852
36920 5070852 1024087 -153941 3296588 5839875 3918533 1810084 3892181 6512515
36912 6512515 3622837 -2823253 -4808978 300950 6292337 6995848 3807813 2180754
36904 2180754 3984710 6325920 6558414 5707290 6454753 9124831 10912898 9345986 5686487
36895 5686487 3725327 5202217 7748844 7875238 4699310 -59100 -4299164 -6267246
36887 -6267246 -4253966 2116926 10087518 15000379 14334304 9984464 6035212 4644487
36879 4644487 4629234 3991375 3031243 3969586 7434641 10765180 11074105 9057430 7872207
36870 7872207 8611727 9188838 8022638 6402452 6112016 6840427 7443820 7912438 8326524
36861 8326524 7606643 5517773 4492417 6793478 10693451 12341045 11205463 10672862
36853 10672862 12643800 14370269 12280501 7130915 3475782 4695990 9759366 14459260
36845 14459260 15101734 11560213 7484971 7074151 10949517 15500413 16755055 14486313
36837 14486313 11959446 12008515 14133496 15590271 14808870 13115089 12797721 13964731 14421584
36828 14421584 12985935 11569173 12673456 15749497 17878374 17666875 16330112 14887502
36820 14887502 12902811 10918491 11384598 15046439 18495513 18138642 15352127 14561186
36812 14561186 16760699 18393058 16964188 14188977 12282095 10681474 8961615 9922610
36804 9922610 15863840 23377735 26297483 23846967 21651031 23443548 25758088 23552552
36796 23552552 18057630 15006371 16259020 17521119 15171587 11719794 12082982 16525976
36788 16525976 20336009 20142534 17834331 17320289 19409610 21600783 21861511 20555424
36780 20555424 18828662 17266197 16811434 18930254 23213336 26256881 25166674 21647146
36772 21647146 20411387 23494903 28160732 30720189 30401986 28875054 28033180 29229376
36764 29229376 32682405 36256829 36643089 33396090 30173707 30169597 32039324 32686021 32446462
36755 32446462 34276189 38566991 42416632 44355442 46330997 49833776 53141827 54314333
36747 54314333 54441664 55531290 56998872 57065947 56636003 58722154 63915557 69186009 72234146
36738 72234146 74877386 80312661 88296780 95380890 99946818 104818707 113575136 125508049
36730 125508049 136110380 142460345 146442652 152028986 160659959 170339412 178444804 184141947
36722 184141947 188244107 191878353 195739461 200153184 205261054 210745285 215413313 217906687
36714 217906687 218577345 219797791 222948926 225809725 225128144 221422540 218229246 216226019
36706 216226019 211874544 203571745 195207818 190457067 186925521 180242497 171384412 164773776
36698 164773776 160581815 154581906 145406688 136290908 128890708 120967804 111869606 104927314
36690 104927314 101799030 99260779 94804046 90982238 90408620 90498022 87734231 83797831
36682 83797831 82318274 82133403 79459353 75131500 73546338 74691595 73361888 67455971
36674 67455971 61544916 59974482 61113748 61417041 61232659 62686645 64483685 63263426
36666 63263426 59222607 56414717 57068134 58663820 57733509 54383520 51627559 51604136 53939546
36657 53939546 57033813 59358742 59737977 58065059 56221945 56748818 59566829 61365308
36649 61365308 59860051 57565314 58926705 64047718 68181329 68168527 66415181 66637528
36641 66637528 68206617 67642691 64323980 61432731 61379672 63174154 64952389 66695112
36633 66695112 69104152 71327892 71453846 68920779 65411432 63179816 62856141 63147382
36625 63147382 62697600 61755257 61379916 61515800 61346526 61628049 64587520 70366663 75422346
36616 75422346 76364484 74172747 72548512 72964124 73666377 73219716 72566859 73085255 74452127
36607 74452127 75231485 74544303 72820263 71725646 73238752 77748322 83192857 87092221
36599 87092221 89127797 90692041 92610587 94889557 98050548 102572994 107182968 110019367
36591 110019367 111839442 115747649 122833353 130115682 134254634 135949804 139125162 146336607
36583 146336607 156118191 164793204 170483184 175324860 183361232 195816165 209359498 220225277
36575 220225277 228997330 239263282 252275995 265812648 278372074 291249129 305408937
36568 305408937 319418312 332282930 345534856 360061264 373239537 382254146 388542899
36561 388542899 395629691 403697319 409885597 413303138 415612752 416288134 411734565 401106750
36553 401106750 389316135 381130572 374676801 364223733 348014435 329845087 313480228
36546 313480228 299062607 285351748 272120892 259090999 245217605 230715010 217746025
36539 217746025 207478647 198244734 188181547 177834074 168364945 159187672 149662169
36532 149662169 141230579 135046711 129148028 121277738 113074317 107572682 103736661 98313368
36524 98313368 92650846 91648722 94543601 93010296 82193412 68800877 63277756 66934905
36516 66934905 71705735 70623906 63634507 54234012 45587767 40468532 40702767 44840285
36508 44840285 48549965 48566564 45368107 42078297 41610066 44001364 45611085 42625464
36500 42625464 36632638 34111956 38070031 43092023 42215336 36118091 31015187 29461107
36492 29461107 28553130 26258099 23887554 22165775 20116904 18569321 19876659 23176241
36484 23176241 24504759 22621237 20266712 18933098 17362398 16057085 17447383 19964486
36476 19964486 18398553 13011930 11618914 18101070 25030773 23828489 17322415 14907151
36468 14907151 18392525 20609196 17196498 12342598 11597881 14688945 17532152 17502900
36460 17502900 14814708 11221283 8621255 7338591 5667448 2753148 1171108 4244129
36452 4244129 11256413 17666011 19716878 17033318 11830713 7805928 8202255 12018566
36444 12018566 13685738 9881062 4930445 5156674 9376429 10552932 6585698 3255153
36436 3255153 5015026 8718678 9383398 7314863 5747688 5117324 3813152 2105241
36428 2105241 1365439 1112557 440419 940711 4476228 8936808 10074767 7553679 5569943
36419 5569943 6687907 8243678 6487172 1965043 -1360342 -1218667 688599 1247970
36411 1247970 -651189 -3406275 -4443415 -2403441 1657096 4801433 4541956 1359644
36403 1359644 -1357271 -675518 2651662 5199982 5121693 4021754 3972686 4209026 2484658
36394 2484658 -1034928 -3287105 -1962994 1878881 5344660 6688761 6249900 5443381
36386 5443381 5523244 6675661 7761754 7448998 5953150 5038188 5850276 7385963 7743207
36377 7743207 6451494 4837015 4268804 4768865 5404383 5315864 3983499 1210170 -2197982
36368 -2197982 -4077198 -2705316 632956 2500954 1900701 2326880 6974066 13078829
36360 13078829 14396218 9451097 3751877 2433954 4014147 3834716 953221 -1641233
36352 -1641233 -1932299 -565249 1421846 3219311 3046245 -279464 -4341474 -4863566 -1225400
36343 -1225400 2564928 3501369 3490109 5796982 9622309 10746925 7057959 1398090 -1608950
36334 -1608950 -581106 1641678 2036695 1420513 3052064 7323781 10025869 7328582
36326 7328582 870981 -4169935 -5047994 -3254093 -1092901 891624 2878637 4371146
36318 4371146 4593884 3181289 396655 -2439139 -3341101 -1692457 891171 2851621
36310 2851621 4396194 5493935 4554570 1758142 1056746 4688933 7816576 4141905
36302 4141905 -4061196 -7836857 -3991756 862446 642783 -2246455 -2790049 -1543194
36294 -1543194 -2055828 -4140834 -4863395 -3720817 -2341428 -984733 732187 1536350 633394
36285 633394 181523 1990798 3873482 3152122 1547183 2135467 3506791 2059373 -1299679
36276 -1299679 -2229870 -133369 1188789 71038 -1200810 -1656345 -3320204 -6264001
36268 -6264001 -7032739 -4117634 -727697 142112 -373984 -263125 -173227 -1109627 -1703838
36259 -1703838 -536808 1205251 1750290 1253722 360329 -1368325 -3624781 -4409486 -3021883
36250 -3021883 -1622425 -1691401 -1430635 879271 3315901 2823984 -686054 -5215896 -9470261
36241 -9470261 -12081527 -10433762 -3788445 3957624 8014106 8052290 6879570 5388443
36233 5388443 2481883 -1130270 -3150024 -3472139 -4086333 -5143089 -4543600 -1757413 1156120
36224 1156120 2834573 3978513 4896692 4544962 2813960 1307226 1053140 1484845 2045790
36215 2045790 2688427 2666024 1160917 -810847 -1521767 -1410486 -2149065 -3175927 -2442629
36206 -2442629 -427633 451250 544661 2571490 5733294 5314565 108092 -4717615 -4946314
36197 -4946314 -2734971 -1275102 1002882 5977681 9891285 8238291 3950388 3824621
36189 3824621 7904386 9459316 6017864 3521145 7091110 13430956 16225517 15016950
36181 15016950 14185688 15351942 15524579 12796789 10127499 11671975 17057096 21482329
36173 21482329 21621830 19643342 19941338 23028704 25237236 24430833 22819065 22864644 23579648
36164 23579648 23062454 21687822 19897250 15886647 9426947 5267887 7702072 13522636
36156 13522636 15899926 14100436 13202055 14621930 14137744 10547132 8793949 11243545
36148 11243545 12629762 8498643 3133980 3202068 7521446 9470506 7051235 4271301
36140 4271301 3724647 3775527 3149812 3089821 3995541 4054234 2457781 913893 979754 2304456
36130 2304456 3982380 5381506 5522860 4016421 2593253 3222799 4843527 4730660 3018888
36121 3018888 2629879 4309560 5227790 3686517 1927246 2363616 3738456 3308407 802503
36112 802503 -2093891 -4516536 -6243061 -6063516 -3127169 562366 1661324 -245200
36104 -245200 -2068969 -1417609 716830 2418834 3883197 5981934 7185638 4874163
36096 4874163 -47870 -2656707 201436 5417290 7103116 3671434 -847020 -2272673
36088 -2272673 -705284 970793 980935 57152 182473 2684671 6715971 9421715 8641276
36079 8641276 5349247 2258995 700478 786518 3541248 9319241 14267674 12911526
36071 12911526 5817482 412602 1574076 5336405 5475080 2725286 2512230 5717845
36063 5717845 7376470 4467275 141696 -1053515 1219416 3729581 3801024 1746345
36055 1746345 449418 2738293 8054202 12138273 11334408 6584790 1912400 -17242
36047 -17242 554187 1895471 2013929 -15733 -2226602 -1197261 2837221 5006163 2550662
36038 2550662 -593798 340822 3685811 4814256 4102447 5292028 7634259 6572093
36030 6572093 1989961 -1014699 -356389 372351 -1386817 -3916916 -6020875 -8635565
36022 -8635565 -9871742 -5416275 3121567 7168690 2745735 -3138915 -2600699 2383525
36014 2383525 5163801 5094551 5913961 7240535 5561813 2029211 1884330 6168960 10121276
36005 10121276 10340021 8442497 7000962 6374336 6338229 6951674 7079829 5382155 3110031
35996 3110031 2780606 4120425 4635092 3949938 3876139 4350525 3533533 2194382 3301849
35987 3301849 6132260 5661920 251056 -4307765 -1901106 5643428 11038130 10458985
35979 10458985 6573514 3795870 3951685 6538568 10238582 13155267 13339001 10329924
35971 10329924 5758029 2052451 702305 1372498 2129789 1035948 -1570895 -2815554
35963 -2815554 -559239 3293157 4538712 2228117 392747 2495282 5857327 4699414
35955 4699414 -1651960 -7336411 -7951143 -6179702 -6478676 -7361323 -3869547 3540878 8217540
35946 8217540 6426606 2367774 1731737 4198318 5591790 4602582 3479811 3482109 3387406
35937 3387406 2421757 1811309 2815087 4874320 6248103 5779086 4044884 2961076 3595536
35928 3595536 4454202 3391485 1267815 1448732 4962133 8666514 9499544 8006564 6045364
35919 6045364 3775249 1240589 277866 1792420 3183684 1727607 -1084000 -1864134
35911 -1864134 -607815 -176387 -1492823 -2796462 -3178545 -3489455 -3902382 -3580431 -2573919
35902 -2573919 -1334773 1023068 4948202 7788388 6617231 3245254 2255942 4041622
35894 4041622 4406155 1905434 652096 3671350 7835560 8544658 6124423 4133047
35886 4133047 3795765 3692786 3262596 3080427 2678418 1411449 874039 3110479 6488795
35877 6488795 6784874 3168459 -107690 304673 1984243 691487 -2663590 -2957480 1162258
35868 1162258 4302471 1555365 -4285836 -6392753 -3380365 -749572 -2429035 -5225217
35860 -5225217 -4100485 175384 2192111 -610183 -4932847 -6056724 -2859702 1967365
35852 1967365 4997445 4828104 2727577 888943 -53800 -1140617 -2604293 -2787551 -449194
35843 -449194 3235666 6047809 6737386 4800756 259723 -4913529 -7359944 -6302411
35835 -6302411 -4835218 -5102250 -4791554 -1511233 1995387 1408573 -2119534 -3569303 -2084357
35826 -2084357 -1986110 -5175639 -7926738 -7237141 -5592246 -6226212 -7299627 -4833132 504655
35817 504655 3500948 992448 -4556569 -8492138 -8975567 -7654515 -6435072 -4949479
35809 -4949479 -1718947 2829866 5955568 5796702 3709506 2279262 2090954 1935986 1249143
35800 1249143 554226 164089 202468 1274633 3309742 4467706 3288708 1380013 1706372
35791 1706372 4406264 6404758 5215695 1497588 -1922905 -2189637 1589155 6812823
35783 6812823 8908709 6279142 2525213 1750872 3338760 3942392 2756371 1485869
35775 1485869 726314 87321 429821 1969790 1743403 -2355780 -6499666 -5476215 -1357557
35766 -1357557 -1118689 -5518807 -7486840 -3167102 2498740 4198951 3721803 4774382
35758 4774382 5873061 3643727 -655240 -3122925 -3240405 -3404678 -4282765 -4572289 -4088309
35749 -4088309 -3869512 -4241730 -5022337 -6157579 -6414189 -3733263 1076239 3629316 1501698
35740 1501698 -1896187 -1678350 2281351 5922782 5964355 2286179 -2580207 -4665266 -1825869
35731 -1825869 2599930 2539076 -2705917 -6959666 -5951919 -2907257 -2095068 -1903436 707224
35722 707224 3326781 1955600 -1378017 -1545130 1093046 1722100 -386316 -1147467 589126
35713 589126 1150287 -1082351 -2815433 -1610964 504394 1117668 705221 -112166 -2441072
35704 -2441072 -6006994 -7901238 -6880891 -5576647 -5771340 -4707382 352710 6139306
35696 6139306 6231719 -358523 -7031906 -7213325 -1905710 2166072 948507 -2711944 -3832442
35687 -3832442 -2087432 -1394850 -3618510 -6103920 -6315207 -5644902 -6517987 -8340105 -9118186
35678 -9118186 -9201711 -10274358 -11772450 -11429216 -8907121 -6156258 -4359457 -2896252 -1218024
35669 -1218024 391579 1897760 3535748 4818893 5029599 4493672 4129740 4107239 3879570
35660 3879570 2922761 962808 -1318784 -1744088 873271 3513171 1814125 -2888346
35652 -2888346 -4055441 277684 3638414 1098897 -2412775 -73047 5110623 4774521
35644 4774521 -1047209 -3699189 668064 6126931 7045959 5245436 4263001 3497847 1899557
35635 1899557 1577670 3350988 3570626 37222 -2939350 -407140 5270933 7539474
35627 7539474 5064028 2982928 4948504 8154707 7438483 1724805 -5143991 -8996076
35619 -8996076 -9463236 -9147076 -9306815 -8189280 -4635455 -1144618 -619442 -1572406 -242913
35610 -242913 3243412 5045881 3913935 2635571 2310227 221756 -4296046 -6481644
35602 -6481644 -2233329 5533118 10221028 9204183 5102798 1236521 -1118477 -2048634
35594 -2048634 -2234732 -2429729 -2303306 -827842 1299105 1548477 -862295 -3510643 -4467601
35585 -4467601 -4986434 -6399340 -6858661 -4115236 273963 2728277 2581743 2165376 2464770
35576 2464770 1726699 -1175464 -4303654 -4690223 -1872957 1343657 1623773 -1438581 -4933958
35567 -4933958 -6165758 -5707609 -5631466 -5812202 -4575048 -2500623 -2213901 -3959072 -4868569
35558 -4868569 -3656417 -2470420 -2577201 -2029758 57653 725150 -2034003 -4951280 -3989321
35549 -3989321 -675561 577309 -164659 1363456 6248461 10014796 8787939 4362182
35541 4362182 1429985 1987942 4037240 4461498 1939478 -2305616 -5817936 -7061592
35533 -7061592 -6381134 -4958201 -3538604 -2426136 -1692900 -806627 938110 2985372 3561671
35524 3561671 1772539 -1368104 -4326138 -6087876 -5643943 -2492100 1620800 3498353
35516 3498353 1990125 -1098696 -4042875 -6665918 -8190584 -6877636 -3277664 -674491
35508 -674491 -435258 -72335 2012150 3337033 1572516 -1519801 -3593747 -5709740 -8962439
35499 -8962439 -10441737 -7271587 -2051387 755624 1691372 4232933 7688379 8109815
35491 8109815 5372223 3268120 2715295 986456 -1750437 -1389957 2872245 5896023
35483 5896023 3766716 -998077 -4027937 -4769514 -4794114 -4139062 -2545316 -1616980 -2714874
35474 -2714874 -4500277 -4771261 -3167758 -688598 1564140 2264375 931796 -179364
35466 -179364 1674968 4890242 4829366 1181417 -731741 1683902 3787864 1419279 -1785047
35457 -1785047 -365451 3397860 2815235 -2109222 -4295224 -718595 2948439 1171922
35449 1171922 -3517514 -5003621 -2088927 1541300 3471522 4446183 4919599 3658260
35441 3658260 621865 -1570933 -826206 1217464 1137384 -1502600 -3342466 -1835055 1137973
35432 1137973 1934206 246383 -900575 101107 1600574 2253599 3372727 5867272
35424 5867272 7427447 5544950 1724507 -297294 356480 1277240 905477 107179 -371371
35415 -371371 -1108824 -2172270 -2657224 -2679901 -3329770 -3938956 -2163549 1964001 4814397
35406 4814397 3902103 1435176 729381 1190401 9438 -2505157 -3081036 -960515 474906
35397 474906 -1044037 -2704774 -376724 5138613 8413529 6039829 788399 -1948951
35389 -1948951 -503741 2058820 2917211 3131028 4891387 6883025 5353134 -115417
35381 -115417 -4948364 -5290827 -3064921 -2956959 -5918184 -8512830 -7998196 -5079510 -1661837
35372 -1661837 1214402 2723760 2405918 1930344 3980399 7988243 9657806 6718208
35364 6718208 2697778 2290789 4834187 5587089 2512469 -1491409 -2974539 -1553926
35356 -1553926 1272956 4237370 6147522 5628413 2476219 -1537983 -3978667 -3511636
35348 -3511636 -646549 2323542 2617333 -274401 -3356516 -3331582 -884272 186921 -1784824
35339 -1784824 -4219593 -4146187 -2060423 -622507 -1040003 -2262265 -2942513 -2903530 -2839056
35330 -2839056 -3127114 -2945974 -1045983 1878666 2541128 -1345217 -7230630 -9822945 -7230296
35321 -7230296 -2693378 184998 1205471 1565099 996525 -996230 -3099469 -3711353 -3278547
35312 -3278547 -3253717 -3829419 -4328421 -4629420 -4544162 -3049028 18204 2650069 3004006
35303 3004006 2015163 1669731 1709244 435878 -1890796 -3126569 -2661310 -2200626 -2612211
35294 -2612211 -2347627 -257122 1701129 350781 -4536988 -9371355 -10439580 -7813573
35286 -7813573 -4902579 -4310877 -5138556 -4850245 -2715669 -271341 697981 -813926 -4879343
35277 -4879343 -9303053 -9597923 -3686258 3660309 5069986 -87651 -4838933 -4441401
35269 -4441401 -2254960 -2951199 -4657776 -2655620 2391838 5452374 4698469 2788875
35261 2788875 1385140 -435683 -2204355 -1448195 1777790 3740349 1965641 -1646464
35253 -1646464 -3881531 -3798458 -2271744 -479214 10893 -2163206 -6191230 -9190122 -9096099
35244 -9096099 -6490118 -3626388 -2854218 -5297606 -9282345 -10837937 -7882579 -3076182
35236 -3076182 -282049 441090 1305676 1804095 -468012 -4560832 -6386351 -4632001 -2248938
35227 -2248938 -1429629 -1266284 -1039467 -1296323 -710754 3083342 7843490 7289950 218304
35218 218304 -5968392 -4736078 797935 3057787 559794 -1785786 -727349 2018662
35210 2018662 3651214 3328573 1590010 -231410 -501216 527319 244122 -2350865 -4181137
35201 -4181137 -2530065 137516 -459338 -3775142 -5303896 -3264353 -342253 947378
35193 947378 792730 -9280 -1047068 -1060565 763171 2065585 -436636 -5432071 -7478300
35184 -7478300 -4127938 792655 2516838 957467 -740294 -737070 329264 974505 243629
35175 243629 -1220746 -1045783 1932768 4473751 1787079 -5503403 -10801329 -9852944 -6148933
35166 -6148933 -5155402 -6332099 -5058726 -640017 2351579 648590 -3773395 -7093450
35158 -7093450 -7813014 -6478512 -3989439 -1696507 -1153612 -2207876 -2823852 -2134956 -2132634
35149 -2132634 -4614263 -7667831 -7403152 -2939046 2267574 4464734 3569288 2436201
35141 2436201 3149299 4915199 5313186 3034432 -604592 -2738821 -1807301 522666 723769
35132 723769 -2856807 -7877510 -10175547 -8072232 -3966753 -1427845 -1361126 -1888378 -1716717
35123 -1716717 -2072970 -4293594 -6690439 -6000633 -2102739 1027606 397094 -1918736 -2064191
35114 -2064191 -471176 -1346525 -5969112 -9972489 -9082273 -4987284 -2819092 -4159228
35106 -4159228 -5502161 -3546059 595385 3360674 3211326 1758303 1007466 752071 -730590
35097 -730590 -3747258 -5994305 -5127524 -1943243 371725 60909 -1646377 -2834851 -2851750
35088 -2851750 -1558637 1157459 4188286 5636061 5496285 5639067 6073816 4247242 -212122
35079 -212122 -3568418 -3530934 -3109092 -5197971 -7008991 -4989942 -2019793 -3124446 -6200099
35070 -6200099 -4732421 840401 2783108 -1804469 -6731918 -7120557 -6045244 -6906922
35062 -6906922 -6887905 -3469862 -683469 -2251627 -4226359 -1854438 1096064 -1671902
35054 -1671902 -7236264 -7083165 -847636 3101201 1033112 -1368261 481591 3212530
35046 3212530 2595121 354835 -415088 -799696 -2295928 -2351657 1141760 4560723 3112143
35037 3112143 -1745086 -4499775 -3541324 -1984854 -1515109 -470333 1654015 2471869 1066046
35028 1066046 484718 3478967 7945111 9178412 5767216 1058958 -1205976 -983600
35020 -983600 -969179 -2611761 -4235679 -3106464 1286399 6119117 7135349 2170567 -6199796
35011 -6199796 -11805512 -10298735 -3888071 829559 291300 -2651575 -3595722 -2191120
35003 -2191120 -749823 308842 2182542 4125154 3893452 1508862 -783304 -2305928
34995 -2305928 -4309105 -6336274 -6060013 -3817280 -3548642 -7166476 -11052239 -10740672 -6919875
34986 -6919875 -4138846 -4893057 -7313796 -8048104 -5798319 -2452463 -1500395 -4515193 -8905196
34977 -8905196 -10548688 -8752245 -6505798 -5652725 -4751848 -2584130 -408579 976454
34969 976454 3038460 5951939 6488594 2698153 -1997940 -3033210 -846778 958830
34961 958830 1575033 2778696 4306160 4267028 3447336 4195032 5043232 1746647 -5202866
34952 -5202866 -9238572 -6381722 -1216302 -1100467 -7115823 -13696110 -15410748 -11620972
34944 -11620972 -5804184 -2469993 -3852058 -8003478 -10708957 -9883405 -6952850 -3901850
34936 -3901850 -1346398 -134334 -1842539 -5961595 -9094966 -8975510 -7222716 -6338211
34928 -6338211 -6249314 -5795842 -5175916 -4557195 -2702144 394968 2033146 968528 370470
34919 370470 2971482 5947769 5147446 2047777 1093123 1920197 596464 -2248499 -1707833
34910 -1707833 2422438 4406646 2316905 1524827 4872975 6571715 1365234 -6207327
34902 -6207327 -8429583 -5816862 -4549581 -5569149 -4163416 772940 4729554 5194470
34894 5194470 4552625 4309981 2546462 -1184385 -3927830 -4411886 -5194226 -7585527 -9113313
34885 -9113313 -8382503 -7696198 -7922608 -5575731 946140 6387656 4980460 -1028457 -4460507
34876 -4460507 -3158193 -1544904 -2725283 -4236783 -2808685 706522 3216935 3698507
34868 3698507 3489304 3422269 2413209 -926189 -5830131 -9187763 -8583677 -5267239 -2618854
34859 -2618854 -1617715 -93715 2787758 4219025 1962442 -1735321 -3357166 -3211294
34851 -3211294 -3842544 -4845675 -3445519 57218 1639146 -689372 -3871690 -4039403
34843 -4039403 -1251621 1474275 1951032 351522 -1528478 -1579190 661995 2763077 1719869
34834 1719869 -1989316 -4636604 -4189493 -2647653 -2184194 -1535566 1382345 5124147 6036136
34825 6036136 3229043 -644683 -3455575 -5453059 -6429537 -4263226 1457794 6601278
34817 6601278 6557461 2416528 -257010 922976 2285763 298922 -3040722 -4133234
34809 -4133234 -4078604 -6284611 -9255152 -7622589 -1158596 2917273 -602772 -7604312
34801 -7604312 -10477243 -7898777 -4639800 -3968149 -4699697 -4658933 -3067372 -7381 3169015
34792 3169015 3562401 60449 -3888288 -4249563 -2270860 -2518546 -5739911 -8160791 -7930710
34783 -7930710 -7488275 -8506569 -9010320 -7225953 -4250414 -921084 4016011 10070648
34775 10070648 13018815 10104935 4604878 1868361 2742967 3985877 3470812 1758915
34767 1758915 -310065 -2427544 -3834770 -4244404 -5213590 -7996516 -10445977 -8860460
34759 -8860460 -3169365 2193225 3323624 891250 -1607128 -1982023 -659304 902827
34751 902827 1574072 619353 -2154427 -5605426 -7353626 -5943542 -3090721 -2509081 -5647353
34742 -5647353 -9605625 -10464421 -7775526 -4328071 -2497616 -2842539 -5349262 -9135188
34734 -9135188 -11053250 -7903882 -986524 4394703 5262767 4174038 4561791 5684011
34726 5684011 4763493 2084676 706072 1732205 2712083 1141136 -2324850 -4933445
34718 -4933445 -5220195 -4564280 -5238917 -7187732 -7721039 -5159115 -1557211 -13454 -225576
34709 -225576 624231 2944202 3982609 2573192 1318986 2566055 4866245 5048335 1652927
34700 1652927 -4740660 -11978868 -16058320 -13675084 -6857967 -1859238 -1363654 -1263331
34692 -1263331 2232929 6162650 5403683 560795 -3389276 -4227198 -3619057 -2670313 -1103041
34683 -1103041 11280 -734849 -1753785 -301245 2855065 4758612 5472226 7074693
34675 7074693 7937470 3962716 -3497915 -7064512 -3248496 2339147 3203959 852044
34667 852044 1022855 4493907 6870173 5769989 3062075 302650 -3295189 -7387028
34659 -7387028 -8929469 -6137063 -1544392 982157 749789 -141158 -439590 -710691 -1170249
34650 -1170249 -1130305 -1149536 -3315890 -7851724 -11366444 -10814470 -7996946 -7374788 -9968734
34641 -9968734 -12539037 -12871568 -12297390 -11894095 -9886407 -5218055 -789953 -64777 -2305675
34632 -2305675 -4068013 -3936715 -2989428 -1941455 -937278 -1316147 -4398107 -8554996 -9998622
34623 -9998622 -6764262 -510154 5112622 6750080 3519408 -1368049 -2810115 467857
34615 467857 4345720 5290533 4823973 5119576 4029764 -455439 -3943084 -632625 6673355
34606 6673355 8771602 2820394 -3814500 -4114725 347634 4191150 5629081 5633532 4136975
34597 4136975 1019398 -1816200 -2423510 -1086715 876637 2248775 1179063 -3216935
34589 -3216935 -7624301 -7043651 -1987500 1243491 -653813 -3627332 -3186082 -818803
34581 -818803 -120524 -949362 -1385634 -1657208 -2035785 -386755 3914995 6922668 5443466
34572 5443466 2445614 2528904 4704441 4548237 1358946 -1614949 -2309710 -857062 2519169
34563 2519169 6207618 6070930 516400 -5270220 -5235138 -771087 2047142 1478562 451619
34554 451619 -297785 -2559620 -4900649 -3715545 -272558 212013 -2642684 -3455134 -401320
34545 -401320 1574645 -605935 -2939563 -1241150 2479286 4388158 4537052 4229724 2372555
34536 2372555 -1153881 -2600379 383386 3835816 2571718 -2415843 -6171498 -7085738
34528 -7085738 -7264898 -7283059 -5470266 -1976995 543804 472864 -1403157 -3677013 -4960892
34519 -4960892 -3604412 395389 3806333 3197551 -788617 -4415881 -5406844 -4324755
34511 -4324755 -2398942 -521025 342513 214998 811113 2725581 3034773 -1152803 -7425536
34502 -7425536 -9921400 -6693543 -1985908 -399378 -1645765 -2359569 -945430 931341
34494 931341 699926 -2064716 -4580466 -3416088 941879 3446944 507686 -4668430
34486 -4668430 -5854617 -2197507 1014500 166873 -2373142 -3218208 -3061931 -3933144 -4566801
34477 -4566801 -2383880 1559551 3442205 2114879 453566 1035994 3160412 4827038
34469 4827038 5416750 5336451 4701954 3621447 2676657 2003109 741915 -1501599 -3363254
34460 -3363254 -3195639 -1574774 -1024026 -3032928 -6390945 -8832820 -9359064 -8391781 -6674831
34451 -6674831 -5027688 -4407804 -4875428 -4896978 -3135107 -733217 -36785 -780717 381365
34442 381365 5395955 11534566 14291000 12519761 8946112 6269036 4702938 3242846
34434 3242846 1479521 -356255 -1915549 -2797432 -2899087 -2892223 -3583219 -4753934 -5399131
34425 -5399131 -4994551 -3674789 -1462164 1464548 3883884 4329148 2910052 1064844
34417 1064844 -480738 -1919121 -2543876 -1037380 1580834 1710840 -2228111 -6724274
34409 -6724274 -7109423 -3523369 -355498 -218151 -1361428 -1478555 -1170777 -2076848 -3723289
34400 -3723289 -4400563 -3893806 -3058769 -1411781 2246920 6641866 8083169 5010795 598408
34391 598408 -964240 392008 1175942 -615765 -3256741 -4256421 -3433946 -2117305 -976558
34382 -976558 -119085 -268618 -2045207 -4264717 -4578880 -2351259 150493 293609 -1647334
34373 -1647334 -2711182 -858285 2535326 4488077 4055354 2861768 2166824 1277452 -335538
34364 -335538 -1315721 -649985 -123247 -1985840 -4934912 -5340291 -2486574 319387 470763
34355 470763 -813536 -974257 804343 3932125 7216376 8337884 5509361 991339
34347 991339 -356703 2205605 3804408 1658760 -86691 2679043 6316902 4510190
34339 4510190 -1572969 -4813041 -2806424 -332776 -896120 -2264811 -2000918 -1721361 -3398439
34330 -3398439 -5849351 -7168098 -6996360 -4965068 -898906 2381216 1346501 -1790517
34322 -1790517 -658838 5053840 7517176 2632819 -2769907 -1367322 3015866 1802463
34314 1802463 -4595119 -8199680 -6556188 -5403025 -8092751 -10634053 -9309869 -6375859
34306 -6375859 -5137774 -4667035 -2761330 -234611 916882 839750 771408 822756 647621
34297 647621 384473 -251587 -1689711 -2546925 -589864 3391500 5519316 3924468 1130896
34288 1130896 -124366 -594539 -1997193 -3248768 -1878783 2015759 5369850 5315959 1800164
34279 1800164 -2371381 -3858394 -2128930 -210777 -707948 -1992804 -861922 1975082
34271 1975082 2859371 1506661 1736622 4659650 5851246 1986854 -3622589 -5578213
34263 -5578213 -3597132 -1520567 -1120705 -602786 1578573 4461141 6048721 5233351 2470895
34254 2470895 -602171 -2955290 -5598977 -9439150 -11993435 -9575042 -3320078 989184
34246 989184 597790 -1006142 -646106 -377755 -2474719 -4273679 -2750318 -281729 -493979
34237 -493979 -1711662 -407361 1714662 702193 -1663396 -114981 4784301 6972039
34229 6972039 4686670 2589317 2989301 2299124 -1354252 -3813423 -1842410 1178276
34221 1178276 627458 -2613284 -4708451 -4557192 -3278599 -1181854 1232562 1911014 1322
34212 1322 -2391123 -3538920 -4249659 -4542637 -2066091 3132643 6304543 4399485 1099272
34203 1099272 1097681 2974689 2898617 1971182 3453619 5028912 1177612 -7249512 -12904440
34194 -12904440 -12149742 -8964988 -7241911 -5494076 -1891055 1004544 271431 -2611291
34186 -2611291 -4627566 -5673419 -6818865 -6951682 -4634285 -1210785 1050096 2081731
34178 2081731 2576724 1606038 -1196926 -3204053 -2282242 -1102635 -3784698 -9109145 -11529475
34169 -11529475 -9070085 -5914522 -6074580 -8283168 -8925440 -6934971 -3660645 -294947
34161 -294947 2307574 3048421 2003854 1156741 1911007 3097948 3052602 2139694 1275156
34152 1275156 -387845 -3601377 -6098751 -4870996 -1041864 982032 -317990 -1755700
34144 -1755700 -1158029 -1472337 -6343201 -13732975 -17341448 -13878002 -6294976 130930
34136 130930 2625484 1641664 -867088 -2772821 -2837721 -1695536 -1111561 -1579425 -1462248
34127 -1462248 633931 3357569 3750674 888271 -2717886 -3920060 -2470316 -853395
34119 -853395 -790875 -1161016 -71396 2017098 2639976 534331 -2894675 -5393628 -5843216
34110 -5843216 -4345870 -1989368 -981284 -3187086 -7560702 -10691046 -11007997 -10634163
34102 -10634163 -11660717 -12712119 -11430702 -8504549 -6399101 -5523580 -4829106 -4984192
34094 -4984192 -7099861 -8910488 -6661455 -1217140 2170700 1380085 224259 1734660
34086 1734660 3188191 1203399 -2013704 -1963635 1034577 2648090 1174461 -967958
34078 -967958 -1872784 -2249809 -2826075 -3151852 -3301356 -3731305 -3392086 -1140378 997251
34069 997251 -310391 -4059522 -5155064 -1645499 2173092 1961161 -961977 -2844118
34061 -2844118 -3143386 -3404266 -3067060 -667382 2084440 1646389 -2169541 -5946698 -7600610
34052 -7600610 -8112954 -8115151 -6500938 -3560800 -1998563 -2892187 -3471528 -1215507 2122492
34043 2122492 3135264 1619131 30310 -655611 -1538097 -2815393 -3244208 -2795915 -3166261
34034 -3166261 -4834099 -5783817 -4310015 -1554606 -80169 -890754 -2745414 -3736527 -3042274
34025 -3042274 -1761387 -2124816 -4972532 -8087802 -8346585 -5552760 -2573447 -1540909
34017 -1540909 -1843395 -2299058 -3048330 -4239965 -4966101 -4864221 -4799944 -4585134 -2376181
34008 -2376181 1725344 4043658 2180792 -693394 -51921 3057113 3606949 519498
34000 519498 -1691745 99307 3356465 4280632 2845644 1174383 -198837 -1789141
33992 -1789141 -2901868 -2522205 -1281596 -477801 -78978 610267 1221751 855873 -334344
33983 -334344 -1331362 -1447000 -626614 491021 338510 -2303911 -6159885 -8280885 -7736529
33974 -7736529 -6473211 -5672685 -3883430 -313889 2815978 3576941 3500815 4613743 5504939
33965 5504939 3653436 -127284 -3145736 -5172109 -7365134 -8272522 -5785173 -2570126
33957 -2570126 -3940789 -9239854 -10886527 -4752064 3157411 4378151 -824346 -4522847
33949 -4522847 -1876192 3672037 6052956 3750418 -66209 -2380688 -3409826 -5194932
33941 -5194932 -8220058 -10293164 -9315153 -6474430 -4980759 -5450988 -4787619 -897684 3601192
33932 3601192 4617610 2070819 -572619 -1448787 -1889334 -2839467 -3042484 -2051461 -2064583
33923 -2064583 -4393271 -6183211 -3702411 2043569 6178299 6442262 5567904 6152378 6355689
33914 6355689 3175915 -2183196 -5473335 -5000809 -2840412 -762611 1489193 3218918
33906 3218918 1853334 -2918552 -7041107 -6876845 -3936286 -1941964 -1158236 752842
33898 752842 3618627 4828158 4235537 4500163 5788673 4633832 -54358 -3999614 -3508608
33889 -3508608 -986752 -900455 -2965534 -3620124 -2339341 -1560557 -1178844 1488857 5736876
33880 5736876 6946304 4032681 2294570 5331477 8504393 5453328 -1857593 -5637090
33872 -5637090 -3544488 -942648 -1304796 -1113828 2748934 6456151 5124739 1227951
33864 1227951 1042535 4731375 6309519 3200715 -400628 -1020902 -1018354 -3370048 -6023025
33855 -6023025 -5333107 -1910007 982496 2462485 3339537 2350070 -2022668 -6649496 -5861664
33846 -5861664 502138 5554299 3919894 -1672159 -5013045 -4706992 -4151151 -4853279 -4279593
33837 -4279593 -983355 2068732 1744164 -233221 32790 2013671 1053057 -4013734 -7890896
33828 -7890896 -6219306 -2271939 -1832203 -3977905 -2965126 1537614 3161357 -693570
33820 -693570 -4161671 -2438318 338966 -1608870 -5640621 -5216175 -1238565 -675553 -4827162
33811 -4827162 -7054390 -3228757 2667083 5490634 5390712 4685756 3635542 2325961 2229159
33802 2229159 2981206 1772924 -1430561 -2602627 -543178 -57922 -4210462 -8251142
33794 -8251142 -6634373 -2144765 -1726670 -5854974 -8784389 -8114712 -7281355 -8244331 -8027103
33785 -8027103 -4282086 684254 3675841 4577317 4395882 2574841 -1179157 -4486667
33777 -4486667 -4208475 -173415 4187569 4779936 658792 -4423992 -5263213 -1173561 2896975
33768 2896975 3053094 1817089 3449328 6322652 5214396 212010 -2765853 -1016747
33760 -1016747 1386237 948598 -115424 886773 2037099 950425 -422411 301008
33752 301008 906470 -1551090 -4790906 -4525348 -1479946 225071 145607 1296882 3674098
33743 3674098 3817238 1035878 -1392841 -1942593 -2493918 -3236332 -1407895 2873766 4745454
33734 4745454 1509531 -3032414 -4463498 -4026679 -5303619 -7989408 -9055004 -7588706
33726 -7588706 -4670304 -766439 2952120 3139321 -1488578 -6376852 -6209456 -2246286
33718 -2246286 128851 -311067 -312896 773717 -88684 -3084838 -4198220 -2199691 -1251603
33709 -1251603 -3923989 -6776038 -6115294 -3575834 -2314273 -1705397 182560 2344877
33701 2344877 3225702 4205522 6439910 7245964 4378439 1159475 1966894 4733662 3830388
33692 3830388 -872596 -4000504 -3316282 -2066401 -2139750 -1194134 1592339 2632065 -376909
33683 -376909 -4406723 -5732301 -4917564 -4406562 -4502520 -4541453 -5049824 -5960625 -5424552 -3059565
33673 -3059565 -1687945 -3129474 -4985445 -4560882 -3303727 -3968357 -5793183 -6296555 -5846893
33664 -5846893 -6228856 -6107137 -2639819 2665102 4330361 198039 -5278069 -6665184
33656 -6665184 -3894952 -1159451 -1118494 -2152489 -1135500 2216499 4538197 2764927
33648 2764927 -1691270 -4260067 -2822345 70611 1270051 731728 -381359 -2428372
33640 -2428372 -5399509 -6704100 -4452968 -1419980 -1794846 -4730956 -5216384 -1485597
33632 -1485597 2396923 2345221 -726194 -3209507 -3492697 -2558907 -1691552 -1272838 -991404
33623 -991404 -294215 808391 1287082 343297 -1113403 -1459526 -533940 522128 1157579
33614 1157579 1599045 1605026 653113 -1098331 -3431157 -6550495 -9245993 -8441248 -3460287
33605 -3460287 1037109 321307 -3442106 -4162603 -1045282 801605 -654328 -1274212 1145432
33596 1145432 2187138 -1365396 -4386154 -244852 8369582 12083523 7358381 350011
33588 350011 -2384619 -1812989 -2870299 -6637155 -9308744 -7805597 -3810277 -1531441
33580 -1531441 -2482517 -3915769 -3013635 -1085490 -1339094 -3303783 -3093031 83716 1727825
33571 1727825 -1311142 -5590639 -5942349 -2851673 -863513 -1499677 -2314173 -2136286 -2591781
33562 -2591781 -4115802 -4569532 -2855689 -713741 74333 -355001 -1303922 -2097830 -1005314
33553 -1005314 3171344 7730898 7910476 3561083 461614 2722757 7055858 7622145
33545 7622145 4060432 958345 745222 1186011 89478 -1030342 490628 4287036
33537 4287036 7068461 6206207 2120050 -2628419 -5783269 -6814970 -6540913 -6077302 -6253076
33528 -6253076 -7230070 -8004975 -6911550 -3641541 -328533 609056 -626605 -1891670 -2319256
33519 -2319256 -2855845 -3519107 -2621216 198737 2290698 977000 -3160843 -7300400 -9257386
33510 -9257386 -8099520 -3798640 1647432 4305532 2196613 -1634343 -2423332 414241
33502 414241 3139531 3016644 964484 -1116137 -2574684 -2935063 -1740008 -757407 -3184887
33493 -3184887 -8530582 -11220635 -7431821 -1115982 609866 -3199442 -6860317 -6591860
33485 -6591860 -4734397 -4355686 -4421194 -3120946 -2072170 -3218882 -4325295 -2267711 848910
33476 848910 159895 -3767872 -4903524 -1090073 2186455 176855 -3938403 -4478828 -2029839
33467 -2029839 -1434636 -3360274 -3728274 -934511 1873488 2233852 1187870 -297052 -2931355
33458 -2931355 -5483427 -4261742 1045612 4917845 2700057 -3200165 -7053353 -7130386
33450 -7130386 -5833710 -4779070 -3709492 -3074780 -3964400 -5825164 -6961581 -6754384 -5308401
33441 -5308401 -2324600 1237680 2292002 -396308 -3220788 -2442627 -38216 -375498
33433 -375498 -2751699 -2849726 -791729 -1194290 -4539239 -5251480 -632738 4468599 5140198
33424 5140198 2986768 1387253 -468418 -3813726 -5204958 -1382750 3771242 3559653
33416 3559653 -1794808 -5768967 -5239871 -3806482 -5119956 -8118558 -10105801 -10426253
33408 -10426253 -9687666 -8452818 -7630385 -7538213 -6406611 -2725541 1097323 957190 -2953245
33399 -2953245 -6150809 -6232918 -5152081 -4370971 -2342104 1295163 3306708 1577479 -997816
33390 -997816 -407278 3088528 6230248 7311785 6721850 4755505 1742955 -782125 -1471920
33381 -1471920 -922767 -335621 341451 1225539 994481 -1264439 -3871116 -4421808 -3073287
33372 -3073287 -2041365 -2488224 -3669960 -4658684 -5330491 -5883550 -6389041 -6548107 -5680463
33363 -5680463 -3944890 -3379005 -5582361 -8135983 -6350812 171401 5803682 5675303
33355 5675303 1326867 -2651977 -4586027 -5345404 -4891865 -3010219 -1523224 -2038020 -2999622
33346 -2999622 -2368300 -1435804 -2384920 -4097044 -4512971 -4969194 -7176848 -7944863 -3214855
33337 -3214855 3677440 4924802 -134157 -3653731 -1317130 1633323 -189989 -3708475
33329 -3708475 -3309317 -112219 634361 -2066772 -4885361 -6089190 -6309599 -5211422 -2393626
33320 -2393626 -217081 -896442 -1872182 1033892 6560334 9105816 6746132 3209657
33312 3209657 1504262 570942 -683914 -949195 21146 -99653 -1906006 -2376785 125528
33303 125528 2763983 3175059 3763222 7086781 10196116 8567138 3605346 808099 1427180
33294 1427180 1601669 -168473 -662965 1418763 2186576 -1002180 -4603702 -4348923 -1761524
33285 -1761524 -617699 -111934 2861423 6579562 5878817 423519 -4249396 -4697631 -3138275
33276 -3138275 -1780408 714224 4566287 5966672 2606561 -1991227 -3599888 -3138635
33268 -3138635 -3342801 -3290845 -1302665 -200701 -3701684 -9420671 -11541807 -9354323 -6955442
33259 -6955442 -5192703 -985221 4705319 5808645 788716 -3348366 -901578 4010343
33251 4010343 3787141 -1750423 -6215633 -6010382 -3622178 -2616209 -3768843 -6016415
33243 -6016415 -7843506 -7641340 -5161530 -2465989 -1564575 -1794518 -1342165 -262809 130917
33234 130917 -178669 -271960 -342340 -1134790 -2081507 -2193708 -2137554 -3257357 -5104088 -5994341
33224 -5994341 -5479089 -4310788 -2617293 -160318 2143969 2964272 2362980 1184445 -508355
33215 -508355 -2521241 -3182561 -1297457 1395266 2202848 1184654 336627 -70092 -1253840
33206 -1253840 -2500674 -1468253 1723332 3904741 3197274 1198251 -63495 -758608
33198 -758608 -1730143 -2667567 -3114219 -3429253 -3583813 -2618743 -278940 2264627 3992045
33189 3992045 4812909 4401200 2195774 -896783 -2923775 -3728755 -5117580 -7305702 -7759813
33180 -7759813 -5034728 -1305925 787982 1459723 1598449 -350419 -5837277 -11733730
33172 -11733730 -12341407 -6402195 818285 3532448 1478294 -1096610 -781046 2090242
33164 2090242 4852121 5351340 3531467 1077485 -341433 -615196 -800441 -1367003 -1713785
33155 -1713785 -1677209 -2273453 -3862422 -4613034 -2675944 466033 1190045 -1196937 -3207460
33146 -3207460 -2544271 -1985524 -4899384 -9016931 -9084348 -4962972 -1954972 -2307253 -1859638
33137 -1859638 2338421 6253219 4969534 549900 -1468472 -630636 -752904 -2178618
33129 -2178618 -1188263 2882844 5885861 5285433 3198543 1684623 -83782 -2274298
33121 -2274298 -2851973 -1731058 -1823028 -3465573 -2603462 2205375 5659465 2909396 -3035352
33112 -3035352 -5936645 -5062362 -3953494 -3234202 -898728 1693463 747268 -2876767 -3643816
33103 -3643816 253223 3855494 2831296 -835700 -3159738 -3924141 -4713226 -4531285 -1650615
33094 -1650615 1918175 2070068 -1425248 -4038906 -2399224 1379248 2715283 464463
33086 464463 -2012324 -1526371 861853 1631020 -89065 -1230615 686611 3644738 3670857
33077 3670857 311741 -2734962 -2363087 648659 3395216 4017640 2506529 -53775
33069 -53775 -2211349 -3222684 -3913184 -5428754 -6997887 -6428707 -3195768 602688 2981960
33060 2981960 4122048 4859499 4809882 3278274 840447 -1204606 -2092762 -1565082 126128
33051 126128 1291961 -490484 -5257338 -9547697 -10077917 -7441817 -4485020 -2273406
33043 -2273406 17408 2118710 2545221 1611811 1767628 3878188 5408219 3866184 476133
33034 476133 -1435417 -842792 133561 -320488 -1240978 -661039 1306770 2493807 1559711
33025 1559711 -394154 -1499325 -1368854 -853018 -447637 -224873 -685328 -1949223 -2440888
33016 -2440888 -566629 2168094 2315677 -490998 -2595103 -1888813 -1071134 -2720015 -4447651
33007 -4447651 -3163452 -1511120 -4296317 -9559256 -9852304 -3416814 2472237 2111503
32999 2111503 -712995 107423 2933718 1637584 -3961334 -7538969 -5469622 -811162
32991 -811162 2365116 3684904 4349301 4436420 4027483 4120024 5112477 6534874 8512340
32982 8512340 10841024 10919902 6449196 512457 -566772 4123550 8035179 5988259
32974 5988259 751599 -2136975 -1906484 -915955 802127 4184875 6730475 5105368
32966 5105368 1209050 223033 2619964 3377554 116262 -3035993 -1945133 1340499
32958 1340499 2109056 -158175 -2067176 -2005020 -1948465 -3482619 -4904185 -3692147 -404524
32949 -404524 1733899 1118037 -26713 1070745 3332843 3003836 -790605 -4429911 -4986589
32940 -4986589 -4368081 -5985953 -9411733 -11293417 -10150224 -7142193 -3240454 840088
32932 840088 2641466 -72894 -5202915 -7983115 -7274243 -6343242 -6644325 -5332143 -993903
32923 -993903 2431633 887110 -3636074 -5935129 -4737835 -3296672 -3815200 -4866067
32915 -4866067 -4496514 -3066454 -2149666 -2336846 -3016396 -3525539 -3884595 -4427288 -4819180
32906 -4819180 -3981504 -1653401 655666 1575618 2012754 3480777 5078515 4868264 3749856
32897 3749856 4366775 6081204 5384545 2250093 1115801 3376429 4113940 -32069 -4593549
32888 -4593549 -3879422 180529 1816312 968459 2073030 4960601 4558863 -70116 -3575152
32879 -3575152 -2870670 -1518523 -3064160 -5627095 -6400683 -6750107 -8944437 -11499129 -11763706
32870 -11763706 -10404861 -9556506 -8728651 -6289347 -3424777 -3000403 -5265257 -7640345
32862 -7640345 -8240434 -7263794 -5612982 -4340383 -4695099 -6559885 -7540640 -5685438 -2464922
32853 -2464922 -1053573 -2246132 -3973335 -4203502 -2395597 1152404 5115087 6767448
32845 6767448 4274992 -508615 -3647530 -3826997 -3513168 -4907582 -6587952 -5317135
32837 -5317135 -262505 5605077 8238684 6412963 2868056 1279291 2229827 3151444
32829 3151444 2232992 542478 -510495 -1570794 -3336886 -4160112 -2394001 144132
32821 144132 244300 -1685779 -1969068 825720 3941496 4797612 4306897 4455571 5111452
32812 5111452 5048354 4280621 3553957 2845404 1972032 1638451 2493504 3976936 5064520
32803 5064520 5149996 3552882 -128602 -4022209 -4343547 195784 5775816 7578358 5510419
32794 5510419 3373548 3061497 2555102 -52327 -3333284 -4557653 -3115071 -628317
32786 -628317 1131328 1339368 72412 -1759212 -2957801 -3237472 -3422370 -4029201 -4369715
32777 -4369715 -3663104 -2369963 -1595041 -1421025 -477006 2716010 7878162 12125983 11442453
32768 11442453 4296701 -5788813 -12452544 -12193707 -7366548 -3169346 -2675008 -5328528
32760 -5328528 -8695695 -10107113 -7780277 -2546323 1899602 2570095 875077 506904
32752 506904 1713594 818562 -3455604 -6645186 -4386336 890719 3019630 641922
32744 641922 -1716070 -1136550 -81054 -992747 -1688649 447661 3156493 2722281 472966
32735 472966 551959 2126269 -46650 -6173992 -8758633 -2892298 5671889 7795018 3115428
32726 3115428 -905219 -513724 282891 -2150953 -5126807 -4754910 -2408031 -1949899 -3221262
32717 -3221262 -2610724 877183 3883788 3268635 -145084 -2923638 -2600178 199067 2140849
32708 2140849 190567 -4682647 -7847798 -6544702 -3600204 -3257529 -4772524 -3800894
32700 -3800894 311517 3057772 1754809 -213763 1211000 4437484 4976572 2529603
32692 2529603 1142264 2709342 4292420 2929201 43252 -904706 633637 1955209
32684 1955209 1236668 17679 815465 3308060 4306474 1750068 -2569931 -5437660 -6362591
32675 -6362591 -7185624 -7862780 -5774424 -569435 3343034 2052203 -2083020 -3562302
32667 -3562302 -1699825 -1291550 -4920383 -8743748 -7925743 -3163265 850367 1457966 -180757
32658 -180757 -2083881 -3476503 -4160578 -4064904 -3561089 -2788565 -852369 2870977 6830720
32649 6830720 8277314 6341874 2953990 511854 -365116 -645966 -1394433 -2726081 -3766996
32640 -3766996 -3738017 -3324030 -4130021 -6027396 -6244213 -2743681 2286376 4474397 2691524
32631 2691524 272368 385924 2227128 2800336 919761 -1821030 -3169240 -2339975 -600677
32622 -600677 -235150 -2277126 -5028122 -5581281 -2791079 2212651 7907965 12866749 14735804
32613 14735804 11852449 6954307 6151470 11689276 17816968 16861757 8377396 -601807
32605 -601807 -3914102 -1992440 934765 2462093 3272074 4334365 4863220 3514704 914705
32596 914705 -187480 1809212 4705266 4977759 2678536 1210671 1731004 1246173 -1883257
32587 -1883257 -4259675 -2739110 -357867 -2247945 -7432565 -9933424 -7455314 -3718789
32579 -3718789 -1932374 -1292781 -1099971 -2970735 -6577778 -7865469 -4732236 -920303
32571 -920303 -984799 -4248070 -6836685 -7197737 -6543849 -6006306 -6235061 -7823168 -9493350
32562 -9493350 -8092207 -3220977 404680 -1600281 -7462839 -12004424 -13129409 -12098116
32554 -12098116 -9462769 -5062422 -898034 285101 -1053631 -2241685 -2757473 -4092168
32546 -4092168 -5866035 -5855479 -3785962 -1692767 -557944 359610 1229753 1753962 2828132
32537 2828132 4785284 5045190 1482237 -2867794 -3101996 161905 1767213 139389
32529 139389 -1225191 -800819 -1358606 -3648403 -3856696 -131578 3694302 4101770 2880178
32520 2880178 2841254 3069572 2084671 1552874 2925474 4110325 3341641 2631819 3360183
32511 3360183 2425199 -2348905 -6651006 -5297042 -736978 102518 -4165541 -8400089
32503 -8400089 -8997835 -7261370 -5022984 -2308993 242550 1276614 1506574 2639579
32495 2639579 3615595 2093717 -599437 -738464 1502140 2097139 161832 -489373 1611868
32486 1611868 2262463 -1811538 -7233979 -8320669 -4394381 188306 1326161 -1683655
32478 -1683655 -6310798 -8284220 -4933825 1396162 5364167 5240155 4745778 6815284
32470 6815284 8922521 7329499 3130372 629003 1509825 3892276 5875603 6852367
32462 6852367 6170233 3592472 848125 175123 1407046 2521338 2659634 2531593 2345877
32453 2345877 1670907 1047648 1298038 1283016 -1055390 -5007347 -7014860 -5233537 -1904428
32444 -1904428 156905 1350126 3589282 6317562 6858850 4543740 2077098 1924181
32436 1924181 3019554 2596178 486112 -342083 1998217 5148563 5111737 1477613 -1844163
32427 -1844163 -1637690 576555 927777 -1558203 -4214146 -4858983 -4108987 -2911144 -527004
32418 -527004 2969462 4472430 1572132 -2498128 -1837299 3691535 7435770 5410870
32410 5410870 2362647 4327507 8605861 7159729 -1140938 -8173777 -7638784 -2713844
32402 -2713844 -27677 -898685 -2341718 -2992849 -3446363 -3014270 -729000 1542391 988689
32393 988689 -1744271 -3534891 -3586581 -3711363 -4137131 -2809661 575098 3152764 2651794
32384 2651794 228302 -1378601 -721453 1768205 4303274 4611631 1975489 -1543985
32376 -1543985 -3411643 -3574224 -3252883 -1899327 1663842 5601388 6067722 2281691 -2423012
32367 -2423012 -5141563 -6115177 -6442880 -6170895 -5470694 -4792415 -3053460 1269476 6367853
32358 6367853 7785177 4240273 -444939 -2719884 -3229465 -3594510 -3044661 -1082313 -168009
32349 -168009 -2102697 -4109814 -2389845 1873622 3761851 1208417 -2865297 -4824153
32341 -4824153 -4131266 -2809556 -2938227 -4630931 -5459924 -2801250 2245382 5058095 3273666
32332 3273666 267663 402274 2836615 3416988 1272665 -496664 -283150 3061 -1042281
32323 -1042281 -2051088 -2045017 -2627841 -4930557 -6803975 -5597780 -2340845 -610396 -1641349
32314 -1641349 -2742692 -1016218 2838550 5359049 4299857 770753 -2607734 -4651300
32306 -4651300 -5915204 -6756221 -6648807 -5647967 -4934948 -4922527 -4048964 -916092 3027841
32297 3027841 4536642 2330558 -1384872 -3492295 -3315796 -2998905 -4745041 -7865939
32289 -7865939 -8896753 -5262276 1234839 5654845 5148106 1944556 316917 1514636
32281 1514636 3033109 2484926 641089 107122 1868932 4089701 4451130 3104056 2481452
32272 2481452 3966219 5664999 4539679 409837 -3403114 -3693709 -845946 1604472
32264 1604472 507736 -3722828 -7205394 -6388839 -2146962 878019 -305655 -3627152
32256 -3627152 -5071205 -3513520 -673742 1894794 3160074 1657035 -2406076 -5268630
32248 -5268630 -3721295 -354065 -470665 -4211902 -6627581 -5736604 -4982202 -6511552 -7838085
32239 -7838085 -7448071 -7896824 -9943362 -9234567 -3527130 1599859 -68615 -6020635 -8757703
32230 -8757703 -6334847 -3165840 -2045814 -1527662 -670687 -669281 -1399992 -1161963 -380286
32221 -380286 -1374326 -4009867 -5484848 -4796644 -3661262 -2729659 -795194 1709535 2271911
32212 2271911 210728 -2385287 -4270613 -6069598 -7039674 -4799902 155949 3229313
32204 3229313 1192667 -3627127 -6565407 -5996442 -3849470 -2483559 -2625949 -3386485 -3410609
32195 -3410609 -2630306 -2565903 -3752051 -4071619 -1999213 -223946 -2416839 -6897890 -7917572
32186 -7917572 -3962421 -386276 -1913749 -6288819 -7888130 -4742926 585182 4702929
32178 4702929 5379674 1924783 -3594802 -6778452 -5051154 -768266 1516441 -25577
32170 -25577 -3735628 -7222203 -8822492 -7335909 -2796492 2438693 5266605 4991777 3753657
32161 3753657 3554183 4057909 3954486 3372170 3455159 3780965 2203414 -1545994 -3841005
32152 -3841005 -1279116 3943445 6047521 3355708 315040 555257 1906786 1016889
32144 1016889 -728948 139263 3177014 4990122 4476708 2952789 580248 -2932403
32136 -2932403 -5284362 -3887866 -475188 1117423 974236 2053709 3879142 2946651
32128 2946651 -438956 -1620936 981807 3268372 1790971 -2115941 -5813267 -8104338
32120 -8104338 -7446749 -2855926 1997968 1512113 -3004542 -3446306 3333318 10385333 11220381
32111 11220381 9097316 10364907 13979552 14244182 10382602 6874745 6296724 7318866
32103 7318866 8341557 8564998 6955832 4052416 2943844 4922692 6622421 5105494
32095 5105494 2741056 2831822 3770444 2584851 978314 1835382 2525730 -1375661 -7405762
32086 -7405762 -8555143 -3812044 688111 1392400 1348105 3293133 5238386 5123563 4317674
32077 4317674 3996276 2852372 894816 980151 3717145 4916957 1407549 -3821594 -5595850
32068 -5595850 -3232547 -91024 1704353 2923696 4462650 5614699 5328087 3776683
32060 3776683 2267311 1822330 1938810 1302796 3360 -299837 708184 942277 -396999
32051 -396999 -527750 2352534 4397489 532372 -7475473 -12399075 -11211843 -8498573
32043 -8498573 -9133764 -12064640 -13248157 -11067647 -6778760 -2499383 -396184 -1160685
32035 -1160685 -2083858 446205 5506302 7964437 5338224 712721 -2466398 -4345169
32027 -4345169 -5458389 -4074285 113478 3482511 3263912 1512856 663727 -1274161
32019 -1274161 -6282555 -10146446 -6887982 1701781 7085862 5033475 209793 -1720468
32011 -1720468 -1479990 -2773618 -5473434 -6397574 -5019852 -4139834 -4843239 -4428585 -894672
32002 -894672 3030275 2932496 -1275018 -5275695 -6377344 -6504542 -7849263 -8736165 -6799455
31993 -6799455 -3893303 -3679286 -5480653 -5239832 -2530203 -1500909 -3618418 -4640694
31985 -4640694 -1466726 2629160 3337783 2056076 2723544 4740050 4205560 767677 -1847898
31976 -1847898 -1823578 -1249901 -1852349 -2692945 -2762086 -2353470 -1146461 1716631 4689928
31967 4689928 4234620 -340292 -5109366 -6158652 -3829655 -1037214 537151 1164914
31959 1164914 1822988 3527373 6277739 7737130 4998239 -1183768 -6135605 -6734178
31951 -6734178 -4887334 -3756167 -3046880 -953326 1182411 71003 -3972162 -6237060
31943 -6237060 -3337391 2611721 6555722 5698446 1474146 -2341791 -2944739 -978923
31935 -978923 87445 -1961145 -5079916 -5767897 -4416549 -5015302 -8842800 -11540567 -8610999
31926 -8610999 -1701509 3216254 2726066 -1484014 -6059797 -9113204 -9959103 -8454690
31918 -8454690 -5537951 -2777332 -733054 994210 2058793 1548307 155528 -17082
31910 -17082 1231652 1163198 -2059479 -6066669 -6717418 -2983838 2254437 5691657 6320332
31901 6320332 5084308 3404236 2237707 1676876 1321329 1311362 2387832 4436230 5920299
31892 5920299 5662411 4283630 2821288 944756 -1961655 -4760868 -5472253 -3986469
31884 -3986469 -2240264 -1749331 -2431207 -3753978 -5383211 -6465209 -5853616 -3667521 -1561602
31875 -1561602 -974270 -1874791 -3321955 -4271725 -3757073 -1451157 1554068 3423879 3369108
$$ [...]
##END NTUPLES=NMR SPECTRUM
##END=
