##TITLE=31Pdec_ABPA2001
 aceton-d6, 64 sc
 20.1.2023
##JCAMPDX= 6.0         $$ Bruker NMR JCAMP-DX V2.0
##DATA TYPE= NMR SPECTRUM
##DATA CLASS= NTUPLES
##ORIGIN= UXNMR, Bruker Analytische Messtechnik GmbH
##OWNER= root
$$ XWIN-NMR		Version 3.5
$$ Fri Jan 20 15:55:38 2023 Russian Standard Time (UT+4h)  she@DPX200
##.OBSERVE FREQUENCY= 81.013821
##.OBSERVE NUCLEUS= ^31P
##.ACQUISITION MODE= SIMULTANEOUS
##.ACQUISITION SCHEME= undefined
##.AVERAGES= 64
##.DIGITISER RES= 16
##SPECTROMETER/DATA SYSTEM= spect
##.PULSE SEQUENCE= zgpg30
##.SOLVENT NAME= Acetone
##.SHIFT REFERENCE= (INTERNAL, Acetone, 0, 248.564)
##AUDIT TRAIL= $$ (NUMBER, WHEN, WHO, WHERE, WHAT)
$$ ##TITLE= Audit trail, XWIN-NMR		Version 3.5
$$ ##JCAMPDX= 5.01
$$ ##ORIGIN= Bruker BioSpin GmbH
$$ ##OWNER= she
$$ F:/spectra/data/she/nmr/P31/1/pdata/1/auditp.txt
$$ ##AUDIT TRAIL=  $$ (NUMBER, WHEN, WHO, WHERE, WHAT)
(   1,<2023-01-20 15:54:31.85 +0400>,<she>,<DPX200>,
      <continue with go, POWCHK disabled, PULCHK disabled
       configuration hash MD5:
       00 E9 B6 7A A2 85 ED C7 34 08 36 98 17 FE 4E 26
       data hash MD5: 32K
       7C 35 D2 8F 7D 10 25 EA 59 2C FE 89 AD 26 48 57>)
(   2,<2023-01-20 15:54:39.04 +0400>,<she>,<DPX200>,
      <Start of raw data processing
       efp BC_mod = 2 LB = 1 FT_mod = 6 PKNL = 1 PHC0 = -11024.3 PHC1 = 191.8578 SI = 64K 
       data hash MD5: 64K
       5C C8 3C 24 81 CA 7B A6 00 8E 64 2E F5 43 EC 32>)
(   3,<2023-01-20 15:55:07.28 +0400>,<she>,<DPX200>,
      <pk PHC0 = -15.43318 PHC1 = 73.59997 
       data hash MD5: 64K
       A3 28 23 3D 3E 86 08 B3 6D 67 7D BA 22 B0 EF 03>)
(   4,<2023-01-20 15:55:12.85 +0400>,<she>,<DPX200>,
      <abs ABSG = 5 
       data hash MD5: 64K
       B2 67 90 FB 81 5B 30 38 89 B0 4C 10 1B 91 A7 4D>)
$$ ##END=
$$ 
$$ hash MD5
$$ 78 E4 C1 03 4A CA 2F 51 35 22 E8 00 87 23 AF A6
##$RELAX= 
##$RELAX= 
##$RELAX= 
##$RELAX= 
##$RELAX= 
##$RELAX= 
##$RELAX= 
##$RELAX= 
##$RELAX= 
$$ Bruker specific parameters
$$ --------------------------
##$DU= <F:/spectra>
##$EXPNO= 1
##$NAME= <P31>
##$PROCNO= 1
##$TYPE= <nmr>
##$USER= <she>
##$AMP= (0..31)
100 100 100 100 100 100 100 100 100 100 100 100 100 100 100 100 100 100 
100 100 100 100 100 100 100 100 100 100 100 100 100 100 
##$AQSEQ= 0
##$AQ_mod= 1
##$AUNM= <au_zg>
##$AUTOPOS= <>
##$BF1= 81.014009
##$BF2= 200.13
##$BF3= 200.13
##$BF4= 200.13
##$BF5= 200.13
##$BF6= 200.13
##$BF7= 200.13
##$BF8= 200.13
##$BYTORDA= 1
##$CFDGTYP= 0
##$CFRGTYP= 5
##$CHEMSTR= <none>
##$CNST= (0..31)
1 1 145 1 1 1 1 1 1 1 1 1 1 1 1 1 1 1 1 1 1 1 1 1 1 1 1 1 1 1 1 1 
##$CPDPRG= <waltz16>
##$CPDPRG1= <>
##$CPDPRG2= <waltz16>
##$CPDPRG3= <>
##$CPDPRG4= <mlev>
##$CPDPRG5= <mlev>
##$CPDPRG6= <mlev>
##$CPDPRG7= <mlev>
##$CPDPRG8= <mlev>
##$CPDPRGB= <>
##$CPDPRGT= <>
##$D= (0..31)
0 1 0 0 0 0 0 0 0 0 0 0.03 2e-05 3e-06 0 0 0 0 0 0 0 0 0 0 0 0 0 0 0 0 
0 0 
##$DATE= 1674215585
##$DBL= (0..7)
120 120 120 11 120 120 24 19 
##$DBP= (0..7)
150 150 150 150 150 150 150 150 
##$DBP07= 0
##$DBPNAM0= <>
$$ [...]
##$SUBNAM3= <"">
##$SUBNAM4= <"">
##$SUBNAM5= <"">
##$SUBNAM6= <"">
##$SUBNAM7= <"">
##$SUBNAM8= <"">
##$SUBNAM9= <"">
##$SW= 501.771253377433
##$SWIBOX= (0..15)
0 1 3 0 0 0 0 0 0 0 0 0 0 0 0 0 
##$SW_h= 40650.406504065
##$TD= 32768
##$TD0= 1
##$TE= 0
##$TE2= 300
##$TE3= 300
##$TEG= 300
##$TL= (0..7)
0 120 53 12 22 120 120 120 
##$TP= (0..7)
150 150 150 150 150 150 150 150 
##$TP07= 0
##$TPNAME0= <>
##$TPNAME1= <>
##$TPNAME2= <>
##$TPNAME3= <>
##$TPNAME4= <>
##$TPNAME5= <>
##$TPNAME6= <>
##$TPNAME7= <>
##$TPOAL= (0..7)
0.5 0.5 0.5 0.5 0.5 0.5 0.5 0.5 
##$TPOFFS= (0..7)
0 0 0 0 0 0 0 0 
##$TUNHIN= 0
##$TUNHOUT= 0
##$TUNXOUT= 0
##$USERA1= <user>
##$USERA2= <user>
##$USERA3= <user>
##$USERA4= <user>
##$USERA5= <user>
##$V9= 5
##$VALIST= <valist>
##$VCLIST= <CCCCCCCCCCCCCCC>
##$VD= 0
##$VDLIST= <DDDDDDDDDDDDDDD>
##$VPLIST= <PPPPPPPPPPPPPPP>
##$VTLIST= <TTTTTTTTTTTTTTT>
##$WBST= 1024
##$WBSW= 4
##$XGAIN= (0..3)
0 0 0 0 
##$XL= 0
##$YL= 0
##$YMAX_a= 1704
##$YMIN_a= -3910
##$ZGOPTNS= <>
##$ZL1= 120
##$ZL2= 120
##$ZL3= 120
##$ZL4= 120
##$ABSF1= 248.5645
##$ABSF2= -253.2056
##$ABSG= 5
##$ABSL= 3
##$ALPHA= 0
##$AQORDER= 0
##$ASSFAC= 0
##$ASSFACI= 0
##$ASSFACX= 0
##$ASSWID= 0
##$AUNMP= <proc_1d>
##$AZFE= 0.1
##$AZFW= 0.5
##$BCFW= 0
##$BC_mod= 2
##$BYTORDP= 0
##$COROFFS= 0
##$CY= -3
##$DATMOD= 1
##$DC= 0
##$DFILT= <>
##$DTYPP= 0
##$F1P= 0
##$F2P= 0
##$FCOR= 1
##$FTSIZE= 65536
##$FT_mod= 6
##$GAMMA= 0
##$GB= 0
##$INTBC= 1
##$INTSCL= 6.047779e-11
##$ISEN= 30
##$LB= 1
##$LEV0= 0
##$LPBIN= 0
##$MAXI= 10000
##$MC2= 0
##$MEAN= 0
##$ME_mod= 0
##$MI= 50
##$NCOEF= 0
##$NC_proc= -10
##$NLEV= 6
##$NOISF1= 182.463
##$NOISF2= 159.3651
##$NSP= 0
##$NTH_PI= 0
##$NZP= 0
##$OFFSET= 248.5645
##$PC= 4
##$PHC0= -11039.73
##$PHC1= 265.4578
##$PH_mod= 1
##$PKNL= yes
##$PPARMOD= 0
##$PSCAL= 0
##$PSIGN= 0
##$REVERSE= no
##$SF= 81.0140089999694
##$SI= 65536
##$SIGF1= 159.3651
##$SIGF2= -187.1042
##$SINO= 113.3802
##$SIOLD= 16384
##$SREGLST= <1H.CDCl3>
##$SSB= 0
##$STSI= 65536
##$STSR= 0
##$SW_p= 40650.406504065
##$SYMM= 0
##$S_DEV= 0
##$TDeff= 32768
##$TDoff= 0
##$TI= <>
##$TILT= no
##$TM1= 0
##$TM2= 0
##$TOPLEV= 0
##$USERP1= <user>
##$USERP2= <user>
##$USERP3= <user>
##$USERP4= <user>
##$USERP5= <user>
##$WDW= 1
##$XDIM= 65536
##$YMAX_p= 510647684
##$YMIN_p= -365109198
$$ End of Bruker specific parameters
$$ ---------------------------------
##NTUPLES= NMR SPECTRUM
##VAR_NAME=  FREQUENCY,     SPECTRUM/REAL,   SPECTRUM/IMAG
##SYMBOL=    X,             R,               I
##VAR_TYPE=  INDEPENDENT,   DEPENDENT,       DEPENDENT
##VAR_FORM=  AFFN,          ASDF,            ASDF
##VAR_DIM=   65536,         65536,           65536
##UNITS=     HZ,            ARBITRARY UNITS, ARBITRARY UNITS
##FACTOR=    0.620285442955139, 1,           1
##FIRST=     20137.2065510682, 0,            0
##LAST=      -20513.1999529968, 0,           0
##MIN=       -20513.1999529968, -365109198,  0
##MAX=       20137.2065510682, 510647684,    0
$$ Real data points
##PAGE= N=1
##DATA TABLE= (X++(R..R)), XYDATA
$$ [...]
41488 20291010 26116962 33282136 36772491 30908679 18768238 5875743 -7968773 -20577555
41480 -20577555 -20365315 -926560 23701131 32756066 25326195 20636664 31758543 49214977
41472 49214977 53060821 35584876 10195727 -1106750 9355342 25949894 29754490
41465 29754490 25022489 32544437 55266745 69386957 60489230 51190013 73555034 123391204
41457 123391204 162647968 164688692 139010623 110612891 92072132 80943212 71224795
41450 71224795 59255156 44952430 32550951 26464125 24981343 22489296 18147259 17167341
41442 17167341 23151496 33938369 44819521 51013492 47796684 34438910 19054846
41435 19054846 14111949 24249389 40678876 48934845 41087031 20416095 -4142246
41428 -4142246 -25995930 -41171493 -42192769 -20505530 18086468 48140286 48179732 26959591
41420 26959591 11677009 11520567 11451500 3733619 1544253 11013812 14263273 -138109
41412 -138109 -9901072 11041276 47370783 57101998 28895242 -3219071 -6659706 12124411
41404 12124411 25847030 22772626 11684350 2166389 -6219123 -17110986 -26824246 -23438404
41396 -23438404 -239735 28189531 33351708 6727953 -22564017 -20404406 7227256
41389 7227256 22281567 8043309 -8772583 963589 25401378 28038562 -759048
41382 -759048 -28190466 -19570227 17018670 38223972 18013888 -18962149 -28610199 -5748408
41374 -5748408 10188060 -7557575 -35259634 -35899363 -12235560 5392531 9351846 16798912
41366 16798912 25860484 9576916 -36697837 -76334537 -78057668 -55456032 -39889419
41359 -39889419 -35547499 -24238875 1174716 31999460 61679049 85598876 90104251
41352 90104251 65369654 28147480 10405695 20990930 34625439 24966081 -3906608
41345 -3906608 -26503075 -27389327 -14024160 -1527069 5539216 12366212 20397531 22824323
41337 22824323 14991684 2693892 -3899304 292365 14588703 33546779 44726632
41330 44726632 37286154 20786494 20558599 40541911 47929201 17612734 -23606207 -29501363
41322 -29501363 -1759314 14662269 2773781 -4843986 12910495 28847943 16912671
41315 16912671 -1108744 6948955 29443676 32916894 16544056 4746632 1337710
41308 1337710 -7286106 -13073191 5717483 38838042 48827866 27814205 10696173 19788420
41300 19788420 32191109 20883572 -1773383 -5553530 13768234 36356382 49751476
41293 49751476 54693474 48227972 24827892 -5525470 -19114489 -4932791 19955815
41286 19955815 27320043 6469101 -26839815 -47722171 -44592982 -23801836 2668522
41279 2668522 26354350 40064566 38097817 24989157 15337394 17189999 22794853 22445469
41271 22445469 17881066 14154809 10822533 11882464 28204560 53033341 53018910 10550478
41263 10550478 -38303542 -42330311 -5732156 18255361 5875624 -8276784 5204781
41256 5204781 21922380 8725618 -16922925 -14386779 11611567 14253506 -25612607
41249 -25612607 -71279245 -80097341 -52533756 -19567801 -4013744 -8596890 -24698207
41242 -24698207 -36326250 -26985919 1302131 23577948 21925815 13462430 29864403
41235 29864403 70948098 100484546 94494938 72016645 62535056 61530786 44061064
41228 44061064 13105094 2270278 25892239 55717945 60939856 47698627 40323391
41221 40323391 42443557 39130507 24984548 8246891 -4383175 -8775476 -203683 12086798
41213 12086798 2187665 -35457317 -61525621 -37971565 11009952 23788313 -14467254
41206 -14467254 -54380100 -55971943 -36958277 -30755539 -35521983 -31774369 -21932606 -23208341
41198 -23208341 -39046761 -60201508 -78585488 -83652247 -65158738 -36047704 -28291736
41191 -28291736 -46130676 -50995647 -19008687 15742409 11305328 -14104331 -10015854
41184 -10015854 25675246 45554891 29855491 12673389 19687559 27457044 9672911
41177 9672911 -13336643 -6035652 22835942 29219080 -2503733 -36408364 -34362693 -6587212
41169 -6587212 5244599 -13307867 -30815984 -17356610 10376589 13814594 -9098810
41162 -9098810 -22207057 -8022427 10483799 17066305 31953757 67736851 90634278
41155 90634278 65719185 16904200 -3192396 11090732 19554865 5484651 -5404670
41148 -5404670 2357310 10452522 7284250 9029130 23270192 28865885 12087262 -8508516
41140 -8508516 -13056427 -8385820 -6389071 -1316958 11778843 21287589 22027959 30159574
41132 30159574 54182690 73729830 69621053 54563556 51219656 58681468 63951947 68732124
41124 68732124 79207136 83208209 63393292 24869269 -10928630 -31943974 -38562953
41117 -38562953 -31917109 -16575232 -5453343 -6473337 -12178488 -12024426 -2718570 18888242
41109 18888242 51860954 73028125 52915672 4698514 -16807085 11456250 43173038
41102 43173038 30334821 -5209882 -9790209 19914125 41604782 36303196 22210120
41095 22210120 9992452 -5987455 -15672569 44365 29819207 41732506 33149440
41088 33149440 29246366 33164596 23207739 1390151 -3771749 9954465 11384223 -6993506
41080 -6993506 -12510289 11794173 41459758 59159535 82070250 117350853 135981275
41073 135981275 120417996 97245533 90497572 80951525 47012745 10559633 2836504
41066 2836504 14613150 20446894 26210165 49948499 76128461 72388310 39131487 4648261
41058 4648261 -17752567 -33520668 -40959280 -36717276 -35414782 -49065000 -58434356 -40429869
41050 -40429869 -12717829 -12693731 -40041448 -59244657 -53974542 -39709484 -25612994 -5011144
41042 -5011144 15163776 16644444 7205830 16684179 47252274 65635731 56221018 44242355
41034 44242355 50068530 56603169 44322102 27025273 25196564 28430940 15216940 -5759886
41026 -5759886 -5620126 19197746 39266596 32818827 12844113 4891924 11905724 15709365
41018 15709365 10379283 16820588 51789466 92837986 97594966 60270078 23401501
41011 23401501 21956677 41805109 52640602 54342960 59961158 56323707 23511419 -18534391
41003 -18534391 -27321499 303456 24823869 24506625 18988291 27485414 43625676 60427602
40995 60427602 80673978 91489230 69500274 26517035 8808019 30653238 49037847
40988 49037847 29479356 -2840030 -9157439 3117326 6138272 6392182 27645740 58200061
40980 58200061 61805377 34150297 8023607 2793575 2561504 -12052169 -36674499 -52335397
40972 -52335397 -44774160 -15041398 16777350 25572388 11008456 590377 9548478
40965 9548478 16798907 411011 -25072815 -34314609 -33430497 -41804911 -48244733 -26741533
40957 -26741533 11838240 26823108 7519159 -13321898 -10828762 3731767 13389353
40950 13389353 18515509 18440169 4044507 -16372633 -15252070 11484279 27287358 2106949
40942 2106949 -45546343 -75323119 -74852612 -60478298 -44420331 -26652320 -11092252
40935 -11092252 -6447329 -11845910 -16718214 -13464293 -545637 20746678 41479801 44434781
40927 44434781 22136371 -9045186 -26060876 -26917219 -27863527 -35794455 -39896130 -33541773
40919 -33541773 -28596054 -37879049 -52896284 -51871272 -27793355 2811792 21203848
40912 21203848 26504712 28293793 27558793 16585507 -4658517 -24165231 -31887899 -28073934
40904 -28073934 -15049800 8496741 39679702 66859887 78894541 72655560 50013143
40897 50013143 18443901 -3717046 367149 20650264 24269365 -3151926 -36383103
40890 -36383103 -45031146 -32507710 -21880895 -18143509 -8997037 5983056 12550237 5381148
40882 5381148 -6705549 -17058724 -24395863 -23716615 -12927068 -4269984 -10051254 -21902032
40874 -21902032 -23564524 -17043750 -13956118 -10165762 2949762 10117805 -9812860 -39634839
40866 -39634839 -37043533 1439949 29681714 19918591 3761100 21533984 62010692
40859 62010692 82968447 70406893 45550032 25035832 5162152 -15493914 -22426457
40852 -22426457 -2590906 34295411 59140256 51716226 27466656 26090897 60326407
40845 60326407 87926262 60858639 -3824014 -38913223 -17885056 10684978 -1276227
40838 -1276227 -31412059 -27273476 12246407 39526980 30134289 9840716 8036097 18848399
40830 18848399 19753737 5323288 -12247149 -24423533 -35102835 -49397098 -60391208
40823 -60391208 -53171658 -25210130 4404823 16801355 18025134 25168325 33810950 24629305
40815 24629305 1647184 -7576659 3218061 7230767 -9933439 -28089759 -33555505
40808 -33555505 -44236432 -66992040 -68746459 -28349896 16377202 20456273 4319750
40801 4319750 20631726 65574245 82929825 53521963 22103688 25496454 44701845
40794 44701845 44388504 17535338 -25041540 -70049458 -90546602 -59811339 2339782
40787 2339782 34411866 9182027 -29425180 -32362177 -13503086 -15536025 -36600718
40780 -36600718 -36885509 -5570799 23596832 24625026 10673675 4842700 7529013 5592020
40772 5592020 -4388128 -14912591 -19423234 -15807390 -3824861 13895203 30055997 35795723
40764 35795723 27523340 12318413 4272694 8847638 11288357 -8521067 -45347833 -65007310
40756 -65007310 -42536587 3506569 28508688 12509606 -17904245 -21540975 11109751
40749 11109751 49349478 57706368 33339779 3995410 -7002980 -2948380 1545661
40742 1545661 4019450 9568121 12199853 -136598 -22536271 -32725662 -18365205 7729916
40734 7729916 23459725 17902773 -5373050 -32599997 -45080402 -33663466 -11619416
40727 -11619416 -905932 -4254042 -6112136 -2692718 -10431803 -36699234 -61938208 -63911925
40719 -63911925 -44617621 -20902015 -2966100 4860298 -3004695 -23251108 -37539842
40712 -37539842 -32270431 -15373693 -59016 16220116 40118143 61360844 63787449
40705 63787449 50029598 34799878 19379914 -4747294 -29021581 -29279463 -328086
40698 -328086 30408717 34167019 13675646 -4343704 -1456062 15558594 25880660 17140961
40690 17140961 -2984211 -16804824 -16794049 -10251395 -3266746 8579793 26204448 35605945
40682 35605945 24223965 1578224 -10624971 -4288280 11591465 26094735 29832362
40675 29832362 11388432 -28573037 -63280858 -63347841 -35909309 -17991164 -26992984 -40885997
40667 -40885997 -35079111 -15187135 99617 7798109 14472524 16757820 7062082 -10757422
40659 -10757422 -26819596 -37604314 -40321391 -27210303 -1176172 16050260 11920542
40652 11920542 7905524 30630103 65098152 67897449 29875909 -5612820 -176343
40645 -176343 29635068 39884344 18859809 -5002612 -6563507 8451229 20356621
40638 20356621 20821609 13796310 3489791 -7335423 -10613091 4396694 35295472 57687868
40630 57687868 44665142 1860346 -28140559 -12026830 29725821 46249667 24109005
40623 24109005 3937532 18801837 46061073 45474778 21169951 9756703 19625207
40616 19625207 23263984 9614994 2959925 18686751 36431574 35191731 24819433
40609 24819433 21795352 20861075 14176492 13100772 23439905 22685251 -5426252 -33798728
40601 -33798728 -26992642 2109580 12651681 2316553 5551703 27306781 31355933
40594 31355933 5800655 -11662406 2567707 15627161 -6726054 -40942216 -42612543
40587 -42612543 -14457582 6355536 8750287 9669975 8404568 -11435283 -36083166 -27219097
40579 -27219097 15896008 43390597 23464488 -11580061 -13649675 13864852 27330420
40572 27330420 5582231 -28631874 -45200424 -39663453 -26012203 -13054028 3267425
40565 3267425 27845336 51701869 55348472 33433737 10137502 13814533 36239821
40558 36239821 38419212 5111152 -29212714 -26542937 1378329 11485789 -9493721
40551 -9493721 -31710163 -29663798 -15135469 -13595609 -28961001 -45380805 -50025631 -39953456
40543 -39953456 -15202827 20553835 54883282 72553675 68117087 49626631 32447162
40536 32447162 30820826 48288954 70915468 76491435 58215281 34616078 27571752
40529 27571752 34176169 30805928 4820691 -27937534 -40771128 -24848052 3104668
40522 3104668 17987813 9669664 -7621542 -10122172 6469973 16276007 -7535913 -52859122
40514 -52859122 -73693570 -43476977 10334518 39231708 30941472 14582585 14094668
40507 14094668 21355403 20475449 14342951 11897845 7426527 -6577080 -17366893 -6517486
40499 -6517486 17915887 27982840 15919463 3850122 7147789 12073149 2836741 -11332187
40491 -11332187 -16082455 -20617513 -39561448 -56948294 -40342335 8124403 44700322
40484 44700322 38091563 7502349 -6266784 10815595 40375297 58349848 52429999
40477 52429999 26441943 2099332 3260795 23928620 28131232 421485 -22460455
40470 -22460455 1017883 52927592 76336980 54151183 25356258 18384522 13867939
40463 13867939 -7887926 -24640924 -8890144 24993321 46750748 59391063 82418489
40456 82418489 103658275 93403268 59798544 43862325 56209926 62895198 44951150
40449 44951150 29259694 39963920 57010877 51759936 34444789 32664147 42823029
40442 42823029 38245488 14802147 -4593064 -6846493 -1224812 3255780 6064651 522895
40434 522895 -22124907 -49725387 -55670144 -36180190 -18261356 -20567385 -28402738 -21444218
40426 -21444218 -6323920 -3019083 -13193312 -21856016 -20818365 -11323413 9001456 40856672
40418 40856672 68636206 73015109 59909106 56697574 74281408 91554109 85862332
40411 85862332 60892443 31998246 1338147 -32760499 -54024796 -42199066 -7779170
40404 -7779170 12323943 1439246 -15305031 -8479254 14410551 23677973 11394844
40397 11394844 -2475543 -3958334 -1005221 -1808042 -583082 3213783 -7906598 -42255703
40389 -42255703 -71495139 -56777141 -1789065 44528703 45610500 17451108 -514248
40382 -514248 3800343 12580327 13903261 15231251 23022408 31893192 38593069 46826282
40374 46826282 50769937 33311083 -6961079 -43764449 -53637905 -44561428 -37177564 -31735655
40366 -31735655 -16643391 889965 1801956 -9813694 -8363336 12136148 26402232
40359 26402232 16450982 -3615318 -13189579 -11345173 -3537802 12941652 31753813 30260408
40351 30260408 3811708 -14429011 2709465 31162495 29270045 3440161 -1920278
40344 -1920278 22045514 30077283 -8758563 -61375299 -73674902 -39746526 -2496049
40337 -2496049 3103129 -14613922 -22768865 -3590434 27795650 42198218 31783666
40330 31783666 19653550 26305274 36896033 20781202 -21199195 -52969755 -49740634
40323 -49740634 -26067400 -10797694 -13700077 -24915777 -30034638 -18136156 9191215
40316 9191215 31805077 31250755 19527513 25405642 48377969 54026111 24965997 -12205327
40308 -12205327 -25729678 -17754273 -7599469 -2104484 -1666466 -9778723 -15775876 4271408
40300 4271408 45097518 60409170 24997034 -19312880 -18078599 19346316 41586749
40293 41586749 34010953 25274363 25815917 14463998 -11533495 -24434401 -15175203 -10294291
40285 -10294291 -24912488 -38180783 -32703863 -22750190 -23710899 -24968390 -14039448 -687310
40277 -687310 3398000 5125741 11404631 12711277 3367806 -4161534 -3730500 -11656032
40269 -11656032 -37332175 -58156048 -47506291 -13033991 14299363 18178582 7527351
40262 7527351 1208880 15027071 49205892 78339682 73844692 47309642 44366062 78929170
40254 78929170 106353091 89545916 59042858 66447393 102224947 109724973 71167992
40247 71167992 29402352 21205891 33963423 40266280 37925413 38176840 41671158 43571788
40239 43571788 44047867 42220398 35198547 28736375 31941201 39275494 37660980 31507004
40231 31507004 36029200 45347049 38094087 19497264 22115013 52243104 72819844 60545516
40223 60545516 43776235 53864879 71620140 61366379 33051699 23874156 32750581
40216 32750581 24025848 -5615832 -15459653 12279444 39995427 32562290 11358926
40209 11358926 20781851 66469083 117478607 150753297 161386829 143595546 99572410
40202 99572410 63453212 77121759 132761390 172841068 164266634 143680453 163271904
40195 163271904 213739358 237280102 209531032 168919899 155447668 155992308 134873752
40188 134873752 94127547 69008124 72858653 82353664 80804507 81266053 91343435 86538089
40180 86538089 47675999 4838800 7305740 55184864 97064478 100044257 86300634
40173 86300634 85256930 84221670 56711578 16316721 2758094 21345275 35384128
40166 35384128 24298393 13249417 27835320 48786283 39484577 2406952 -21801478
40159 -21801478 -7679902 28200644 56081987 66435447 66718088 63079203 58635882 59219019
40151 59219019 66987916 72876747 66373746 50240358 36101940 27963411 21178716 17412033
40143 17412033 26990787 50595133 70659109 72340553 65411228 70873492 88942574 97194570
40135 97194570 83236144 61916871 51471765 48632963 41610873 34249892 37752260 47529604
40127 47529604 51628412 57673689 83942604 120883594 131265154 101352002 65597480
40120 65597480 60701941 76715522 78927074 62212590 52946378 63098733 73268292
40113 73268292 65479989 48679453 43155946 56205307 80324545 102660779 111275990
40106 111275990 103669495 92988611 95689105 111564450 126175665 131279492 129013350
40099 129013350 117961833 93762923 65854554 54495258 65072152 81755693 91657681
40092 91657681 97340409 99425793 87656068 60430827 34584485 22650948 17497197
40085 17497197 12937657 20516533 47157868 73146522 75836800 63729306 62455724 74560048
40077 74560048 79270516 69956475 65655288 80629587 104249723 119723865 125895823 129624700
40069 129624700 128447536 113622470 86662753 63525919 60049096 75184823 91114074
40062 91114074 92415457 82842790 76904604 77574447 74722920 65714460 59617931 55468819
40054 55468819 38358428 10658857 4235803 38395042 83474782 94498817 68295374
40047 68295374 36618854 13781158 -10775302 -31707202 -23876867 10722720 32530367
40040 32530367 20396460 4432448 18673067 49367851 60098700 47695766 40348230
40033 40348230 50538684 60132121 50278340 23665990 -2617406 -10778885 6993996
40026 6993996 37384957 52512819 41930936 27634427 30155297 34249685 14829505
40019 14829505 -13939414 -11137759 28436969 60576644 52805327 28228291 27912708 52456772
40011 52456772 66165645 46973108 8820468 -20357010 -23745603 -1155089 33786429
40004 33786429 60838829 69885889 72186322 86819899 117102840 148464687 166626061
39997 166626061 167713331 153063454 126746770 98914845 79660905 67336431 53632581
39990 53632581 41019046 40746407 49849729 48038529 28474477 14894248 29919756 58513046
39982 58513046 66415973 48916308 34134894 36560119 37203298 21514801 8950280 22967520
39974 22967520 52322397 68906815 69831346 72086865 74626474 60239577 34714032 28374689
39966 28374689 49291652 66919343 56906744 32977218 16072984 1543287 -16978450
39959 -16978450 -18846571 11796739 44629929 37450491 4980094 7060894 61740952
39952 61740952 114063573 110274550 66076456 33099511 26234602 20902977 6961307
39945 6961307 4170649 21242759 33635815 18260904 -10047861 -16609533 6834392
39938 6834392 32828302 36493231 26726844 28026425 41074765 41119944 17932967 -4092552
39930 -4092552 -848328 13213513 6596169 -17319385 -20223800 15913713 62973583 87297006
39922 87297006 89308154 85450246 75665891 54214867 34700163 34551964 44288003 41396422
39914 41396422 30035284 37237170 68303377 94408970 92369752 72964167 58623003
39907 58623003 52379594 42904606 27322961 15191309 15336604 26276733 36178653 31749417
39899 31749417 13819473 871713 5990037 15490979 7522776 -12493889 -18541827 -6133370
39891 -6133370 317159 -11027305 -20356977 -12528410 -3381599 -8933633 -14258492 685749
39883 685749 26042244 42419329 56935098 84065401 105189245 88345226 43562835
39876 43562835 16840141 24960734 35559358 22559472 4619031 10735299 38259430
39869 38259430 65913194 83495228 87579963 70481969 37311497 16045680 26812862
39862 26812862 54861527 74196199 81625161 84826665 75367266 44691997 14428754
39855 14428754 15422115 40146560 49418280 27899211 1419165 -5404217 2715419 15006477
39847 15006477 35235995 63312043 81682238 78795693 66932677 59895457 51318253
39840 51318253 32608078 14362361 9498358 10352983 4386884 -294153 11453068 32518834
39832 32518834 41845556 35367003 25573387 15861351 -478880 -18889639 -25497266 -19534078
39824 -19534078 -10911387 2402130 28440524 53474255 51302517 26311524 15768183
39817 15768183 36709367 59767301 52934625 24930276 4459165 54698 4336069
39810 4336069 17433327 38736883 50825650 39682310 19716559 12042988 8634330
39803 8634330 -12966321 -47541646 -66604957 -61922072 -53088388 -50388326 -41051604 -18129862
39795 -18129862 6118191 24508495 45124426 65566840 63674133 31373515 -3526106
39788 -3526106 -9721411 7601071 17906053 6571482 -12038794 -17168230 -3679001
39781 -3679001 16208797 25163502 17095855 3954595 1308465 9370325 19373309 34423386
39773 34423386 62926832 89209288 77513271 19536242 -43288220 -64290428 -44032863
39766 -44032863 -19814636 -14924742 -19451855 -15745622 -2601540 8338340 8902909 4223864
39758 4223864 8754308 28783736 48807351 45294619 16254876 -14754578 -26089414
39751 -26089414 -15041487 12930781 50166993 76816695 70696171 39367434 17985149
39744 17985149 20661114 20363384 -3408907 -25050864 -9442804 33765627 64114451
39737 64114451 63129500 43694007 21573690 7996859 16543471 45099001 63075734
39730 63075734 49117294 28346745 36144347 58675585 53247400 19765452 2594589
39723 2594589 19359183 36645315 27157992 6911255 207927 6592914 19145279 39476987
39715 39476987 57344209 50194683 21328397 4361253 10309829 5951759 -30762845
39708 -30762845 -68689378 -68078604 -38193064 -15859974 -9061903 1863189 21885115
39701 21885115 35470783 36057257 32254686 28392144 21374669 12354717 3297547 -11124821
39693 -11124821 -32076519 -46826537 -46524217 -41708677 -43148052 -41311082 -24661193 -3790157
39685 -3790157 6237469 14942331 41003861 76096192 91987784 80826545 62753998
39678 62753998 53030562 44711492 27367694 3721913 -17445171 -30971038 -34531374
39671 -34531374 -28968348 -20582249 -14678525 -8682913 641938 8216851 8376994 6184487
39663 6184487 10722581 21279529 28660441 25742784 11189681 -9725638 -23644029 -19980226
39655 -19980226 -8229324 -9791515 -26971626 -38886431 -35758377 -33654340 -42773770 -47961884
39647 -47961884 -39426719 -34525093 -42915653 -37624351 4427138 55200535 69233159 50022453
39639 50022453 41185140 60475590 84918444 96704817 99366186 87244304 45580823
39632 45580823 -7869132 -24782943 9272538 45809194 32562074 -22436280 -67695770
39625 -67695770 -70495055 -41764432 -11980170 -990185 -6490821 -11685330 -6451910 -286898
39617 -286898 -5925961 -15843102 -12035517 4466369 15386638 15986367 20302554 32732649
39609 32732649 39079736 32850643 27211418 31149098 34687625 29005340 23131966 28773405
39601 28773405 42767930 54663102 60445313 62152456 63467310 67266911 67421737 48104557
39593 48104557 7217446 -27447512 -28436705 -7650792 3318445 4228265 19467094 42229871
39585 42229871 32799634 -14835918 -50336445 -34624090 7813585 30862219 26973657
39578 26973657 16171105 6441468 -1300346 4908042 26071319 34302507 12060369 -11504979
39570 -11504979 -1239270 25832526 25972329 -439554 -10233365 14147283 44050969
39563 44050969 57220002 66427922 81459741 82074925 52758657 16192607 4779302
39556 4779302 15147054 16184403 -5241268 -28166290 -26844342 -432528 31120950
39549 31120950 51097002 57719400 54689634 41259272 19891467 6496428 16562360
39542 16562360 39683339 45715559 23919647 -1176272 -4463630 6690830 10862012
39535 10862012 7913116 12615145 23033901 21629953 5975771 -5141920 995994 16553393
39527 16553393 29240603 36431112 39144030 35916407 27175222 15498223 -51115 -20228232
39519 -20228232 -37156689 -40585096 -31649318 -19746547 -8340672 3935999 11634856
39512 11634856 7379403 -2711550 -4409584 2940851 5685237 -1109239 -5915527 -1271434
39504 -1271434 2178902 -9286228 -31979319 -46910816 -39369946 -14325022 6079199
39497 6079199 3890983 -12943955 -18737225 -5504969 3840438 -9636267 -29320332 -28518617
39489 -28518617 -14216305 -15233117 -32408205 -34421305 -6644887 27457694 41839587
39482 41839587 35981262 18511748 -7027730 -27086992 -19703569 9953314 23738325
39475 23738325 1872573 -26869525 -30777699 -22422251 -27637750 -33564911 -11253974 25302919
39467 25302919 31475683 1707262 -18996084 -1944193 26648693 29100800 6115874
39460 6115874 -14242763 -12360385 13482777 51230622 75444199 65664305 36099795
39453 36099795 22780705 29739635 18500354 -30267240 -77156563 -74629503 -29928007
39446 -29928007 15335770 43452138 59500591 54123982 17038636 -22035244 -18313601
39439 -18313601 19672379 35423408 6724096 -25952806 -29346229 -26929976 -49981166
39432 -49981166 -80739195 -82892160 -60282558 -45231541 -46081715 -43749427 -30120614 -16161082
39424 -16161082 -6620392 4848633 17105874 20193536 10270334 -10186808 -39290621
39417 -39290621 -67427033 -74872779 -56225128 -32733707 -20278730 -3722170 30912824
39410 30912824 59237087 49102186 14200173 -1958895 12896743 33754627 45880351
39403 45880351 55138617 53963394 24902057 -16252900 -27806547 -4630221 11193187
39396 11193187 -2025334 -11813656 11939141 48017855 60890426 52459745 44958953
39389 44958953 40093246 28023250 15581952 14231600 15814761 7144457 -5433682 -9169145
39381 -9169145 -7987400 -11356748 -14964798 -11563583 -5266324 1468990 15580134 31919086
39373 31919086 28583908 3606872 -10735690 5442563 26827384 25610092 18044597
39366 18044597 32257644 55134999 53351566 28944970 11506856 8960112 7487156
39359 7487156 7814026 18978881 26701833 11885076 -8371607 -3910905 12538603 3331763
39351 3331763 -23622144 -18252473 30929877 73524371 69435140 35747172 4738612
39344 4738612 -17170569 -27708317 -13128866 18084748 27726891 4209734 -12319009
39337 -12319009 6442950 26794017 6458318 -35047165 -46724891 -23833502 -5826765
39330 -5826765 -9438832 -13112817 -5761960 -4778402 -17341615 -22256563 -5233240 16213210
39322 16213210 19978514 12202713 17213942 45976198 85792442 114247984 116388127 93465194
39314 93465194 59549364 28496036 6561296 -1090091 11505138 35518910 41909877
39307 41909877 11923443 -31938339 -48582630 -33102437 -23888333 -45911948 -71543822
39300 -71543822 -58294089 -9423183 29997727 33316992 21447409 24704726 38678955
39293 38678955 36029105 9713924 -17104573 -22902242 -11254097 1968794 10013224
39286 10013224 15204378 17786109 15497086 9842422 5031980 3368041 6027002 13677365
39278 13677365 22240784 24438857 20688123 21450419 32510633 44836334 45940010 34912264
39270 34912264 20068210 8921039 5664297 8793863 5911597 -15354204 -43475606
39263 -43475606 -47827929 -20581307 5530347 600623 -20719098 -26842549 -19941649 -23401994
39255 -23401994 -31205986 -14680565 19738610 26552855 -10075686 -45229752 -36161641
39248 -36161641 -3314454 3514482 -23005519 -45543250 -40542606 -23419473 -13861552
39241 -13861552 -5479136 16910452 45727402 52757893 22385715 -26387663 -58169491
39234 -58169491 -59923071 -50409984 -45764764 -32702595 3815668 39147561 29873907 -20535945
39226 -20535945 -53183578 -29078118 16490370 22098069 -18258948 -55037478 -54554109
39219 -54554109 -34388131 -22793120 -13968750 16930154 68512459 103832927 89193905
39212 89193905 33291045 -18855634 -31096112 -10497581 7780260 5575968 684360
39205 684360 17974401 52666368 72952460 56649473 16319268 -15340591 -21306472
39198 -21306472 -15472796 -19685482 -32801891 -35009831 -21292641 -10792955 -14104350 -12449416
39190 -12449416 11411693 39430649 42323606 24725433 13976018 11049603 -9096962
39183 -9096962 -46306839 -64836395 -46851581 -19863148 -12126050 -13925618 -7278724 -3809625
39175 -3809625 -21346831 -44471330 -42880646 -17542608 2313033 2336560 -2985674 3668188
39167 3668188 23592075 45796661 53153836 32880837 -1828289 -12779090 17647892
39160 17647892 53119521 44345499 -2960190 -34134931 -21099082 2619916 -5078799
39153 -5078799 -36497529 -51516878 -35283116 -11938665 -4913994 -6839705 2810631 23515704
39145 23515704 31756954 12902068 -17575789 -33520500 -31361444 -30218790 -40816945
39138 -40816945 -51417391 -49710937 -42266252 -41524711 -46000757 -45778040 -38423488 -27915792
39130 -27915792 -16255106 -7282968 -9902978 -25055358 -37515515 -33962819 -22980266
39123 -22980266 -24563548 -44976337 -72367404 -90170529 -84757991 -50318987 -335557
39116 -335557 35062357 39042588 27636024 24400337 26529235 16596654 -2054595 -9253756
39108 -9253756 -4484877 -9251760 -26773189 -28115288 4974599 44159176 44198195 561326
39100 561326 -43254806 -47838943 -22384615 -7999986 -23158138 -40567787 -25992400
39093 -25992400 11287163 27264467 3303001 -27359342 -27561738 -8482647 -7851993 -30239334
39085 -30239334 -43914061 -35789885 -32006597 -50506429 -65965021 -48033868 -12821166
39078 -12821166 -3349017 -26996295 -46013053 -34030519 -11065622 -7879392 -20996354
39071 -20996354 -26781547 -22945358 -25721612 -33087520 -25008837 -3970265 -237261 -21908722
39063 -21908722 -32436833 -3292468 37942400 45322406 20792826 4667734 12273235
39056 12273235 21473584 18565749 14158417 11846200 3315893 66072 25898179 66993101
39048 66993101 75051617 37663784 518129 -2990479 2198634 -12561453 -25405015
39041 -25405015 -6049504 26880084 38351825 35866551 46661476 62540108 59456425
39034 59456425 49515771 57454303 63276268 29852861 -22173499 -32350015 5855639
39027 5855639 33956790 21473889 6915349 24526368 48157775 40568337 12394885
39020 12394885 -4372797 -7161241 -12738086 -22975926 -30565947 -36431223 -36951330 -18356965
39012 -18356965 11723644 14895964 -24153047 -58007297 -29106190 50535120 109841609
39005 109841609 106058262 68012223 46861114 52030909 51950641 24545732 -11378010 -19334117
38997 -19334117 7233339 32555864 20928689 -18026305 -41808877 -28010306 4528180
38990 4528180 27507371 34681117 35518826 35836869 33664991 22401900 -4804693 -40510794
38982 -40510794 -55426864 -26810463 25245580 54937355 47626531 32296318 31476188
38975 31476188 31098637 14515388 -4840484 -7253140 1238740 5040311 8600856 25618318
38967 25618318 51886337 69900560 70509949 54728641 26804577 -401813 -8109525
38960 -8109525 5349181 18516460 16157296 7079743 1203536 -7636628 -20126034 -19520038
38952 -19520038 -3595531 -1964935 -33079002 -67927499 -69321759 -46094334 -31589875
38945 -31589875 -27148564 -9786051 16396425 23443545 10783908 6994923 16599915 10072063
38937 10072063 -21838116 -45807913 -36896654 -16465391 -15483114 -27425582 -23714007 2277209
38929 2277209 30127921 39620162 25791557 -2093491 -22473763 -14979158 13335514
38922 13335514 27542966 6595348 -25481993 -28204910 3279040 34294987 36354819
38915 36354819 17520122 2967845 1131931 520898 -6625081 -11197566 -2235760 13287388
38907 13287388 17175985 6147166 -2458970 1980852 4323307 -13068950 -38407968 -43324582
38899 -43324582 -24353074 -8140199 -12136658 -23372632 -24770140 -19947502 -17848074 -13188548
38891 -13188548 -1494466 3527586 -8041679 -15473621 7664057 45663594 50384783
38884 50384783 6510375 -41449166 -43477932 -4129234 30725241 30678924 2879240 -29541511
38876 -29541511 -45639452 -30619927 10600973 44408444 39379821 7933698 -9953647
38869 -9953647 -6171153 -11797924 -35334000 -37815988 2341687 40726708 27611665 -13289604
38861 -13289604 -21392316 5257143 14500994 -6887102 -15593139 2709454 3644542 -30827720
38853 -30827720 -47066478 -6744636 39796212 27556532 -21882922 -41441369 -25742917
38846 -25742917 -20613291 -27234931 -1521892 52514128 72548595 38145244 6542635
38839 6542635 20452804 46744525 43105733 25884046 26643677 31520461 14724935 -6631243
38831 -6631243 -2656358 15474930 21719172 27164934 53436968 78332702 65459054 32045392
38823 32045392 27794604 54141622 64185702 41902358 21153366 19212372 11682648
38816 11682648 -10688647 -18471487 -1764220 1429992 -31935338 -64652038 -54583048
38809 -54583048 -16639649 9894193 21063421 32380175 34806101 16062652 2476774
38802 2476774 26311955 65324262 68415090 35026387 15040013 28412239 39495955
38795 39495955 23231642 5867240 17241642 43931993 56616131 51798194 40305518
38788 40305518 21961378 -1914813 -14430287 -8150132 -4536911 -22767448 -46585311
38781 -46585311 -47789067 -27410438 -8168041 -185496 -262302 -11293400 -32652051 -41434769
38773 -41434769 -15756999 27037603 46410622 32811741 15950804 15933225 16892906 -560034
38765 -560034 -27765409 -44895411 -49593689 -51622952 -52903269 -49792635 -46300881 -49058232
38757 -49058232 -52930599 -44668590 -20836301 6494451 22775876 24483956 19614245 19354596
38749 19354596 30191312 49858096 66900190 65804044 39564036 1057125 -24229327
38742 -24229327 -24069812 -12933726 -10622198 -14949011 -10671351 1792246 9838795 17968403
38734 17968403 43266714 76562650 82755966 54981169 33334923 45147733 60257495
38727 60257495 39854815 196551 -15931042 -9053604 -12915512 -25604900 -6418555
38720 -6418555 53886932 109016320 116691805 83201944 36760370 -5702211 -31419510
38713 -31419510 -28744866 -10370102 -9333965 -34505597 -57148212 -54990925 -39219497
38706 -39219497 -23881177 -3417098 19412012 18467358 -14967284 -44980373 -34907108
38699 -34907108 3375207 31402751 34863433 25310965 10922744 -4986265 -11072328
38692 -11072328 -1518264 8051400 483745 -18838270 -36031797 -49786252 -59149455 -51998527
38684 -51998527 -30574256 -26458979 -59066278 -96995273 -94203005 -51645870 -10684544
38677 -10684544 3137002 -2216088 -11485312 -11747918 12667130 56747372 74682205 25826238
38669 25826238 -59912492 -104800202 -77247134 -24133739 -712165 -8171218 -17785092
38662 -17785092 -20434030 -24381072 -26727085 -15597422 7939769 28788044 34051370 20948422
38654 20948422 -3930661 -26204291 -32958884 -26350801 -20446278 -21866773 -23334088 -18659735
38646 -18659735 -12252146 -8701155 -2920095 12428835 34409893 49079907 43133957 18265053
38638 18265053 -6272783 -12571269 -5750299 -4180249 -7381786 4360248 30270224 37193077
38630 37193077 7653239 -26832604 -29758678 -14086391 -16260879 -33950244 -33785645 -12416065
38622 -12416065 -2697133 -17243114 -30286971 -24660114 -16988900 -23553793 -36353564 -46361557
38614 -46361557 -57610577 -64908181 -50549867 -18328381 1498365 -2138472 -2601842 18787658
38606 18787658 41610575 44000710 39382802 46625408 51497726 32062652 2053913 -6406263
38598 -6406263 9453774 24734434 26448169 20357947 5382845 -26150689 -62026559
38591 -62026559 -73221542 -51778238 -25558520 -25695703 -51255982 -73428621 -68137333
38584 -68137333 -39698879 -13692451 -7357903 -10598681 -2819084 16040296 25899540 17027025
38576 17027025 939904 -12655850 -27926057 -43631978 -44730584 -26717637 -7527449
38569 -7527449 -123392 5537233 15728368 11402520 -21791668 -60569992 -69262522 -45215931
38561 -45215931 -12500093 16894404 45915602 66737446 65901954 52262740 47819420
38554 47819420 50132445 35955721 7240047 270245 34279231 77297950 83176068
38547 83176068 46142003 176301 -24419321 -25681722 -17289639 -9198604 -4256580 -3789512
38539 -3789512 -9319822 -19761657 -31343704 -42961844 -58091008 -75036913 -78725799
38532 -78725799 -55639509 -19440251 -5160565 -27676536 -60064072 -66845962 -46161521
38525 -46161521 -22524235 -9861051 -3976700 -5014249 -21991852 -52242893 -76090612
38518 -76090612 -78051739 -61091083 -38104245 -20897174 -16851560 -23522517 -27286216 -19877598
38510 -19877598 -13513056 -25031072 -48285974 -59638325 -49253065 -28630736 -8186114
38503 -8186114 11606511 24968818 19562929 -2033806 -18231841 -13707096 6806909
38496 6806909 34400277 66299183 93217314 97134703 74274019 45005160 30139972
38489 30139972 30841041 38393873 44933461 35623772 -6552361 -71406288 -116498497 -111441316
38481 -111441316 -72539006 -35743477 -12571325 5293201 15158122 7100368 -9823949
38474 -9823949 -13945732 -1135717 14958583 28696680 43990512 54007315 46658157
38467 46658157 30120018 25499848 31783276 25442425 -1064488 -28527935 -43856375
38460 -43856375 -52543410 -49922672 -16747298 37159093 60121996 20267818 -45815471
38453 -45815471 -79415974 -73693714 -64146850 -62242099 -44893432 -7235646 20600969
38446 20600969 20862119 14783640 25202600 43574383 53658647 60740846 73315511 77796625
38438 77796625 59715251 35412590 32597259 46330617 44145683 15404896 -12389094
38431 -12389094 -14149925 -92879 5686051 1273110 2836281 14499910 22437569 17348320
38423 17348320 5312424 -6728332 -20338720 -32981010 -30955122 -9299841 10919604
38416 10919604 4206436 -22641960 -34781894 -13942259 19649041 37972753 39996740
38409 39996740 42269877 49517332 52462909 46148721 33372953 16073254 -1165238 -5689900
38401 -5689900 8354702 25566257 27119820 17765316 17000571 28683014 38537866 36448140
38393 36448140 21755015 -5048923 -32269207 -29876133 15316405 65439284 71141939
38386 71141939 40914211 25483699 33401253 19521961 -28198632 -53890117 -21120606
38379 -21120606 20956744 9543786 -36320759 -50189009 -18325651 15298774 25599490
38372 25599490 26919041 25115788 8217356 -13404890 -11084492 10150787 10596939 -23038772
38364 -23038772 -57245242 -62626636 -47115276 -29326947 -15790070 -13138493 -26029737
38357 -26029737 -34985203 -14286103 20776579 26121901 -2758485 -21069753 -7551397
38350 -7551397 3348071 -14421917 -32674475 -21670176 -4070169 -13743514 -35904117
38343 -35904117 -33921312 -9575002 7866413 11460453 11793828 730633 -34057954 -70269871
38335 -70269871 -72173403 -44925280 -25922944 -26247401 -22904641 -8020172 -1484871 -9057452
38327 -9057452 -10348669 515465 2474666 -8978215 -5693515 22518683 37811762 8400015
38319 8400015 -34505300 -34685835 8186890 38701838 26383128 4233287 11860787 35296282
38311 35296282 32854094 520232 -24763210 -23165190 -17272304 -28575218 -39949391
38304 -39949391 -25762039 869038 2525602 -27147009 -52956382 -46851817 -21754125
38297 -21754125 -7498278 -13146616 -25895979 -33500953 -34241067 -31025133 -24633113 -11359751
38289 -11359751 12359173 38667246 48521798 34739531 16964102 16567662 24494242 17128561
38281 17128561 -2129457 -6958568 7115742 15439065 6859098 -985179 713128 -5521051
38273 -5521051 -27106332 -41792687 -35290832 -26693497 -32563203 -36426171 -21575575 -5125075
38265 -5125075 -7628972 -14561494 -2730880 16691529 17306942 1251842 -11484741 -20081588
38257 -20081588 -32797368 -36649945 -16593910 8894744 12122837 3812026 13369154 32251557
38249 32251557 25342394 -5365770 -18840458 -335496 19299147 17771658 9146408
38242 9146408 6276961 -12250 -9189927 -1137090 23524475 32974366 13986901 -5865597
38234 -5865597 -5748388 -1199241 -3597781 5638503 29088911 27148156 -18074570 -52614636
38226 -52614636 -20542546 44402601 60833404 18629255 -12228534 7792854 37963291
38219 37963291 36761046 26209239 38972140 52632605 28314615 -16825688 -30143930
38212 -30143930 -1573786 29656842 41086721 50302699 68058713 76405814 68290109
38205 68290109 64869162 70958578 54758987 3756520 -36831148 -24427385 10978833
38198 10978833 8633203 -29370647 -43698730 -11675445 24153724 29250450 21245347
38191 21245347 22258607 20688224 7684261 3208998 13281837 6751404 -27716198 -46078187
38183 -46078187 -16294851 19984826 8371703 -30769160 -39887267 -22275919 -28883077
38176 -28883077 -60736160 -63960205 -25658434 3270834 -1427969 630275 29931257
38169 29931257 34302824 -28997945 -110630791 -127082781 -69737375 -2299020 29746566
38162 29746566 35464484 34977056 29189833 17805006 12338597 20734113 36651553 46289099
38154 46289099 35878747 1420411 -37250404 -48452928 -32168817 -31217806 -72549142
38147 -72549142 -116647162 -102460230 -32646417 27428734 35772220 16462657 6131128
38140 6131128 125928 -21955712 -48413116 -49165226 -23538574 -745028 4687171 8769109
38132 8769109 24534392 37780919 29158470 4124492 -14051158 -12149487 4969437
38125 4969437 27243913 46431423 53403694 42136953 18065154 -6115624 -22591915
38118 -22591915 -29291304 -23706709 -8575068 -380398 -15902457 -49440950 -78675259
38111 -78675259 -93329447 -99879373 -97245306 -72598940 -29958859 1707830 4707643
38104 4707643 -2599513 5628841 26054906 35950861 25987056 7059247 -3127869 11959429
38096 11959429 56118020 104397974 121077315 109890930 119372855 174556850 231567977
38089 231567977 232558092 181244902 126293279 91696045 68118818 56909605 71164146
38082 71164146 96633035 99313977 75432215 53528674 45445550 36129730 24480993
38075 24480993 31348559 59240314 83494631 92043559 97271910 102251034 94218110 78889431
38067 78889431 80608578 98951087 106382179 99573939 109030180 142769601 165357450 153881689
38059 153881689 132869791 129074558 129948630 114094317 89626081 75682204 74552053
38052 74552053 84730110 113475179 157078711 197245742 231081809 270243615 299383347
38045 299383347 282210307 227815731 197431973 214350565 221326993 170337236 103649581
38038 103649581 90015700 120660189 131794307 103916482 74735844 66850279 62503544
38031 62503544 48475187 36291756 33816435 33650316 30979887 24910448 8251977 -18189190
38023 -18189190 -33371294 -24484659 -10929381 -11953558 -12340066 5982961 22098085 7571298
38015 7571298 -19890535 -19931526 7028871 25144835 21487153 14131151 9419566 -4353574
38007 -4353574 -23635711 -30260346 -23710712 -18734607 -17155464 -14056645 -18796064 -34460371
37999 -34460371 -34913781 -5135250 15640685 -16359217 -71785104 -79228153 -26875669
37992 -26875669 26692918 41186336 33088630 22940122 7060690 -7698911 -757834
37985 -757834 16399343 7962658 -18400997 -11193479 37888625 68297507 41446524 -557071
37977 -557071 -4782322 14409205 11493940 -15497793 -33024699 -28400915 -16495656 -6890238
37969 -6890238 2787613 12281521 19681749 25885053 27318245 21381840 22076877 42718481
37961 42718481 62147246 46533996 9048684 536420 29953319 47762315 28170716
37954 28170716 10306302 26778938 48276786 40584714 23634480 23742503 15185604 -31032973
37946 -31032973 -78268940 -69254440 -15318995 21706597 19569245 8075991 4328133
37939 4328133 -4572010 -18509271 -19614637 -11882444 -17034177 -29905842 -24602995 -6690153
37931 -6690153 -11597542 -44130065 -64224600 -44481634 -3462023 29495633 46893691
37924 46893691 48822876 30309151 -1518751 -24688833 -30568275 -32906538 -40246000 -42322365
37916 -42322365 -32547587 -22453130 -24642163 -37794532 -52254932 -55116484 -33436931
37909 -33436931 6766013 31228770 14869038 -16534685 -15471047 18013342 34982891
37902 34982891 11285796 -18886233 -18880506 -607051 4779673 -4035124 -8777836 -9419232
37894 -9419232 -20354583 -39174574 -45708158 -29467503 -641935 23767105 33005464
37887 33005464 26156327 12820014 7383369 17136967 39102352 67109063 92310417
37880 92310417 99819227 81902655 55207900 44998197 48849442 39006200 8594292
37873 8594292 -10377989 8368018 44480920 56680238 35150719 6636515 -3014682
37866 -3014682 9281665 32592481 52160691 53756618 36177879 19081062 22508272
37859 22508272 38502834 39601063 19037397 5625473 27469571 71607097 96135037
37852 96135037 82022635 56549413 55011819 71083350 66399676 29294849 -2107454
37845 -2107454 9250563 46327141 61674024 42561426 21512165 23505881 34717764
37838 34717764 32533063 19045431 9010870 4247923 -2974896 -13219444 -19075072 -11937620
37830 -11937620 15666511 60459594 97705104 100929979 79550959 72176253 90093090
37823 90093090 95327361 56278016 -821373 -25954694 -11803624 7850663 14283374
37816 14283374 21636667 40979558 60750654 68307107 63940192 48100815 19757612
37809 19757612 -5903813 -2785525 31652995 65839104 69122519 43312997 11650233
37802 11650233 -8885494 -15807150 -14776326 -13840426 -15382298 -10926101 5146237 17893207
37794 17893207 5970762 -24294620 -40769410 -28821965 -10191881 -6297390 -5710280
37787 -5710280 11418997 34391427 34190448 7741424 -15211869 -11706457 5982269 7448501
37779 7448501 -20082167 -57803487 -73875878 -56190265 -27187207 -20007147 -38680933
37772 -38680933 -53132399 -38560377 -5920211 16732138 20064701 16840534 20080744
37765 20080744 33114389 53008193 68467579 61875850 29607305 -5967249 -20150863
37758 -20150863 -14066229 -3128231 11271980 35169988 55775900 51730531 29165536
37751 29165536 18121496 28877893 40722926 41103768 44514781 58226889 59930964 32751411
37743 32751411 -1329272 -10436954 1475730 6334151 -1724408 -1619816 16389251 35231971
37735 35231971 37084295 23288774 3630805 -15730118 -27370798 -21560174 804722
37728 804722 23896307 32586091 26437300 15473323 9369726 13221474 25920562 38217087
37720 38217087 37840645 21365312 -377236 -10196253 1917475 30346634 57286597
37713 57286597 68185760 65036140 59192970 51843686 33371050 5241153 -13356413
37706 -13356413 -10638306 702690 4394304 3098742 3486230 -3566198 -23337029 -33953149
37698 -33953149 -16235819 3996216 -13961874 -53964508 -50866441 14554159 77240290
37691 77240290 75628229 35586737 21198463 33040347 15660222 -42769351 -81847836
37684 -81847836 -56352789 -1588559 19758411 2407301 -6194552 22471331 66064691
37677 66064691 86988073 72807027 38849904 9443325 408271 8228500 15078840
37670 15078840 11679925 9280589 18551236 27163357 17888530 1712854 6231491 30373044
37662 30373044 40157118 19226614 -5055767 -3925504 9833906 6856944 -10308423
37655 -10308423 -14758137 166949 16422271 25905428 35772922 39045175 15415661 -30161682
37647 -30161682 -62194227 -61220405 -46573764 -38287157 -27607853 -6608347 3896380
37640 3896380 -12780542 -31928061 -19323774 14268930 27607812 10222096 -8042545
37633 -8042545 -8011836 -5988594 -20360652 -42686518 -52921620 -42504077 -14973109 17776681
37625 17776681 35477341 24631479 -2829237 -23419252 -32989562 -41845813 -43734545
37618 -43734545 -22240308 9282930 11563198 -23879547 -56592874 -54150635 -34498756
37611 -34498756 -28242405 -30598828 -22307711 -12122254 -20280954 -35704761 -28746663 -119861
37603 -119861 18585854 13545921 7504481 24861590 59855559 83988138 71884187 24460321
37595 24460321 -19816748 -10125772 57541775 120091868 116103138 62974316 28194207
37588 28194207 32624068 31598120 -2886517 -35874612 -30182209 -7079925 -7689267 -25886559
37580 -25886559 -24033608 2244198 19767923 14000429 9884884 29869944 60517589
37573 60517589 72061172 53276882 19555636 -1108214 11797708 52107474 87327003
37566 87327003 90588608 70148683 53601284 48835472 41493514 28217028 25163046 36473748
37558 36473748 39556827 16842812 -15427629 -26733926 -9855103 14555634 23112645
37551 23112645 9607209 -12049984 -17469592 5195927 35252395 36566514 3651655
37544 3651655 -26323017 -21583749 1580388 4333757 -20917609 -47369914 -55606074 -51236496
37536 -51236496 -43559982 -33410537 -24698741 -24048967 -24393579 -11200627 9507032 12048196
37528 12048196 -11471001 -35878853 -36147624 -17131426 1100233 8922406 5078709 -12507120
37520 -12507120 -37154972 -49972059 -43588817 -36208025 -43984067 -52387481 -36954225 -3601816
37512 -3601816 16015962 7210307 -11550771 -17229627 -8458235 1825948 5268989 2370387
37504 2370387 -2727893 -4413921 3816210 26236741 60339348 93018635 103966561 82718042
37496 82718042 45026723 21541838 24890463 38478609 42532936 36509298 27560586 14692120
37488 14692120 -247483 -1256935 21697101 50774233 58568846 42436082 22887939
37481 22887939 13923147 13148605 16181558 21792799 25108553 22491252 21001717 28177320
37473 28177320 36293200 32107024 18354605 10667352 17044371 33136042 50658346 57362997
37465 57362997 40159714 5622866 -14892018 -1324764 25767773 34326481 25337218
37458 25337218 20782654 20690075 6934789 -17185632 -27482101 -17863478 -5759694 462229
37450 462229 6954526 9554955 -818722 -8763086 11082518 47613115 60053482 34433476
37442 34433476 -6359379 -49385391 -99199701 -132432930 -103658442 -19460857 47619155
37435 47619155 51578702 31919559 43813036 74813152 77059145 45989778 15526363
37428 15526363 -777293 -13341429 -16412673 8123374 51641206 81316463 80305704
37421 80305704 58800860 32194374 12015662 7683010 14088689 9869776 -11582872
37414 -11582872 -26960694 -19445864 -6615678 -6937418 -5924849 12300691 27583632 16838810
37406 16838810 -641143 4832629 17756774 2824069 -30381286 -40106883 -20483462
37399 -20483462 -5834295 -12374365 -25330064 -40067874 -64382962 -80663879 -59392057
37392 -59392057 -14563931 7189143 -1063692 -570937 16894431 8532622 -40805023 -79095836
37384 -79095836 -63197199 -25719308 -22638085 -51883687 -70570465 -66443952 -64131346
37377 -64131346 -73360255 -74191063 -53427209 -25171058 -11093525 -16964140 -28503709 -22030559
37369 -22030559 13346436 57901927 77881123 64600023 39914293 19580734 -2878858
37362 -2878858 -27409648 -34606813 -20268581 -12633398 -29973863 -47965175 -39215905 -20741897
37354 -20741897 -25344137 -44423806 -42558759 -20920031 -20423778 -56235618 -90101010 -84271794
37346 -84271794 -51524659 -29998595 -31104550 -37147164 -36224643 -32199242 -24215948 -3153768
37338 -3153768 25029805 34998949 16576969 -2173558 11481244 46257021 59032393
37331 59032393 37059699 17172030 29759902 53929106 54078056 36403901 33039341
37324 33039341 44682332 40720157 13921674 -5825466 880407 17645938 24970739
37317 24970739 24748862 19108214 -1938542 -33197300 -44640734 -21797775 8947859
37310 8947859 19881707 27843881 77251318 189115392 339423326 469616295 510647684
37303 510647684 431436764 287129146 186000882 174863982 185642108 133516594 37221225
37296 37221225 -13247971 10385253 42476556 29059558 -1023710 2375009 31951013
37289 31951013 47175186 41526293 39398507 44751315 36866432 11474086 -11587049 -22409926
37281 -22409926 -29491236 -30336495 -8157835 28593088 35582694 -12351439 -76258338 -94584589
37273 -94584589 -60157916 -23242663 -18569011 -24693976 -9331754 16568778 18372790
37266 18372790 -5864436 -21939933 -11320870 2348981 -11020903 -44403258 -61213898
37259 -61213898 -40053989 333230 22855705 13035479 -8875043 -18898144 -21631795
37252 -21631795 -36035030 -55545200 -51621414 -25257852 -21050748 -63910569 -110086747
37245 -110086747 -101183434 -50404884 -27165516 -57833032 -91024108 -74153936 -20256367
37238 -20256367 24752196 45136580 54486304 56971568 44480065 22244650 8926171
37231 8926171 12946526 26392447 39172838 45932458 43912189 36357644 34678588 48070111
37223 48070111 73108544 96744808 104639220 88579921 57358007 37572303 45687251
37216 45687251 60370015 46318177 8139609 -9112045 16090870 48051038 43995362
37209 43995362 10973504 -14126266 -21132256 -31672368 -57113160 -80230759 -78918173
37202 -78918173 -49786978 -8760600 20442857 24059438 14539918 19957753 47558782
37195 47558782 71327636 68382502 51476873 46636485 52251881 43616887 11109520 -27915655
37187 -27915655 -52784033 -57235210 -45084920 -24075444 -5450319 992553 -6524614
37180 -6524614 -22753492 -38375659 -41401719 -26945271 -8680309 -6636684 -19313506
37173 -19313506 -24333647 -12064283 1213368 1754390 -1623101 2803676 11377508 18858122
37165 18858122 28477667 35418058 24920584 1839609 -5213564 12400808 24820418
37158 24820418 11130073 -6561418 -5149829 -3321756 -23710571 -41522422 -19026299
37151 -19026299 27387810 45154888 21589937 -6119151 -13295732 -12477211 -12637331 335878
37143 335878 29948223 52850868 51929055 38859096 31632565 31639149 32167674 31093982 28502819
37134 28502819 25357429 24918571 24407896 14106419 -1320356 2184601 30216480 48913461
37126 48913461 33191945 13085806 28849661 58363281 43917175 -15298901 -56559157
37119 -56559157 -46002635 -21325800 -25805724 -50711867 -66923010 -70046094 -66776398
37112 -66776398 -52349708 -28706512 -15153755 -16630511 -9163153 20243333 46425666
37105 46425666 42547479 19492155 5724819 9590773 22805395 39793999 52212724
37098 52212724 44968214 19799710 4680802 18651833 43416299 48933591 31287888
37091 31287888 6955171 -14348813 -31508953 -39778275 -35207479 -22946240 -9367672
37084 -9367672 4389576 14436446 14390180 9829354 15022851 29028668 34719580 27768675
37076 27768675 24191640 31536755 36595201 30856644 23874760 21810211 17116744 7949839
37068 7949839 2105658 -4057136 -19624319 -26934544 4921257 62632073 88702439 59167503
37060 59167503 17619667 5953904 6472504 -11796883 -31842943 -19920422 12991543
37053 12991543 28603249 19733356 9536919 9583010 15289540 25074623 30912153 12471250
37045 12471250 -25166515 -36025309 3684819 46195101 34864184 -10260916 -26361704
37038 -26361704 -6288880 1793848 -16771972 -23018197 2693096 30720010 38220309
37031 38220309 39124329 41079190 24646114 -11451569 -29706844 -6143928 31595360
37024 31595360 43938180 28961530 10611375 2291113 1822050 2108947 -8245698 -36284997
37016 -36284997 -67103465 -75182703 -59273671 -42878989 -36471677 -27541894 -13480970
37009 -13480970 -12356937 -31079611 -53455831 -69915846 -86859388 -95725451 -70551720
37002 -70551720 -15836626 19222321 2119044 -35294662 -40221623 -8724679 17919137
36995 17919137 12501674 -10732157 -22160601 -9673327 12685669 19027803 -622670
36988 -622670 -25312265 -28545978 -16665038 -18988714 -38433843 -42635404 -14081280 22024220
36980 22024220 35957099 31163394 25488515 21655779 16805140 16225055 16316444 -1393163
36972 -1393163 -36741646 -56369357 -37822218 -4695611 9158804 7566249 14019419
36965 14019419 26478728 24372755 7106905 -6219376 -6054555 4498286 23199228
36958 23199228 40634683 35527430 6155821 -11827584 8846061 42259127 48056502
36951 48056502 37199762 52256761 91722817 106228280 73490206 27976065 3645077
36944 3645077 -9092900 -30276071 -51040785 -51781261 -34593452 -15764232 -2711746
36937 -2711746 6305041 13731774 23823819 38582540 48667974 44708690 36735240 39530680
36929 39530680 41001880 17183654 -18674603 -21723657 16045907 43319142 20492669
36922 20492669 -22517947 -33366770 -13027913 -2005312 -8814849 -766308 34443999
36915 34443999 62693967 53831360 25537666 14807965 26002971 32357530 20640877
36908 20640877 8734175 13987508 24352775 16862654 -5222342 -14997516 -1986820
36901 -1986820 13439539 15913657 22320409 51931622 87515499 96777604 83350206 81346907
36893 81346907 98833611 102991688 72027580 29661053 10780797 18242939 32167788
36886 32167788 40523250 41290885 32476523 19080767 15445168 24902957 32091293 28961310
36878 28961310 30029132 46719419 66822107 76578356 80999871 82147491 62550633 18362892
36870 18362892 -13850798 1387625 45885677 72722247 71383482 69215254 76279940
36863 76279940 72780416 53814559 44423726 57582812 71330633 63977197 45662423
36856 45662423 38233250 43563019 46934834 38306894 20426826 6677787 13721347 42869155
36848 42869155 69850028 70773935 55962538 55761226 74174034 83463088 67528110 42491284
36840 42491284 27924824 25394143 33345721 54225579 75849569 74639300 50928360
36833 50928360 32836817 30971595 20771454 -10922576 -35152074 -25025883 -1932845
36826 -1932845 -2895723 -23074499 -28542208 -12588708 -389067 -3116773 -4717387 3199810
36818 3199810 5991344 -5957593 -19385288 -20044185 -14838564 -20452519 -39856050 -58951976
36810 -58951976 -63236420 -54720158 -51344383 -64285083 -76737168 -59427352 -12309824
36803 -12309824 27190733 29076652 5881598 -12281123 -17717502 -17919183 -7432680 21060174
36795 21060174 47327475 40194628 4728098 -17486813 -2317066 26961146 33339554
36788 33339554 11347663 -11907714 -9687307 18149296 46730136 52740060 41243510
36781 41243510 37474853 47435318 45105984 14355423 -16452404 -8748591 30311170 56980313
36773 56980313 49183370 25219737 9015644 8690736 27093545 58597289 73529273
36766 73529273 42704867 -14462535 -41811062 -18934734 11296005 3618508 -32365796
36759 -32365796 -56074181 -50773974 -32102606 -21011412 -26849960 -41435090 -38138759
36752 -38138759 2592594 56978715 74869391 47198870 24071815 43151879 73393325
36745 73393325 63068974 16006568 -20641089 -25962901 -19214518 -14295185 -4945065 4247153
36737 4247153 -6410408 -34816505 -48596953 -27180581 11489281 37773277 43420810
36730 43420810 37379290 27714350 20642340 23511371 36060093 47014555 47612478 41791638
36722 41791638 38491432 41169626 47270433 49763173 38629912 11849971 -13382845 -12919047
36714 -12919047 16077772 49223187 61580220 50710919 29915143 10924896 866436
36707 866436 5411058 22802831 39186319 40371742 27729606 15559919 13346697 16738711
36699 16738711 15887755 6218401 -10505846 -28716785 -37645457 -23499432 16885205 64685175
36691 64685175 91212860 85260051 61373440 38970740 23892792 14273703 8529625
36684 8529625 -3097979 -36439784 -83125299 -99861236 -58617326 2352422 15270845
36677 15270845 -29075654 -69483694 -58782581 -18289961 10281546 24237254 38449750
36670 38449750 40616426 13113946 -21577412 -24390512 471120 13045728 1850609
36663 1850609 -3098857 14127636 29714315 24394462 16095217 25857129 39582333 31176844
36655 31176844 6430190 -4040816 10596804 27239735 21824061 979117 -6875938
36648 -6875938 13318727 43918393 52685833 27007555 -15873477 -50789690 -65229071
36641 -65229071 -56587198 -27177709 6740023 18209949 -121583 -22235763 -24478505
36634 -24478505 -20365810 -34872294 -58506193 -60983104 -42940554 -34722744 -42988856 -40530271
36626 -40530271 -19083211 -9264264 -26463209 -36006488 -4908955 41351841 53234047
36619 53234047 29930994 15381354 27945640 36778930 15931562 -15254119 -26101815
36612 -26101815 -23017763 -35156467 -61957591 -66048338 -26674730 22602635 30621679
36605 30621679 -5677182 -37182860 -27829907 1658972 11198265 247888 428663 20347826
36597 20347826 32980803 21080433 2011702 -6215581 -16046616 -46065908 -83811745
36590 -83811745 -96937326 -73611453 -32053941 6290178 35276134 54963942 59356120
36583 59356120 42054239 10090827 -15897684 -20990668 -13832487 -15300158 -26354668
36576 -26354668 -22642335 7211189 35962447 33363872 12736542 9945321 25072291
36569 25072291 25706527 8427480 9842596 42389646 65834606 49688944 22954176
36562 22954176 25017805 40231745 25898523 -16035752 -41684440 -30000771 -3286096
36555 -3286096 13639591 18243736 14711700 5946112 2472045 11984916 20717146 10486010
36547 10486010 -9609119 -14867761 -2353646 11713555 23129861 34326489 27026069
36540 27026069 -16733692 -68723069 -77524854 -43348683 -20963599 -35579004 -47399070
36533 -47399070 -22486098 12377510 20228512 14073928 22456710 31293597 11321563 -21119033
36525 -21119033 -24535153 -386869 11059397 -1956883 -9362323 3993132 15116126
36518 15116126 6798751 -6304540 -10192912 -14283530 -24450189 -24961543 -6796653 13292299
36510 13292299 21453849 28115158 39102380 32405759 -6485362 -46873122 -46148814 -10451248
36502 -10451248 13500277 4910993 -7701748 3515734 24030383 22372569 -3713676
36495 -3713676 -26827955 -25583701 -4713873 15221926 16791651 -872916 -18322607
36488 -18322607 -11160895 21409296 49818158 47034894 21742181 4503378 6634266
36481 6634266 12601610 12613237 18088102 34744137 42594457 21792056 -15981990 -43010129
36473 -43010129 -52720392 -58877596 -64524048 -58800626 -45281850 -45419079 -64638753 -78474669
36465 -78474669 -64902006 -30902929 4948305 34670440 50091839 34228019 -10550387
36458 -10550387 -43980779 -30383465 8349965 15110186 -27728291 -77311485 -89269551
36451 -89269551 -68129689 -46891132 -41102821 -40946116 -33362638 -14984842 9280911 29343264
36443 29343264 36380541 30875324 18820813 2493574 -13121168 -10650189 20468835
36436 20468835 55688996 54592626 16127496 -13836077 -3151658 26901344 40211944
36429 40211944 34495549 26224276 15131301 -2135522 -4993423 23585847 55156762
36422 55156762 44261185 -4317958 -37269299 -24246142 10823906 36349650 51718583
36415 51718583 64094665 61113576 30410420 -14676580 -47822246 -53224366 -27082535
36408 -27082535 22853124 68105020 74611612 43661736 16210391 20446975 38791226
36401 38791226 45776399 50744131 72484907 93540131 79494080 35992314 8735755
36394 8735755 23762209 58055444 75921024 69144477 52384656 40114536 38977360
36387 38977360 46859897 49269316 29528154 -7673213 -33066973 -22440420 17151959
36380 17151959 56737215 73444079 63386477 35840689 6076460 -8747543 1343417
36373 1343417 27892628 46028336 35413312 1975006 -25337283 -23277891 3538922
36366 3538922 32848886 50037546 53788622 43674835 19713107 -5657851 -13950726
36359 -13950726 -4466598 5034368 7589299 17696434 42417637 61943555 55536450 30709937
36351 30709937 8245231 -7821685 -25065881 -39394527 -39144516 -25241017 -7783491
36344 -7783491 10138308 26826408 30076738 12594593 -9468444 -16514336 -15225517 -22757650
36336 -22757650 -30939529 -18550418 5833380 10670271 -5977434 -9022630 17450937
36329 17450937 42931238 38093096 18048350 13179531 21261999 17504605 -2363991 -16848480
36321 -16848480 -11152170 5987543 16326371 9784414 -8678028 -20934579 -10736503
36314 -10736503 15354445 30408634 18130952 -7963526 -23483981 -20166013 -6378566
36307 -6378566 6632450 9636212 -1113479 -15721593 -18141352 -9512406 -7551749 -12893480
36299 -12893480 2084172 51782279 103883362 113484924 79429293 40296194 21866559
36292 21866559 16938582 15258547 22830034 42065630 55633478 45268201 16258192
36285 16258192 -6893929 -4311848 22656619 52484639 61062325 45725848 30151622
36278 30151622 36846629 58799589 70515289 62642143 48228464 35801985 18492933
36271 18492933 -2965990 -8197365 15344856 46609230 51990586 26625231 -1743617
36264 -1743617 -6987308 13450617 49000454 88263751 115037227 111865777 82819760
36257 82819760 59847170 67528525 88793016 86883298 58099768 36499357 40944659
36250 40944659 46077089 23190623 -13788551 -28784817 -14300878 6954526 21375217
36243 21375217 34510515 45980637 46812096 43705677 53851347 69578439 61395184 27743575
36235 27743575 7934882 26513798 55594896 57346121 36877187 23279922 20974002
36228 20974002 14738965 7355121 15208646 34545039 47381820 56679481 80156619 109220414
36220 109220414 110639367 76146049 36772018 16490840 3326382 -17186792 -29953977
36213 -29953977 -16501292 8464122 15199306 2181949 -5384505 4360127 15448349
36206 15448349 11025116 -4744003 -16535856 -15245056 -728590 20114990 32115713
36199 32115713 20662568 -9070716 -30659155 -25067914 -4447494 4874601 -2010303
36192 -2010303 -6396967 1824423 10497387 10169724 10997342 20318151 23764062 10465065
36184 10465065 -1160784 7678178 16525309 -5384732 -37502039 -24421920 38031885
36177 38031885 84354227 69765912 31146590 22833241 35359218 26858001 1803296
36170 1803296 -1537714 15045295 10902018 -20256538 -36471775 -15221501 17013258
36163 17013258 36068339 51883549 70461312 70727748 44775757 20414464 15509012
36156 15509012 7489503 -20660871 -41003794 -25765179 -313732 -5876528 -31915405
36149 -31915405 -34081176 -6532304 12577329 4013956 -10794284 -14678733 -17956422 -26080231
36141 -26080231 -22739308 -1460106 18135869 23533991 30176617 48995255 59361649
36134 59361649 39968003 7045945 -6527289 1547333 4450093 -10575275 -27261022
36127 -27261022 -29903375 -24395190 -21906894 -18546165 -2258070 28659726 61980741 81679866
36119 81679866 77746432 51926676 18593486 -3883429 -6707633 5165162 20979685
36112 20979685 31327499 28878673 11216573 -13703273 -32206789 -39139789 -41281785
36105 -41281785 -43777279 -42551825 -36185630 -34624418 -45003821 -57089676 -56597298 -46731494
36097 -46731494 -40103011 -33904935 -14629531 11200867 15339950 -12566644 -43894427
36090 -43894427 -44917744 -16439401 16494269 39911197 55884273 63665768 60111833
36083 60111833 54482091 59864259 70525369 68558756 52593980 37873055 27083252
36076 27083252 6873363 -20492842 -29424226 -9024322 15102301 16251925 3780562
36069 3780562 1695573 7050952 -228996 -14439139 -5200129 34045532 68825631 68789239
36061 68789239 47090496 35701630 38319773 32842435 13764633 4288094 19965722
36054 19965722 42990784 47603835 35634195 26955898 23802501 9962293 -13630384
36047 -13630384 -19672404 5959910 36806055 38360654 13980448 -4798118 -4749696 -1700017
36039 -1700017 -7736660 -15048632 -16263122 -15360005 -10900918 6525537 28950984 28621385
36031 28621385 -1854151 -30223908 -28159049 -14422928 -26676971 -64348933 -91068774
36024 -91068774 -86459175 -62479259 -30091646 14299946 60677374 77294623 49957146
36017 49957146 6639216 -16568616 -16394463 -10270397 -283674 25733922 65263191 97308252
36009 97308252 106785293 95363397 70576847 42189567 27377970 38169662 59736367
36002 59736367 60724676 32894327 3421966 -1817047 9274671 12599995 3347517 -4546487
35994 -4546487 -5610079 -8837725 -17737309 -21989780 -11803975 11943508 42499128 69172261
35986 69172261 75209552 51249730 14757782 -2397195 5900892 10550323 -9100573
35979 -9100573 -30290051 -16883590 27031220 59384886 54119790 28894688 14225254
35972 14225254 16083188 19583217 14464828 3832800 -4224823 -3183243 9267610 28349772
35964 28349772 45173415 54778666 56002762 45332298 23382829 7812520 20848889
35957 20848889 55451705 72750751 48567073 6804283 -12871356 -6763058 -1238634
35950 -1238634 -4743220 1321227 21645227 30398878 10307324 -17220782 -21239688 -3100967
35942 -3100967 11538150 9703551 -1260005 -14146247 -27660580 -35281938 -28562537 -11301561
35934 -11301561 5767353 22053097 41644029 54408506 44577154 18853333 2901781
35927 2901781 5782201 11202748 9784273 13103172 24562824 25804266 12232540 14318692
35919 14318692 53691641 98497449 98365140 53603262 14261095 14114871 39464253 63364268
35911 63364268 75719293 73023803 52022693 26855950 24356464 46913931 63516198
35904 63516198 51917804 26513696 9302519 -2323735 -18988345 -32617506 -30400099
35897 -30400099 -19588111 -15314779 -16426447 -14543008 -13872654 -19231941 -16790858 7238039
35889 7238039 36889722 42212617 21783808 5192633 12863828 34280470 47744789
35882 47744789 44209708 29764605 18502949 23000295 40965172 55164740 55985046 53714481
35874 53714481 55784192 48091017 20869526 -2000339 9973950 45263660 61176379
35867 61176379 42019153 15309954 7867976 16136701 25657760 31053913 28007466 11177150
35859 11177150 -10420762 -18315704 -11674158 -7272140 -8854033 -3219270 8479717 6667341
35851 6667341 -10024569 -15876444 894200 19218318 21895849 18415735 13846570 -8088991
35843 -8088991 -45431445 -58578266 -25642714 14780525 17981690 3216518 19539174
35836 19539174 59539920 64669262 15882953 -34894418 -36615319 956074 36355059
35829 36355059 49187527 43209796 26435613 11964149 17922526 44656090 66554765
35822 66554765 64258618 51393888 52204482 64785851 65288001 42140836 10473126 -4485952
35814 -4485952 11249381 49590434 81897877 79602606 44655750 12457179 12730020 34319713
35806 34319713 42443875 24915049 3810568 1931231 15646316 26719084 26662577 19789463
35798 19789463 11334956 2829117 -5144596 -12996286 -21092927 -23222808 -7772446 25864758
35790 25864758 58353988 70239020 66960858 69122179 78689243 73745546 43075393 7434594
35782 7434594 -6805933 -962480 5298000 5335301 7597247 12794259 11564014 5417973
35774 5417973 8934093 25106658 35911726 26614856 6673030 -3692975 640067 6782058
35766 6782058 3081352 -5086931 571928 29612223 63329115 65062493 20632119 -37160342
35758 -37160342 -58755781 -30792114 14056767 36787941 25965044 -4902966 -34059262
35751 -34059262 -43922424 -34971650 -29856878 -47707329 -75563399 -84913060 -73532224 -64268912
35743 -64268912 -62368923 -47455968 -16063470 2918912 -8207176 -28734065 -36130191
35736 -36130191 -39066859 -48727639 -46721681 -14674426 26416057 42121027 34759204 32918400
35728 32918400 42185207 42052191 26670082 14341423 15102141 17361853 10612368 -726019
35720 -726019 -8759335 -10275023 -4446211 3339704 1349189 -10861061 -16047333 -6372764
35712 -6372764 427819 -6338903 -3206388 29884282 64491527 57873727 20468055 3321490
35704 3321490 22479311 43387849 42723891 36967500 39861055 39227878 32667805 41470226
35696 41470226 67022975 74646318 47195721 17581063 18457494 33203232 29576022 12109030
35688 12109030 4605783 5099072 -2611262 -10080947 3969500 33485386 52484043 55915909
35680 55915909 60492712 69744443 69919462 58743094 48709912 41570216 26892457 7250061
35672 7250061 -1684423 406690 -5062074 -24671967 -40529688 -36181846 -16744503 3538363
35664 3538363 17224683 20389545 8539546 -15626582 -39511214 -49916664 -39121798
35657 -39121798 -6544776 32933519 49242626 26770064 -7993775 -12284050 16509308
35650 16509308 35612762 16295032 -17563110 -26245709 -7369286 9745512 8165692
35643 8165692 -1943319 -5549439 1951904 19575829 42483777 57834857 53642113 34552484
35635 34552484 18559154 16806067 24971300 33684749 38148828 37603966 33559266 28624669
35627 28624669 21775041 8962376 -5201086 -5312158 12912759 27778390 17261402
35620 17261402 -6676755 -12850767 1989570 8783719 -5933581 -18245810 -7424618
35613 -7424618 10199798 10522319 1436437 5485059 20433353 28231114 30903342 43717792
35605 43717792 58960121 51409991 19747403 -10645414 -28498735 -46264764 -63644653
35598 -63644653 -58706224 -28811457 -5091303 -6330776 -9941888 7912884 33313334
35591 33313334 44332078 52517861 78450982 104902920 94683061 47642901 3188960
35584 3188960 -12819106 -11258383 -8135305 -655108 16786394 35843361 43154900 32202370
35576 32202370 4020151 -30071851 -48519195 -39124521 -16486297 -3044345 2136739
35569 2136739 14498995 29338845 24325390 -890452 -15753105 585419 31449613
35562 31449613 45910100 32463069 1083688 -31451863 -49389617 -45945259 -32085568
35555 -32085568 -26298628 -31826566 -36429904 -34909304 -34668068 -37621151 -36492637 -32427039
35547 -32427039 -34987730 -39508150 -27454179 1967477 23055798 18106895 329598
35540 329598 -10240105 -14324358 -22763186 -35401100 -44712079 -45875195 -32803691 -2194861
35532 -2194861 27671621 25004260 -11989260 -42588907 -36737849 -19087393 -30506248
35525 -30506248 -61976322 -64001582 -19148969 30077789 35558497 580751 -31851523
35518 -31851523 -32573761 -13059724 -4042245 -18946748 -41593667 -46982917 -29086073 -4090403
35510 -4090403 9702534 6242007 -11232804 -33622443 -45034736 -34223289 -12223632
35503 -12223632 -3183972 -11268654 -13909022 2967313 21900056 19903969 348001 -17766981
35495 -17766981 -27219655 -30928687 -26455215 -12218593 1647065 7903690 16570676 35088492
35487 35088492 47860700 40551063 31850789 48832852 77685356 76465510 39754103
35480 39754103 12676482 27224345 58249770 64513077 46699763 36232795 43144192
35473 43144192 46220774 30219163 5776122 -10608266 -15411297 -11138828 2138530
35466 2138530 19494651 28452960 23956515 17093508 19437570 27359237 32932075 40865988
35458 40865988 57182151 66490542 44023646 -5398580 -43128659 -43245545 -24687315
35451 -24687315 -21996181 -41274914 -64243689 -80395292 -90630559 -89780684 -72524927
35444 -72524927 -51003868 -41013262 -36245046 -22774996 -11222478 -20630958 -35352785
35437 -35352785 -19620812 21715587 42129273 24807771 8868072 24126773 46213042
35430 46213042 46470605 41863000 54752957 62405296 37093706 6368822 15543789 48544068
35422 48544068 47823342 7805373 -13500206 15095575 52527315 50748637 18144007
35415 18144007 -9914762 -26286659 -44452739 -60632752 -58065257 -38482188 -21646204
35408 -21646204 -16008193 -9542315 8500109 29376379 33568983 14835788 -7974006
35401 -7974006 -8446731 15855329 37945102 34472921 14380750 3841149 12828512 29925057
35393 29925057 39517327 29147792 -6511735 -49057412 -58583331 -19185380 29756176
35386 29756176 38330153 11977395 -2725340 9653707 18545817 6055098 -5816709
35379 -5816709 672347 9868849 7340729 6609823 17956800 23287522 8763382 -5250006
35371 -5250006 4813562 27217572 35094453 26679003 19953457 24001690 38775019 64756027
35363 64756027 88876687 81587599 36667657 -5126066 -4399983 21861464 29693137 17690536
35355 17690536 23228814 54462447 73699449 57496708 31560750 28026283 41470237
35348 41470237 49323267 49480005 52289876 53490237 41547752 22966099 17682423 32186769
35340 32186769 53598108 67593777 67485480 48042894 7362254 -40545287 -67630281
35333 -67630281 -55863243 -16680906 18370883 25869612 8335960 -13488034 -22676322
35326 -22676322 -19682364 -16152484 -19180543 -24667964 -25064137 -19301314 -13156155 -12649724
35318 -12649724 -19566337 -30729568 -37756104 -30309709 -7566854 12422548 5479557 -27991753
35310 -27991753 -53525780 -39450452 -1044439 11959018 -21500578 -63579236 -66678385
35303 -66678385 -36223675 -18476105 -32239660 -43573693 -17031950 32766303 59180365
35296 59180365 40892272 3493146 -12745872 6058841 38638965 52296189 32808408
35289 32808408 -5835999 -37717209 -46851978 -32531806 -3055160 25374774 30835655
35282 30835655 3934466 -35912479 -57942812 -55320545 -46899632 -42303039 -27031627
35275 -27031627 7931843 41826407 46004931 17749937 -22113682 -54041248 -68016782
35268 -68016782 -59112978 -33299971 -10911068 -7259281 -13876730 -12779285 -2733127 4648647
35260 4648647 8401648 18061955 32190373 36947384 28402017 19229148 19386080 24636543
35252 24636543 27662341 26678439 19889217 5966590 -6015760 -2848552 10348214 10208766
35244 10208766 -11959365 -31596391 -19316571 21428461 58989808 69359502 54170689
35237 54170689 28290049 4660845 -8969934 -11619675 -10760647 -14257581 -19227053 -16270495
35229 -16270495 -4837324 4229964 2614482 -7127947 -17832649 -22946589 -14303756 13039259
35221 13039259 47926480 65948747 54147218 25863113 3976848 -2253221 3518816
35214 3518816 15893581 24404950 11085974 -26978011 -58164990 -44766924 6320059
35207 6320059 45343506 39638090 8825466 -10989706 -13524860 -13016032 -9781030 6144158
35199 6144158 27480180 35640268 32438434 38975144 59885721 73735030 66659249 53031653
35191 53031653 50793874 55567077 54895094 52446949 58050755 63658523 53042886 34226483
35183 34226483 37196485 68735352 90144335 62171157 2893530 -27476145 -4056019
35176 -4056019 29505427 23862606 -5701123 -5812960 32246293 60950671 50659341 29161710
35168 29161710 28640431 35567616 24920819 9135695 11532275 16361685 -6759242 -42598437
35160 -42598437 -44595115 -7053005 23593413 14544007 -18193403 -47082377 -63537490
35153 -63537490 -60374139 -26986678 18490840 30638684 -4443695 -42902178 -41228777
35146 -41228777 -12693883 1779392 -5783407 -11097494 -2578792 6478025 4534420 -4059795
35138 -4059795 -10122209 -9448883 -3802850 181499 -1252460 -1581854 2932229 -2742963
35130 -2742963 -30226341 -51948668 -25635713 36463653 65974870 28006051 -28180147
35123 -28180147 -38099253 -3631368 31660629 53112294 72546535 80898743 57929421
35116 57929421 19096075 3372881 16327806 26825770 19091646 9633884 12378158
35109 12378158 22247167 33514387 42202283 32651604 -5375786 -49160934 -65459145
35102 -65459145 -55871661 -45965842 -37566410 -13453521 16039631 19728078 1675673 1482387
35094 1482387 29035185 46780869 31885884 9971928 6863697 9630315 -85939 -12412216
35086 -12412216 -14955176 -17404539 -24079806 -15236862 15584270 36602683 21645109 -7687881
35078 -7687881 -15472899 -3288734 3997587 3056167 7473186 13031721 2075313 -24152594
35070 -24152594 -44283078 -42769685 -18993085 17874075 45890326 39429404 2397917
35063 2397917 -25344495 -17803857 164369 -7416064 -30722674 -31141599 -1848077 25251743
35055 25251743 27670000 13714486 -3130575 -20632806 -35690172 -40225558 -32783300
35048 -32783300 -17903935 1990991 17903115 9255098 -28077858 -58928252 -43422558
35041 -43422558 10099367 54227785 60165030 38397023 7487846 -23962438 -43623896
35034 -43623896 -38101937 -17294055 -8446121 -18793382 -28781563 -26098790 -18764030 -9851230
35026 -9851230 9876573 34961867 41330545 22393734 1176613 -7618113 -19393902
35019 -19393902 -45816528 -66445454 -57747171 -29896876 -10782868 -8671005 -12168981
35012 -12168981 -13419316 -10491411 956054 17960942 22962337 5608040 -18381109
35005 -18381109 -28739671 -29238672 -33461067 -34063348 -14015989 16754626 26181835 5942828
34997 5942828 -13158285 -1878699 30790287 53871105 52959055 39170953 29155060
34990 29155060 30055603 40129396 51833483 54288040 42633371 27351395 26043404 41444419
34982 41444419 54834407 48535059 28774141 15281470 12712076 8646203 -115402 -777193
34974 -777193 7793513 3889304 -22574821 -44769565 -33991718 -5045985 4352764 -9788205
34966 -9788205 -16160460 575907 23768909 41106573 57281055 63626731 38532003
34959 38532003 -5638541 -19334072 14618983 47702205 34933132 1849814 1626447
34952 1626447 34136302 54823812 45310503 26711114 13305117 810821 -3245912
34945 -3245912 15654495 41386681 38279180 7153482 -10154616 7456423 32177956
34938 32177956 34200861 20886403 11732949 6149841 -3258242 -11093468 -13085384 -18950999
34930 -18950999 -34108085 -46635886 -46060436 -37202138 -25450534 -9218185 4594931
34923 4594931 3379256 -2930445 13274443 49585518 64542652 38522174 9939106
34916 9939106 19633994 48524191 49190057 18079879 -6563800 -7068086 -3615138 -10804220
34908 -10804220 -15222448 -2624161 21430452 44925854 61717469 67377865 61777332
34901 61777332 55560096 55393147 46749253 13786215 -27458764 -42330991 -24670044 -4026077
34893 -4026077 -1541075 -4448061 7066664 30388817 49317619 55123508 48241361 32396722
34885 32396722 15741954 7514334 7881286 8888192 5432156 -4084687 -23060622 -47934294
34877 -47934294 -59499532 -42110987 -8822362 12001287 12050563 5074012 -16156 -2360894
34869 -2360894 7846228 36209931 56118004 32999957 -18368621 -42392330 -19899257
34862 -19899257 6915115 5030414 -1323071 16156582 34226145 20692643 -2912083
34855 -2912083 5320777 35324511 42974577 26718859 26013181 44889257 38911432 -7805786
34847 -7805786 -48628931 -43602833 -17092594 -13795681 -33270222 -45282729 -44007673 -47091250
34839 -47091250 -55557848 -52155837 -34071541 -16259553 -4978917 4929589 9462589 348487
34831 348487 -9837178 2651924 32756736 46045121 29496582 14534353 30556374
34824 30556374 59451267 62096139 34136302 6979952 1835015 11150022 22070770
34817 22070770 28910218 21050873 -9988914 -42864532 -37998577 5399642 33700103
34810 33700103 7465531 -38479623 -39796991 7155542 42633138 30019594 1173524
34803 1173524 1167997 25427211 38606844 30903060 23286815 27330688 29719689 18065462
34795 18065462 1141806 -2923711 11918821 33493874 41825705 27688891 5069557
34788 5069557 -888478 15500628 30524246 21454952 -2384068 -13485731 -4293100 7379549
34780 7379549 9614819 11635562 20617344 22504585 2494312 -25214897 -28097292 2557378
34772 2557378 36028598 38149376 14132005 2292000 25798939 63670426 76573142
34765 76573142 52885488 18421653 3448419 11551082 24003894 26423440 23974295
34758 23974295 31393136 52588012 73766488 78076060 63251271 39424576 14064183
34751 14064183 -9056017 -18732928 -4356936 20080374 24431240 8411002 11893244
34744 11893244 54047741 88856585 61367232 -8990795 -51055131 -42562003 -32083051
34737 -32083051 -51284343 -64704457 -36212570 5580478 11965411 -12099798 -26770541
34730 -26770541 -24803601 -30034099 -42936732 -38877562 -18163143 -10820840 -25312519 -33660454
34722 -33660454 -19371173 -3876016 -7963450 -17202777 -8435375 11168047 17581726 11074590
34714 11074590 17177246 44767016 64707104 45081501 -323003 -19069549 16536210
34707 16536210 70302106 85860825 57853058 30633964 30456726 36625974 27374845 12792237
34699 12792237 2328185 -19467453 -54246773 -65281908 -32136778 3212160 -6362464
34692 -6362464 -36797144 -29875265 13104417 38171219 30259999 30062312 55111182 71168348
34684 71168348 58752213 46197067 52139538 51902544 30950899 19030886 35855426
34677 35855426 51183131 38914447 26530945 45402721 71607156 67828615 51773286
34670 51773286 65613214 98832597 100527427 59627174 18888069 10233400 23550055
34663 23550055 41086449 58451864 66703967 54474481 35198104 35870670 53097708
34656 53097708 57215727 45603859 50126594 78997388 94141746 69314313 33503704
34649 33503704 26658539 41653202 43698281 25282523 5822161 -8710073 -27792819
34642 -27792819 -43232430 -31040516 8198702 40773741 41756748 22398536 5974130
34635 5974130 -1336427 -2709204 3908702 13334020 4778603 -28260157 -52481546 -31006213
34627 -31006213 18767772 39688203 15002196 -3566555 29226878 81041720 83356669
34620 83356669 26943012 -27147175 -30552558 195191 25831074 40914744 62390918
34613 62390918 85806174 85605208 54222818 16650257 1409799 9229420 15475954 -158992
34605 -158992 -28898209 -40738186 -20221203 12522445 26946581 20759387 15240815 17084039
34597 17084039 11253664 -5558808 -14532689 -9320838 -11204429 -30126319 -38424656 -11754096
34589 -11754096 25367215 29392183 447916 -21275272 -17263822 -11119986 -21538516
34582 -21538516 -29992266 -12866860 18838775 34714336 27498469 18814340 24336509 30374517
34574 30374517 12894683 -26564671 -54783995 -43003807 -4859923 13980116 -12007671
34567 -12007671 -58157525 -80554804 -66380580 -39803967 -25116674 -22063578 -18341029
34560 -18341029 -10268180 -3519438 -2123871 -4634751 -8458800 -12650275 -15726700 -13837383
34552 -13837383 -5538845 1085675 -6048723 -24037004 -30981811 -14528117 4393118 -1636479
34544 -1636479 -20399757 -11283146 31559161 61460389 43254712 4170822 -8112732
34537 -8112732 5691140 6549240 -16597313 -30429396 -8844514 31506013 56362628
34530 56362628 52309540 30983892 9805842 -4262618 -18919244 -43859439 -69248999
34523 -69248999 -68400132 -33498128 6910193 24601996 28748549 40634718 49328890 30170661
34515 30170661 -3029861 -10264375 8282150 5966547 -35613175 -70948723 -56885100
34508 -56885100 -17670652 -7329633 -31483436 -47042624 -29094208 834681 15399545
34501 15399545 17666016 23868394 31616568 24830209 3764791 -8066289 6172319 30013924
34493 30013924 31735712 8011706 -9727510 -1437518 10904343 623729 -14300757
34486 -14300757 5697782 56198384 87141140 73338081 47131964 44192665 53771528
34479 53771528 49718112 40165701 49926999 71481611 71676648 42041152 10488330 2498448
34471 2498448 16537390 39278132 60603535 68656474 52315493 18734257 -6321498
34464 -6321498 -5062693 14336056 30985315 32712212 19802251 -1938551 -23402967
34457 -23402967 -33408961 -26622362 -10328355 1064558 -567033 -10648097 -19405695
34450 -19405695 -23493545 -26249657 -27079458 -19265445 -3822816 4437512 -2588536 -7473690
34442 -7473690 11644737 43076866 48105380 11945098 -33455090 -48870820 -30923248
34435 -30923248 -2214623 22105907 38133238 38935356 21454346 1991497 3473002
34428 3473002 27969023 56346426 71744246 70092876 53365346 28142813 6780558
34421 6780558 -4382673 -13267565 -25616511 -29436199 -13366369 8556274 12637827 -109459
34413 -109459 -9343104 -10381004 -15801816 -22702581 -10285072 21865197 43152125 34646506
34405 34646506 17798055 22216046 43691319 53377963 35483729 -193729 -31509272
34398 -31509272 -36515369 -6692024 37533133 57769716 39621702 10957512 3616626
34391 3616626 13329390 17877020 18483869 34047371 61599326 72391353 49345472 6515521
34383 6515521 -29764645 -40986721 -21714149 13462110 32486872 20215569 5248203
34376 5248203 21806447 49546315 34120992 -25854228 -62395965 -32710080 16894546
34369 16894546 20979898 -10150300 -17875231 8873164 26872821 18089595 11632709 19783789
34361 19783789 14442919 -11392449 -16103000 21680575 54903774 33633095 -18741840
34354 -18741840 -45682028 -44601568 -54644581 -74855411 -62077931 -12631145 20258081
34347 20258081 10367290 640973 28713994 61865622 52636861 20118826 18430752 45938241
34339 45938241 47768516 6230822 -29715654 -18728117 18409690 41117302 44687011
34332 44687011 43754547 33678471 6487838 -15684864 -3833157 29333204 40763667
34325 40763667 16727131 -10842874 -11343429 9757923 29302991 32677674 13259081
34318 13259081 -27595152 -67082384 -71922480 -38863010 -2628863 12542684 24243354
34311 24243354 51929175 71776007 47821215 -6716187 -40440528 -33194880 -14975225
34304 -14975225 -11408220 -10673398 711539 6631216 -7942697 -22289705 -7687675 25383052
34296 25383052 38545071 18384950 -7723700 -7990992 21665946 61823996 88316152
34289 88316152 85766020 57544946 24250691 1623553 -16899876 -42266555 -60756091
34282 -60756091 -45776309 -1258452 31185047 21481228 -10494671 -22879003 -5685119
34275 -5685119 13964189 14729366 5856488 4567100 8768284 5481747 -5679100 -13409904
34267 -13409904 -13625591 -11765948 -8029001 2836831 14549705 10142679 -11776439 -27922871
34259 -27922871 -20180359 -419656 9860192 10659087 13511065 12391620 -7469685 -35892497
34251 -35892497 -43023159 -22377425 -1318066 -834142 -10466738 -13591152 -12540335 -14716007
34243 -14716007 -16867269 -18696128 -29254519 -42119060 -28503776 20715995 67381452
34236 67381452 69988990 39918410 22111473 30311334 36835652 24767262 14412825
34229 14412825 27271092 49875875 49617338 14089271 -35597813 -64107912 -51230354
34222 -51230354 -8821425 30622801 46533639 46645502 46333108 44285049 32083640 16467460
34214 16467460 12228896 17761271 16490732 1805734 -14375242 -17305124 -2774489 21291677
34206 21291677 37098747 29016085 4075641 -10898129 -4762806 1417413 -9750103
34199 -9750103 -19422066 -2185223 28465978 37601977 21869924 9976951 14907954 21097468
34191 21097468 19142141 18655559 22712357 21591032 16912362 21024587 27102426 11967601
34183 11967601 -23197406 -46316390 -39190955 -19765716 -9056087 -5233818 -3514729
34176 -3514729 -12875467 -35674643 -53764931 -51067622 -31700704 -5550224 23619087
34169 23619087 47302338 52211504 39738847 24025132 7231174 -16187120 -29518212
34162 -29518212 -6179287 38884640 52558658 17498116 -17524072 -7086620 28362035
34155 28362035 41757985 29295932 23256122 36886008 53327359 57295914 49075903
34148 49075903 36677391 33529933 48971795 65358254 47314274 -7838065 -55404100
34141 -55404100 -60402784 -40218053 -26513047 -19062003 -9343647 -14123654 -43018644 -63123529
34133 -63123529 -44364189 -15346461 -21991210 -50932566 -51497247 -20772342 -5035704
34126 -5035704 -19351188 -28249969 -15046951 -11394704 -38148113 -66499093 -63444147 -37331898
34118 -37331898 -13637179 2544984 16484919 23310146 19918742 16812877 20348679 20905007
34110 20905007 11344063 -1013148 -10373382 -20508156 -28596675 -22826311 -5067493 5805676
34102 5805676 1852349 -4706111 -7570351 -16685413 -32677364 -36545659 -17550738 11658763
34094 11658763 38329788 62081310 72767082 47609436 -8601310 -48800890 -36726060
34087 -36726060 5516317 29267681 20626077 2333075 -9126400 -15449891 -13999969
34080 -13999969 3431513 28647877 40874181 35855656 28306009 22345868 3857755
34073 3857755 -29028714 -50443940 -38268822 -6982073 9474019 964143 -11244115
34066 -11244115 -9892154 -5710827 -16246534 -34073719 -33418331 -5976311 26190751 37747519
34058 37747519 27407834 12467280 8525437 22940913 55328171 90700451 101724526
34051 101724526 75075781 31836163 6144412 5506790 7578536 -4282438 -19708680
34044 -19708680 -21110983 -10587432 -5773394 -13849481 -20097607 -6385124 22600808 40397330
34036 40397330 30880554 9150923 -3147562 -12775596 -38845166 -65317184 -47760463
34029 -47760463 18761434 76216840 75288590 39431912 23261128 34495837 40556336
34022 40556336 32669521 31629784 36528933 20513518 -16165853 -35705426 -18802688
34015 -18802688 8079916 16571713 12099898 8759162 1135357 -17660235 -35269546 -38017330
34007 -38017330 -31180071 -26520073 -26468652 -30580635 -39281117 -44078497 -34275423 -17703027
33999 -17703027 -11201070 -8962911 8797656 32405515 26559496 -11800935 -41007973
33992 -41007973 -38186600 -32841733 -50882976 -67255381 -51559760 -25631792 -30380942
33985 -30380942 -58843849 -68313886 -45293965 -15664479 1538316 10734644 14493605
33978 14493605 8756646 3526204 15941277 40695180 54829005 52287822 47395838 44880065
33970 44880065 34681729 18598058 14062767 25092567 33610519 27416322 16322904
33963 16322904 12811529 14413598 12927950 6581512 -2985540 -13624922 -19508972 -16957007
33955 -16957007 -13368660 -15966457 -12926198 14676578 58367576 80336391 57237795
33948 57237795 11878882 -11375521 5024998 37597179 50077576 27841710 -11489804
33941 -11489804 -34405352 -20685470 17465352 45446858 39715939 12071075 -3294310
33934 -3294310 10831966 34122942 36743969 23968581 32162632 70840551 93493363
33927 93493363 55060825 -16395929 -46588932 -13994224 23160571 13963717 -16841620
33920 -16841620 -19726677 -799337 -3238330 -30284227 -40790234 -17929341 7952402
33913 7952402 13792208 16524319 32736059 42817307 23399411 -8814171 -16365877 7175062
33905 7175062 31449187 31864626 15708122 3625000 3304287 9935678 21338470 39847523
33897 39847523 60360756 67293332 50463954 20411821 -114453 -586983 8080529 9918715
33889 9918715 1795190 -7784965 -9593361 490615 17789525 26029579 8551387 -29351815
33881 -29351815 -58341017 -55744419 -31948171 -16145710 -21598595 -35484923 -38420215
33874 -38420215 -23254274 2388878 22570545 24646836 12874879 7105552 19758268
33867 19758268 38788621 43616820 33468907 26435306 30973115 33640408 22171276 8993003
33859 8993003 16894281 42132791 48101401 8421204 -51954574 -78751269 -53342226
33852 -53342226 -13616587 -335611 -7659117 -7646171 854946 2199582 6124222 36020708
33844 36020708 78287486 87674924 50284773 2629738 -19993046 -15884090 8140263
33837 8140263 47490948 72598435 43604924 -22563733 -50870808 -7882226 45849153
33830 45849153 44205216 7949713 -4060542 7095258 -2825530 -35280699 -50436297
33823 -50436297 -41002316 -37739527 -46081555 -39930951 -19000792 -12263627 -19583484 -8444454
33815 -8444454 21645637 28489413 -3312785 -34313170 -31335826 -10434649 1440702
33808 1440702 4808470 6387637 -1022531 -15106223 -15018368 4533311 22229613 27862290
33800 27862290 35478009 44737732 30388597 -9085943 -32887617 -14616624 17029194
33793 17029194 20815560 -4391170 -33104129 -48659980 -43780581 -18921304 -1146315
33786 -1146315 -26977965 -82051415 -99391199 -48457854 17037640 37381597 28203348
33779 28203348 35604994 52248516 40827785 12078825 9110317 26397622 14178949
33772 14178949 -33966314 -62249647 -35885464 10933942 30627436 20571193 2597085
33765 2597085 -16801458 -37331577 -44847648 -30267985 -11080948 -8948298 -17505428 -13959529
33757 -13959529 4462233 15098216 425365 -29420466 -48521187 -43406170 -24347574
33750 -24347574 -8375650 2645563 17717576 32826556 28324493 -2063802 -35190804
33743 -35190804 -44955153 -33483263 -22242586 -22581602 -29320350 -33595913 -28086025 -10489157
33735 -10489157 4494749 -8194689 -47309557 -72321563 -52088092 -12002694 -2137237
33728 -2137237 -28329896 -50080824 -44312286 -33653752 -43181932 -61601755 -60989666 -32343448
33720 -32343448 12996464 59179045 89773436 91926587 71903516 56363368 63649801
33713 63649801 77429865 60046395 -4393042 -82757332 -115439862 -76019544 -6803386
33706 -6803386 22517956 -3728315 -30585687 -9993935 34333701 47210301 21395553
33699 21395553 -3772089 -7806577 -6715081 -9646111 -5592307 1157731 -12366632 -43291895
33691 -43291895 -56569538 -39448241 -22818949 -28234234 -32157947 -9048017 24216142
33684 24216142 36934373 28704975 14517264 -7187092 -37770903 -52991607 -31511403
33677 -31511403 7118295 27489974 27418299 28467463 31983546 22681973 6687078 6040152
33669 6040152 17874843 16773307 -515397 -7499496 10644582 38973473 59339032
33662 59339032 65050122 48171323 7014758 -29596082 -23980696 14116277 31650988
33655 31650988 8348046 -11422972 12663143 54250447 61618574 32897321 9056938
33648 9056938 9464481 16130315 14504167 10516741 5825409 -10080767 -35887529 -51865061
33640 -51865061 -44707300 -21291626 3755206 16585428 3725333 -33251989 -63943113
33633 -63943113 -56911854 -23593408 -5853830 -14605299 -13981438 19501841 55751473 54653700
33625 54653700 24980808 7429952 13985616 17760148 -1805081 -33805253 -57338575
33618 -57338575 -62958694 -48724826 -17528810 13909740 22344625 5496802 -10245827
33611 -10245827 29822 30068419 51087017 44098203 16777392 -7869132 -13941409
33604 -13941409 -4966725 3505382 2693119 -1186683 837161 6964297 10378971 12017684
33596 12017684 16287658 17855795 6858135 -11528471 -15998758 6539845 43418978
33589 43418978 68136562 65771634 44629510 25662599 19758752 14342607 -10669773
33582 -10669773 -49771537 -68119830 -44047937 -2320298 16686599 11801467 15612341
33575 15612341 35866828 38771271 4538114 -33495654 -32666114 -2982721 6986648 -22085747
33567 -22085747 -57960897 -64541050 -44722838 -24438037 -14229662 -5682868 2658992
33560 2658992 -2160812 -23301501 -38768986 -26275957 3214481 17296986 8878146
33553 8878146 6302177 25087840 37565135 17900371 -6050061 11359567 55561882
33546 55561882 60986224 6562312 -48326269 -46888001 -9510171 10031997 6563343
33539 6563343 14582835 38121273 40741533 4177676 -44579533 -72198993 -74841867 -67242513
33531 -67242513 -59775355 -54992802 -50824927 -41806158 -26926420 -13562422 -4160364 9995872
33523 9995872 27111935 23294490 -13514271 -53079474 -57341704 -34163905 -21189542
33516 -21189542 -24535077 -16474012 6428766 11634579 -9632624 -16397088 23082210 80965502
33508 80965502 106546532 87446636 48420732 12599959 -8864539 -7997569 10550278
33501 10550278 23595669 16016599 1325060 -3078993 -3809592 -11656098 -12308082 12758440
33493 12758440 48192983 60094820 44911809 33493461 46901393 73869431 92095887
33486 92095887 87719721 54549244 986618 -39230702 -31456093 14261013 45155762
33479 45155762 26948269 -15136021 -31868794 -12769212 5125394 -12926635 -56301885
33472 -56301885 -81004065 -59354056 -10038060 26581688 37404117 44482428 60825290
33465 60825290 62640994 26057218 -27105371 -51573519 -38959910 -22190022 -20043992
33458 -20043992 -13802428 11276697 36379896 40135985 30737608 24550687 16912608 -112014
33450 -112014 -11962597 -3835948 6633955 -8006440 -38414610 -48212087 -27987599 -6407331
33442 -6407331 -3950289 -7367763 266080 12880514 19542652 25293545 35929244 40756526
33434 40756526 29871597 14607385 11515906 16658155 15051401 7700300 8984981 20544981
33426 20544981 26920592 18320485 2273167 -10163852 -17406006 -23078849 -28117608 -30445057
33418 -30445057 -26977980 -16169085 -3423226 321542 -6962309 -11607722 -3468366 4457643
33410 4457643 -7577207 -32777196 -41021408 -18522283 15313604 37708321 49715790
33403 49715790 61218404 65839852 49394945 14604061 -19617794 -39161856 -41572904
33396 -41572904 -27430228 -772330 23523965 28227164 12641324 -6902613 -16210908
33389 -16210908 -13734301 -3563012 9266928 15219785 5998245 -10651101 -14136678 2401799
33381 2401799 18391009 9717201 -19768026 -43147744 -45100442 -38596308 -42876010 -55541034
33373 -55541034 -56524725 -35609273 -4669267 19406462 33901848 45413602 53198431
33366 53198431 49266443 34311755 21812446 21699696 28025297 28303547 18863368 5470654
33358 5470654 -5333908 -9023478 -2633730 10314096 17734530 10451399 -4955974 -12153309
33350 -12153309 -4793838 5146538 349537 -23202605 -50781714 -61172313 -46617808
33343 -46617808 -21515179 -7429008 -9061138 -12122515 -6442329 253352 -1993648 -8674922
33335 -8674922 -12206904 -19062218 -37315600 -53070407 -41488386 -3745802 27076018
33328 27076018 24948023 278963 -18525722 -18727903 -7016456 7904181 20625825
33321 20625825 23754976 14320605 4713387 11826666 31338438 36034730 8836854 -30917190
33313 -30917190 -46789091 -29376451 -8110837 -13088844 -35787209 -41302834 -16325049
33306 -16325049 12351952 13572375 -8970870 -27443381 -30360553 -32442266 -43823054
33299 -43823054 -49712490 -31931590 1595393 24184415 23879662 15619819 17045456 24066958
33291 24066958 20464169 5861208 -1117434 7768899 11870813 -12502342 -53672582 -71377130
33283 -71377130 -45437667 -100031 28779001 34253198 32078612 28981138 18949850
33276 18949850 4839963 290475 7631051 12768208 7798731 2968499 8006883 14417289
33268 14417289 7520533 -10732964 -21453912 -10230632 16935738 39902194 45084082
33261 45084082 39134244 40104982 55262985 73198231 79630303 72695270 58310654 41182512
33253 41182512 28230448 28617873 38240868 36435152 13827357 -8829579 -9308641 1276453
33245 1276453 -1447785 -10392784 3483410 38725403 57608577 40661543 12388559
33238 12388559 -681069 -4893615 -14159857 -20082357 -11096746 3145682 10862745 19612546
33230 19612546 34150158 35436167 10682939 -16099407 -16810427 -5575867 -15196992 -39829617
33222 -39829617 -43123144 -19101818 -1177614 -5624127 -8041941 10639701 32486457
33215 32486457 36901655 34999905 44891063 57220401 52861700 37716367 31612300 32835085
33207 32835085 21636184 -3629689 -18767841 -6457714 21176526 39471861 39351133
33200 39351133 32459922 35119406 51762131 70901343 75762272 61202349 39710024
33193 39710024 28315202 31042407 36599001 30952573 9748503 -18111782 -35656539
33186 -35656539 -30587959 -8135291 11388434 13129096 3621564 392632 7618676 10617386
33178 10617386 -3224891 -26180313 -39799353 -38313669 -32465891 -29600719 -22194990 -4513373
33170 -4513373 9928860 4582672 -9979095 -4907574 20905760 28128173 -9257852 -56160336
33162 -56160336 -54280488 -2283656 37264383 18861050 -30890548 -57474486 -49406029
33155 -49406029 -36167441 -33713061 -27815186 -8301283 12450654 21100659 18149983 3862404
33147 3862404 -26539510 -62561435 -76158806 -56168096 -26401056 -10870535 1398768
33140 1398768 32446230 69791409 76110528 41866174 -2050003 -28929943 -45139205
33133 -45139205 -63690364 -75214816 -64232430 -37163080 -15238150 -10607037 -23531095
33126 -23531095 -49775257 -75292118 -78426686 -56723639 -38157452 -44782166 -59913307
$$ [...]
##END NTUPLES=NMR SPECTRUM
##END=
