##TITLE=31Pdec_ABEL3105
 CDCl3, 24 sc
 1.06.2021
##JCAMPDX= 6.0         $$ Bruker NMR JCAMP-DX V2.0
##DATA TYPE= NMR SPECTRUM
##DATA CLASS= NTUPLES
##ORIGIN= UXNMR, Bruker Analytische Messtechnik GmbH
##OWNER= root
$$ XWIN-NMR		Version 3.5
$$ Tue Jun  1 11:38:09 2021 Russian Standard Time (UT+4h)  she@DPX200
##.OBSERVE FREQUENCY= 81.013821
##.OBSERVE NUCLEUS= ^31P
##.ACQUISITION MODE= SIMULTANEOUS
##.ACQUISITION SCHEME= undefined
##.AVERAGES= 24
##.DIGITISER RES= 16
##SPECTROMETER/DATA SYSTEM= spect
##.PULSE SEQUENCE= zgpg30
##.SOLVENT NAME= CDCl3
##.SHIFT REFERENCE= (INTERNAL, CDCl3, 0, 248.564)
##AUDIT TRAIL= $$ (NUMBER, WHEN, WHO, WHERE, WHAT)
$$ ##TITLE= Audit trail, XWIN-NMR		Version 3.5
$$ ##JCAMPDX= 5.01
$$ ##ORIGIN= Bruker BioSpin GmbH
$$ ##OWNER= she
$$ F:/spectra/data/she/nmr/P31/1/pdata/1/auditp.txt
$$ ##AUDIT TRAIL=  $$ (NUMBER, WHEN, WHO, WHERE, WHAT)
(   1,<2021-06-01 11:37:04.12 +0400>,<she>,<DPX200>,
      <created by zg, POWCHK disabled, PULCHK disabled
       configuration hash MD5:
       00 E9 B6 7A A2 85 ED C7 34 08 36 98 17 FE 4E 26
       data hash MD5: 32K
       C7 44 E3 58 F0 5F C7 4C 2D 9C A1 D7 02 65 0E 4C>)
(   2,<2021-06-01 11:37:08.12 +0400>,<she>,<DPX200>,
      <Start of raw data processing
       efp BC_mod = 2 LB = 1 FT_mod = 6 PKNL = 1 PHC0 = -5729.41 PHC1 = -256.5275 SI = 64K 
       data hash MD5: 64K
       78 92 90 E2 74 AA 14 91 D1 AA AF 3C DE F4 87 EE>)
(   3,<2021-06-01 11:37:37.54 +0400>,<she>,<DPX200>,
      <pk PHC0 = -102.0868 PHC1 = 271.4002 
       data hash MD5: 64K
       9C D0 7F 2D 5D 7B F4 1B 39 C8 97 83 F4 65 29 8B>)
(   4,<2021-06-01 11:37:47.51 +0400>,<she>,<DPX200>,
      <abs ABSG = 5 
       data hash MD5: 64K
       60 EB AA DE 6A 71 E3 95 3C C7 5A 69 70 DC 02 27>)
$$ ##END=
$$ 
$$ hash MD5
$$ DE 07 BE 85 05 1F 84 4A 5F A9 F9 8C 6E 5F 6C 97
##$RELAX= 
##$RELAX= 
##$RELAX= 
##$RELAX= 
##$RELAX= 
##$RELAX= 
##$RELAX= 
##$RELAX= 
$$ Bruker specific parameters
$$ --------------------------
##$DU= <F:/spectra>
##$EXPNO= 1
##$NAME= <P31>
##$PROCNO= 1
##$TYPE= <nmr>
##$USER= <she>
##$AMP= (0..31)
100 100 100 100 100 100 100 100 100 100 100 100 100 100 100 100 100 100 
100 100 100 100 100 100 100 100 100 100 100 100 100 100 
##$AQSEQ= 0
##$AQ_mod= 1
##$AUNM= <au_zg>
##$AUTOPOS= <>
##$BF1= 81.014009
##$BF2= 200.13
##$BF3= 200.13
##$BF4= 200.13
##$BF5= 200.13
##$BF6= 200.13
##$BF7= 200.13
##$BF8= 200.13
##$BYTORDA= 1
##$CFDGTYP= 0
##$CFRGTYP= 5
##$CHEMSTR= <none>
##$CNST= (0..31)
1 1 145 1 1 1 1 1 1 1 1 1 1 1 1 1 1 1 1 1 1 1 1 1 1 1 1 1 1 1 1 1 
##$CPDPRG= <waltz16>
##$CPDPRG1= <>
##$CPDPRG2= <waltz16>
##$CPDPRG3= <>
##$CPDPRG4= <mlev>
##$CPDPRG5= <mlev>
##$CPDPRG6= <mlev>
##$CPDPRG7= <mlev>
##$CPDPRG8= <mlev>
##$CPDPRGB= <>
##$CPDPRGT= <>
##$D= (0..31)
0 1 0 0 0 0 0 0 0 0 0 0.03 2e-05 3e-06 0 0 0 0 0 0 0 0 0 0 0 0 0 0 0 0 
0 0 
##$DATE= 1622533023
##$DBL= (0..7)
120 120 120 11 120 120 24 19 
##$DBP= (0..7)
150 150 150 150 150 150 150 150 
##$DBP07= 0
##$DBPNAM0= <>
##$DBPNAM1= <>
##$DBPNAM2= <>
$$ [...]
##$SUBNAM3= <"">
##$SUBNAM4= <"">
##$SUBNAM5= <"">
##$SUBNAM6= <"">
##$SUBNAM7= <"">
##$SUBNAM8= <"">
##$SUBNAM9= <"">
##$SW= 501.771253377433
##$SWIBOX= (0..15)
0 1 3 0 0 0 0 0 0 0 0 0 0 0 0 0 
##$SW_h= 40650.406504065
##$TD= 32768
##$TD0= 1
##$TE= 0
##$TE2= 300
##$TE3= 300
##$TEG= 300
##$TL= (0..7)
0 120 53 12 22 120 120 120 
##$TP= (0..7)
150 150 150 150 150 150 150 150 
##$TP07= 0
##$TPNAME0= <>
##$TPNAME1= <>
##$TPNAME2= <>
##$TPNAME3= <>
##$TPNAME4= <>
##$TPNAME5= <>
##$TPNAME6= <>
##$TPNAME7= <>
##$TPOAL= (0..7)
0.5 0.5 0.5 0.5 0.5 0.5 0.5 0.5 
##$TPOFFS= (0..7)
0 0 0 0 0 0 0 0 
##$TUNHIN= 0
##$TUNHOUT= 0
##$TUNXOUT= 0
##$USERA1= <user>
##$USERA2= <user>
##$USERA3= <user>
##$USERA4= <user>
##$USERA5= <user>
##$V9= 5
##$VALIST= <valist>
##$VCLIST= <CCCCCCCCCCCCCCC>
##$VD= 0
##$VDLIST= <DDDDDDDDDDDDDDD>
##$VPLIST= <PPPPPPPPPPPPPPP>
##$VTLIST= <TTTTTTTTTTTTTTT>
##$WBST= 1024
##$WBSW= 4
##$XGAIN= (0..3)
0 0 0 0 
##$XL= 0
##$YL= 0
##$YMAX_a= 28023
##$YMIN_a= -28746
##$ZGOPTNS= <>
##$ZL1= 120
##$ZL2= 120
##$ZL3= 120
##$ZL4= 120
##$ABSF1= 248.5645
##$ABSF2= -253.2056
##$ABSG= 5
##$ABSL= 3
##$ALPHA= 0
##$AQORDER= 0
##$ASSFAC= 0
##$ASSFACI= 0
##$ASSFACX= 0
##$ASSWID= 0
##$AUNMP= <proc_1d>
##$AZFE= 0.1
##$AZFW= 0.5
##$BCFW= 0
##$BC_mod= 2
##$BYTORDP= 0
##$COROFFS= 0
##$CY= -3
##$DATMOD= 1
##$DC= 0
##$DFILT= <>
##$DTYPP= 0
##$F1P= 0
##$F2P= 0
##$FCOR= 1
##$FTSIZE= 65536
##$FT_mod= 6
##$GAMMA= 0
##$GB= 0
##$INTBC= 1
##$INTSCL= 5.30512e-09
##$ISEN= 30
##$LB= 1
##$LEV0= 0
##$LPBIN= 0
##$MAXI= 10000
##$MC2= 0
##$MEAN= 0
##$ME_mod= 0
##$MI= 50
##$NCOEF= 0
##$NC_proc= -3
##$NLEV= 6
##$NOISF1= 182.463
##$NOISF2= 159.3651
##$NSP= 0
##$NTH_PI= 0
##$NZP= 0
##$OFFSET= 248.5645
##$PC= 4
##$PHC0= -5831.497
##$PHC1= 14.87271
##$PH_mod= 1
##$PKNL= yes
##$PPARMOD= 0
##$PSCAL= 0
##$PSIGN= 0
##$REVERSE= no
##$SF= 81.014009
##$SI= 65536
##$SIGF1= 159.3651
##$SIGF2= -187.1042
##$SINO= 113.3802
##$SIOLD= 16384
##$SREGLST= <1H.CDCl3>
##$SSB= 0
##$STSI= 65536
##$STSR= 0
##$SW_p= 40650.406504065
##$SYMM= 0
##$S_DEV= 0
##$TDeff= 32768
##$TDoff= 0
##$TI= <>
##$TILT= no
##$TM1= 0
##$TM2= 0
##$TOPLEV= 0
##$USERP1= <user>
##$USERP2= <user>
##$USERP3= <user>
##$USERP4= <user>
##$USERP5= <user>
##$WDW= 1
##$XDIM= 65536
##$YMAX_p= 382003666
##$YMIN_p= -2146436
$$ End of Bruker specific parameters
$$ ---------------------------------
##NTUPLES= NMR SPECTRUM
##VAR_NAME=  FREQUENCY,     SPECTRUM/REAL,   SPECTRUM/IMAG
##SYMBOL=    X,             R,               I
##VAR_TYPE=  INDEPENDENT,   DEPENDENT,       DEPENDENT
##VAR_FORM=  AFFN,          ASDF,            ASDF
##VAR_DIM=   65536,         65536,           65536
##UNITS=     HZ,            ARBITRARY UNITS, ARBITRARY UNITS
##FACTOR=    0.620285442955139, 1,           1
##FIRST=     20137.2065510759, 0,            0
##LAST=      -20513.1999529892, 0,           0
##MIN=       -20513.1999529892, -2146436,    0
##MAX=       20137.2065510759, 382003666,    0
$$ Real data points
##PAGE= N=1
##DATA TABLE= (X++(R..R)), XYDATA
$$ [...]
39671A80859l22459m61650k92254K11864O12532M46132n2331j91812J49187L34317
39661F14385k4443m73269m33601j1696K71794J93933n6456k06785j07808J53574
39651h0372K35066q1295m60164l63534J39637M18435K19806j4464N2828J49303
39641B15246j4970k16209j58377K6833J04926J48078K53770K43990O908k13854
39631C96341k00003q8934m2654L7762J91307J95153k7410k00938j64783j09426
39621a3585j12496L0065K45639R5063l95651n16191J9393M71385K25445j77296
39611a28229R706M07056J62533n14183o24746q466M41714K37369p5962K5028K63196
39600A95016K04832l0277j16356o6770o2476j00954r7024o0988m672R1653J51124
$$ plain form
39671 180859 -141600 -603250 -895504 -683640 -71108 375024 322693 130881 280068 614385
39661 614385 589942 116673 -316928 -328624 -56830 137103 80647 -126138 -233946 -80372
39651 -80372 154694 73399 -386765 -750299 -610662 -192227 27579 13115 65943 215246
39641 215246 200276 -15933 -174310 -147477 -42551 105527 359297 603287 610195 396341
39631 396341 196338 107404 64750 102512 293819 488972 461562 260624 95841 -13585
39621 -13585 -126081 -96016 149623 244686 -150965 -667156 -647763 -176378 49067 -128229
39611 -128229 -118523 288533 451066 -63117 -687863 -696329 -254615 -17246 -93208 -68180 195016
39600 195016 399848 369571 253215 186445 123969 23015 -74009 -134997 -139669 -48016 103108
39589A03108R2013L7074J35212K30092O0750k67159m01445k78901j30910k5369
39579d45535J38139K38917N9182k17328j74047J41686K48214J9809j39978l6047
39569a66988K1601j30154j67795R0624K73418P4097j92360j17664R6182j4982
39559b34021l68340m10887N7378N80196O27168J96940k42750k69685Q4040L87045
39549D07084K89971o5101k34578n7306J57773Q3076k07007l87056k82469O139
39539b89474K51898K70908N0361k11904k81997j37682M9512J58458K02054J93173
39529B55307J08874j2491j07456j98607k97728k70896l5024J93137J49829l4273
39519b49328j5816J61327J01705k30239l38787L1017M13095K83641j46098k59245
$$ plain form
39589 103108 195121 232195 367407 597499 658249 391090 -10355 -289256 -420166 -445535
39579 -445535 -307396 -68479 -9297 -226625 -400672 -258986 -10772 9037 -130941 -166988
39569 -166988 -145387 -275541 -443336 -352712 -79294 -5197 -197557 -315221 -219039 -234021
39559 -234021 -602361 -1013248 -955870 -375674 251494 448434 205684 -64001 20039 407084
39549 407084 697055 631954 397376 340070 497843 580919 373912 -13144 -295613 -289474
39539 -289474 -37576 233332 283693 71789 -210208 -347890 -298378 -139920 62134 255307
39529 255307 364181 351690 244234 45627 -252101 -522997 -558021 -364884 -215055 -249328
39519 -249328 -265144 -103817 -2112 -232351 -571138 -540121 -127026 156615 10517 -248728
39509b48728M5750K53908L2067l06373k77292J17117M22876L20656j3960j74170
39499A71851l5093J29879N4181j61158k19441m2611J79740K91457K98840K16343
39489H83988J6371k32323l78064l78277l03049j52837R9753K88670J77139j21565
39479a00194j65833K02639N54744M27213l7144k97830j41463J11459J06933j16569
39469E43955k90577l06167k78804k95135k63989q0003J62944K54066J53966N7380
39459c42364J11724K13478J95884R6012P3761J39708J39691p001j95732k70096
39449A55065j82465l3159J2266r4731j76318l3530K30162L06511J43856J1410
39439C39067N398j15281l85936l88030O4705M27541J69867l28278l10816J53679
$$ plain form
39509 -248728 -202978 50930 82997 -223376 -500668 -383551 39325 359981 346021 171851
39499 171851 136758 266637 320818 159660 -59781 -102392 77348 368805 667645 883988
39489 883988 900359 668036 289972 -88305 -391354 -544191 -444438 -155768 21371 -100194
39479 -100194 -266027 -63388 491356 918569 881425 583595 442132 553591 660524 543955
39469 543955 253378 -52789 -331593 -626728 -890717 -970720 -807776 -553710 -399744 -342364
39459 -342364 -230640 -17162 178722 274734 348495 488203 627894 620893 425161 155065
39449 155065 -27400 -60559 -48293 -143024 -319342 -352872 -122710 183801 327657 339067
39439 339067 344465 229184 -156752 -544782 -480077 -52536 117331 -210947 -521763 -368084
39429c68084L03264m5692k19011J60617N52620L89184q6184l24833k85711k49651
39419a73481k31072q1049J02302J24296N6798P0799R4799j0229j24409p1156K5196
39408b17206n0939j77788o3851K24840K89311j7898l45263k83765J36537M97523
39398h499M57825J03798j66634j15872N4976K5602j41693j04788J51804J94208
39388D50727k03178o22582n29081k463L93062L41227N1958j34385j13138L9220
39378c28633K33444L84359L98494K36216n0288l48639n23274m62112j66327J99448
39368d27312L98695L09661M7278j19892m4231J07647N0430k11707l57738k12270
39358d59439J508L9321P546R4239J80454P9621m4943O4833K44842J35949j67752
$$ plain form
39429 -368084 -64820 -110512 -329523 -168906 383714 772898 686714 361881 76170 -173481
39419 -173481 -404553 -485602 -383300 -259004 -202206 -131407 -36608 -46837 -171246 -242402 -217206
39408 -217206 -268145 -445933 -509784 -284944 4367 -13531 -358794 -642559 -506022 -8499
39398 -8499 449326 553124 386490 270618 325594 351196 209503 104715 256519 450727
39388 450727 247549 -375033 -904114 -906577 -513515 -172288 -120330 -254715 -367853 -328633
39378 -328633 -95189 289170 687664 923880 873592 524953 1679 -460433 -626760 -427312
39368 -427312 -28617 281044 328322 208430 164199 271846 322276 110569 -247169 -459439
39358 -459439 -457931 -418610 -411064 -316825 -136371 -56750 -101693 -36860 207982 343931 176179
39347A76179k32840k3583M0511j80044l22537j69314L2005Q5370J57349L33001
39337a03903L58609J13305j08615q1617k999p6419j52657q8661n6914j66693j72034
39326e38598Q0383K81833J31121j52130j82637O473J28461J39350J75460J99041
39316B68757Q0904j06566j81545j11478L0008J91924K76063J71345j6578n9842
39306E42992j5240j42390l38017j88214K55544L88594J7198k74345j08072O4990
39296B03040j46038l05990J7786L50682J02344l13627j42065L65179L43933j94938
39286B80306l89533K2442L56964J96649m2098M057O3984j28243l30414k85664
39276b51550j49951j15943q1383O0719K07153K82960L16425K14200j14158l96673
$$ plain form
39347 176179 -56661 -80244 -39733 -219777 -542314 -711628 -679623 -594253 -436904 -103903
39337 -103903 254706 368011 259396 177779 174780 98361 -54296 -142957 -199871 -366564 -538598
39326 -538598 -458215 -176382 -45261 -197391 -380028 -373555 -245094 -105744 69716 268757
39316 268757 349661 243095 61550 -49928 -19920 172004 448067 619412 602834 542992
39306 542992 527752 385362 47345 -140869 114675 503269 520467 246122 138050 203040
39296 203040 57002 -248988 -231202 119480 221824 -91803 -233868 131311 475244 280306
39286 280306 -109227 -86785 270179 466828 424730 428787 492771 364528 34114 -251550
39276 -251550 -401501 -517444 -598827 -538108 -330955 -47995 268430 482630 368472 -28201
39266b8201k56289J56965L17152J20518l3417K3451L8144n6115q230J52333O2416
39255D88727k53188k91015O4319K62967j5807l40212k56373N5570K39032L12479
39245B66499L59323K01356j80265l77583j46606J68746K02156R8762P9849k7036
39235F45201l39170m79200j50171K52419K00028j30163j86184O1366J81364N2408
39225A07898m7594j9291m0749j35161j38708o3100m3684P234K41067M39524K36023
39214E43459k42464m46739j69774K09096L18670K05768M5490j38313k90261k24704
39204a89772O5441K69104J44520j48759k91017k13856r2615m4731p254J23478
39194c85461L31428M54164L14250o0549l75005l49521p1127Q4224p3507k95872
$$ plain form
39266 -28201 -284490 -127525 189627 310145 276728 300179 338323 282208 273978 426311 488727
39255 488727 235539 -55476 8843 271810 256003 -84209 -340582 -285012 -45980 266499
39245 266499 625822 827178 646913 269330 122724 291470 493626 592388 672237 645201
39235 645201 306031 -173169 -323340 -70921 129107 -1056 -187240 -125874 55490 107898
39225 107898 60304 41013 264 -134897 -273605 -336705 -380389 -373155 -132088 307436 543459
39214 543459 300995 -145744 -315518 -106422 212248 418016 463506 325193 34932 -189772
39204 -189772 -124331 144773 289293 140534 -150483 -364339 -456954 -501685 -508939 -385461
39194 -385461 -54033 400131 714381 653832 278827 -70694 -141821 -57597 -131104 -426976
39184d26976k21671J41893M08798K82352q7940k97494j78269L2132M5366j02510
39174d04319j68694q3448J0910N9853J59680K73079J80846j28309k95341o9720
39164d65463K59183K30819j09702k72995n3702J85289Q5416j83527k25302j7582
39154e67566J23918R0010J11383K81486L09049j4749l69418k88627J30146L12658
39144A18290K5388l11368k75342j5446R4480M8376Q8947K13133J98580K3798j01509
39133A07327q2188o975P4457J51866J10357r7365k23438l2401K41389J65229j96885
39122B11373l32920o8063J92520J35079l2277l7968L900j00985k24233j47319
39112d00893M7647J16485Q897j42016k27704j89096o843J90613J96152J5829j14005
$$ plain form
39184 -426976 -648647 -506754 -97956 184396 96456 -201038 -379307 -347175 -301809 -404319
39174 -404319 -573013 -656461 -645551 -585698 -426018 -152939 27907 -100402 -395743 -465463
39164 -465463 -206280 24539 -85163 -358158 -411860 -226571 -141155 -324682 -549984 -567566
39154 -567566 -443648 -353638 -242255 39231 348280 333531 -35887 -324514 -194368 118290
39144 118290 143678 -167690 -443032 -458478 -363998 -315622 -226675 -13542 185038 208836 107327
39133 107327 25139 18164 92621 244487 354844 257479 34041 1640 243029 408258 211373
39122 211373 -121547 -189610 2910 137989 105712 67744 71644 -29341 -253574 -400893
39112 -400893 -353246 -236761 -227864 -369880 -597584 -786680 -793523 -602910 -406758 -390929 -504934
39101e04934p7931O788Q4493K26532L18823J04049l02791l96848k3634L27873
39091b37580K79192J16774J83449K20810j11200m82617l61391N0966J15249j59997
39081c86345j38269L22815N86126K78347j26969j29210L4807p3974l06760k49355
39071a88787J0074N5136r8536m1314K58708L29145k3004l40791k13188R3700R4217
39060f4640j41929j54808J26134K89918J34076n3522l2713K6111n2534q8729Q5528
39049G2892K32829O8989k33033k98730j20569K8987P9422J32610J11697q4846
39039i752k01001P7990N05415N08531N0276l07298k56257q5729o8607r3064p1651
39028D8853j39252k35974o8914K76120K90523j00793k78951Q6533M36029K05607
$$ plain form
39101 -504934 -582865 -576077 -491584 -265052 53771 157820 -144971 -541819 -565453 -237580
39091 -237580 41612 158386 341835 562645 451445 -31172 -392563 -341597 -226348 -386345
39081 -386345 -524614 -201799 384327 662674 535705 406495 441302 367328 60568 -188787
39071 -188787 -178713 -123577 -222113 -263427 -4719 324426 301422 -39369 -252557 -158857 -64640
39060 -64640 -206569 -361377 -235243 54675 188751 135229 102516 128627 76093 -12636 72892
39049 72892 305721 374710 141677 -157053 -277622 -248635 -169213 -36603 75094 -9752
39039 -9752 -210753 -132763 372652 881183 931459 624161 367904 282175 213568 120504 48853
39028 48853 -90399 -326373 -395287 -119167 171356 70563 -208388 -121855 314174 519781
39018E19781k72708l58455r2620N4780J6654K9746L7340j22597k03985Q5379M34190
39007A27505L32332o3532j78595J8068M9679j55263j72028P6606J59711n7255
38997A37228j72685O5J21321j838p8125M6588M9600k30106l83241r4186K70036
38986c35343K21769p8476j29374J07599K29230O3729j50138k02235j32501j8680
38976d24420J24640K09649J19428o0913r0689P9626K05474R0054j26915j61735
38966c5801J6946J48135M1831j67837k24573r5779L9902R2531J36342J70549M6842
38955A69088k55862m91754m34904j48503J56620L53663L72590J78761n5578l0518
38945a86397K09121J92704k69304o30628l26815L16137M82612N0053k83040q4201
$$ plain form
39018 519781 247073 -111382 -204002 -149222 -132568 -102822 -65482 -188079 -392064 -306685 127505
39007 127505 459837 396305 217710 235778 285457 130194 -41834 34772 194483 137228
38997 137228 -35457 -35392 85929 84091 5966 52554 102154 -127952 -511193 -605379 -335343
38986 -335343 -113574 -192050 -321424 -213825 15405 79134 -71004 -273239 -405740 -424420
38976 -424420 -299780 -90131 29297 -31616 -122305 -42679 162795 252849 125934 -35801
38966 -35801 -18855 129280 171111 3274 -221299 -317078 -277176 -184645 -48303 122246 169088
38955 169088 -86774 -578528 -1013432 -1161935 -1005315 -651652 -279062 -100301 -155879 -186397
38945 -186397 22724 215428 -53876 -684504 -1011319 -695182 -212570 -162517 -445557 -529758
38935e29758K57622K65058O4431j904J6763j01669k41337j22092J71204K57283
38925C5601K4832k16771j98917l3860J7694o3616o1610J35144L49832L34019Q8758
38914D11106j39793j70702p1149l465k1302p9549j26616j18219n1053k0878r8773
38903d90393j38695N4513L26449K74684j21460l53996j09884K41274K24528l6175
38893a29155j27356m7060p3709j62513m5970J91223K08672K4166j8518J24896
38883e5324J49491p867o9368L5325N0915p9805q3626J26480K75810J98218L9635
38872E79884j07123l11979m63144l05852O4656K46675J66673J33479J77770j1983
38862A69056l37049k20726L87730O92131K10081m29008m38571k6723R6546j29425
$$ plain form
38935 -529758 -272136 -7078 57353 55449 72212 -29457 -270794 -392886 -221682 35601
38925 35601 60433 -156338 -355255 -389115 -371421 -435037 -496647 -361503 -11671 322348 411106
38914 411106 271313 100611 29462 25997 4695 -74854 -201470 -319689 -370742 -391620 -490393
38903 -490393 -629088 -574575 -248126 26558 -94902 -448898 -558782 -317508 -92980 -129155
38893 -129155 -256511 -303571 -377280 -539793 -585763 -394540 -185868 -161702 -180220 -55324
38883 -55324 94167 86300 16932 52257 103172 23367 -60259 66221 342031 540249 579884
38872 579884 472761 160782 -302362 -608214 -543558 -296883 -130210 3269 181039 169056
38862 169056 -167993 -388719 -989 691142 901223 472215 33644 6921 103467 -25958
38852b5958k28235j05860o7030j07838N3618L21699K94600q132j16346J36082
38842A46600L80582L20457Q0461j30515k55232k13449N9851L04993J12499m41525
38832C64722p43165m24759J40916L54120J22130j57573j58677N8478K16182J57955
38822f9671J4622K6285J79900J74897j07586l13088r4979K84700K71022j31941
38812B34161l35347o2330K59767K15357O911k235P7173m8261k33935j18889J80301
38801A72673J71227k07928m26170j53353K58376L39675J54211M3638L0625j00631
38791B82343l05016l09840j02301L8113K6391Q4032K62811K63386o3110l86385
38781b09576l54074r9067K7047k62M3979J75439K03068J06239M4971L4410m6584
$$ plain form
38852 -25958 -254193 -360053 -427083 -534921 -481303 -159604 134996 126864 10518 146600
38842 146600 527182 847639 928100 797585 542353 328904 388755 693748 806247 364722
38832 364722 -378443 -803202 -662286 -308166 -186036 -343609 -502286 -443808 -227626 -69671
38822 -69671 -55049 -28764 151136 326033 218447 -94641 -189620 95080 366102 234161
38812 234161 -101186 -163516 96251 311608 318519 316284 393457 345196 111261 -7628 172673
38801 172673 343900 135972 -290198 -443551 -185175 154500 308711 352349 382974 282343
38791 282343 -22673 -332513 -434814 -396701 -370310 -286278 -23467 239919 176809 -209576
38781 -209576 -563650 -662717 -635670 -635932 -591953 -416514 -213446 -107207 -62236 -27826 -74410
38770g4410j47799r6546N1546O5809m3743m1281O6634k060k61371l19876L876
38759g99221L31473K80131K7518k6610J04248R5706j07599k19627q6070J09050
38749b91001J46269K5006j37148k55150k56601p0921K60248N39099N64103L17789
38739H41693k8594k87691l92920l47554j25336K34209M63793K60778k45446m88709
38729a15777j62689L16329L60907J6648j94652q3966M3764j5037j18445j58840
38719a11758j90050j23986J78962M47268K19447l29658m41544Q4081M85853J86368
38709D04983l28351l40509j6272K4494j98380j71845J32756K38713K5573j26618
38699c55456n5272j2451r0218n5869J44057K60656K23941K37188K99483J55675
$$ plain form
38770 -74410 -222209 -318755 -267209 -201400 -245143 -286424 -219790 -221850 -483221 -803097 -799221
38759 -799221 -467748 -187617 -160099 -186709 -82461 13245 -94354 -313981 -400051 -291001
38749 -291001 -144732 -119726 -256874 -512024 -768625 -839546 -579298 -40199 523904 841693
38739 841693 813099 525408 132488 -215066 -340402 -106193 357600 618378 372932 -115777
38729 -115777 -278466 37863 398770 415418 220766 136800 180564 165527 47082 -111758
38719 -111758 -301808 -425794 -246832 200436 419883 90225 -351319 -267238 218615 404983
38709 404983 76632 -263877 -280149 -255655 -454035 -625880 -493124 -254411 -228838 -355456
38699 -355456 -410728 -423179 -513397 -569266 -425209 -164553 59388 296576 596059 751734
38689G51734j59078k58342n6549M7943j33852k35195N949K37930P2404k29160
38679D3784j53944K29942L71462P7472k31277j61788J33972K36013J2718k79783
38669B78571l54835j99975j0591R3183J77184K93283L03888O9409k57204l55332
38659C7581j76179j5909o5282j34207O475K27556K42227P2396J1831J44293K01053
38648E51835l650k47472k08958N2204J79164M0995j01012k4339J16830P8650m8107
38637C86140r25J61995R7979k45337m55698k37308J31145J85693q4147k91497
38627c51960k24010m2274N6197P4395Q1776Q4017R4866J53955K08362J31450p6236
38616A90538k35377j98050p321J87835K69141J76740o4069k84751k72743k8353
$$ plain form
38689 751734 592656 334314 277765 325708 191856 -43339 -37390 200540 272944 43784
38679 43784 -110160 119782 491244 568716 337439 175651 309623 545636 558354 278571
38669 278571 -76264 -276239 -286830 -193647 -16463 276820 580708 650117 392913 37581
38659 37581 -138598 -154507 -219789 -353996 -347521 -119965 122262 194658 206489 350782 551835
38648 551835 548185 300713 91755 143959 323123 364118 263106 238767 355597 434247 386140
38637 386140 385215 547210 645189 399852 -55846 -293154 -162009 23684 -60463 -351960
38627 -351960 -575970 -618244 -562047 -487652 -405876 -321859 -226993 -73038 135324 266774 190538
38616 190538 -44839 -242889 -250210 -62375 206766 383506 319437 34686 -238057 -266410
38606b66410J73750J02215j14369j41644R5484K86771J74489n2312k9558J96642
38596D25058J91388j83623m76573l01914L2692j0013l13899k58841K67819O23919
38586c987L60305j39125k89433j09863K0368L4036J03458J50564l1929k85727
38576a91333k28187J20567L14554J51543m3942N6309L09959L45428O5552k71365
38566F29085l68925j74973J02668K11160R8058q0526j92516k47199k42500r4858
38556c60526J51962K57564J17925k4895O2190K24917J77268l0807j28793q6517
38546C60288j01877j93615j72296j3762P9063K2968l8102j5780J0642J2257P3858
38535B3644J76219J60351r910j50969r9435J00782K78840K75610L6276k86044
$$ plain form
38606 -266410 -92660 9555 -104814 -246458 -150974 135797 310286 257974 228416 425058
38596 425058 616446 432823 -43750 -345664 -312972 -322985 -636884 -895725 -627906 -3987
38586 -3987 356318 217193 -72240 -182103 -161735 -127699 -24241 126323 94394 -191333
38576 -191333 -419520 -298953 15601 167144 123202 179511 489470 834898 900450 629085
38566 629085 260160 85187 187855 399015 497073 416547 224031 -23168 -265668 -360526
38556 -360526 -208564 49000 166925 142030 204220 429137 606405 575598 446805 360288
38546 360288 258411 64796 -107500 -121262 -42199 -19231 -57333 -73113 -62471 -50214 23644
38535 23644 199863 360214 350304 199335 99900 200682 479522 755132 791408 505364
38525E05364l91400j75188Q9388J11495j6956m0050J4011m2326j27490k4246J39667
38514D2269L6199k42813k39279J08408K93855K8242l07509k82185m3485K8617
38504e77681n8600l6933J24073K27380J95873Q8380q6211k80375k86204o016K89147
38493d07167K87753J12726J24902L21111L13426n3060m23071m14000j04401J43294
38483i8487J53471K8880r5932j64020j07948J14916L53224L26558j6631l44750
38473A49281l15477k0495J41216L981j83200j59939m64P2967K9438M449O0757
38462b17486J42437J85539J50196L3720n9826n288J00899k432l01247l92436n3737
38451d19661L37121L01714k6990j16193J58798L77502K36801q5022k94696l27722
$$ plain form
38525 505364 113964 -61224 28164 139659 122703 82653 96664 54338 -73152 -97398 42269
38514 42269 78468 -164345 -403624 -295216 -1361 26881 -280628 -562813 -606298 -577681
38504 -577681 -636281 -673214 -549141 -321761 -125888 -37508 -123719 -404094 -690298 -696314 -407167
38493 -407167 -119414 -6688 118214 439325 752751 699691 276620 -137380 -241781 -98487
38483 -98487 54984 83864 -12068 -176088 -284036 -169120 184104 510662 494031 149281
38473 149281 -166196 -186691 -45475 -41494 -224694 -384633 -385097 -312130 -282692 -278243 -217486
38462 -217486 -75049 110490 260686 294406 234580 229292 330191 327759 26512 -365924 -419661
38451 -419661 -82540 219174 192184 75991 234789 612291 849092 764070 469374 141652
38441A41652k21824J176J89859J13488j77327l05796o1326K82335L21896K9323
38431C13456k71222l17029j45679K7939P1221N5987J10557J69329K1312l08691
38421b72820m42135j28758L30260M36389J54662j01068p3714P9027J13159j9037
38411G5965k15246k99981j04515K80860M49800J79083j68493j24627J64958J91605
38401D29409o8415j50244P4029K05000M7313r9261o0073q1850k57025k55856K7398
38390a89575J33535k18244n43694k71300L67258O66687M13166L656k27701l03412
38380a69624k89703j32729J41941L56217L71194K14599L1711k4636N3183O0957
38370F13110j60131m04717l19548M0735K40930J26914K6174J29235J54036r5390
$$ plain form
38441 141652 -80172 -78996 110863 224351 47024 -258772 -320098 -37763 284133 313456
38431 313456 42234 -274795 -420474 -392535 -321314 -265327 -154770 14559 35871 -272820
38421 -272820 -714955 -843713 -513453 -77064 77598 -23470 -97184 -18157 95002 75965
38411 75965 -139281 -439262 -543777 -262917 186883 365966 197473 72846 237804 429409
38401 429409 360994 210750 284779 489779 537092 437831 377758 295908 38883 -216973 -189575
38390 -189575 -56040 -274284 -817978 -1089278 -722020 -55333 357833 361489 133788 -169624
38380 -169624 -459327 -592056 -450115 -93898 277296 491895 523606 498970 552153 613110
38370 613110 452979 48262 -271286 -230551 10379 137293 163467 292702 446738 351348
38360C51348l04868j68586P0243L6669j50210j34135O4827J64900J33265J20323
38350A83776P4726j09969k34382o8279J49108O566l51149l42014J67264O11627
38340H7274N08431N6543k45358k34127r3519K3322J07292J30888J0681k30542
38330A20885l89145k75258J7521J55192k3330k50550j80662J05614K41580J61698
38320c16455J48994K65560K14064p1534j97014L7085K19582k8402l97867l65813
38310d91800r792J83712J02857N1339J33408J36492n315j07081j02244j07315
38300b15739j13531M416J68673J59163R513j5285J31660J92643K4819j94464k49039
38289i7171j28565M4904J30890K8119j79846k04294R2942M19468L98185R0367
$$ plain form
38360 351348 46480 -122106 -51863 -15194 -165404 -299539 -234712 -69812 63453 183776
38350 183776 258502 148533 -85849 -154128 -5020 1546 -349603 -691617 -524353 87274
38340 87274 595705 652248 406890 172763 79244 102566 209858 340746 351427 120885
38330 120885 -268260 -543518 -525997 -370805 -394135 -644685 -825347 -719733 -478153 -316455
38320 -316455 -167461 98099 312163 240629 43615 80700 300282 271880 -125987 -491800
38310 -491800 -501592 -317880 -215023 -163684 -30276 106216 100901 -6180 -108424 -215739
38300 -215739 -329270 -324854 -156181 2982 12495 -2790 128870 321513 346332 151868 -97171
38289 -97171 -225736 -180832 -49942 -21823 -201669 -405963 -313021 106447 504632 594999
38279E94999j35385j56606j58581k03225j34012O8201J97624J53748N3682l1899
38269B48546j63301l04987k92360q6812J60616L16412L28951J46137j64819k96782
38259a08399m0997L07016K69128r7066k37505O8858L69169K09140k38407m72404
38249B8533l11342J3970K20054J97845J4676j37350r6736N7160P0912j30004l10680
38238c82962k41261Q508J88183J50716n9309k66901k53634N4861M07453M13676
38228A9330L7396k68083j03170L29983M67021J24335k77800l11829q5938L2269
38218c6486J4090J05497K45640P0227l61615m12238J66893O32990K50273n08978
38208A66293n94867J7407L55673P3093q8391K59166M11612j08946n63665k05913
$$ plain form
38279 594999 459614 303008 144427 -58798 -192810 -124609 73015 226763 280445 248546
38269 248546 85245 -219742 -512102 -598914 -438298 -121886 207065 353202 188383 -108399
38259 -108399 -149396 157620 426748 329682 92177 161035 530204 739344 500937 28533
38249 28533 -282809 -268839 -48785 149060 163736 26386 -70350 -13190 57722 -72282 -382962
38238 -382962 -624223 -615715 -427532 -276816 -336125 -603026 -856660 -801799 -394346 19330
38228 19330 56726 -211357 -314527 15456 482477 606812 329012 17183 -68755 -36486
38218 -36486 -22396 83101 328741 398968 37353 -374885 -207992 424998 675271 166293
38208 166293 -428574 -411167 -55494 17599 -70792 188374 599986 491040 -72625 -278538
38198b78538M01725L30023j57652j69155K03711J25819m02219n28737p5779J99608
38188c51194R157k6980L50717M90797K6992m04656k42867Q6617K135k43099j29571
38177d31952J72053J72683m2406k7083K04374K35445l4671k85142k88734j02141
38167d27574J54967L52879L06532K592k46572j61773J10264K14196O9138r9503
38157B75146j03702K5159J13568r69k77624m10668j68861K09233K70652J4390
38147e3676j03486Q5477J87667p6080l79663k92047R8106L92161M24727K89226
38137E72412P9104j05485j17273J7406M6987j34870l05332k76341j64149j10258
38127d97799l8027J04468J64572O6412k2778o714k8121j37338j41428J9859J21404
$$ plain form
38198 -278538 123187 453210 295558 126403 330114 455933 53714 -475023 -550802 -351194
38188 -351194 -342037 -369017 -18300 472497 499489 94833 -148034 -61417 -59282 -302381 -431952
38177 -431952 -259899 -87216 -129622 -156705 47669 283114 248443 -36699 -325433 -427574
38167 -427574 -272607 80272 386804 389396 142824 -18949 91315 305511 374649 275146
38157 275146 171444 196603 310171 309202 31578 -379090 -547951 -338718 -68066 -53676
38147 -53676 -157162 -71685 115982 39902 -339761 -631808 -533702 -141541 283186 572412
38137 572412 651516 546031 428758 446164 493151 358281 52949 -223392 -387541 -497799
38127 -497799 -535826 -431358 -266786 -200374 -223152 -229866 -257987 -395325 -536753 -516894 -395490
38116c95490P4938Q9084J97181J07819k01335k71346Q9835L80294J82240j46392
38106A06828j04173J03812n205k92861k47498J04417K43353J1140k08623j35611
38096d24421J06957L13427L73334J86128j98313m45271l12730k2884R4398J00182
38086b29193J87507K16344J0589j63562L378K40267J06822k04036j85214N9697
38076D2599J2188k59300j83332K20045K74780j49251l21881J06061M46438R7078
38066B85425m49869m06175Q9021K99541O8773r4009O5839K28199J05021j66142
38056B5624l18949k70354o6436J89343L04455J45834j31824k20908o7351O1695
38046c48871j6224j25956j6454K15951K17168r0104k94466j3981N09258O46168
$$ plain form
38116 -395490 -320552 -231468 -34287 73532 -127803 -399149 -309314 70980 253220 106828
38106 106828 2655 106467 101262 -191599 -439097 -334680 -91327 -80187 -288810 -424421
38096 -424421 -317464 -4037 369297 555425 357112 -88159 -400889 -423773 -329375 -229193
38086 -229193 -41686 174658 185247 21685 25063 265330 372152 168116 -17098 42599
38076 42599 54787 -204513 -387845 -167800 106980 -42271 -364152 -258091 188347 285425
38066 285425 -164444 -570619 -481598 -182057 -113284 -207293 -141454 86745 191766 25624
38056 25624 -293325 -563679 -630115 -440772 -136317 9517 -122307 -343215 -410566 -348871
38046 -348871 -365095 -491051 -507505 -291554 -74386 -164490 -458956 -472937 36321 682489
38036F82489K21997k37526k51813j4473K0383j32255j08347J35448K56383R2021
38026F64307j44084k56419k70599k08791l5442J24934Q0231o7016j9963J97810
38016F4968K34915Q730j28005K4944J94111J24688j2505N904L5989j35630l54550
38005F3559l23514p3356J22608J62302J46071J14130L5121k4650L1667J46939
37995D00877J79588R2887o3141k40664l25460j49519K32186M42069K02798k53793
37985E17828m47403k39639P1136J84416R3630k7392l1778R7870K05366P4295k63899
37974B34430m42156j94997K17418L10122M8079j27742J0249J47739k2060k67747
37964h6665j79629J55741K68658M1093j24295J6122J33240j13076m43089l41535
$$ plain form
38036 682489 904486 666960 415147 400674 421057 288802 180455 315903 572286 664307
38026 664307 520223 263804 -6795 -215586 -251028 -126094 -45863 -112879 -132842 64968
38016 64968 299883 308613 180608 205552 399663 524351 511846 517750 553739 418109 63559
38005 63559 -259955 -333311 -210703 -48401 97670 211800 246921 222271 253938 400877
37995 400877 580465 673352 610211 369547 44087 -105432 126754 568823 771621 517828
37985 517828 70425 -169214 -98078 86338 179968 152576 120798 218668 424034 498329 234430
37974 234430 -207726 -402723 -185305 124817 172896 45154 55403 203142 181082 -86665
37964 -86665 -266294 -110553 158105 199198 74903 91025 224265 111189 -331900 -673435
37954f73435J09308L16493Q6238j18613J3404J45602m9765k43004J4614M58276
37944E9118M53228j180k68900n8842K24288K06114K4148j03869k41422l95566
37934a02883l14491M3320K63671O8906k13873j66481P5025J24774J1076M3345
37924a67611K04616J87511l8251j60501l0053J56860K04248J16031n6580k58691
37914A57579l24616j31981J36121J79157J8269o4155l276l775q9978j6678K48933
37903A05600L52301P6232k80196l12662o3814J12792P6278N774N8695J62202J54107
37892D47309p826j94970k22569n2935J13638N2529j77447k90126j59712L1344
37882d60765Q8650N0178M1052P8888J39130K29443K82467J74189k3733m4873J47043
$$ plain form
37954 -673435 -564127 -247634 -161396 -280009 -266605 -121003 -170768 -413772 -399158 59118
37944 59118 512346 511166 242266 183424 407712 613826 637974 534105 292683 -102883
37934 -102883 -417374 -374054 -110383 -41477 -255350 -421831 -346806 -222032 -210956 -167611
37924 -167611 37005 224516 186265 25764 -4289 152571 356819 472850 416270 157579
37914 157579 -167037 -299018 -162897 16260 34529 -29626 -32902 -36677 -126655 -143333 105600
37903 105600 457901 534133 253937 -58725 -122539 -9747 66531 72305 131000 293202 447309
37892 447309 439483 244513 21944 -30991 82647 135176 -42271 -332397 -492109 -460765
37882 -460765 -372115 -321937 -280885 -201997 -62867 166576 449043 623232 599499 554626 701669
37871G01669J94961j34843n12188m56536k3615K96061K69399J23385Q4625J07842
37861F50760J13245J36054J35152l6213l37738m88539l49903j32355p7784j37780
37851e25101j13978M9124K41976L27413K22063j5467j43305K5063L12239L43563
37841G23590O1813k02290k31757j66878j43561n9559J14628J58876j5110j44020
37831I5732m7698N3008m1505j20586L1071J73832M61k99415l30323j02874J11336
37820d76961K74690M23320L02330k16330o02816k87578L52432M30131r9523m00235
37810c00540j17502J59173K2579j04577J32872L30021R2094k13549j06652J80297
37800G4216J64880p2927j63242j19234j37476j01187J31860K99932J64827K687
$$ plain form
37871 701669 896630 761787 249599 -206937 -230552 65509 334908 458293 542918 650760
37861 650760 764005 900059 1035211 998998 661260 172721 -177182 -309537 -387321 -525101
37851 -525101 -639079 -589955 -347979 -20566 201497 186030 42725 67788 380027 723590
37841 723590 785403 583113 351356 184478 40917 -18642 95986 254862 239752 95732
37831 95732 48034 101042 59537 -61049 -29978 143854 144315 -155100 -485423 -588297 -476961
37820 -476961 -202271 221049 523379 307049 -295767 -583345 -230913 199218 99695 -300540
37810 -300540 -418042 -258869 -236290 -340867 -207995 122026 214120 571 -106081 74216
37800 74216 239096 166169 2927 -116307 -253783 -354970 -223110 76822 241649 244336
37790B44336R5046J43891j55634l93503p9515L74466K14024l64933m67550M9279
37780c40093L90879J60606j12652j6380J05097o5819k02925J4879K87372K27019
37770D47983q967q8990o2716j00444p6308J40719L11255J67878j34701k83443
37760C12266k66472k30827j48110K7054J15981k79p5933J43079M35540L68122
37750F80421o3015m17746l99781j48335O2605J57276K21267K80334K15540p0690
37740E17876m00685l84012P4553M70017K48973l89091o82629l38760J30659K47972
37730e05127J89335K64867L13350P9238k17101k15935l3305r020p2614P5859L10344
37719A79891K10670j83977l46902p7960J91941R9654j08310k0786K84597L78263
$$ plain form
37790 244336 339382 483273 327639 -65864 -145379 229087 443111 78178 -389372 -340093
37780 -340093 50786 211392 98740 82360 187457 121638 -81287 -66408 220964 447983
37770 447983 439016 350026 287310 186866 110558 251277 562532 730410 595709 312266
37760 312266 45794 -185033 -333143 -306089 -190108 -190387 -266320 -123241 312299 680421
37750 680421 617406 199660 -200121 -348456 -285851 -128575 92692 373026 588566 517876
37740 517876 117191 -266821 -192268 277749 526722 137631 -544998 -883758 -753099 -505127
37730 -505127 -315792 -50925 262425 341663 124562 -91373 -124678 -133698 -206312 -130453 179891
37719 179891 390561 206584 -140318 -218278 -26337 73317 -34993 -55779 228818 607081
37709F07081J09621k07924k29104J3456J98417J21109r2930k02808j80184j78891
37699d2157k19717j42286O5232J55091O990j19075L5143K93180K99902O9453o7553
37688C34203J157M3666q5315k12334j44218M1459J26919K6274j53899k27089q0639
37677c29816J88993L24876K01415p282r1541j16261k40604l45368j72847J87465
37667d00970L27884J19262q2587M353J63602Q7996o6840P1754M21673M56790m3731
37656A059186o18164o89350k68728J46491K23470O1192j18699k26799k08393l036
37646f42830K55635K71686J8639j17404J07196L49028J64460k60700l56708n3046
37636b64044J39652l2439k24190j49152j1769q366O5842L32823M40483J22071
$$ plain form
37709 607081 716702 508778 279674 293130 491547 612656 519726 316918 136734 -42157
37699 -42157 -261874 -404160 -338928 -183837 -176847 -295922 -260779 32401 332303 401756 334203
37688 334203 335360 379026 293711 81377 -62841 -21382 105537 131811 -22088 -249177 -329816
37677 -329816 -140823 184053 385468 378186 286645 170384 -70220 -415588 -588435 -400970
37667 -400970 -73086 46176 -36411 -32058 131544 219540 152700 224454 646127 1102917 1059186
37656 1059186 441022 -248328 -517056 -370565 -147095 -85903 -204602 -431401 -639794 -642830
37646 -642830 -387195 -115509 -96870 -214274 -107078 241950 406410 145710 -210998 -264044
37636 -264044 -124392 -156831 -381021 -530173 -541942 -550308 -484466 -151643 288840 410911
37626D10911k61726k52254j1320L6097n5857P335P2123j80157m54479j71923M63464
37615c97786N96261M3955l74883j26520K54610J37427j88233j06405K67457L46429
37605D52312M0008k35793l01010l12658k60357M183K88641K22855q1520j21068
37595c04407J72649K88358p427k47775j5493L77560L90236P4884q5013M7934J43048
37584H34554l580j97100k25600j60240j50466j74095j30746j5771J09968K02093
37574H9017K18177J42238O1194P2779R2507n2584k84275k77796N2589L26344J96010
37563F36200j30497j84265P8167K56290J40551l6767o9911j08592l07455m61749
37553a88028k98891N4768K18859Q7901p5406n6837O5911J36415J41835J23586
$$ plain form
37626 410911 149185 -103069 -114389 -78292 -134149 -126814 -54691 -234848 -689327 -861250 -397786
37615 -397786 198475 242430 -132453 -258973 -4363 133064 -55169 -161574 105883 452312
37605 452312 492320 256527 -44483 -357141 -617498 -613315 -324674 -101819 -183339 -304407
37595 -304407 -131758 156600 149173 -98602 -114095 263465 653701 728585 643572 691506 834554
37584 834554 830974 633874 408274 248034 97568 -76527 -207273 -223044 -113076 89017
37574 89017 307194 449432 510626 583405 675912 623328 339053 61257 113846 440190 636200
37563 636200 505703 321438 399605 655895 796446 759679 689768 581176 273721 -188028
37553 -188028 -486919 -432151 -213292 -125391 -200797 -257634 -191723 -55308 86527 210113
37543B10113M5403j09596k21039j65203k1045J3313p7737p4959J26062K66506
37533h182N3210l23481l27023J66098N84588M07786r7951k95906j23149p3619
37523c7629l00053l71620p2238J90640R9394j9251J83481L91240J57271k40377
37513a9142j83841K46418L69283K440k89133j67123j6745j79026l28819o5326
37503f31014L59343M21630J26658q2844l3965M1014k755l3160L5754Q4463K2095
37492C07219p9023j45713j95441k20671j63270m1984N5234J24672K24293K85165
37482A50481J49396j41646l00982j62002P1406J01663n1559j11360L5958J91418
37472f7227J53618J006m5592O6970J87841J92912J19310N6441P095r0386k45947
$$ plain form
37543 210113 255516 145920 -75119 -240322 -261367 -248054 -325791 -400750 -274688 -8182
37533 -8182 45028 -278453 -605476 -439378 145210 552996 455045 159139 35990 -37629
37523 -37629 -337682 -709302 -781540 -590900 -491506 -510757 -327276 63964 221235 -19142
37513 -19142 -202983 43435 412718 415158 126025 -41098 -57843 -236869 -565688 -631014
37503 -631014 -271671 149959 276617 193773 159808 200822 198067 164907 200661 285124 307219
37492 307219 228196 82483 -112958 -333629 -496899 -538883 -483649 -358977 -134684 150481
37482 150481 299877 158231 -142751 -304753 -233347 -131684 -183243 -294603 -258645 -67227
37472 -67227 86391 87397 41805 108775 296616 489528 608838 665279 672374 581988 336041
37461C36041l60758k89312L387L16706L34842j1017l65062l07918J16207M35085
37451B08201L43846L7734j42871j59122j82623k51293k58463j79181q2710J6258
37441f50224J27675J78163J19568O3283J04715J08915q0753k96250k08661J66780
37431c66789M31388L26994L2619j46422j40259n1524N2420J36173J35034L1411
37421D41045r9137j91194k45853k52442j74431m1270O7854J39869J95628J66469
37411F538j7643k33138k67316j21939N682M1014P8291J08066R745j35141o6800
37400e92641K02104L09349R3002j20099j5657K24054K36039L3293q5512k1155
37390B62777N1454M068j16698k25615k62553j87520o1063k0491n3950K8677K59334
$$ plain form
37461 336041 -24717 -314029 -310642 6064 340906 329889 -35173 -343091 -226884 208201
37451 208201 552047 589781 446910 287788 105165 -146128 -404591 -583772 -666482 -650224
37441 -650224 -522549 -344386 -224818 -161535 -56820 52095 -28658 -324908 -533569 -366789
37431 -366789 64599 391593 424212 277790 137531 86007 138427 274600 409634 441045
37421 441045 341908 150714 -95139 -347581 -522012 -563282 -495428 -355559 -159931 6538
37411 6538 -11105 -244243 -511559 -633498 -627816 -586802 -508511 -400445 -390700 -525841 -592641
37400 -592641 -390537 -81188 11814 -108285 -123942 100112 336151 369444 283932 262777
37390 262777 314231 318299 201601 -24014 -286567 -474087 -535150 -555641 -609591 -580914 -321580
37379c21580L72098J93693n9442j03607K5560J50861K51547K96950Q4917l74586
37369E16411o03963k56790K62313L05082p6914k82973j30363p419p6950l2550
37359c84116K18799L03892O0794j28060J0393J85132Q7157r3794q2452q944o6969
37348A01832p6371J49507L32994J28007k60769l51655j06370R3199O6363j1935
37338F4802n238L1172M7664L1682p7912k31095j82296J26639L23209J29980j19133
37327A39474J6112K97694J59071l05033m34130r4095J06879j27123k79166O4021
37317d56296M74157L70994p2068k81524j64941n7730n0286M7932K06783J82312
37307A99333j595m4582J23954K22335P1063j52845k13990j27851o8941j25929
$$ plain form
37379 -321580 50518 244211 184769 81162 106722 257583 509130 806080 890997 516411
37369 516411 -87552 -344342 -82029 223053 146139 -136834 -267197 -274616 -351566 -384116
37359 -384116 -165317 138575 199369 71309 81702 266834 353991 260197 177745 168801 101832
37348 101832 25461 174968 507962 635969 375200 23545 -82825 10374 76737 64802
37338 64802 59564 90736 138400 170082 92170 -138925 -321221 -194582 128627 258607 139474
37327 139474 155586 453280 612351 307318 -126812 -220907 -114028 -241151 -520317 -456296
37317 -456296 17861 388855 316787 35263 -129678 -187408 -237694 -189762 17021 199333
37307 199333 197738 153156 277110 499445 570508 417663 203673 75822 6881 -119048
37297a19048k21597k01348o76K41218L19210K37536J71714J19610j08764m23260
37287A4595l73876J52054N39576K35104l61528l97423J80999N43656J87268m14127
37277C06298n75934k74010O1130J98817J96811J17229m255o2771n660O8739Q8031
37266A14425J27122K22595K43965Q6232j68916l81944m71717l51629O724L75282
37256a97861M21044J60870l5618q082j3817k10658l32021j43857J40841K21911
37246B752J55041J01680k0834k49180k76942P7646M04940K44596j52796k03540
37236H3363O0395R8461j71281k49798L5843K28682M4114j83456j38311j1683j7119
37225b20790K4266K13726K09965j80400m94839k53748K44726L66021J09831j032
$$ plain form
37297 -119048 -340645 -541993 -542669 -301451 17759 255295 427009 546619 437855 14595
37287 14595 -359281 -207227 332349 567453 205925 -191498 -10499 533157 720425 306298
37277 306298 -269636 -543646 -482516 -283699 -86888 30341 26086 -36685 -42345 26394 114425
37266 114425 241547 464142 708107 794339 625423 243479 -228238 -579867 -573143 -197861
37256 -197861 223183 384053 348435 340353 326536 115878 -216143 -360000 -219159 2752
37246 2752 157793 259473 238639 -10541 -287483 -209837 195103 439699 286903 83363
37236 83363 143758 242219 70938 -178860 -143017 85665 129779 -53677 -191988 -203671 -220790
37225 -220790 -196524 17202 227167 46767 -448072 -701820 -457094 -91073 18758 17726
37215A7726J59702J93503m5199j98931o0441R7366M9315k1746N0460P0843j17904
37204A94694k57588p1169K29528K30201n6618k35217j20109P2762J17466L9970
37194A43920n5431j45835j90842r6847J13272K62425K46165J53948Q3106j0848
37184E03033j64199k52308j50093M4272J17417L1396n5030m2076L107K6663J05759
37173A67941K78568L77783K01128j74689m06345k64779R8474L40480L02774R6045
37163A017380j24385k99793l74191k55028J0412J62834J9065k42961k91374j01775
37153d79816K2559p7318j82078n7509J79752K67608K01789J76281K12879J32727
37143C96874j03272k84975k50466q8509L8609R5598J00401J9541j24565j67648
$$ plain form
37215 17726 177428 370931 325732 126801 66360 163726 213041 191295 241755 312598 194694
37204 194694 -62894 -134063 95465 325666 269048 33831 -86278 -13516 103950 143920
37194 143920 88489 -57346 -248188 -345035 -231763 30662 276827 430775 513881 503033
37184 503033 338834 86526 -63567 -19295 98122 129518 74488 32412 35519 62182 167941
37173 167941 446509 824292 1025420 850731 444386 179607 278081 618561 921335 1017380
37163 1017380 892995 593202 219011 -36017 -25605 137229 156294 -86667 -378041 -479816
37153 -479816 -457257 -534575 -716653 -774162 -594410 -326802 -125013 51268 264147 396874
37143 396874 293602 8627 -241839 -330348 -291739 -196141 -95740 -76199 -200764 -368412
37133c68412J4857L02741M40560L19299N5796j57130j85485r802K19740K30918
37123H63082j01901n30470o35800l07918J20397K87877J98921Q1869Q684j17545
37113a32804k60634k15761N7677L02274K97419J46762P1592Q0650M8242j3379
37103C82038m589K7495l2637j13235n5210O8680L9973j11622j41832m0095n4424
37092c5458j91186j29688J91157L54243J09794j86543j42485N4088L1181r1626
37082c6523M5192L45922L81742R2141j65118k05118j62406r0291R0068K47104
37072E42713J32775j51054k34597n5855R1358R3593J20100J66013J9440k36909
37062D87577k29559O5700K12904J9537j60465m1008J63218J59904n775j87699
$$ plain form
37133 -368412 -353555 -50814 389746 709045 764841 607711 422226 412424 632164 863082
37123 863082 761181 230711 -405089 -713007 -592610 -304733 -105812 -23943 -15259 -132804
37113 -132804 -393438 -609199 -551522 -249248 48171 194933 266525 347175 395417 382038
37103 382038 377449 404944 372307 259072 203862 272542 312515 200893 59061 18966 -35458
37092 -35458 -226644 -356332 -165175 189068 298862 112319 -30166 23922 55103 -36523
37082 -36523 8669 354591 736333 828474 663356 458238 295832 205541 295609 542713
37072 542713 675488 524434 289837 233982 325340 418933 539033 705046 724486 487577
37062 487577 258018 323718 536622 556159 395694 354686 517904 677808 672033 484334
37052D84334l61792m06110j14643L48625M83608J80235p9884L198J12806l6312
37042F14065j85046p5283K4211j80874m41627l92034j37501M8901J99676L48286
37032a77226K10376k79176n55214j78130L88256M28275N6210q5818P8186P9677
37022c4584j40275j40069J56910K84294M1261j92848j27328L7117Q0199J29950
37012I4627L07670M06391K04036j55381l30227k06819p780k143j53874j33210
37002B3290K00451M51353J68405l88283n00407q3332J52381j27042l21716K5633
36992c99267L91352J97727j44608Q962L46674J70677l01328k97096J41970K68586
36982C83649m6029j94836l987M8451j62335k01490J2130N3590j07172j863L66014
$$ plain form
37052 484334 122542 -283568 -398211 -49586 434022 614257 534373 537571 650377 614065
37042 614065 429019 353736 377947 197073 -244554 -636588 -774089 -725188 -525512 -177226
37032 -177226 33150 -246026 -801240 -979370 -591114 -162839 -106629 -192447 -114261 -34584
37022 -34584 -174859 -314928 -158018 126276 167537 -25311 -152639 -115522 -35323 94627
37012 94627 402297 808688 1012724 857343 527116 320297 312517 310374 156500 23290
37002 23290 223741 675094 843499 455216 -45191 -128523 23858 -103184 -424900 -399267
36992 -399267 -7915 189812 45204 54166 400840 571517 270189 -26907 115063 383649
36982 383649 337620 142784 138797 187248 24913 -176577 -164447 -110857 -218029 -219892 146122
36971A46122L92156n8479l61440j75271R3087J27504J45363K29673R0413k07549
36961D21579j55969K30985K61023k48510n43969j60985L15392K61956m5493j07222
36951B28787m5062j34467j77216J7240J37299l7389j36878J19919L36673J28133
36941D37039j76375j32338O2787L6227n4627Q0066K38268J34877m826J19197K64634
36930A004929P0630k82885m10526l40378k62288o6528L09669M82059J53813l03578
36920C54917l61090r1841R3522J19478J45596J38618L2638j2142O9205M0290j57938
36909C71253j96900Q850N2032j67155j00807M28887O44687Q758p12996n15052
36899a78443K88975N94200J81405j91874j40219m7335j54775j78003N2953K72733
$$ plain form
36971 146122 538278 479799 118359 -56912 36175 163679 309042 538715 629128 421579
36961 421579 265610 496595 757618 509108 -34861 -195846 119546 381502 336009 228787
36951 228787 183725 49258 -127958 -110718 26581 -10808 -147686 -27767 308906 437039
36941 437039 260664 128326 191113 227340 172713 252779 491047 625924 621098 740295 1004929
36930 1004929 1075559 792674 382148 41770 -220518 -287046 22623 504682 658495 354917
36920 354917 -6173 -98014 -4492 114986 260582 399200 431838 419696 488901 529191 371253
36909 371253 174353 183203 235235 68080 -32727 396160 1040847 1049605 336609 -178443
36899 -178443 110532 704732 886137 694263 554044 506709 351934 173931 226884 499617
36889D99617K34199K512k27658k63720l87L23265K41212k38056m64125p8577L82394
36878D10676L13997n7642j79232m5872N8936J74476L46188K33056k61873n22757
36868D69953j37258L00383J28119k50671j15394K72874J89436k19883k58091L6375
36858D15843O4816j48690p9342K01562J54813j56003j81086O2709Q1194r2673
36848C23143l248K50718J65545j50942j22076K27736L23846P5918p1301m584L3247
36837A048002R4931L15035L30513j44801n36817k33868K41669M7314m52918l05945
36827D03115K87341L17230k22611l95727l3481J41897M616J09274L53883R8978
36817A064515m13053l09193K67039L29624j56789k70505J09654K06220k7927R1633
$$ plain form
36889 499617 733816 736328 508670 244950 244563 567828 809040 570984 106859 28282 410676
36878 410676 724673 667031 487799 441927 500863 675339 1021527 1254583 992710 469953
36868 469953 332695 633078 761197 510526 395132 668006 857442 637559 379468 415843
36858 415843 480659 331969 252627 454189 609002 452999 271913 334622 415816 323143
36848 323143 319895 570613 736158 585216 463140 690876 1014722 1090640 1019339 1014755 1048002
36837 1048002 1142933 1457968 1788481 1643680 1106863 872995 1114664 1161978 709060 403115
36827 403115 690456 1007686 785075 389348 355867 497764 502380 611654 965537 1064515
36817 1064515 651462 342269 609308 938932 782143 511638 621292 827512 799585 891218
36807H91218L97313R7370m66942k15973N68752N89411p5127j32856M00219K63214
36797B316599m28877k63338O18243N79845l22500k60731Q52606J064650J57540
36788D314037J44260J249665J345717L83933R51513L062416L544804K678237N354624
36779B3029206J1875980J3853785N241775p432993j2828156r240102m075464j800291
36771A8623740n62579Q29694J327738K920605Q660995J4184579J0175903l568430
36763E2592245j4763235j3938974o120400j827328k743609l198134j210909j06751
36755H682905j125215j645202o25936j09036q62304j125205k63406J92940k74218
36746B845323l27755L60090M39121l83240o99938m6066L38126q1840l02055J10697
$$ plain form
36807 891218 1288531 1385901 918959 702986 1271738 1861149 1786022 1653166 2053385 2316599
36797 2316599 1887722 1624384 2242627 2822472 2499972 2239241 3091847 4156497 4314037
36788 4314037 4458297 5707962 7053679 7437612 8389125 11451541 14996345 17674582 23029206
36779 23029206 34905186 48758971 54000746 46567753 33739597 24499495 20424031 18623740
36771 18623740 18061161 18890855 20218593 23139198 31800193 45984772 56160675 52592245
36763 52592245 37829010 23890036 17769636 15942308 13198699 10000565 8789656 8682905
36755 8682905 7557690 5912488 5286552 5177516 4315212 3190007 2926601 3119541 2845323
36746 2845323 2517568 2877658 3316779 2933539 2233601 2187535 2525661 2443821 2141766 2252463
36736B252463K65865j54270k75930J71027L40468J0139k298M37031M81362J08418
36726C634275L08664J020639Q70813l93628j194150o68467j9651l05074o90200
36717B563221j65148N85913M69145j24567j61817K70415M22013L25970M84811
36708D669956P11549M98997J05092J69413N57664N49602l3353o74415r44921q17238
36698D792346m22064r153J11895p402O4001M33758O66391N68104N38968P52803
36688G489647P32703K63124m2768K77969P31144P38103N81182O94747P35582K53386
36678A2454819l65309n68295o37182j021582j286407q36853j51566q2480l77900
36669G127245j87636L37769L43565q3161k7897N78740Q76315O95731P83307J267884
$$ plain form
36736 2252463 2518328 2364058 2088128 2259155 2599623 2609762 2607464 3044495 3525857 3634275
36726 3634275 3942939 4963578 5834391 5440763 4246613 3578146 3558495 3253421 2563221
36717 2563221 2398073 2983986 3453131 3328564 3166747 3437162 3859175 4185145 4669956
36708 4669956 5381505 5880502 5985594 6155007 6712671 7262273 7228920 6554505 5609584 4792346
36698 4792346 4370282 4361129 4473024 4465622 4529623 4963381 5629772 6197876 6736844 7489647
36688 7489647 8222350 8485474 8442706 8720675 9451819 10189922 10771104 11465851 12201433 12454819
36678 12454819 12089510 11521215 10884033 9862451 8576044 7739191 7587625 7505145 7127245
36669 7127245 6939609 7277378 7620943 7537782 7509885 8088625 8964940 9660671 10443978 11711862
36659A1711862J410012J136545J310823K108524K641877K654278L051506M216153
36651C0241580N373708O231242P585499R669081J1749275J4082724J8085625K3711814
36643A26730548K9449036L6100233M6314949N6806326N5173264L1429310p503509
36636C74500157m0921829n3746086m8620730l7822780k9059751k2841019j8650122
36629A22837840j7022584j6579575j4434443j0375416p212254o374494o129051
36622D4710023m864876l395385k899822k866583k427947j981091k106150k202419
36614B1965750j522218n87879l86026q53926j182055j074477q39073o59779n13325
36605A4346992m62795m69065k64202J46878K88749o2704m35618l76431j20728
$$ plain form
36659 11711862 13121874 14258419 15569242 17677766 20319643 22973921 26025427 30241580
36651 30241580 35615288 41846530 49432029 59101110 70850385 84933109 103018734 126730548
36643 126730548 156179584 192279817 238594766 295401092 350574356 382003666 374500157
36636 374500157 333578328 279832242 231211512 193388732 164328981 141487962 122837840
36629 122837840 105815256 89235681 74801238 64425822 57213568 50839074 44710023
36622 44710023 39845147 36449762 33549940 30683357 28255410 26274319 24168169 21965750
36614 21965750 20443532 19855653 19469627 18615701 17433646 16359169 15520096 14860317 14346992
36605 14346992 13884197 13415132 13150930 13297808 13586557 13523853 13088235 12711804 12591076
36596A2591076p4817j05035J11203M22790M65117K94720K27218K47717P2574l26202
36586A3926361o64713p41996n98754l65479j67455q7597q9503r0427j34246k83194
36576A0702997l74854k22119k3667j34518m25955m11604p6269M2694k35929m21385
36566H419391k28179q4196l42456o25119m91865k14232k72419n22700n11574k80611
36556D846040k06076k76772j72099P5495Q7834k26338n28471n38304l01190o740
36546B753379J61466P6579j74751l06715k11917j24719k07676k64778j19654N2730
36536A633944P3804Q0976J61293P7016k24972k81046J61955N14791J33512n86681
36526A744592o95539q1794M46380M29934K60269K92913K87739O6998M8121O16374
$$ plain form
36596 12591076 12516259 12411224 12522427 12945217 13410334 13705054 13932272 14179989 14252563 13926361
36586 13926361 13261648 12519652 11920898 11555419 11387964 11300367 11210864 11120437 10986191 10702997
36576 10702997 10328143 10106024 10082357 9947839 9521884 9110280 9034011 9076705 8840776 8419391
36566 8419391 8191212 8107016 7764560 7139441 6647576 6433344 6160925 5638225 5126651 4846040
36556 4846040 4639964 4363192 4191093 4266588 4354422 4128084 3599613 3061309 2760119 2753379
36546 2753379 2914845 2991424 2816673 2509958 2298041 2173322 1965646 1700868 1581214 1633944
36536 1633944 1707748 1788724 1950017 2027033 1802061 1521015 1682970 2197761 2331273 1744592
36526 1744592 1049053 967259 1413639 1843573 2103842 2396755 2684494 2751492 2799613 3415987
36516C415987J373293J502662P32328l82192j052549r58739m33456o1417q2655
36507D053262k32770k14392j23484j99016l62962l57820k10929j67931k25974
36498A957984j40699J01527K14671P1076j20721j64713r6692m118P6885M7251
36488A942451j71630m04004l75130j42060n7762k48036m31859l41123l8603K52492
36478a5264L72002K32846j10288l61062k45021Q3898K04409K5644j26012o9066
36468g914r055r0607j27835j348O7163o3022r7515K38094O33779N40306r930l73791
36456F98325j58664K58233K73009j27941l93563j91861J44991J03526k98126n57682
36446b49753l81142o263K24795K88685L01531K14064l0090k35575j69697Q2719
$$ plain form
36516 3415987 4789280 6291942 7024270 6642078 5589529 4630790 4197334 4135917 4053262
36507 4053262 3820492 3606100 3482616 3283600 2920638 2562818 2351889 2183958 1957984
36498 1957984 1817285 1918812 2133483 2204559 2083838 1919125 1822433 1818315 1895200 1942451
36488 1942451 1770821 1366817 991687 849627 791865 543829 111970 -229153 -267756 -15264
36478 -15264 356738 589584 479296 118234 -126787 -42889 161520 187164 61152 -7914
36468 -7914 -16969 -107576 -235411 -236759 -169596 -232618 -330133 -92039 541740 1082046 1072116 698325
36456 698325 539661 797894 1070903 942962 549399 357538 502529 606055 307929 -249753
36446 -249753 -630895 -637158 -412363 -123678 177853 391917 361827 126252 -43445 39274
36436C9274K55101K75154K31021R0110k21309n31082n43138k35596J20487K99206
36426b20772K53172K3955k13288j63752K03770M43703J82082k84709l88633j30222
36416b94694K5725k0057O4290K79353K02973j79219k92920O2853K80773o5142
36406F3935m34754j53314M62247N54808L3487l40126j26989K29827J76882j67475
36396B98528k96612n5381K14850J62568j53655l57579k09285R5916J68285n6649
36386a89014k26981p6321K07817K94122J83405J09961J02811k6336k75216l54290
36376b50042j01650K45329L53770K16075Q3913P1342M5404p4527j40650m0653
36366D08311M6302r4420l05473k38356O5865J79212j5165q2659K28574M70759
$$ plain form
36436 39274 294375 569529 800550 890660 669351 138269 -404869 -640465 -519978 -220772
36426 -220772 32400 56355 -156933 -320685 -116915 326788 508870 224161 -164472 -294694
36416 -294694 -268969 -289026 -224736 54617 257590 78371 -214549 -151696 129077 63935
36406 63935 -370819 -524133 -61886 492922 526409 186283 59294 289121 466003 298528
36396 298528 1916 -53465 161385 323953 170298 -187281 -396566 -300650 -132365 -189014
36386 -189014 -415995 -492316 -284499 9623 193028 302989 405800 379464 104248 -250042
36376 -250042 -351692 -106363 247407 463482 547395 618737 664141 589614 448964 408311
36366 408311 454613 360193 54720 -183636 -117771 61441 46276 -36383 192191 662950
36356F62950J78287l09163l24752N8734J54127k18552m85439k89332J8873Q9739
36346d64528J02902K44288K57571m7057l26772k16036Q6626J88487J16518J22022
36336F4021J79463J20299L820n2845j50676l26534l00086O6856L74167K36064
36326B14549p1765o5541J28721M6414k40101k34402Q0172J85625p1517k26717
36316b54562n855K44675J82635j6295o1577j5321m6273p7310J4349J17382P4566
36305A56414n4234j15458o9085N0496J81335J72635p0834l25648k38740J39002
36295a74117L50714J83973m3485k0002J12823R6805N074M2285J47799J19577k7097
36284G94349j00564k4002J18938K25602K16457O2379j26834j96663j85389k45472
$$ plain form
36356 662950 841237 532074 207322 266056 420183 201631 -283808 -573140 -554267 -464528
36346 -464528 -361626 -117338 140233 93176 -233596 -449632 -363006 -174519 -58001 64021
36336 64021 243484 363783 367603 314758 164082 -162452 -462538 -395682 -21515 214549
36326 214549 142784 77243 205964 252378 12277 -222125 -141953 43672 -27845 -254562
36316 -254562 -260417 -15742 166893 150598 89021 73700 27427 -49883 -35534 81848 156414
36305 156414 102180 -13278 -82363 -31867 149468 322103 251269 -74379 -313119 -174117
36295 -174117 176597 360570 317085 297083 409906 506711 511785 554070 701869 821446 794349
36284 794349 693785 669783 788721 1014323 1230780 1293159 1166325 969662 784273 538801
36274E38801l01558j23254J84176J90051j77072m09029j66090K03300K56660J26688
36264C22673J33158J49715o1570k42193n0000J84969r8636o29591n48118K24076
36254f15517P33176L85207k11254k42390J46052K75207L3401j23870j0498R3385
36244D62899M425j27748j65111j60183j50174q8278j4151k7286o7844L2057K48847
36233e2547L39924J63253j46935l54483l28998q2005K45254M19064K90246k8987
36223D63786k62989k52954o7629J14730J35780n5852l12015l54665r8104J74819
36213e15093J51304p0440j28503M8185J41601l1480k07392p6728K27701L01841
36203a59004K8977k79261k99724o3079J57520J95464J31599J28674K09948K34687
$$ plain form
36274 538801 237243 113989 298165 488216 311144 -97885 -263975 -60675 195985 322673
36264 322673 455831 605546 543976 301783 251783 436752 338116 -291475 -839593 -615517
36254 -615517 117659 502866 291612 49222 195274 470481 503882 380012 369514 462899
36244 462899 467324 339576 174465 14282 -135892 -224170 -238321 -265607 -333451 -301394 -52547
36233 -52547 287377 450630 303695 -50788 -379786 -461791 -216537 202527 492773 463786
36223 463786 200797 -52157 -119786 -5056 130724 74872 -237143 -591808 -689912 -515093
36213 -515093 -363789 -434229 -562732 -514547 -372946 -404426 -611818 -688546 -460845 -159004
36203 -159004 -130027 -409288 -709012 -772091 -614571 -419107 -287508 -158834 51114 285801
36193B85801P6927k02517l85933l06873k2286K35200K87980J81772Q5288M3298
36183B78657n3301k07296k06705L9739K19845P24l66651k68756L36741O92453
36173D65450K59238m57330n78328n7978L71252L22890J62400K23802K75405N2010
36163A038811k02100j35429J10700J40445o2889j59886j9795J18626O4238n1481
36153H41240k485K20978M29666M76016M09962M01193N08632N66390L80653O732
36143D238977l09976m51380m96149m74946l17410j11054j18626l77879n51751
36134A029806l88560r4094m410j11758j97336k28375k83148k40674O3132M45688
36124i729N37162L19179J26666Q7632l4577l27210m59262j74911K37742K84898
$$ plain form
36193 285801 362728 160211 -225722 -532595 -554881 -319681 -31701 150071 235359 278657
36183 278657 225356 18060 -188645 -148906 70939 71663 -294988 -563744 -227003 465450
36173 465450 724688 267358 -310970 -368948 2304 325194 487594 711396 986801 1038811
36163 1038811 836711 701282 811982 952427 889538 729652 709857 828483 892721 841240
36153 841240 838755 1059733 1489399 1965415 2375377 2776570 3285202 3851592 4232245 4238977
36143 4238977 3929001 3477621 2981472 2506526 2189116 2078062 1959436 1581557 1029806
36134 1029806 641246 547152 542742 430984 233648 5273 -277875 -518549 -455417 -9729
36124 -9729 527433 846612 973278 1060910 1026333 699123 239861 64950 302692 587590
36114E87590p8888m26500m27329j81699K8783J04036J33049J65405J31576J801
36104C7824q9528J5755K53400L54579J69487j24582k37678j18112L5685O8655
36094C65485K2014j3813m7264j16269j70121j17025L6148J55371J03257j17315
36084A00468l40298l67348j46858J69556L58243L16001J29001l4550q8726p8592
36074A6897o7902l4113N1677R0114l8401k15309j52222J74177L89937K24368q2575
36063C56648j51934l6475m8598j77376j34543Q5642J83309R8380Q0663J60294
36053D16010P2635j80106k43044m9958K2793j38490j42251J45590K53535n9445
36043I7269k77649J3254L66457K37500o7195J0948K33939K1046m19179l91905
$$ plain form
36114 587590 508702 82202 -345127 -526826 -498043 -394007 -260958 -95553 36023 37824
36104 37824 -51704 -35949 217451 572030 741517 616935 379257 261145 296830 365485
36094 365485 387499 373686 326422 210153 40032 -76993 -40845 114526 217783 100468
36084 100468 -239830 -607178 -754036 -584480 -226237 89764 218765 184215 95489 16897
36074 16897 -51005 -85118 -33441 56673 18272 -197037 -349259 -175082 214855 439223 356648
36063 356648 204714 168239 119641 -57735 -192278 -106636 76673 175053 255716 416010
36053 416010 488645 308539 65495 15537 38330 -100160 -242411 -96821 156714 97269
36043 97269 -180380 -167126 199331 436831 369636 380584 614523 635569 216390 -175515
36033a75515O4858K55088K3163j03986L1161O095k43228k37347J06298K71722
36023a691J14248J05851L26385J80716m60753q02734l68961J91219K09750O6918
36013d39052L39332O37475K88303l55890l67502K63310O12783K53648k13363j80363
36003H38681J72545L47157K46863J48364K59255M76407M49684p1607q11380j087359
35993I68610o13138O0906K40624l3986k18543j29294n7936j53087k23263j44750
35983c03857j2906J22591K82504L35096J31680j53383j93725m139J02921K3736
35973C30518n6186o7362j38120k49638j99516L0681K13911K32752J80522R2850
35963C70412q2198k27453j35374J03757J54089m4328j61332m65J97726J37344
$$ plain form
36033 -175515 -110657 144431 167594 63608 94769 100864 -142364 -379711 -273413 -1691
36023 -1691 112557 218408 544793 725509 264756 -537978 -906939 -715720 -505970 -439052
36013 -439052 -99720 537755 826058 470168 102666 365976 978759 1232407 1019044 838681
36003 838681 1011226 1358383 1605246 1753610 2012865 2489272 2938956 2867349 2055969 968610
35993 968610 355472 416378 657002 623016 404473 275179 217243 64156 -159107 -303857
35983 -303857 -316763 -194172 88332 423428 555108 401725 208000 203861 306782 330518
35973 330518 274332 206970 68850 -180788 -380304 -349623 -135712 97040 277562 370412
35963 370412 288214 60761 -74613 29144 183233 138905 -22427 -22892 174834 312178
35953C12178j23767l18463l13659j61502K9468J60381J96415K01957K17001J40727
35943C40736r6429l16668k82725n2215J08401J20976J31043J82373J64365Q0397
35933C80254N4563N6005o0269k08512j19876J83939L15526O6974k74268l37681
35923E6655j50946o627k3027m3210R3251L06660L24024K80l97770m02720L0557
35912b12873L53264J40204k67933k53028J38234K88025o628k49057o7470K41050
35902A03788K46295M330j69115j88407j49104o6379M7510O3602n4920j12299M0251
35891b34448K60934L30454K34717R1899j6866k8984P7243J47903j0831k75008
35881E77013k82145J8077K36707J33425l7703m375O8124q1601l14655l04948m6358
$$ plain form
35953 312178 188411 -130052 -443711 -605213 -575745 -415364 -218949 -16992 200009 340736
35943 340736 244307 -72361 -355086 -407301 -298900 -177924 -46881 135492 299857 380254
35933 380254 434817 490822 430553 222041 102165 286104 601630 668604 394336 56655
35923 56655 -94291 -100918 -123945 -167155 -73904 232756 556780 557060 159290 -243430 -212873
35912 -212873 140391 280595 12662 -240366 -102132 185893 179265 -69792 -137262 103788
35902 103788 350083 354413 185298 -3109 -152213 -218592 -171082 -107480 -162400 -274699 -234448
35891 -234448 26486 356940 591657 683556 666690 637706 714949 862852 852021 577013
35881 577013 294868 312945 549652 683077 645374 640999 709123 627522 312867 7919 -38439
35870c8439J90215K54853J83116J2041j88012k29260k1562K29822K61624Q0392
35860G34790j24648k50546k87957k27194j33658j42934k26001j70919N4454J91968
35850e82645J18454N8030J44773J40929r7859k49791k4841K95405K82958M8434
35840A33847q470J01770O6186r2423p3885Q9005O5666j42880j79886K0791J11688
35829I1409n2023j87837j10912q049k6299k6552P1598J00352j0000n9831N3987
35818a64157J34795L2827j12050j41015r5487k1078J42724L30298L12349M4719
35808D63925k24143l10336k67396j33367J28939L53861K60149n5936j70844k3053
35798B1799k1510k57534k38032K21469M82240L1318o01284n81083j8886K97227
$$ plain form
35870 -38439 151776 406629 589745 601786 413774 184514 162952 392774 654398 734790
35860 734790 610142 359596 71639 -155555 -289213 -432147 -658148 -829067 -774613 -582645
35850 -582645 -464191 -406161 -261388 -120459 -218318 -468109 -492950 -197545 85413 133847
35840 133847 125377 227147 293333 200910 127025 216030 281696 138816 -41070 -20279 91409
35829 91409 39386 -148451 -259363 -267412 -293711 -320263 -248665 -148313 -158313 -218144 -164157
35818 -164157 -29362 3465 -108585 -249600 -345087 -366165 -223441 106857 419206 463925
35808 463925 239782 -70554 -337950 -471317 -342378 11483 271632 215696 44852 21799
35798 21799 289 -257245 -495277 -273808 208432 239750 -361534 -942617 -961503 -664276
35788f64276J48618L3379J81447K61894J27609P5489J92444J37738j78749l30758
35778a5165r3842J33410j2048k65943k08655P6115K41292K46775K54534K13618
35768E70091m872k36497k14668k6125J2621j32028j83371j7390J74359K04325
35758A46445R9264l6662j37412j28533K7760K09417K28344O9846r9618j52733
35748B26118r5571J7275J10464Q1761o5588j44088k2970J21165K7817k20964k78001
35737b42582m7123J73327J46892K1710M2533J61429J39342q9639l39993m04215
35727d38319k36675M6439K63582L07005K39010J97332J90424R3772j17187k73782
35717B71601k43176j28264j14132j93879j81091K8781L11245M33320K76023m6903
$$ plain form
35788 -664276 -515658 -482279 -300832 -38938 88671 164160 356604 494342 315593 -15165
35778 -15165 -109007 24403 12355 -253588 -462243 -386128 -144836 101939 356473 570091
35768 570091 565219 328722 114054 87929 100550 -31478 -214849 -232239 -57880 146445
35758 146445 245709 209047 71635 -56898 -29138 180279 408623 478469 378851 226118
35748 226118 130547 147822 258286 340047 274459 130371 107401 228566 256383 35419 -242582
35737 -242582 -289705 -116378 30514 52224 94757 256186 395528 305889 -34104 -438319
35727 -438319 -674994 -628555 -364973 -57968 181042 378374 568798 662570 545383 271601
35717 271601 28425 -99839 -213971 -407850 -588941 -560160 -248915 184405 460428 413525
35707D13525k63267j75022J34566L44322J91998k49150n93338m87310K189L84040
35697b97447K64339j39699k39782J09218L72902J39411k19379j35272K06218J55473
35687B15982k72480l38022K07707O29854L25709k48486l40050m5826J3653k01635
35677e3594j69779K11835M35759K26212q6388j74425j40852j54809j38979l7575
35667h2595n821j22979k30332k06995j12170L4212K70454M25399K43236j23087
35657H9322k04261N2381J57323r0934k24758P7456L67944J57746k20596j56664
35647D959J82984J26513l41382n12442r8666L26690K58316l0368n4406J30498
35637g304J69731L2065n1834m3027q2138j51418r2352R7935K50100K58526J39016
$$ plain form
35707 413525 150258 -24764 109802 454124 646122 396972 -196366 -683676 -681487 -297447
35697 -297447 -33108 -172807 -412589 -303371 69531 208942 -10437 -145709 60509 215982
35687 215982 -56498 -394520 -186813 443041 768750 520264 180214 134388 148041 -53594
35677 -53594 -223373 -11538 424221 650433 564045 389620 248768 93959 -45020 -82595
35667 -82595 -88416 -211395 -441727 -648722 -760892 -726680 -456226 -30827 212409 89322
35657 89322 -114939 -62558 94765 3831 -220927 -143471 224473 382219 161623 4959
35647 4959 187943 314456 -26926 -539368 -638034 -311344 -53028 -83396 -137802 -7304
35637 -7304 162427 194492 142658 99631 17493 -133925 -226277 -128342 121758 380284 519300
35626E19300p2753k95246l64068k12443m163Q8859J22867J93317J66010j02690
35616C8990l86873l11979N0960K09798l4646k83807j43316K11325L48480J92330
35606a08738o387j15645j75227j27311J15731L67817L13978n520k09129j36925
35596h7356l6189p4296o3069J17131K02013j7411k52430j27627J84569K10713
35586E6048n7857j55098R2441K96027J50440j00279r9197P5931J22507K1131j3336
35575C88758N8753P9988J8410p47K1337o2943k28909k18163O2363K96252J33918
35564E49017k89196m57671j27446L34096L90269o193l85197l61055n3015J64771
35554b41620J41621J7280o3083q7483o6659J2539R4495P2081n4548j48675j03343
$$ plain form
35626 519300 446547 151301 -212767 -425210 -429373 -340514 -217647 -24330 141680 38990
35616 38990 -347883 -659862 -608902 -399104 -433750 -717557 -860873 -649548 -301068 -108738
35606 -108738 -115125 -230770 -405997 -533308 -417577 -49760 264218 258698 49569 -87356
35596 -87356 -123545 -197841 -260910 -143779 58234 40823 -211607 -339234 -154665 56048
35586 56048 -1809 -156907 -64466 231561 382001 281722 182525 258456 380963 402094 388758
35575 388758 447511 527499 545909 545162 566499 503556 274647 56484 118847 415099 549017
35564 549017 259821 -197850 -325296 8800 399069 392876 7679 -353376 -406391 -241620
35554 -241620 -99999 -82719 -145802 -233285 -299944 -287405 -192910 -120829 -175377 -324052 -427395
35543d27395M7974J93180K30235J17107o6139j45181n6351M3784J8620o720J29979
35532G9093K68961J26693j82852k29495N7959K24064j8819l35521l04648o3657
35522c78222k8951k15483k72406p9877J06748R3958j2861l6406P4585K83516M71303
35511E904M28449Q6209k70320k78591K1265K37995J54939n7641j58591r5188O6893
35500A41323K03244J17442k31298m86352k47841K82415M41275L3906l41803j74858
35490b62547K06580J93938j49131k59194j1884J34463m9993j98431J4445L38896
35480d2858L62371J25477k3865R998J3203j16643k18396j61980m6141k0309p0615
35469a89758p1457M0882K03390K77844J56564j07037k73250j28650K41617M90244
$$ plain form
35543 -427395 -379421 -186241 43994 161101 94962 -50219 -106570 -62786 -44166 -50886 79093
35532 79093 348054 474747 291895 62400 120359 344423 325604 -9917 -314565 -378222
35522 -378222 -407173 -622656 -895062 -974939 -868191 -774233 -787094 -823500 -748915 -465399 5904
35511 5904 434353 520562 250242 -28349 -7084 230911 385850 328209 169618 74430 141323
35500 141323 344567 462009 230711 -255641 -503482 -221067 220208 254114 -87689 -262547
35490 -262547 -55967 137971 -11160 -270354 -282238 -147775 -197768 -396199 -381754 -42858
35480 -42858 319513 444990 421125 431123 444326 327683 109287 -52693 -98834 -119143 -189758
35469 -189758 -261215 -220333 -16943 260901 417465 310428 37178 -91472 150145 640389
35459F40389L69622j4201l47613m24752k71054n6015L2518q2571k55340k11327
35449f20344J12954L94568K71274j56670l92106j70178J95302K46615j1754j80963
35439c11302o1827J10885Q7529j4495N2870K22566J92723p3173k30599n8410J78351
35428I5118J11961j48516j58742J67560L83089J64905j82362j65776J67257L06015
35418G40509K0377l37617l49315m9065K20046K50368Q6586j49290l42772l64859
35408b75032j58377J38888K79499J51524j12506k71786j86605P8986L08978L10104
35398B63673R1714j35901j84771r0995l4314p1769n4520J31752L33313K81558
35388E29740j9326k32001j18431J18142J16043j21332k52909j30124J5032j0390
$$ plain form
35459 640389 1010011 995810 648197 223445 -47609 -103624 -71106 -153677 -409017 -620344
35449 -620344 -507390 -112822 158452 1782 -390324 -560502 -365200 -118585 -130339 -311302
35439 -311302 -373129 -262244 -174715 -189210 -136340 86226 278949 205776 -24823 -83233 95118
35428 95118 207079 58563 -100179 67381 450470 615375 433013 267237 434494 740509
35418 740509 760886 423269 73954 24889 244935 495303 581889 432599 89827 -275032
35408 -275032 -433409 -294521 -15022 136502 23996 -247790 -434395 -355409 -46431 263673
35398 263673 355387 219486 34715 -56280 -90594 -162363 -216883 -85131 248182 529740
35388 529740 510414 278413 159982 278124 394167 272835 19926 -110198 -95166 -105556
35378a05556p4743k4548K8538l5957p4809L9033J09204n8082k37197j12568J43831
35367d02854J11939j54960j90101J01111K79879J14763o2806L7614J98758J26932
35357A60275o5220j33856j16971j42849j23716L0008J45543N4398j01773j16414
35347d10575l8040K1707J32155L00355K72054p1512l84671l14476m5371L0961
35337e07413l5467Q9891L79349M54985J85739j68443l67143l55988j08912K80693
35327a52709M43371J25728l22950l31687O8250L08305J56183l4598q802L7939
35317B89030m9498q9586O345q04k09309l10657q8751K02041K55610J54133R6139
35306B54693L6050r3106j36341k5964j252j66344j76783K04800N63855L67659
$$ plain form
35378 -105556 -180299 -204847 -176309 -212266 -287075 -248042 -138838 -196920 -434117 -546685 -402854
35367 -402854 -290915 -445875 -635976 -534865 -254986 -140223 -203029 -165415 33343 160275
35357 160275 95055 -38801 -155772 -298621 -422337 -392329 -246786 -192388 -294161 -410575
35347 -410575 -448615 -426908 -294753 5602 277656 206144 -178527 -493003 -538374 -507413
35337 -507413 -542880 -452989 -73640 381345 567084 398641 31498 -324490 -433402 -152709
35327 -152709 290662 416390 93440 -238247 -169997 138308 294491 259893 251091 289030
35317 289030 239532 149946 156291 155487 -53822 -364479 -453230 -251189 4421 158554 254693
35306 254693 290743 197637 61296 35332 34080 -132264 -309047 -104247 459608 827267
35296H27267j87403m32384k00992L8270n608j00081m9766l5641j68104j79339
35286d93781J18016M19151L30298m7402k75997j74807N3090J89383J94427P5066
35276C87444j52110l38932k89922l4174J73387J79247Q3651J3265n2283j24707
35266a55134r0630P7641J76302N8320q0018K1179K22516J50134j87547l35381
35256a42618n8730K86194K67874l2415k32487k18524j66156j38572k7731J42024
35246c21141J81413M2963r7601j09712l8994O0657K02314L17058K42893l7742
35236D42108l03799l34828j40164J06614K56835K58620J35196m1142j85906k33328
35226c9794j40351O4007K10092J10949j55967k54736k6785K50838K49087N8642
$$ plain form
35296 827267 639864 207480 6488 44758 39150 -60931 -110697 -146338 -314442 -493781
35286 -493781 -375765 43386 373684 326282 50285 -124522 -71432 117951 312378 387444
35276 387444 235334 -103598 -393520 -427694 -254307 -75060 8591 21856 -30427 -155134
35266 -155134 -245764 -168123 8179 66499 -13519 7660 230176 380310 192763 -142618
35256 -142618 -201348 84846 352720 320305 87818 -130706 -296862 -435434 -463165 -321141
35246 -321141 -139728 -96765 -194366 -304078 -343072 -282415 -80101 236957 479850 442108
35236 442108 138309 -196519 -336683 -230069 26766 285386 420582 379440 193534 -39794
35226 -39794 -180145 -116138 93954 204903 48936 -205800 -232585 18253 267340 325982
35216C25982k289Q1612L8703j81109k82400q4560J89209K09961n9406l57257l91036
35205e12590r3318K78727L51750P1831j91988j56269l3602j36633k88647q9037
35195g99776L48348M75130J59988r4565N4260K91387J98812j23544l12474k83404
35185h5838j85679o5492J03878K20790J61044j5758j55487k04377j87394j19108
35175e33421l7831M041M5339J59938K77571K54500J16848J630j05374k78355l60999
35164d56113j56650J28435J01403j50580j50195J49941K53205j7110k05154m5040
35154e47858Q8026o1140r9776K49551M93515J44248l73786l47890Q8444K39668
35144a26998p855j37956L9401J64358M1971j02868j14385o3821P5443L45358M39038
$$ plain form
35216 325982 323693 405305 444008 262899 -19501 -104061 85148 295109 235703 -121554 -512590
35205 -512590 -605908 -327181 24569 96400 -95588 -251857 -285459 -422092 -710739 -799776
35195 -799776 -451428 23702 183690 89125 143385 434772 633584 510040 197566 -85838
35185 -85838 -271517 -337009 -233131 -12341 148703 132945 -22542 -226919 -414313 -533421
35175 -533421 -571252 -567211 -521872 -361934 -84363 170137 286985 288615 183241 -95114 -456113
35164 -456113 -612763 -484328 -382925 -533505 -683700 -533759 -280554 -297664 -502818 -547858
35154 -547858 -459832 -520972 -620748 -371197 122318 266566 -107220 -455110 -366666 -126998
35144 -126998 -134853 -272809 -233408 -69050 -27079 -129947 -244332 -308153 -232710 112648 551686
35133E51686L3534n28788n51621l0373K93681O1560k12572m3887K72638K24392
35123G0250r7037k12882q96K10329J54242q2118k31070j37623Q4852J56994k0880
35112a05839j85518n5769K30067K97589Q8347j05354j27005j10702j35865j02503
35102c12552r546n988r3883j08360m5585p2786j67854j12016R8791K07208J29437
35091d93134O1250P9202L3870p4352l5750J37215J51327n0257j50481r610R4198
35080b56522j3456r2646L4713J27751l7883k51826k13459K8673K75725M83302
35070H4372N75958L27393k15129n30204k59817K27102L22237o570l02290l14276
35060i1224j70104K146J87413K85299J80620l885k7912J11356J87163O8859j56296
$$ plain form
35133 551686 585220 56432 -495189 -525562 -231881 -170321 -382893 -426780 -154142 70250
35123 70250 -26787 -239669 -240565 -30236 124006 41888 -189182 -326805 -241953 -84959 -105839
35112 -105839 -291357 -347126 -117059 180530 268877 163523 36518 -74184 -210049 -312552
35102 -312552 -322098 -328086 -421969 -530329 -575914 -648700 -816554 -928570 -829779 -622571 -493134
35091 -493134 -431884 -352682 -318812 -393164 -428914 -291699 -140372 -190629 -341110 -350720 -256522
35080 -256522 -269978 -362624 -327911 -200160 -238043 -489869 -703328 -674655 -398930 84372
35070 84372 660330 987723 772594 242390 -17427 209675 531912 525342 223052 -91224
35060 -91224 -261328 -259182 -71769 213530 394150 390265 362353 473709 660872 729731 573435
35049E73435l21605k89512l9675K21605K18872L32p9125Q5706J55995n8835k21367
35038B45826m1756J67768J1775k51058j03876L10517L52724q7154m04969k17175
35028a7378J35055K19607J19785J08928J29555l7490l17905l95976j52016J71567
35018c6268K54845O5889r8238J5230K27030J13040l44709n99467k77694K26743
35008d53599K86742o7839k86451j70911l7190l4149Q2676L65358M34261R2816
34998B11714k71549k27256Q7862K16267K3730j94639j32769J91768M53054L15746
34988F73928j67073n06000l39193N6118J50987m5275p1872J41262J49593j53097
34978a10622k45025J26615M06745R6136l92464l74620K2005J33629j33858k40204
$$ plain form
35049 573435 251830 -37682 -77357 144248 363120 363452 284327 370033 526028 467193 245826
35038 245826 204070 371838 383613 132555 28679 339196 691920 604766 199797 -17378
35028 -17378 117677 337284 457069 565997 695552 658062 340157 -55819 -207835 -36268
35018 -36268 218577 284466 186228 201458 428488 541528 196819 -402648 -680342 -453599
35008 -453599 -166857 -234696 -521147 -692058 -729248 -763397 -680721 -315363 118898 211714
34998 211714 -59835 -287091 -199229 17038 40768 -153871 -286640 -94872 358182 673928
34988 673928 506855 855 -338338 -282220 -131233 -176508 -248380 -107118 42475 -110622
34978 -110622 -355647 -229032 177713 273849 -118615 -493235 -471230 -337601 -471459 -711663
34968g11663J5369J97906L4202j30227O8763M24375M77036J33362k87180m45092
34958b23149k51454J14428L46182K75529M0878j01089q7544l1020J9510P9612
34948A81883O6733j01397k87376k77353j07502J8881Q0994J97440K94677J90381
34938B57361j4410l6367Q4186L1158j75861j32959K28138M09399J14269k59022
34928E05892k66036r6477j37673k57054r4653K04178J82930j22315k00239R7971
34918a83476L11559R6738k70590l23937l979L59401M30759J27332k99325m08890
34908a64408l8563L92229L47225q7820l32574j87817p1032k33753l09061J9606
34898f65968L95458L29636N350l8089J91511J85293j62341l33148k3360L40982
$$ plain form
34968 -711663 -696294 -498388 -464186 -594413 -525650 -101275 375761 509123 221943 -223149
34958 -223149 -474603 -360175 -13993 261536 302414 201325 113781 82761 102271 181883
34948 181883 248616 147219 -140157 -417510 -525012 -506131 -425137 -227697 66980 257361
34938 257361 242951 206584 290770 321928 146067 13108 241246 650645 764914 505892
34928 505892 239856 143379 5706 -251348 -346001 -141823 41107 -81208 -281447 -183476
34918 -183476 128083 224821 -45769 -369706 -373685 -14284 416475 543807 244482 -164408
34908 -164408 -202971 189258 536483 448663 116089 -71728 -142760 -376513 -685574 -665968
34898 -665968 -270510 59126 64476 26387 217898 403191 240850 -92298 -115658 225324
34888B25324K35061j99760l95817j51638J79382K22645M288j87334j58220L5168
34878a90901J79252J19110o5993j30822K6493J94611J16061j34730k31760n7461
34868a76140J43787J52304P2627O6471J4027k46158m78798k76251K55123M79454
34858F446R4147l87501l37068J19780L58699J79316k3453M1395J88055J71901
34848D11717N4045k2922q2182j43057r0434Q6430J72848M7328j04423r8407n6621
34837A74322j67046l23038k65470K3876K99054L53849J86261n7057j70312l5219
34827A9220K00366K27655k0697k43052j78100N3846J83764J60550Q3063l3225
34817D53390j85728k49790j48385r807M2246P2921J18454L2781j99975k79663
$$ plain form
34888 225324 460385 260625 -135192 -286830 -107448 115197 119485 -67849 -226069 -190901
34878 -190901 -11649 107461 41468 -89354 -62861 131750 247811 113081 -118679 -176140
34868 -176140 -32353 119951 192578 259049 273076 26918 -451880 -728131 -473008 6446
34858 6446 100593 -286908 -623976 -504196 -145497 33819 10366 51761 239816 411717
34848 411717 465762 442840 360658 217601 127167 213597 386445 433773 329350 230943 174322
34837 174322 7276 -315762 -581232 -557356 -258302 95547 281808 224751 54439 19220
34827 19220 219586 447241 426544 183492 5392 59238 243002 403552 486615 453390
34817 453390 267662 17872 -130513 -140320 -98074 -25153 93301 126082 -73893 -353556
34807c53556l9358J96922R3138j32545q6135J02872K4997k32934j97103J50139
34797d73563L00312P7466p3778J37956L67914K29732r8249k12480p8382N9654
34787B36582J09327J56410K14924J92466L1838k10503l48227j83523J69630K28236
34777E97160k36536o68886l60813M36714P15120J44424m28994k47946K95583L88176
34767F34002P667k43078j28455O4723J43008J61269Q1311j79738m21099l49380
34757b29770n5704J05281M9265j2989k023j7805l0267P0970J66451M7444j75161
34746h4308k07936q1301q2585j95904r1437K58456M39831K35421m0421p2889j6742
34735F0185j32581k71765j03913L10188N41494L58424j2572k24835j97985r0309
$$ plain form
34807 -353556 -392914 -195992 -102854 -235399 -321534 -218662 -193665 -426599 -623702 -473563
34797 -473563 -173251 -95785 -169563 -31607 336307 566039 467790 255310 176928 236582
34787 236582 345909 502319 717243 909709 941547 731044 382817 199294 368924 597160
34777 597160 360624 -308262 -669075 -232361 482759 627183 198189 -49757 245826 634002
34767 634002 641669 398591 270136 334859 477867 639136 720447 540709 119610 -229770
34757 -229770 -285474 -180193 -130928 -143917 -145940 -163745 -194012 -123042 43409 90853 -84308
34746 -84308 -292244 -373545 -456130 -652034 -743471 -485015 -45184 190237 149816 76927 60185
34735 60185 -72396 -344161 -448074 -137886 403608 762032 749460 524625 326640 236331
34725B36331l3910k1043k868J8297K3061J9202m868r7106k24148k19870l935K12874
34713i7983J60736o9932j13009J20012K76805R5288j96612k38602n7582M5701
34703g5178l1836j16740o5351Q5040K23874K59128J57345L052p1554p9995j48051
34692A39734k40377j65119O3956J70044N0816n6761j1356J1087o2338J852K35260
34681A36798K32408j73679m71814k14867K35029K90505O3244L1873J48621M6688
34671C24806j43359k3791K20370Q8342k43816j50043K56959J92758m21834p07469
34661f07077k44746K71288K30818O295R1094K24290N4748r1742J30303L11276
34651C76547k6301n00912m57924m6996J18705K2808J05743L24037K31465j21607
$$ plain form
34725 236331 202421 181378 178510 196807 219868 239070 234202 137096 -87052 -306922 -310857 -97983
34713 -97983 62753 -7179 -120188 -176 276629 371917 175305 -63297 -120879 -75178
34703 -75178 -107014 -223754 -289105 -204065 19809 278937 436282 439334 367780 287785 139734
34692 139734 -100643 -265762 -201806 -31762 19054 -37707 -49063 -37976 -100314 -98462 136798
34681 136798 369206 195527 -276287 -491154 -256125 34380 97624 129497 278118 324806
34671 324806 181447 157656 378026 466368 222552 72509 329468 522226 100392 -607077
34661 -607077 -851823 -580535 -349717 -343422 -252328 -28038 26710 -65032 65271 376547
34651 376547 350246 -150666 -608590 -655586 -536881 -514073 -408330 -84293 147172 25565
34641B5565k10255N8906K28095J09990J2887O7971J7408j91765k43679o4379m735
34630a93991j98075k87048m6494K28268K46863J76773K42495K83666R3272j33144
34620D12585r6765Q8294Q5047j04799j66308j0399P8303j04399l60041l62380
34610e40862j01208J09775L8796j77244k18307L453K35073K18160R279j27923
34600e51008n5617J31256K58230K11156n829k25863k12708N7870K95096K37024
34590A39607N853q3468J5285O8677j9775p4321K0537J18686N9636q5314j49221
34579A6182j08255n6412m0962l7481l3512n2103j07444j65343j42372J7642K26945
34568d83115K86852J21098j00298j76020j21841o7353r650J30956K78537K56268
$$ plain form
34641 25565 -184690 -125784 102311 212301 225188 293159 310567 118802 -124877 -189256 -193991
34630 -193991 -392066 -679114 -725608 -497340 -250477 -73704 168791 452457 545729 412585
34620 412585 315820 404114 489161 384362 218054 207655 285958 181559 -178482 -540862
34610 -540862 -642070 -532295 -493499 -670743 -889050 -885597 -650524 -432364 -423085 -551008
34600 -551008 -606625 -475369 -217139 -5983 -11812 -237675 -450383 -392513 -97417 139607
34590 139607 145460 61992 77277 145954 126179 51858 72395 191081 250717 165403 16182
34579 16182 -92073 -148485 -189447 -226928 -260440 -312543 -419987 -585330 -727702 -710060 -483115
34568 -483115 -196263 -75165 -175463 -351483 -473324 -540677 -550327 -419371 -140834 115434
34558A15434O2089j15232j51789p7584N0946J55062P3813k19387l90525j03405
34548f00578L79802M04894j23937m83702j40250M23199L87532j87157m65359q5881
34538d91437L61325K85388o9473j25559J16346J89832k2233j44336K0011J79209
34528B99073O9811j31754j58689q7623j16797j60362k0102K01271K31961Q0176
34518B06965k2934o1537j99954l28023j23306L37848N22779K02594j87701k27838
34508A18893j02088j31536j44348J55116M91683L26388k53168n62014k73658J88916
34498a85816L30517J77967J9822m4146n9833k1015N8540P6144O144l5211O861
34487C29974L8730N380l4815o9914j41334j60344J489J93033R5813k41704l60534
$$ plain form
34558 115434 177523 62291 -89498 -167082 -116136 38926 112739 -106648 -497173 -600578
34548 -600578 -220776 184118 60181 -423521 -563771 -140572 246960 59803 -405556 -491437
34538 -491437 -130112 155276 85803 -39756 76590 266422 244189 99853 119864 299073
34528 299073 368884 237130 78441 -9182 -125979 -286341 -306443 -105172 126789 206965
34518 206965 184031 122494 -77460 -405483 -528789 -190941 331838 534432 346731 118893
34508 118893 16805 -114731 -259079 -103963 387720 714108 460940 -101074 -374732 -185816
34498 -185816 144701 322668 342490 298344 238511 217496 276036 352180 358324 323113 329974
34487 329974 368704 374084 339269 269355 128021 -32323 -30834 162199 258012 16308 -344226
34476c44226p0077K10138P4539k40069k30299J09682L28845K10766J3253J6176
34466G8728J63210K19858O6373k14280l94933k72433P9878K98422J43042j65206
34456B659k35860m5037J00579P8722P9472J70676J05996k37878n20304l32886
34446h33861J97333N03454K79804j53116k74063P524K92425K14978j24476l14879
34436b04877j41851J81180L01900J36203r7093j77761r4205M1217J53056K12269
34426C10038J76625L3885j16398j32005j0414Q0930J6233j13770j29560k0818
34416I4746M9326k965o6814k2539Q7479J50131J24985J1761j89462l68068l03696
34405d35116M3711L66697L46481O4355j48557j78381j69306j68922p2783P5721
$$ plain form
34476 -344226 -414303 -204165 -129626 -369695 -599994 -490312 -161467 49299 62552 78728
34466 78728 241938 461796 528169 313889 -81044 -353477 -273599 24823 167865 2659
34456 2659 -233201 -278238 -177659 -98937 -19465 151211 257207 19329 -500975 -833861
34446 -833861 -636528 -133074 146730 -6386 -280449 -272925 19500 234478 110002 -204877
34436 -204877 -346728 -165548 136352 272555 175462 -2299 -96504 -55287 97769 310038
34426 310038 486663 520548 404150 272145 261731 342661 358894 245124 115564 94746
34416 94746 144072 141107 74293 51754 139233 289364 414349 426110 236648 -131420 -435116
34405 -435116 -391405 -24708 321773 386128 237571 59190 -110116 -279038 -351821 -276100
34395b76100Q7711p747L5637K13920J98122r0640k37113L8220L65894K49644j60092
34384D17456k84896K2986L15496K31569p8548k83752k78400j47442m41M4628p2626
34373a13970k13213j50850J05916K87611K21070L2009p0008l4404O1119J17911
34363B43191M5963j44801k53264q5424K17831K81653J729k88953k68722j0238
34353b61035K25341L41411L58102K19824r3976l86256m13061j83705Q4691K42243
34343A33579K74759J87205P706j47498j80335j36383r7288m2363M2295N6398j9289
34332G8786J9351K77563M45954J71030l35302m84297j36736K00297J27371j32865
34322B31152j99645j05261p2087n1389J07402K56496J54940o3368o2151J26160
$$ plain form
34395 -276100 -188389 -196136 -160499 53421 251543 160903 -76210 -37990 327904 577548 417456
34384 417456 132560 155546 471042 702611 624063 340311 61911 -85531 -85972 -41344 -113970
34373 -113970 -327183 -478033 -372117 -84506 136564 168573 98565 64161 125280 243191
34363 243191 289154 144353 -108911 -194335 23496 305149 306878 17925 -250797 -261035
34353 -261035 -35694 305717 663819 883643 789667 403411 -9650 -193355 -108664 133579
34343 133579 408338 595543 603249 455751 275416 139033 41745 -618 41677 98075 78786
34332 78786 98137 375700 821654 992684 657382 173085 36349 236646 364017 231152
34322 231152 31507 -73754 -145841 -197230 -89828 166668 321608 258240 196089 322249
34312C22249J38366j12051k95302k00801r352Q5658J46946K22522J69191m2090
34302D25336j72381j03994p0493k26470l06718o7007K21469J60893r8150q2166
34292c19681K06882K78015k6929k58241r6152J34603J7308k66812k26104J65156
34282c91955M09498J82888k47334l82900p4409L53185M69697J82509j80484k50140
34272G0555m6498R4415J9517m0995J17394L04220K12460r4016k69515j97091j01857
34261F8589j38813j69116n1998R3589R1046m007j0353Q0784J03184k1225j75123
34250a33443k13829j26239o18Q9461J30068J43442J44908J09815l28j51848k20818
34239b29429j27876L6999J14220Q5829O9308Q7003K287k20997l52062j73205J60601
$$ plain form
34312 322249 460615 348564 53262 -147539 -156891 -71233 75713 298235 467426 425336
34302 425336 252955 148961 78468 -148002 -454720 -521727 -300258 -139365 -237515 -319681
34292 -319681 -112799 165216 138287 -119954 -216106 -81503 -64195 -331007 -557111 -391955
34282 -391955 17543 200431 -46903 -429803 -504212 -151027 318670 501179 320695 70555
34272 70555 24057 118472 137989 96994 214388 518608 731068 637052 367537 170446 68589
34261 68589 -70224 -239340 -291338 -197749 -106703 -110710 -121063 -40279 62905 41680 -133443
34250 -133443 -347272 -473511 -474129 -384668 -254600 -111158 33750 143565 143237 -8611 -229429
34239 -229429 -357305 -320306 -206086 -120257 -50949 36054 38341 -182656 -534718 -707923 -547322
34228e47322K76320R1557p7636J1383J91515J80816J4079n4959L0216P1699m1050
34217A46618j65348j33089K6154J62181J90612J39018P7624M3519K341r6871k00525
34206A92234j71685r216Q1094j9074j10259L3194K47364J62361k20870m73267
34196b88124l25595L90J75478J89081K07360K42781J90540M8370q8168j50826
34186B01287j03405N1741J88484J49794O219J582J43113J28659j49914l41342
34176B76218j37818K30384L29747J30654p9351k03340l50361m62148l52633q8266
34166g06914O2564O3386J29044K95958L36454J51636q8656k49839l39160k66461
34156f11988J03457N40924N08698j28053p71818p63389j68057L73819M21995J10595
$$ plain form
34228 -547322 -271002 -179445 -257081 -245698 -54183 126633 140712 85753 115969 187668 146618
34217 146618 -18730 -151819 -125665 36516 227128 366146 443770 487289 489630 392759 192234
34206 192234 20549 11333 92427 73353 -36906 -3712 243652 406013 185143 -288124
34196 -288124 -613719 -613329 -437851 -248770 -41410 201371 391911 440281 352113 201287
34186 201287 97882 149623 338107 487901 494120 495702 638815 767474 617560 276218
34176 276218 138400 368784 698531 829185 749834 546494 196133 -266015 -618648 -706914
34166 -706914 -644350 -580964 -451920 -155962 180492 332128 243472 -6367 -345527 -611988
34156 -611988 -508531 32393 541091 413038 -358780 -1122169 -1290226 -916407 -494412 -383817
34146c83817j50941j24010R0977K05666P3569j21344j03059J00115K01305J01831
34136a09708J6235P2511R2913n6817j80609n7107J82112K47379J17664J3761M0296
34125C78630Q9132M6960q6220k41544l10298k02968P345J08773K9190n2115M448
34114b28667P8858L5862m579J20258K89274K58508M9520r3991p7897l1543m4580
34103C51023o3622l8792J9372J01336J51291L3317k61253m59384k90984J27573
34093c30123M15380L76578J18930j82639l85115l30101m812K88208K24471r7159
34083I3618k89267k15486p3331K0639J43713K53863J75827k7023p0616O2740P4683
34072A49360q7952q9684J72706K97350M0454k14353p3764J84334P2754k65845
$$ plain form
34146 -383817 -534758 -658768 -567791 -362125 -288556 -409900 -512959 -412844 -211539 -109708
34136 -109708 -93473 -20962 71951 15134 -165475 -222582 -40470 206909 324573 338334 378630
34125 378630 467762 514722 428502 186958 -123340 -326308 -318963 -210190 -181000 -233115 -228667
34114 -228667 -149809 -113947 -118526 1732 291006 549514 599034 505043 427146 395603 351023
34103 351023 287401 248609 267981 369317 520608 553925 292672 -166712 -457696 -330123
34093 -330123 85257 461835 580765 398126 13011 -317090 -321902 -33694 190777 93618
34083 93618 -195649 -411135 -484466 -463827 -320114 -66251 109576 82553 11937 74677 149360
34072 149360 61408 -28276 144430 441780 482234 267881 194117 378451 451205 185360
34062A85360k81061Q1909L08643J30388j38259j58508N147J45112K05826J82832
34052F67389O4205j0436J47965M24103M94236L74805M71367R17405J310431J378494
34042F239964J450276J827736K080639J570376M72952l92466p42000j136107j906078
34033I465292k442730k053682j087371n50699p55019r88591o28302P57J91058
34024A150713j30780m08527k98550l7207N3792K0084N7986J32330O8002j16050
34014D91793k11161j21978K5490Q2464L3343o4973j66199k16396j61687l2155
34004c41459N8520N2287K5552P1950J51339J25173n9749k67334k77261n027L76088
33993h9921N56349L76703K296k28204j47533P2112J22295r0972l47281l75078
$$ plain form
34062 185360 -95701 -13792 294851 425239 286980 128472 133619 278731 484557 667389
34052 667389 731594 721158 869123 1293226 1787462 2162267 2633634 3551039 4861470 6239964
34042 6239964 7690240 9517976 11598615 13168991 13641943 13249477 12507477 11371370 9465292
34033 9465292 7022562 4968880 3881509 3330810 2575791 1587200 958898 959655 1150713
34024 1150713 1019933 611406 312856 275649 329441 349525 407511 539841 607843 491793
34014 491793 280632 158654 184144 266608 299951 234978 68779 -147617 -309304 -341459
34004 -341459 -282939 -230652 -205100 -133150 18189 143362 83613 -183721 -460982 -466009 -89921
33993 -89921 466428 843131 845427 617223 469690 541802 664097 573125 225844 -149234
33983a49234j62027O0845J18802O6519K7563m711q3504j31355m1067Q6611L5766
33972a75792j65385k16465K9307L33834M05127K49690L0303j99201l82089l06386
33962c97057R6792M51080L29999j00042k51267M1607K85778P8647l18135m06191
33952a88789j35375J42899J91352N6838j28540k40861j62677O8635K00833P3928
33942a21757j18058j02767N1234P0902n3416o4918J07243K25256J38563O498O145
33931A44925O4551L4088n4643p5747j1595O3713J02619P9588k9336j66339j95598
33920d3774q0769M8351R5358J29981J98762J52118j36231m65929m76210j29505
33910g07848J96699J88243k0060q5052M8933J13087m1630j95392q4000J79409
$$ plain form
33983 -149234 -311261 -250416 -131614 -65095 -37532 -42243 -125747 -257102 -298169 -211558 -175792
33972 -175792 -341177 -557642 -528335 -194501 210626 460316 490619 291418 -90671 -397057
33962 -397057 -300265 150815 480814 380772 129505 171112 456890 535537 217402 -188789
33952 -188789 -324164 -181265 10087 66925 -61615 -302476 -465153 -396518 -195685 -121757
33942 -121757 -239815 -342582 -291348 -220446 -273862 -338780 -231537 -6281 132282 138780 144925
33931 144925 209476 243564 188921 113174 101579 165292 267911 347499 318163 151824 -43774
33920 -43774 -124543 -76192 19166 149147 347909 500027 363796 -102133 -578343 -707848
33910 -707848 -511149 -322906 -342966 -428018 -379085 -265998 -307628 -503020 -587020 -407611
33900d07611K29851k3636k36191r8530K17605K86181O319k80290k57778l228J96144
33889c71164K13982J33517M0856n8777j44900j45599l2258J27198K39217K58937
33879B61009J77329m126k33307l76671l13642r0565Q7788Q7798J9001P7624K49761
33868e8001L14440J57750q0988k34240k93806k69827p6408K45910L87991J38884
33858B31705k29441k70551J1029K01360J22850K4540N9508K3826j83303k64694
33848b73171j3235K49206J23157k21746k91119q152K39819K32602J41922J05852
33838B85135K1227j25428j15899J19559K95034J62366j27868k69188k01083o6262
33828b2407M5518R5860R197j81196k42446m2921J86287J65431K2787R0924L01602
$$ plain form
33900 -407611 -177760 -201396 -437587 -536117 -318512 -32331 -26012 -306302 -564080 -567308 -371164
33889 -371164 -157182 -23665 17191 -41586 -186486 -332085 -364343 -237145 2072 261009
33879 261009 438338 434212 200905 -175766 -489408 -579973 -492185 -404387 -385386 -307762 -58001
33868 -58001 256439 414189 333201 98961 -194845 -464672 -541080 -295170 92821 231705
33858 231705 2264 -268287 -257258 -55898 66952 91492 151000 174826 -8477 -273171
33848 -273171 -286406 -37200 85957 -135789 -426908 -435060 -195241 37361 179283 285135
33838 285135 306362 180934 65035 184594 479628 641994 514126 244938 43855 -22407
33828 -22407 23111 118971 128168 -53028 -295474 -338395 -152108 13323 36110 127034 428636
33817D28636K10702k73096o03974l14443K87557N03053J66833k02891j57992J48775
33807A93160K93247J44019r3194k13345j98734j55014j93127l07446l10233k5441
33797h66108L80838M78518J37463k23015j97699K2596n571k37042k29598P8411
33787f61207K38510M4147j39267l4986P3887j01834k88715j10646K38763L22090
33777d19258J92085K17248L58630K57864l4358r2699Q5347J1049l99244n48478
33767c71814j04173L99300L57396j3897j20621P1980J48510K9571J3063J33931
33757E43246Q7520j79039l25041j74729J9537J5367q5798j00308m6045l050M4296
33746b04044P6907K59j21279m1745K76051M80769K68682j72706l94470k52774
$$ plain form
33817 428636 639338 366242 -237732 -552175 -264618 238435 405268 202377 44385 193160
33807 193160 486407 630426 537232 323887 125153 -29861 -222988 -530434 -840667 -866108
33797 -866108 -485270 -6752 130711 -92304 -290003 -267407 -272978 -510020 -739618 -661207
33787 -661207 -422697 -378550 -517817 -552803 -478916 -580750 -869465 -980111 -741348 -419258
33777 -419258 -227173 -9925 348705 606569 572211 479512 564859 575908 176664 -371814
33767 -371814 -475987 -76687 280709 266812 146191 218171 366681 396252 409315 543246
33757 543246 630766 451727 126686 -48043 -28506 -13139 -98937 -199245 -245290 -248340 -204044
33746 -204044 -127137 -126878 -248157 -289902 -13851 466918 735600 562894 168424 -84350
33736h4350k5551j5692k19010l73285k24048K23683O39642O32914J79703k98857
33726D35149l91265j32931J27135J76695Q1679l1673j10823j09382M27J14056
33716A59067P8875n7216o6898J00724J76308n4125l74062l73354j9576K59257
33706a71000J33094k05387l30643j39144J14191K50769L42826M11158K65839j45844
33696E25859m67122l19310J39157L67870J53697j55941j99853o4278k5211r5896
33686a41028q8555K9790J07824P1146l994m9290o6087n4143j6113Q162K7321J33246
33674d1721L14027L54680J23734j53627j65862J6446M2273j68863l06884j64454
33664a50251O4551J17065L2034J3447J07049J80774J10259j15801l61851l90911
$$ plain form
33736 -84350 -109901 -125593 -344603 -717888 -941936 -718253 -78611 554303 734006 435149
33726 435149 43884 -89047 38088 214783 296462 264789 153966 44584 45011 159067
33716 159067 237942 180726 113828 214552 390860 336735 -37327 -410681 -430257 -171000
33706 -171000 -37906 -243293 -573936 -713080 -598889 -348120 -5294 405864 671703 525859
33696 525859 58737 -260573 -121416 246454 400151 244210 44357 -19921 -45132 -141028
33686 -141028 -229583 -199793 -91969 -20823 -24817 -74107 -140194 -194337 -210450 -202288 -174967 -41721
33674 -41721 272306 626986 750720 597093 431231 447677 489950 321087 14203 -150251
33664 -150251 -85700 31365 63399 76846 183895 364669 474928 359127 -2724 -393635
33654c93635j20721J65980J28494j04760q2180K20647K73666j41692m47080j02621
33644f03902M86341N17357J332k81636O533L10940J14940l01592l72409o3052
33634a85148K15535K31087R9801j0702m4747j183P7023J09731R4734J17871J63870
33623H67872P3592j91853m02800l27377l4039K00623J99413J1192j82356k27582
33613a3315j41008q1493q7778L6991L62909N24344J74550l51558l79648O9810
33603A13804K42568j58500m63517j33990L31856K44886j11699j6225L93240L42626
33593G85049k10496m65604j28339J31590j09251k88298J19958O07481M09553k27035
$$ plain form
33654 -393635 -514356 -348376 -219882 -324642 -406822 -186175 87491 -54201 -501281 -603902
33644 -603902 -117561 399796 401128 119492 126025 436965 551905 250313 -122096 -185148
33634 -185148 30387 261474 361275 350573 305826 304643 381666 491397 586131 704002 867872
33623 867872 941464 749611 346811 19434 -14605 186018 385431 396623 214267 -13315
33613 -13315 -154323 -235816 -323594 -286603 76306 600650 775200 423642 43994 113804
33603 113804 356372 197872 -265645 -399635 -67779 177107 65408 49183 442423 785049
33593 785049 574553 108949 -19390 112200 2949 -285349 -165391 442090 851643 624608
$$ [...]
##END NTUPLES=NMR SPECTRUM
##END=
