##TITLE=31Pdec_ABDP3105
 CDCl3, 24 sc
 1.06.2021
##JCAMPDX= 6.0         $$ Bruker NMR JCAMP-DX V2.0
##DATA TYPE= NMR SPECTRUM
##DATA CLASS= NTUPLES
##ORIGIN= UXNMR, Bruker Analytische Messtechnik GmbH
##OWNER= root
$$ XWIN-NMR		Version 3.5
$$ Tue Jun  1 11:45:09 2021 Russian Standard Time (UT+4h)  she@DPX200
##.OBSERVE FREQUENCY= 81.013821
##.OBSERVE NUCLEUS= ^31P
##.ACQUISITION MODE= SIMULTANEOUS
##.ACQUISITION SCHEME= undefined
##.AVERAGES= 24
##.DIGITISER RES= 16
##SPECTROMETER/DATA SYSTEM= spect
##.PULSE SEQUENCE= zgpg30
##.SOLVENT NAME= CDCl3
##.SHIFT REFERENCE= (INTERNAL, CDCl3, 0, 248.564)
##AUDIT TRAIL= $$ (NUMBER, WHEN, WHO, WHERE, WHAT)
$$ ##TITLE= Audit trail, XWIN-NMR		Version 3.5
$$ ##JCAMPDX= 5.01
$$ ##ORIGIN= Bruker BioSpin GmbH
$$ ##OWNER= she
$$ F:/spectra/data/she/nmr/P31/1/pdata/1/auditp.txt
$$ ##AUDIT TRAIL=  $$ (NUMBER, WHEN, WHO, WHERE, WHAT)
(   1,<2021-06-01 11:44:03.04 +0400>,<she>,<DPX200>,
      <created by zg, POWCHK disabled, PULCHK disabled
       configuration hash MD5:
       00 E9 B6 7A A2 85 ED C7 34 08 36 98 17 FE 4E 26
       data hash MD5: 32K
       48 84 5A 35 0E B0 E2 95 D1 F4 26 A8 11 F3 21 18>)
(   2,<2021-06-01 11:44:06.68 +0400>,<she>,<DPX200>,
      <Start of raw data processing
       efp BC_mod = 2 LB = 1 FT_mod = 6 PKNL = 1 PHC0 = -5831.497 PHC1 = 14.87271 SI = 64K 
       data hash MD5: 64K
       FD E1 17 3F 56 92 E8 D3 9B 86 20 E9 80 C6 99 34>)
(   3,<2021-06-01 11:44:37.46 +0400>,<she>,<DPX200>,
      <pk PHC0 = 76.30384 PHC1 = -178.4 
       data hash MD5: 64K
       9C D1 0B D1 F7 9D FD 24 1A 7C 24 04 DA A3 C5 E5>)
(   4,<2021-06-01 11:44:41.09 +0400>,<she>,<DPX200>,
      <abs ABSG = 5 
       data hash MD5: 64K
       E0 BF 8D 01 4D F3 6F 01 41 AF 71 AF 46 72 52 0C>)
$$ ##END=
$$ 
$$ hash MD5
$$ 3E D9 C5 6C 62 B5 C8 33 B1 26 A7 8F 9C BC 18 F4
##$RELAX= 
##$RELAX= 
##$RELAX= 
##$RELAX= 
##$RELAX= 
##$RELAX= 
##$RELAX= 
##$RELAX= 
$$ Bruker specific parameters
$$ --------------------------
##$DU= <F:/spectra>
##$EXPNO= 1
##$NAME= <P31>
##$PROCNO= 1
##$TYPE= <nmr>
##$USER= <she>
##$AMP= (0..31)
100 100 100 100 100 100 100 100 100 100 100 100 100 100 100 100 100 100 
100 100 100 100 100 100 100 100 100 100 100 100 100 100 
##$AQSEQ= 0
##$AQ_mod= 1
##$AUNM= <au_zg>
##$AUTOPOS= <>
##$BF1= 81.014009
##$BF2= 200.13
##$BF3= 200.13
##$BF4= 200.13
##$BF5= 200.13
##$BF6= 200.13
##$BF7= 200.13
##$BF8= 200.13
##$BYTORDA= 1
##$CFDGTYP= 0
##$CFRGTYP= 5
##$CHEMSTR= <none>
##$CNST= (0..31)
1 1 145 1 1 1 1 1 1 1 1 1 1 1 1 1 1 1 1 1 1 1 1 1 1 1 1 1 1 1 1 1 
##$CPDPRG= <waltz16>
##$CPDPRG1= <>
##$CPDPRG2= <waltz16>
##$CPDPRG3= <>
##$CPDPRG4= <mlev>
##$CPDPRG5= <mlev>
##$CPDPRG6= <mlev>
##$CPDPRG7= <mlev>
##$CPDPRG8= <mlev>
##$CPDPRGB= <>
##$CPDPRGT= <>
##$D= (0..31)
0 1 0 0 0 0 0 0 0 0 0 0.03 2e-05 3e-06 0 0 0 0 0 0 0 0 0 0 0 0 0 0 0 0 
0 0 
##$DATE= 1622533442
##$DBL= (0..7)
120 120 120 11 120 120 24 19 
##$DBP= (0..7)
150 150 150 150 150 150 150 150 
##$DBP07= 0
##$DBPNAM0= <>
##$DBPNAM1= <>
##$DBPNAM2= <>
$$ [...]
##$SUBNAM3= <"">
##$SUBNAM4= <"">
##$SUBNAM5= <"">
##$SUBNAM6= <"">
##$SUBNAM7= <"">
##$SUBNAM8= <"">
##$SUBNAM9= <"">
##$SW= 501.771253377433
##$SWIBOX= (0..15)
0 1 3 0 0 0 0 0 0 0 0 0 0 0 0 0 
##$SW_h= 40650.406504065
##$TD= 32768
##$TD0= 1
##$TE= 0
##$TE2= 300
##$TE3= 300
##$TEG= 300
##$TL= (0..7)
0 120 53 12 22 120 120 120 
##$TP= (0..7)
150 150 150 150 150 150 150 150 
##$TP07= 0
##$TPNAME0= <>
##$TPNAME1= <>
##$TPNAME2= <>
##$TPNAME3= <>
##$TPNAME4= <>
##$TPNAME5= <>
##$TPNAME6= <>
##$TPNAME7= <>
##$TPOAL= (0..7)
0.5 0.5 0.5 0.5 0.5 0.5 0.5 0.5 
##$TPOFFS= (0..7)
0 0 0 0 0 0 0 0 
##$TUNHIN= 0
##$TUNHOUT= 0
##$TUNXOUT= 0
##$USERA1= <user>
##$USERA2= <user>
##$USERA3= <user>
##$USERA4= <user>
##$USERA5= <user>
##$V9= 5
##$VALIST= <valist>
##$VCLIST= <CCCCCCCCCCCCCCC>
##$VD= 0
##$VDLIST= <DDDDDDDDDDDDDDD>
##$VPLIST= <PPPPPPPPPPPPPPP>
##$VTLIST= <TTTTTTTTTTTTTTT>
##$WBST= 1024
##$WBSW= 4
##$XGAIN= (0..3)
0 0 0 0 
##$XL= 0
##$YL= 0
##$YMAX_a= 30748
##$YMIN_a= -31591
##$ZGOPTNS= <>
##$ZL1= 120
##$ZL2= 120
##$ZL3= 120
##$ZL4= 120
##$ABSF1= 248.5645
##$ABSF2= -253.2056
##$ABSG= 5
##$ABSL= 3
##$ALPHA= 0
##$AQORDER= 0
##$ASSFAC= 0
##$ASSFACI= 0
##$ASSFACX= 0
##$ASSWID= 0
##$AUNMP= <proc_1d>
##$AZFE= 0.1
##$AZFW= 0.5
##$BCFW= 0
##$BC_mod= 2
##$BYTORDP= 0
##$COROFFS= 0
##$CY= -3
##$DATMOD= 1
##$DC= 0
##$DFILT= <>
##$DTYPP= 0
##$F1P= 0
##$F2P= 0
##$FCOR= 1
##$FTSIZE= 65536
##$FT_mod= 6
##$GAMMA= 0
##$GB= 0
##$INTBC= 1
##$INTSCL= 5.30512e-09
##$ISEN= 30
##$LB= 1
##$LEV0= 0
##$LPBIN= 0
##$MAXI= 10000
##$MC2= 0
##$MEAN= 0
##$ME_mod= 0
##$MI= 50
##$NCOEF= 0
##$NC_proc= -3
##$NLEV= 6
##$NOISF1= 182.463
##$NOISF2= 159.3651
##$NSP= 0
##$NTH_PI= 0
##$NZP= 0
##$OFFSET= 248.5645
##$PC= 4
##$PHC0= -5755.193
##$PHC1= -163.5273
##$PH_mod= 1
##$PKNL= yes
##$PPARMOD= 0
##$PSCAL= 0
##$PSIGN= 0
##$REVERSE= no
##$SF= 81.014009
##$SI= 65536
##$SIGF1= 159.3651
##$SIGF2= -187.1042
##$SINO= 113.3802
##$SIOLD= 16384
##$SREGLST= <1H.CDCl3>
##$SSB= 0
##$STSI= 65536
##$STSR= 0
##$SW_p= 40650.406504065
##$SYMM= 0
##$S_DEV= 0
##$TDeff= 32768
##$TDoff= 0
##$TI= <>
##$TILT= no
##$TM1= 0
##$TM2= 0
##$TOPLEV= 0
##$USERP1= <user>
##$USERP2= <user>
##$USERP3= <user>
##$USERP4= <user>
##$USERP5= <user>
##$WDW= 1
##$XDIM= 65536
##$YMAX_p= 272451735
##$YMIN_p= -1450072
$$ End of Bruker specific parameters
$$ ---------------------------------
##NTUPLES= NMR SPECTRUM
##VAR_NAME=  FREQUENCY,     SPECTRUM/REAL,   SPECTRUM/IMAG
##SYMBOL=    X,             R,               I
##VAR_TYPE=  INDEPENDENT,   DEPENDENT,       DEPENDENT
##VAR_FORM=  AFFN,          ASDF,            ASDF
##VAR_DIM=   65536,         65536,           65536
##UNITS=     HZ,            ARBITRARY UNITS, ARBITRARY UNITS
##FACTOR=    0.620285442955139, 1,           1
##FIRST=     20137.2065510759, 0,            0
##LAST=      -20513.1999529892, 0,           0
##MIN=       -20513.1999529892, -1450072,    0
##MAX=       20137.2065510759, 272451735,    0
$$ Real data points
##PAGE= N=1
##DATA TABLE= (X++(R..R)), XYDATA
$$ [...]
40850b37266o0863k7150M5885J40781J68818J07725J6927p6425j72985k23637
40840c18190j88321j17973o4217N130R5593J26420R8969J42449K47383J91194
40830B18437o5730j89943J9326K16952J3402l43641k92693J68828M77932L45937
40820E68807P1444m1772p0706j46433j93875j70028j83803k23131j08927J49607
40810c48817K99648K53809J88849J39370q2729m21757m92771j85350Q8344K4054
40800e37350j15088N935K30482K28279N3055l0488k5625r7590j77222o8957J65698
40789c68871K80465K16803J21520P7177M9492P412q8262k79925m47938l55427
40779g87554j8204K26731K03894J41053K08362J88778p3397k74564j21826J29902
$$ plain form
40850 -237266 -298129 -325279 -279394 -138613 30205 137930 154857 78432 -94553 -318190
40840 -318190 -506511 -624484 -688701 -683571 -587978 -461558 -362589 -220140 27243 218437
40830 218437 152707 -37236 -17910 199042 212444 -131197 -423890 -255062 222870 568807
40820 568807 640251 598479 527773 381340 187465 17437 -166366 -389497 -498424 -348817
40810 -348817 -49169 204640 393489 532859 450130 28373 -464398 -649748 -561404 -537350
40800 -537350 -652438 -646503 -416021 -187742 -134687 -165175 -190800 -288390 -465612 -534569 -368871
40789 -368871 -88406 128397 249917 327094 376586 383998 295736 15811 -432127 -787554
40779 -787554 -805758 -579027 -375133 -234080 -25718 163060 89663 -184901 -306727 -176825
40769a76825Q9224j06299o2389J62660J87813p436j05073n6004q8618j61026N874
40758c18099L28523L69550L6086k56376k38186j14807j01884r5757J4478J14271
40748b62201J24350J43181J85392J13918n4641j17657m6090j9080m0501O8600
40738I5271K28616J25142k08508l36576j21990M2711o2458j07710J26124K60417
40728D1039l7850l90894k55947J97000L53890R7831j14053l1025R3532J9869j34012
40717a60620j78645j28234o0606L8858J74911K61421K28509J00555n5666j68545
40707E1938j68941n6756O8733J16502Q9933K6086m7698o1106M3642J56518R2122
40696C10973r8097j38427N0531K06221J30185m3784j48421k29893k83588j03410
$$ plain form
40769 -176825 -87601 -193900 -256289 -93629 94184 86748 -18325 -74329 -162947 -323973 -318099
40758 -318099 10424 379974 416060 159684 -78502 -193309 -295193 -390950 -376472 -262201
40748 -262201 -137851 5330 190722 304640 249999 132342 86252 67172 26671 95271
40738 95271 323887 449029 240521 -96055 -218045 -175334 -237792 -345502 -219378 41039
40728 41039 3189 -387705 -643652 -446652 -92762 5069 -108984 -140009 -46477 -26608 -160620
40717 -160620 -339265 -467499 -528105 -489247 -314336 -52915 175594 276149 220483 51938
40707 51938 -117003 -173759 -105026 11476 101409 127495 79797 18691 62333 218851 310973
40696 310973 212876 74449 124980 331201 461386 417602 269181 39288 -244300 -347710
40686c47710K93090M42351N8023m14773l65127P8305K68550M8734q5854J22857
40676I8446K68528j1219l96173l42512J03505L65637J43663j86474j01322L27504
40666B69583M73356q08n85358n20583J54019O07303L61328r8812j55852K4339
40656E28515o6190l30696k66252Q8666J63993j71480l62994o2598L48996L95747
40646B65707J49810n9160j53254k07282j87043r8114j11223k51931k27004J44705
40636g34789N49389N33188R6426l29351m00197j52145J38243K24298Q8492l9583
40626b6029M4309K13206J56230j49073l67805k87471r2407l0474o5267k4391J23452
40615e05720K93722L98842L28957L8185k61368k54324K6714J95831P3481q3516
$$ plain form
40686 -347710 -54620 387731 445754 30981 -334146 -255841 12709 61443 -24411 98446
40676 98446 366974 355755 -40418 -382930 -279425 86212 229875 43401 -57921 269583
40666 269583 742939 742131 156773 -363810 -209791 397512 758840 660028 504176 528515
40656 528515 462325 131629 -134623 -45957 118036 -53444 -416438 -479036 -130040 265707
40646 265707 415517 356357 203103 -4179 -191222 -289336 -400559 -652490 -879494 -734789
40636 -734789 -185400 347788 444214 114863 -285334 -437479 -299236 -74938 13554 -26029
40626 -26029 18280 231486 387716 238643 -129162 -416633 -509040 -539514 -604781 -629172 -505720
40615 -505720 -211998 186844 515801 553986 292618 38294 65008 260839 334320 250804
40605B50804o3535l5547j70128k85764j70819M8644J67364K38747L42899L08666
40595F31331J7550k77128k99248j75988j51287j34074N1787K14623P7792j66201
40585b10843j02889K06978K99697N1083j55595n3899J59788K05919Q3047n9341
40575D23945j24667p1865N7263J01997j5695j16390k9007Q7161r708k03997j98697
40564i9660k2240N4275K4466J12972K69030J85799j31982k95577j27679R9410
40554F8814J33821N0236l0971j41910k51838k08826k3146J07051J27540J60632
40544h597J83367N2906j33092j30085j3285o9380k12653q1114K31281K05701j84407
40533a59358l08388Q9976M24354K28550j19946j46941p6037k48667l61202l1248
$$ plain form
40605 250804 187269 151722 -18406 -304170 -474989 -426345 -258981 -20234 322665 631331
40595 631331 648881 371753 72505 -103483 -254770 -388844 -337057 -122434 -44642 -210843
40585 -210843 -313732 -106754 192943 244026 88431 34532 194320 400239 483286 423945
40575 423945 299278 227413 284676 386673 370978 254588 225581 312742 303034 99037 -99660
40564 -99660 -121900 -67625 -43159 69813 338843 524642 392660 97083 -30596 68814
40554 68814 202635 252871 221900 79990 -171848 -380674 -403820 -296769 -169229 -8597
40544 -8597 174770 227676 94584 -35501 -48786 -118166 -330819 -411933 -180652 25049 -159358
40533 -159358 -467746 -377770 46584 275134 155188 8247 -67790 -316457 -677659 -708907
40523g08907L63192K31357j96356k22534J64586L36917J04897p4112M3261J83279
40513B25580J74646J67633J41469j30513m90753m33875P0858M12402K35783p2770
40503C00460q4269M0658k0313j66663j41677k9964p0069k14241k39104j14566
40493g39748L3613J61276K52389K02652J347j33777l7370J38351J58577N3059
40483I0369K047J9170n781n4568k0443O1352N4939k8744l5051P0900J23190n614
40471B71766k04421k41987m0329K30533L35752K16531R845j42495k07775j81069
40461D6351m5283J09421R6987r0725j88723l1274J48090M6579k23928l01253j20431
40450e54189N5926R3779R3621O7211p4193j86503K345L67650M34482J04018j40906
$$ plain form
40523 -708907 -345715 -114358 -310714 -533248 -368662 -31745 73152 -960 42301 225580
40513 225580 400226 567859 709328 578815 88062 -345813 -274955 137447 373230 300460
40503 300460 216191 256849 236536 69873 -71804 -101768 -171837 -386078 -625182 -739748
40493 -739748 -706135 -544859 -292470 -89818 -88471 -222248 -259618 -121267 37310 90369
40483 90369 92416 111586 105805 51237 30794 92146 147085 118341 83290 154190 277380 271766
40471 271766 67345 -174642 -214971 15562 351314 567845 577690 435195 227420 46351
40461 46351 1068 110489 207476 116751 -71972 -103246 44844 91423 -132505 -433758 -554189
40450 -554189 -498263 -404484 -310863 -243652 -317845 -504348 -502003 -134353 300129 404147 263241
40439B63241J3379K30704J23060j17309j20603n929j17455l39197k46859J50860
40429a66108L72236J92820o8097j00686k1978n3021j17471j9605J80045K21389
40419D19524J924l00483m38769l22075n0064J88110K42573J01371q6925j07507
40409c52321J28613M44137N15975K23241j81223l61493k96310k18432k14968j39432
40399d52213O0655K08209J85681J04274N6831m4205k19475k71544r8889P1274
40389c99402J9240j03052l2053J56823J79506K725j50844j75457j49477r8376
40379g50367j170L3777p0355r2030K08709N83809N31601Q3934j52131R0126L07134
40368G73037M0813l59436l00530P3276J09430k75382m43661p0768L21415J93768
$$ plain form
40439 263241 276620 507324 630384 513075 392472 386543 269088 -70109 -316968 -166108
40429 -166108 206128 398948 330851 230165 208187 155166 37695 18090 198135 419524
40419 419524 421448 120965 -317804 -639879 -689943 -501833 -259260 -157889 -244814 -352321
40409 -352321 -223708 220429 736404 959645 778422 416929 120619 -97813 -312781 -452213
40399 -452213 -391558 -183349 2332 106606 163437 119232 -100243 -371787 -470676 -399402
40389 -399402 -380162 -483214 -515267 -358444 -178938 -176213 -327057 -502514 -651991 -750367
40379 -750367 -751537 -717760 -788115 -880145 -671436 -87627 443974 527908 375777 465903 773037
40368 773037 813850 454414 153884 227160 336590 61208 -382453 -453221 -131806 61962
40358F1962j71780j64182J68638K34451j18090l61386j41811J92819J93466j5786
40348a21699n2798O4469M0721j10806r9379R1723J62484L6417n452J60508K66159
40337D32347J09527j15177j64632j11562j22065j42630o9507O226j3878j8588
40327b09939Q0762J25114P511l2946K18805M82583L18760j67744m25371k52080
40317A45455k8596o5497j64912m4745J65598J56610o0193j93027j08045L9707
40307a57645Q8015O2553N1574M0539l9462j63796k08345j06953M5523J06985P1856
40296b09156M8140O3611L4790l7957j8409J24755K04217J00521n737Q9692K44167
40285F38634J58672j37054l12043k46230j79311k65329l04419r6107K04944L22366
$$ plain form
40358 61962 -109818 -274000 -105362 129089 10999 -350387 -492198 -299379 -105913 -121699
40348 -121699 -174497 -110028 -69307 -180113 -279492 -187769 -25285 11132 5680 166188 432347
40337 432347 541874 426697 262065 150503 28438 -114192 -183699 -177473 -191351 -209939
40327 -209939 -129177 -4063 3448 -29498 189307 671890 990650 822906 397535 145455
40317 145455 116859 51362 -113550 -158295 7303 163913 103720 -89307 -197352 -157645
40307 -157645 -69630 -7077 44497 85036 45574 -118222 -326567 -433520 -387997 -281012 -209156
40296 -209156 -161016 -97405 -62615 -100572 -118981 5774 209991 310512 304775 394467 638634
40285 638634 797306 660252 348209 101979 -77332 -342661 -647080 -743187 -538243 -215877
40275b15877K58064K00725J67373K8851j57901j53882O6482J99102M0023j82181
40265B50779j27945J31739K00787m9952k77906j73790Q5045J14225j06452k29273
40255a82743o2859J79178K05604L012k24031l01263j83555O0646K77937L37682
40245A09608K57319J36620r671k02419l14399j70232J37072K78939J27934p1088
40235B79683p5551L5970N4775n3766j81489k35753j51625O6607K28496J16106
40225H3453j47553j76206J03598K82869P0841k71437l53497j91483k4565J02903
40215e21077K40086K79096J51968L5199L8768k1819k08383j83355K05849M54237
40205D70569R8757m38558m10201Q5451K84841O267j44088J16364K90918K5231
$$ plain form
40275 -215877 42187 242912 410285 439136 281235 127353 193835 392937 432960 250779
40265 250779 122834 254573 455360 405408 127502 -46288 38757 152982 46530 -182743
40255 -182743 -245602 -66424 139180 142192 -81839 -383102 -566657 -506011 -228074 109608
40245 109608 366927 503547 493876 291457 -22942 -193174 -56102 222837 350771 279683
40235 279683 204132 240102 294877 241111 59622 -176131 -327756 -261149 -32653 83453
40225 83453 -64100 -240306 -136708 146161 217002 -54435 -407932 -599415 -623980 -521077
40215 -521077 -280991 -1895 150073 185272 224040 202221 -6162 -189517 16332 470569
40205 470569 569326 130768 -279433 -193982 90859 97126 -46962 69402 360320 385551
40195C85551k80319j87376O4846L2149k01926k39200q496K10868K09706O294k44288
40184b52191l19425j12753J48050J36467o2265m6413K18796K82360n3280l68602
40174d29256k78854Q312J21810R7511J41463J87029R2434j7561R859M6077l6246
40163e7422n9782J09641K13525J4127k22237j11694K12377L25922J79374M7949
40153F51780j6847j63605k77275r0682K52374K77897r5178l85631k44650Q2272
40143i545J71424j9281k11262k08437n3692J00001J56806J61514K19091K91460
40133E98079J92377r8176k90623j73094L0104j6363k18043k06442L8791J42737
40123f53o2252k92577k80435j23002q520Q1928J93682J94200K6j87186j29511
$$ plain form
40195 385551 105232 -82144 -17298 14851 -187075 -426275 -434771 -223903 -14197 -7903 -252191
40184 -252191 -571616 -684369 -536319 -399852 -462117 -508530 -289734 -7374 -60654 -429256
40174 -429256 -708110 -699798 -577988 -480477 -339014 -151985 -59551 -77112 -67253 -21176 -57422
40163 -57422 -117204 -7563 205962 220089 -2148 -113842 98535 424457 603831 651780
40153 651780 634933 471328 194053 103371 355745 633642 538464 152833 -91817 -9545
40143 -9545 161879 142598 -68664 -277101 -330793 -230792 -73986 87528 306619 598079
40133 598079 790456 692280 401657 228563 258667 242304 24261 -182181 -143390 -653
40123 -653 -62905 -355482 -635917 -758919 -767439 -685511 -491829 -297629 -297603 -484789 -614300
40112f14300Q6224J78364Q5362J4262R2777J95796J69585M9398m7179j13394j96572
40101i9677k22406o3103K02115K84902N5733k31385k42231R448K19488K06386
40091A19270O1425o5986j08026l0417J16676J21544j43065m08918k75659J81376
40081d31780M37010K46142m4562p7273L1348L4006k401P1419J26121p840j83998
40070A98192j74719n1035N23J7340Q2685N7265j31124j85036J24495M42009K72262
40059F52857k14261l89786j18566R2963o0657k63925j68320Q6216J78818P9209
40049a25452k6716l5417L3499J16307J20886J7441o6421j3923O6431J6866p2013
40038C1488k8384M8889k6625j01849R7806L80942K67773k02725m29788j68918
$$ plain form
40112 -614300 -528076 -349712 -264350 -250088 -157311 38485 208070 257468 210289 96895 -99677
40101 -99677 -322083 -385186 -183071 101831 157564 -73821 -316052 -306604 -87116 119270
40091 119270 180695 114709 6683 -23734 92942 214486 71421 -337497 -613156 -431780
40081 -431780 5230 251372 206810 129537 160885 194891 192490 263909 390030 382190 198192
40070 198192 23473 -27562 -27039 -9699 72986 130251 -873 -185909 -61414 380595 652857
40059 652857 438596 48810 -69756 23207 -37450 -301375 -469695 -383479 -204661 -125452
40049 -125452 -152168 -187585 -154086 -37779 83107 100548 34127 20204 86635 103501 31488
40038 31488 3104 51993 25368 -76481 21325 402267 670040 467315 37527 -131391
40028a31391R6060l4737k57550j48527J17237J22123p1035q1458J19602K10761
40018e8915Q9120j8047J4679N3927L943n6926p4429r3936j04446l7407M3680k6667
40006b65424k28483k90822k8245L74310N36550L05576q9484l14714k83574j58906
39996d43216n8037P3375K42225K72153O9547j37593q3759J20628J57342N977o5602
39985A53040J5343M9863K367P0091K11040Q4026l17987m58059l7911M29423L05033
39974E06269k24787m30207j01678K39455J77317q4737j67250m1340Q5090J06798
39964F4930M9295m2017r0839k1963J00521J22999N1078N1852J29414L8234l14499
39953A39005n91302l99716J59863N73891N19334J66691j32236k31834j81992l6319
$$ plain form
40028 -131391 -35331 -70068 -327618 -476145 -358908 -236785 -307820 -389278 -269676 -58915
40018 -58915 30205 12158 26837 80764 84707 27781 -46648 -140584 -245030 -282437 -238757 -265424
40006 -265424 -493907 -784729 -812974 -438664 97886 403462 313978 -736 -284310 -443216
39996 -443216 -501253 -427878 -185653 86500 156047 18454 -65305 55323 212665 218642 153040
39985 153040 168383 218246 220613 290704 501744 585770 267783 -190276 -228187 201236 506269
39974 506269 281482 -148725 -250403 -10948 166369 81632 -85618 -126958 -41868 64930
39964 64930 114225 72208 -18631 -40594 59927 182926 234004 285856 415270 453504 139005
39953 139005 -452297 -852013 -692150 -118259 401075 567766 435530 203696 21704 -14615
39943a4615J46776K21173Q1310j39241j78030J1956J83640J26395o7117j66027
39933B06220j14375m2659m0565o5405n6058j8556O404j2213p1668j08541m5416
39922c62832Q5027J42177O9722j8815l3325m9234j22203j15532P3956K35523O7774
39911b7762l44262n45197k55884K93109O32445N17454J00809k27622j77368J47107
39901A12829L29449J39079j62668j93803J4609J32944O6031J0890J8863r7813
39891C70410l55448m70759k81450J6793J98387K84162L33176K40596m8030l31620
39881d3783l66991j52439J28637L03635K68432L1236k13908k37701o9024M8253
39871c03653K2612P13N2310N7823j6571k8606O2912J25009J32446J92245K13363
$$ plain form
39943 -14615 132161 353334 434644 295403 117373 129329 312969 439364 372247 206220
39933 206220 91845 49186 8621 -56784 -112842 -131398 -124994 -137207 -208875 -317416 -362832
39922 -362832 -277805 -135628 -65906 -84721 -118046 -167280 -289483 -405015 -331059 -95536 -27762
39911 -27762 -372024 -917221 -1173105 -879996 -247551 269903 370712 143090 -34278 112829
39901 112829 442278 581357 418689 224886 239495 372439 438470 449360 468223 370410
39891 370410 14962 -455797 -737247 -720454 -522067 -237905 95271 335867 287837 -43783
39881 -43783 -410774 -563213 -434576 -130941 137491 168727 -45181 -282882 -351906 -303653
39871 -303653 -281041 -280328 -228018 -170195 -186766 -215372 -152460 -27451 104995 297240 510603
39860E10603m1909m46990n10728j10541K35240J29205j22600p5244J31362R8945
39850b02657j13265j41342L4584J30630J12989J97569L59677L22308L8035k22205
39840E16323k82976k27532j47316m4403K0430k6289q7096j6543J09885J01323
39830h4194l4849j34632j48439j17697L124K18981L19634J51005o3798j9081J77512
39819B67566J79053l3623j63977j08336l6997j0884O3888J22436M666j74492j39014
39808b9714O8762J52435R0072J22762K16520P9833k16396k26794R8216K25638
39798E81334j11403m45667l18931J6494Q6589m0064O074J96355J93305k3738j25840
39787A4508K1416J88691J57944l9991k49602l10934j14741K32104L88012J71635
$$ plain form
39860 510603 468694 21704 -489024 -599565 -364325 -235120 -357720 -432964 -301602 -202657
39850 -202657 -315922 -457264 -422680 -292050 -179061 18508 378185 700493 738528 516323
39840 516323 233347 5815 -141501 -185904 -165474 -191763 -278859 -295402 -185517 -84194
39830 -84194 -119043 -253675 -402114 -519811 -516687 -297706 21928 172933 109135 90054 267566
39819 267566 446619 412996 249019 140683 103686 92802 156690 279126 283792 109300 -29714
39808 -29714 39048 191483 281555 404317 620837 700670 484274 257480 355696 581334
39798 581334 469931 24264 -294667 -278173 -191584 -231648 -225574 -29219 164086 140348 14508
39787 14508 35924 224615 382559 342568 92966 -217968 -332709 -100605 287407 459042
39777D59042j28356j17598J29499J93681l7628k19072j05579R3248P8499r5036
39767B50700j66217q1460j1680k8125n290J18545J84788M6516j60459j62180N7995
39756D3133K08437J03866o4916l9104R1255L3585k16396l27462j14835J95214
39746h7223K85979J27513q0977j67568p2211J53078K99724J25477l13902n89167
39736c19277l45919K35479N94971L94009j47974n09288l88546K1237K57856J05209
39726a02243j66300j66775Q2738J94917j3707k60530k10784P2322K61876J99508
39716a08978K0198o6578J1942J45002J42962l5645j71460n5767J56738J32459
39706A70873r5004j32149J11758K08287q1515l23322p0060L50142K83069k17488
$$ plain form
39777 459042 330686 213088 342587 536268 498640 279568 173989 267237 345736 250700
39767 250700 84483 3023 -8657 -36782 -42072 76473 261261 307777 147318 -14862 43133
39756 43133 251570 355436 290520 251416 342671 376256 159860 -167602 -282437 -87223
39746 -87223 198756 326269 245292 77724 5513 158591 458315 583792 269890 -319277
39736 -319277 -665196 -429717 165254 559263 411289 -97999 -486545 -465308 -207452 -102243
39726 -102243 -268543 -435318 -352580 -157663 -171370 -431900 -642684 -570362 -308486 -108978
39716 -108978 -88780 -155358 -143416 1586 144548 108903 -62557 -118324 38414 170873
39706 170873 75869 -56280 55478 263765 182250 -141072 -211132 139010 422079 204591
39696B04591m51140j39862K07736J39585j13763j28795O5753J79843J49668P8209
39686A91825m5426k16944k26283L9561K71865J03911l04061m37931j52869J70342
39676f06010K27197J55410J70108J90086N9926j12226j15151J4823O2891k4263
39666B2791j00410q1148k4836M1015J60505K78009K25294k9039k74993l21835
39656a04647k34735j70786r4061J32545M06644M00978K5512l44271l17475k9321
39646c29617O4003j06993j06499K75727N68326K63083l42609m68119L3815M37837
39636B88954J77004l90350n58694k26983J35598K11983R2797l9986q5245L1823
39626c63099K42468K64501k1251k72126j39283J50749J38542j02759j23353P2808
$$ plain form
39696 204591 -246549 -386411 -178675 -39090 -152853 -281648 -215895 -36052 113616 191825
39686 191825 146399 -70545 -296828 -257267 14598 118509 -185552 -623483 -776352 -606010
39676 -606010 -378813 -223403 -53295 136791 196717 84491 -30660 -15837 47054 22791
39666 22791 -77619 -158767 -183603 -142588 17917 295926 521220 492181 217188 -104647
39656 -104647 -339382 -510168 -604229 -471684 -65040 335938 361450 17179 -300296 -329617
39646 -329617 -265614 -372607 -479106 -203379 364947 628030 285421 -182698 -148883 288954
39636 288954 465958 75608 -483086 -710069 -574471 -362488 -269691 -309677 -394922 -363099
39626 -363099 -120631 143870 122619 -149507 -288790 -138041 501 -102258 -225611 -152803
39616a52803L6008k56368k75025J25457L79314J39583j55199o7093J36274Q1898
39606g954l57K07330L97371J43309k72273k72462N5492J49983p9365k18357j26047
39595b3330m6088k8193Q7136J76370j643k12781k7713L42606K56004k80798n44956
39584c03386k46893O6912P563o1898J90484M16625K26588j10397j45055K5427
39574F5970L7944q5943p9310L6383J8068j58065k80685k12184J8648K82124L60900
39563C850J19541k26718k90972n3099J16048M0653o5134p1684j05404j20852J25563
39552e28208M82622M22533o2861k64723J41976M93943J76871l86038m57331j42127
39542a23343n7320k67718l44540j91377n7353N0563K62976L63612R9296k24650
$$ plain form
39616 -152803 -116795 -373163 -648188 -522731 -143417 -3834 -159033 -226126 -89852 -7954
39606 -7954 -8311 199019 596390 739699 467426 194964 250456 400439 321074 102717 -23330
39595 -23330 -69418 -97611 -10475 165895 164252 -48529 -76242 266364 522368 241570 -303386
39584 -303386 -550279 -483367 -475804 -537702 -347218 69407 295995 185598 40543 65970
39574 65970 103914 17971 -61339 -24956 -6888 -164953 -445638 -657822 -639174 -357050 3850
39563 3850 123391 -103327 -394299 -447398 -331350 -290697 -355831 -427515 -532919 -653771 -528208
39552 -528208 -45586 376947 314086 49363 191339 685282 862153 476115 18784 -123343
39542 -123343 -180663 -448381 -792921 -984298 -1041651 -991088 -728112 -364500 -265204 -489854
39532d89854j50433J31664J10533j17671m4399K74419L02630L8203L9121L61305
39522D55518L81554j02788m59344k48572R8293N6674j87376j94908j7905J1851
39512b07003j30308k17191j45233N9441L50382N41797L78051o2175l44232k57211
39502c3682p6265n3535l7650J43845L05682K29506N1117l944n068j16012k37998
39491A65996j74569J2951R8492K1605r2943j36775q1693L6170R0298k6863k02299
39480b89630k01346n730J82765K79929L42334K53667j72299o84367o94980j16074
39470a105731L81184K57224j71142k69383K6726K92400K94758J49478o252j00446
39460b51184m0077J27674J42663o9948j58350J34525M48818K68037k61583m88356
$$ plain form
39532 -489854 -640287 -508623 -398090 -515761 -560160 -285741 16889 55092 94213 455518
39522 455518 837072 734284 274940 26368 124661 181335 -6041 -200949 -218854 -207003
39512 -207003 -337311 -554502 -699735 -640294 -289912 251885 629936 567761 223529 -33682
39502 -33682 -109947 -163482 -201132 -57287 248395 477901 529018 525074 520006 403994 165996
39491 165996 -8573 4378 102870 124475 31532 -105243 -186936 -150766 -60468 -87331 -289630
39480 -289630 -490976 -496706 -313941 -34012 308322 561989 389690 -294677 -989657 -1105731
39470 -1105731 -724547 -467323 -638465 -907848 -881122 -588722 -293964 -144486 -150738 -251184
39460 -251184 -291261 -163587 -20924 -90872 -249222 -114697 334121 602158 340575 -147781
39450a47781j91392J48557R9775j46203j59521Q0701K06068J6428k23059j23243
39440d39670K76996M80136J63449l28812m08563n6473K02422J30259M9618J35439
39430B04801M2673l89964o33666k28321L90861M85971J18616o4914O2728L3524
39420B2309k34350k31592J92890M59060J76985k09171j45730J76281K07129q5176
39410C28635k65167j51569J7390O3745P7081J25450J12370R98p5974k8494M2564
39399B47029O73j32834k14163j48106J5464J25109O4160j25300k62983k02722
39389f33673K4501K44327K81565P5807k60361m63623l06141J31934M39190K77450
39379a89024j79313l75679l7019M46940M84434L7694l50223k95728k0097R6998
$$ plain form
39450 -147781 -339173 -190616 -90841 -237044 -396565 -315864 -109796 -93368 -316427 -439670
39440 -439670 -162674 317462 480911 152099 -256464 -312937 -110515 19744 69362 204801
39430 204801 247474 -142490 -776156 -1004477 -613616 -127645 -9029 -73943 -11215 22309
39420 22309 -212041 -443633 -250743 208317 385302 176131 30401 206682 413811 328635
39410 328635 63468 -88101 -70711 -6966 70115 195565 307935 308933 232959 204465 247029
39399 247029 247702 114868 -99295 -247401 -231937 -106828 -42668 -167968 -430951 -633673
39389 -633673 -609172 -364845 -83280 -7473 -267834 -731457 -1037598 -905664 -466474 -189024
39379 -189024 -368337 -744016 -781035 -334095 150339 188033 -162190 -457918 -478015 -381017
39369c81017Q4904J86458L32148K44236k6473j27588J3400Q4798m6032j25174
39359B39660l2114l8238k78080m02175j24839K53484L00413J24203J15778K51866
39349D09958J82075j12265k71509j52181j178q62n0592n8398p9775r5193J4949
39338b14971J95807K19403L3510j57636k07601j65104q0404M8941J26164L9785
39328a62106q6208k6982J51423J64855o773p6452N3174J34934L1770n0450M4787
39317A71972J35317J4345k08776k85226j53042N4822J64780O5234j55848j89729
39307c86151J15872M17330K82236j17521k08352Q4195K33298J8259j45204l2442
39297B61520l6941l39293l80177J93539P02600L93298k69529k58305L53618M87793
$$ plain form
39369 -381017 -296113 -109655 222493 466729 440256 312668 326068 410866 364834 239660
39359 239660 207546 169308 -108772 -510947 -635786 -382302 -81889 42314 158092 409958
39349 409958 592033 479768 208259 56078 54900 54038 3446 -54952 -134727 -229920 -214971
39338 -214971 -19164 200239 233749 76113 -131488 -296592 -376996 -328055 -201891 -162106
39328 -162106 -248314 -275296 -123873 40982 34209 -42243 10931 145865 177635 127185 171972
39317 171972 307289 321634 112858 -172368 -325410 -270588 -105808 -40574 -196422 -386151
39307 -386151 -270279 147051 429287 311766 103414 187609 420907 439166 293962 261520
39297 261520 224579 -114714 -494891 -301352 401248 794546 525017 266712 620330 1108123
39287A108123j91903p49453m81171O7831J23216j27010p7003J86242J53980r4664
39277h1812l0605L00887K49030l25936o69390k18630N10613O27893R5464l17383
39267A40131j62047J81797K02283l8633j58187p2888q945n6024o9364O827K8146
39256f904p2555j38011l1971J33864J44771l6606k29360k28548m267K52081K97409
39245G9903J14937m1717J2850J23163N2182r7007k3371K37260K82084o5990m68674
39234B05620n28867k57510P1316K60714K24780l2049k78431j88653J73978L15322
39224c3780O730l17881k05483J11729J18547j38108j67436J22638K86948Q4476
39214a31620j62208r6870J80814L32720K10959n9101k19468p1059K65580L42479
$$ plain form
39287 1108123 916220 166767 -314404 -246573 -123357 -250367 -327370 -141128 12852 -81812
39277 -81812 -112417 188470 437500 111564 -557826 -776456 -265843 362050 457514 140131
39267 140131 -21916 159881 362164 323531 165344 92456 83511 27487 -41877 -35050 -6904
39256 -6904 -79459 -217470 -249441 -115577 29194 -7412 -236772 -465320 -469587 -217506 79903
39245 79903 194840 153123 165973 289136 341318 244311 220940 458200 740284 674294 205620
39234 205620 -323247 -580757 -509441 -248727 -23947 -55996 -334427 -523080 -349102 -33780
39224 -33780 -27050 -344931 -550414 -438685 -320138 -458246 -625682 -503044 -216096 -131620
39214 -131620 -293828 -390698 -209884 122836 333795 274694 55226 -15833 249747 592226
39204E92226o9066n21409m00113J57101L83105J791l60674j38174L48907M44971
39194D38665J15233j59075j74759j55067k07499j45737Q9579K34620Q2212j91813
39184g3641k46068J134K79178K68957l8668l07520k31871P8495K34638J00522
39174F5156m2668L0041J19064n1005l25986l13971M70K00672L9789k20175k02830
39163g01443Q6151L31464L28507J57731J6325K2215J50662K51015J48055j66344
39153F24338m46858m13955r7761J43013L8851k26687k21889J61884N22629M41204
39143E24769K4488k37614j07191J37878J31588r3706k08063o1981J35082J24423
39133C69673p2316k25447k15240j43101j22837j06302j6729N6537j8802j39751
$$ plain form
39204 592226 523160 1751 -398362 -241261 141844 143635 -217039 -355213 -6306 438665
39194 438665 553898 394823 220064 64997 -142502 -288239 -198660 35960 118172 -73641
39184 -73641 -319709 -318575 -39397 229560 190892 -116628 -348499 -270004 -35366 65156
39174 65156 22488 52529 171593 120588 -205398 -519369 -518899 -318227 -278438 -498613 -701443
39163 -701443 -615292 -283828 44679 202410 218735 240950 391612 642627 790682 624338
39153 624338 177480 -236475 -334236 -191223 -152372 -379059 -600948 -439064 83565 524769
39143 524769 549257 311643 204452 342330 473918 380212 172149 110168 245250 369673
39133 369673 297357 71910 -143330 -286431 -409268 -515570 -532299 -475762 -494564 -634315
39123f34315m8452K54088M16194K04001j41474k18698J5883K68584L28682K23463
39113F67956L7276j66241k74836k10804o8242J2844M3323P1780J0240j65119j94452
39102b36275J18104M48766K98344k29948m88121j95166J98837K21746j6025j67370
39092d7108j80053j77468j38791o107J38718K41826L65179M25507J86130k71740
39082E36093m66728k04062O5788m8511k34444l1798L32032K83111j46194l63699
39072b78412j39628J42878J83371J27942J27847O2863j00179j11472J50051L93019
39062E58280K93419o0109l14124k96732j43806o2921r7719j19772k3859J01351
39052a65992R0771j9980l3378N1482N638j82136j78844J40043L88776K57146K1290
$$ plain form
39123 -634315 -682767 -428679 -12485 191516 50042 -168656 -152773 115811 444493 667956
39113 667956 705232 538991 264155 53351 -14891 -2047 41276 113056 123296 -41823 -236275
39102 -236275 -118171 330595 628939 398991 -89130 -284296 -85459 136287 120262 -47108
39092 -47108 -227161 -404629 -543420 -549527 -410809 -168983 196196 621703 807833 536093
39082 536093 69365 -134697 -68909 -117420 -351864 -383662 -51630 231481 85287 -278412
39072 -278412 -418040 -275162 -91791 36151 163998 226861 126682 15210 165261 558280
39062 558280 851699 791590 477466 180734 36928 -25993 -123712 -243484 -267343 -165992
39052 -165992 -75221 -95201 -128579 -77097 -71459 -253595 -432439 -292396 96380 353526 374816
39041C74816L9668J11731j13751m15526l35895r7J05444j703Q1808K82739J57376
39030B86610j59930m4317M55638N13404j09463n52195k07741K94265J34072m00122
39020B10221m70447l0535K37657M1894k35580k55181r5789N3012J12635O8366
39010c63747J2573R9889K28979O2120l62528m52854Q7911O54829N27683q5183
39000D09672l96160j60036J87949L13798K58714O2202k59882m37461k32506P1892
38990a81818L5652j94977j28593J92213K59850J8322n3113J54075J76949j19274
38980A59286k22751J11210L50400M9733l85713l47350L8211J96924N919j62489
38970b06620r8755N1381J53640K18745K11853O6974j27524k06986j50891l7551
$$ plain form
39041 374816 414484 526215 412464 -3062 -338957 -339054 -233610 -235313 -153505 129234 286610
39030 286610 126680 82363 538001 1051405 941942 389747 182006 476271 610343 210221
39020 210221 -260226 -290761 -53104 -11210 -246790 -501971 -597760 -544748 -432113 -363747
39010 -363747 -351174 -251285 -22306 39814 -322714 -775568 -687657 -32828 494855 409672
39000 409672 13512 -146524 41425 355223 613937 676139 416257 -21204 -253710 -181818
38990 -181818 -146166 -341143 -469736 -277523 -17673 649 -52464 101611 278560 159286
38980 159286 -63465 47745 398145 447878 62165 -285185 -246974 -50050 -44131 -206620
38970 -206620 -305375 -253994 -100354 118391 330244 397218 269694 62708 -88183 -125734
38960a25734J16844K76650K77207L4248k39958k69557q8273M6247L7925Q593J1148
38949H5340m9297j73159j80131K4691K52766K42577N280j73486q8380J39111K43698
38938C29010J66420P9423Q2178O7403m3177j26457o0744O2836R5579N0215j448
38927G01238q1609j72453j35857L521m8846l61570m63982J589N57775M45405k09887
38916B35324m97172n2413M36422K98531k16506m88158m07841k35738k6434K67906
38906f86079M30191K40199q1945j45677L9737J63656J38696J19792J05845n7258
38896B67157k97990l20415l7128K75468L16080P0747k28951l23265j29386J60242
38886b47441K54000J16574N501N7762O5801j47718l64944k67262O1624K39042
$$ plain form
38960 -125734 -8890 267760 544967 579215 339257 69700 -18573 27674 65599 74192 85340
38949 85340 36043 -137116 -317247 -292556 -39790 202787 208067 34581 -53799 85312 329010
38938 329010 495430 574853 657031 724434 681257 554800 494056 556892 652471 702686 701238
38927 701238 619629 447176 311319 314840 265994 -95576 -559558 -557969 -194 445211 235324
38916 235324 -261848 -314261 122161 420692 204186 -283972 -691813 -927551 -953985 -686079
38906 -686079 -255888 -15689 -97634 -243311 -203574 -39918 98778 218570 324415 267157
38896 267157 -30833 -351248 -388376 -112908 203172 273919 44968 -278297 -407683 -247441
38886 -247441 6559 123133 128634 186396 252197 104479 -260465 -527727 -466103 -227061
38876b27061J20542m6204M141K41373M18966L39181M9094j74408j15620Q5881
38866F95885J00109j11565k37212j11589M3470K2815n4079m8025p0515j83718
38856D5576j71441O7688K27814P2682j08450M0545L05360K24649j49650l39637
38846B15136j70222Q8050K25474K64031J78332q3174l21343k72465n2745L139
38836G4213r6844n4167J39967J69503l2805j62323p6743o464j15681k45319k12691
38825f19354m3742J56757K71507J35479k22292l90436o2838L84677L40154r0409
38815a40497k16341J31274L50322R0058k08272j07501J50676J76957P0318O8573
38805C65567N3446j20182k21683m8895J33712L2611j38669m4587J59969J14920
$$ plain form
38876 -227061 -106519 -152723 -148582 92791 511757 850938 900032 725624 610004 695885
38866 695885 795994 684429 447217 335628 379098 401913 347834 299809 229294 45576
38856 45576 -125865 -58177 169637 242319 133869 174414 479774 704423 554773 215136
38846 215136 44914 132964 358438 622469 800801 717627 396284 123819 71074 74213
38836 74213 -22631 -76798 63169 232672 199867 37544 -39199 -45663 -161344 -406663 -619354
38825 -619354 -663096 -506339 -234832 -99353 -321645 -712081 -774919 -390242 -50088 -140497
38815 -140497 -356838 -225564 124758 214816 6544 -100957 49719 226676 296994 365567
38805 365567 419013 298831 77148 28253 161965 194576 55907 11320 171289 286209
38795B86209r8459j25895K0641J6986j68118k08108L7109K97930K66714m9044
38785B75965l47262k80633J87089N81373L51826l35699o33100j26988N09283M30941
38775F12795j95965n18905k40689J35789K01734J08855Q2233N0693p1771j71627
38765f858j60041q7567L5326K15445K65413r718l85210l83580M7205M14879L59034
38754C04328P0881j06964j34341j28407p8636N7025J91686K41129K41333K02660
38744H60694M6521j85919k78485j44429J1896o893j19488j56976j40544j65426
38734b79049j55195K5566K75109L03882J4459l27339l83332j29456J40876J91256
38724c23223J13803J40125K64070K47264J6538j80472j41423j4679l8746j53175
$$ plain form
38795 286209 187750 61855 82496 99482 -68636 -276744 -239635 58295 325009 275965
38785 275965 -71297 -351930 -164841 416532 768358 432659 -200441 -327429 181854 612795
38775 612795 416830 -102075 -342764 -206975 -5241 103614 185847 236540 164769 -6858
38765 -6858 -166899 -254466 -219140 -3695 261718 252000 -133210 -516790 -469585 -54706 304328
38754 304328 375209 268245 133904 5497 -73139 -16114 175572 416701 658034 860694
38744 860694 907215 721296 442811 298382 310278 303385 183897 26921 -113623 -279049
38734 -279049 -434244 -408678 -133569 170313 184772 -142567 -525899 -655355 -514479 -323223
38724 -323223 -209420 -69295 194775 442039 458577 278105 136682 122003 83257 -69918
38714f9918j24619N4877J69983J29343N7102N0266N4689j8784k00332m26851m86363
38703h10607j60876L90228O12313K20551l17813l44794J09338M52627M11810K56777
38693H19554J79339L7533j72477j61609J03524J95054j28378m82009m07901l8850
38683e6220J51179K0814j60906j60564j7437Q2582j395k02573k19152J39408N48899
38672A24635M62282q9918m25706j62111K25666J59440j68867j97059O5726J25420
38662A19508j24955k65129r2806Q2048K8721k7697J38343L21140K16283p7038
38652C18418k04289p3673N5970k3473k00906k33337p2412R3602R9197J2869K5945
38641b02089J71876K66200J49652j06267k82801k33380m062J83414R4279k31927
$$ plain form
38714 -69918 -194537 -139660 30323 159666 216768 267034 321723 302939 102607 -324244 -810607
38703 -810607 -971483 -581255 31058 251609 -66204 -410998 -301660 150967 562777 819554
38693 819554 998893 1036426 863949 702340 805864 1000918 872540 390531 -17370 -56220
38683 -56220 94959 115773 -45133 -205697 -223134 -140552 -141947 -344520 -563672 -424264 124635
38672 124635 586917 496999 71293 -90818 134848 294288 125421 -71638 -5912 119508
38662 119508 -5447 -270576 -363382 -281334 -252613 -280310 -141967 179173 395456 318418
38652 318418 114129 40456 96426 72953 -127953 -361290 -433702 -340100 -240903 -228034 -202089
38641 -202089 -30213 235987 385639 279372 -3429 -236809 -240871 -57457 36822 -195105
38631a95105l96503p7391M49296N41972M4762m47670l80879N1928L00364K36870
38621A27644J26746N2970j19101k94551j87488J47309K81169L2998k65426k79799
38611c77529j02315J5576N1144J04146J46258J16033Q6029J19266J10871k3308
38601B46171j44860r9798m045p4413k51509k60779m1703J51132J43725R5684K04510
38590c5885L43129K31646r7917k77303j06339J54297J63578q851l9807R4593Q1810
38579E02951j58622k58689J3701K86500R3403l48561l77144J07431M11867M4740
38569C17577n18692m83339J33370N41599K99306j42738j91021N0366P0322j89932
38559a13182k70965L1752L09262J46797k59330l88472r3625K93454M41028L10337
$$ plain form
38631 -195105 -591608 -668999 -219703 322269 367031 -80639 -461518 -409590 -109226 127644
38621 127644 254390 307360 188259 -106292 -293780 -146471 134698 167696 -97730 -377529
38611 -377529 -479844 -464268 -413124 -308978 -162720 -46687 39342 158608 269479 246171
38601 246171 101311 1513 -2532 -76945 -328454 -589233 -630936 -479804 -336079 -240395 -35885
38590 -35885 307244 538890 440973 163670 57331 211628 375206 366355 326548 421141 502951
38579 502951 344329 85640 99341 385841 479244 130683 -246461 -139030 272837 317577
38569 317577 -201115 -684454 -551084 -9485 289821 147083 -43938 6428 76750 -113182
38559 -113182 -384147 -352395 -43133 103664 -155666 -544138 -637763 -344309 96719 407056
38549D07056L4482k10390k33010P281K57871K32637l650j58114j61074j70902
38539B187j71652J2329K60253J93672j76696l30933k2925K88014J44617k00795
38529a929k36391J3309J60630J41737J60987J45852j28751m57492l66332J10788
38519d57592L90059J80293j51900k12134q7202j1434M2222J63029K29472J15719
38509B00532o6276j51997j46577r6367L5715K03204K15222K1593j50576j19512
38499e5039p415K99m0874K5671J64131J96397O0082j31730k26041j42658O6711
38488i0466K27615K09892Q8709J1322m7353j89629l10392k01705N8298J52765
38478i0944J3171q4871M876R5554N8953L6247Q6622K3081j70963j62840J84391
$$ plain form
38549 407056 441538 231148 -1862 5419 263290 495927 492277 334163 173089 2187
38539 2187 -169465 -157136 103117 296789 120093 -210840 -233765 54249 198866 -1929
38529 -1929 -238320 -225011 -64381 77356 238343 384195 255444 -202048 -568380 -457592
38519 -457592 -67533 112760 -39140 -251274 -338476 -349910 -307688 -144659 84813 200532
38509 200532 134256 -17741 -164318 -260685 -224970 -21766 193456 215049 64473 -55039
38499 -55039 -62454 -62155 -103029 -77358 86773 283170 343252 211522 -14519 -157177 -90466
38488 -90466 137149 347041 435750 447072 399719 210090 -100302 -302007 -243709 -90944
38478 -90944 -77773 -162644 -157768 -62214 -3261 32986 119608 142689 -28274 -191114 -6723
38467f723M57348K57303j86219l69732k29410p6655k7756M9866J49171J17671
38457A34864j6935q4523p6712q2251j9431K02104L56011J54006k30728l36094
38447C11j00096P8913J4321k2633J29083J84459q0575l67694k60683J43843L66829
38436H6078J93969j15433k31908j16298M8253J02625K9981p2269q7791J0414J31246
38425b1133J67697J16265N8310K9448l4261j74160k73860j62342J06726K23222
38415C5912J7271k31402j30222K31661L57054O8609k05225o8938K50256K68142
38405E93118l9452k60851j68044N1196J48475R6287M950j3389Q8451J85229L2219
38394G18189l65969n89615l06343J93474L37885P0293j24827P279J61513L7103
$$ plain form
38467 -6723 450625 707928 521709 151977 -77433 -154088 -181844 -131978 17193 134864
38457 134864 117929 33406 -43306 -125557 -144988 57116 413127 567133 336405 311
38447 311 -99785 -20872 -6551 -29184 99899 284358 203783 -163911 -424594 -280751 86078
38436 86078 280047 164614 -67294 -183592 -135339 -32714 -2733 -75002 -162793 -152379 -21133
38425 -21133 146564 262829 321139 350587 316326 142166 -131694 -294036 -187310 35912
38415 35912 53183 -178219 -308441 -76780 280274 348883 143658 74720 324976 593118
38405 593118 553666 292815 124771 175967 324442 420729 425679 412290 500741 685970 718189
38394 718189 352220 -237395 -543738 -350264 -12379 57914 -66913 -59634 101879 138982
38384A38982j92611k01543R694J94503K01619M2650j91215l18153j58765K03377
38374b71462M25622L09649K9750j62618k53595l20258k74105N925L84402N37724
38364D11034L11508j03063l46696k18569J20504K82357Q6391j88986j60757J10160
38354C03883J93621p9215l78063l60660r0166J82558L61991M38111L36015O8808
38344I76883j61494k24745k34042k83181k57351j12876o3093k05521k46225M6536
38334g65109L69033K97855j8529q4649J43452K35694M7316p7644L5408R8852n4161
38323B27518j30079N1784J30753j98589n48533l56934J95535M01539Q2904j91966
38313c36068k6635K63967K72940J35628J58120K16193K1620k59315k04887J28543
$$ plain form
38384 138982 -53629 -255172 -245478 -50975 150644 193294 2079 -316074 -474839 -271462
38374 -271462 154160 463809 493559 330941 77346 -242912 -517017 -511092 -126690 411034
38364 411034 722542 619479 272783 54214 174718 457075 543466 354480 193723 303883
38354 303883 497504 418289 40226 -320434 -410600 -228042 133949 572060 908075 976883
38344 976883 815389 590644 356602 73421 -183930 -296806 -359899 -565420 -811645 -765109
38334 -765109 -396076 -98221 -116750 -201399 -57947 177747 225063 147419 182827 281679 227518
38323 227518 97439 149223 279976 81387 -467146 -824080 -628545 -227006 -144102 -336068
38313 -336068 -362703 -98736 174204 309832 467952 684145 705765 446450 241563 370106
38303C70106K24901p6811l11440j29774J62521J38644o2462l1248J81697J56528
38293F22662j52039k95298n0148K13048J12955j60727j74651P4938J91836r76
38283C81600k29069k04751j1741R0107M6902m761l6340j65733l65425l66560k6980
38272h92751L52153L39951k1142k21343J4775L28039K51883r6926k02944P4130
38262g4175L07613J50531j76123k39259l732J76717Q9281p1523j8801K13806L17378
38251F71713J31690j30376j70292l858J01485L9305k5412J0983K0526p7851j38627
38240D29286o3747M954k0819K8899K24579K80986J8960k20706q6570J39577j8672
38229G16727l74240l50626M615P1551k48520l36922M6470L19485R6998j49675
$$ plain form
38303 370106 595007 518196 206756 76982 239503 378147 315685 284437 466134 622662
38293 622662 470623 175325 125177 338225 451180 290453 115802 190740 382576 381600
38283 381600 152531 -52220 -63961 26146 73048 68287 31947 -133786 -499211 -865771 -892751
38272 -892751 -540598 -200647 -221789 -443132 -428357 -100318 151565 54639 -148305 -74175
38262 -74175 233438 383969 207846 -31413 -35145 141572 230853 159330 140529 354335 671713
38251 671713 803403 673027 502735 498877 600362 639667 614255 625238 645764 567913 429286
38240 429286 365539 370493 349674 378573 603152 884138 903098 682392 595822 735399 716727
38229 716727 342487 -8139 -3524 68027 -180493 -517415 -470945 -151460 -54462 -204137
38219b04137L1188K67721Q7747j81920o709L52889K68251j62839l10335j01039
38209D0817m6512k50532k48465Q0304K41921j5175k65253j18905K01017L11324
38199f9459K19254J10483m528j27500j07276P2094J44348l1811k04680j24865
38189a23940O5752J04089J5136j8283K1347N1683Q4426J14912J9313j94445k49788
38178a09798j680K30357P6045k84911l26322P2029M63578M66186K00105j8250
38168G67339j07526j51702j33008Q515J62096J44610n417m7769J00428K09873
38158I47439N1790k63901m12631k58959Q731J30207K8196j86935l32442k55872
38148e44377M0127L34041L68775J42947r0586j36367l1494J00137J87669J70481
$$ plain form
38219 -204137 -172949 94772 182519 599 -6110 346779 615030 452191 141856 40817
38209 40817 -5695 -256227 -504692 -424388 -182467 -197642 -462895 -581800 -380783 -69459
38199 -69459 149795 260278 255750 128250 20974 93068 237416 205605 925 -123940
38189 -123940 -58188 45901 61037 42754 64101 115784 200210 315122 334435 139990 -109798
38178 -109798 -111478 118879 194924 -89987 -416309 -344280 119298 585484 785589 767339
38168 767339 659813 508111 375103 383618 545714 690324 684907 637138 737566 947439
38158 947439 999229 735328 322697 63738 72469 202676 230872 43937 -288505 -544377
38148 -544377 -504250 -170209 198566 341513 250927 114560 83066 183203 370872 541353
38138E41353J6976j51469j59048n3668m9320j38056o9030J85107L08057J58791
38128E89693J1147L1308m0824l33560m29856k1700M22861K81957k23473l60009
38118g2456j8639K33711J52709P0693J17296n008k97276k88927J35621M37973
38108D65697K85941N4853R4931J41899q7407l10197k14640n4552j46445k49898
38098a9818n1269J69221J3943k58998j51366J77723J88836o0321j6951L54697
38088C45697M71821J24530j87034j09589M3215p4072k56798j78924L5322P0497
38078B84665m7760n2781J11052K40738J84458j541j39823q3296J21416K08172
38068H25300K847k52221j53203K55377M54697J53199l11886m66205k98401j15554
$$ plain form
38138 541353 558329 406860 247812 194144 144824 6768 -62262 122845 430902 589693
38128 589693 600840 632148 591324 257764 -172092 -193792 229069 511026 287553 -72456
38118 -72456 -91095 142616 295325 366018 483314 478306 181030 -107897 27724 465697
38108 465697 751638 806491 901422 1043321 955914 645717 431077 376525 230080 -19818
38098 -19818 -71087 98134 112077 -146921 -298287 -120564 68272 7951 -9000 345697
38088 345697 817518 942048 755014 645425 688640 614568 357770 178846 214168 284665
38078 284665 236905 184124 295176 535914 720372 718831 579008 495712 617128 825300
38068 825300 828147 575926 422723 678100 1132797 1285996 974110 507905 209504 93950
38058I3950l6955N5765J89342K20914P7283j28805k33458j63607K7130J86432
38048B87991J84728O7630R61K1947j1615j49333k04956l1913K07388K36953M0794
38037F50575j41314j36317Q616J59151K28392J89882P6652l2408r1222j09811
38027H02196n7945J32780L77695M13650J46345j21256o0776J82313J79705j15924
38017A878783k68609j5120L36746L78429J75582Q1759J84273K69491K28938J69369
38007C419641J63707K00705L54065O70775Q91631O72358J73140J3703M32836Q81701
37997G874262P72622K99351Q7856K66452L89331J94481q2252k02475k69875m28898
37987H900855n94997o70850p24859p72356o63951l91900k40975l97273o26298
$$ plain form
38058 93950 56995 112760 302102 523016 600299 471494 238036 74429 101559 287991
38048 287991 472719 540349 541310 563257 551642 402309 197353 165440 372828 609781 650575
38037 650575 509261 372944 381560 540711 769103 958985 1035637 1003229 912007 802196
38027 802196 744251 877031 1254726 1668376 1814721 1693465 1632689 1815002 1994707 1878783
38017 1878783 1610174 1595054 1931800 2310229 2485811 2567570 2751843 3021334 3250272 3419641
38007 3419641 3583348 3784053 4138118 4808893 5700524 6372882 6546022 6559725 6992561 7874262
37997 7874262 8646884 8946235 9034091 9300543 9689874 9884355 9802103 9599628 9329753 8900855
37987 8900855 8305858 7635008 6910149 6137793 5473842 5081942 4840967 4443694 3817396
37978C817396n89977l10301p2901j2982m0907p2661j03615j20644j24963j75445
37968B193000k69277k84688j74733p2894n7370N879J90006K77278O4419k66512
37958A605108l74877k29410n2521P3265K05074K52980Q2301j41792j13173J06211
37948A413166J46312n2732j20120J15105L10446J65403r2548j01760M9650J5236
37938A848158k17970l24668j61937O4027J68634K13565K74705K45219L0229k23908
37928A916054k79739j26072J6668P402m7557j12R4185P9660j3882J3642K02005
37917A862254L15635J70698q9068j98857j19264M496J07461K07925K38904J35854
37907B636038M8834J93617M87819O06557M37983K14722J27549Q7050j9592j08988
$$ plain form
37978 3817396 3227419 2917118 2844217 2831235 2790328 2717667 2614052 2493408 2368445 2193000
37968 2193000 1923723 1639035 1464302 1391408 1334038 1339917 1529923 1807201 1871620 1605108
37958 1605108 1230231 1000821 948300 1021565 1226639 1479619 1561920 1420128 1306955 1413166
37948 1413166 1559478 1506746 1386626 1501731 1812177 1977580 1885032 1783272 1832922 1848158
37938 1848158 1630188 1305520 1143583 1207610 1376244 1589809 1864514 2109733 2139962 1916054
37928 1916054 1636315 1510243 1526911 1534313 1486756 1486644 1580829 1660489 1646607 1660249 1862254
37917 1862254 2177889 2348587 2259519 2060662 1941398 1945894 2053355 2261280 2500184 2636038
37907 2636038 2684872 2878489 3366308 3972865 4410848 4625570 4753119 4840169 4820577 4711589
37897D711589j04881j18930k24264k54298o4322J69854J81849L5473K7787K08964
37887D568821K93209J04113j51991k00408r5623r3510k16637k06227L7962K12859
37877D252568J6516l42284l49321R2129M79814M00081Q0173j5394J26091J64505
37867D904878K9850q669J37075K34858J74366J32894J92514J95703J27934K30110
37857F351513N23168O37543M03176K15443M45588Q36402R28766Q01275Q62955
37848A2005829J102754J135480R53329J040350J611786K236411K449873K383404
37840B4919216K523286L088068L886356M649579N319018O067118P110353Q439555
37832F6002549R779946J0976516J2337062J4334704J7058580K0311897K4049827
$$ plain form
37897 4711589 4606708 4487778 4263514 4009216 3944894 4114748 4296597 4332070 4359857 4568821
37887 4568821 4862030 4966143 4814152 4613744 4518121 4424611 4207974 4001747 4039709 4252568
37877 4252568 4269084 3926800 3577479 3669608 4149422 4549503 4629676 4614282 4740373 4904878
37867 4904878 4934728 4926059 5063134 5297992 5472358 5605252 5797766 5993469 6121403 6351513
37857 6351513 6874681 7512224 7915400 8130843 8576431 9412833 10341599 11142874 12005829
37848 12005829 13108583 14244063 15197392 16237742 17849528 20085939 22535812 24919216
37840 24919216 27442502 30530570 34416926 39066505 44385523 50452641 57562994 66002549
37832 66002549 75782495 86759011 99096073 113430777 130489357 150801254 174851081
37825A74851081K7850683K9613690K5796592J4339689k381630j8322366k8084447
37818B23663292l0477891k8049968k3972362j9935276j6399104j3581091j1614669
37811G9632931j0238985q967514p600659o328530n360056m661388m055127l407646
37803B9013026k710088k097623j760513j705167j661240j399918j077500j015090
37795A5585887j165947j125933p44919l83886l84229n95565o91406o72821p07578
37786I113603o86660l86168J5039M7996l61414p31585o80607l85620k07505j80607
37776E556472j30724n5326q3726j90508k21597j44735o0270j5448L460m7313j97694
37765D412591l15672k33958q866J45645J77783K35232L55167L58083J56796m2262
$$ plain form
37825 174851081 202701764 232315454 258112046 272451735 270070105 251747739 223663292
37818 223663292 193185401 165135433 141163071 121227795 104828691 91247600 79632931
37811 79632931 69393946 60426432 52825773 46497243 41137187 36475799 32420672 29013026
37803 29013026 26302938 24205315 22444802 20739635 19078395 17678477 16600977 15585887
37795 15585887 14419940 13294007 12549088 12165202 11780973 11185408 10494002 9821181 9113603
37786 9113603 8426943 8040775 8055814 8103810 7742396 7010811 6330204 5944584 5737079 5556472
37776 5556472 5425748 5370422 5286696 5096188 4874591 4729856 4669586 4654138 4657598 4610285 4412591
37765 4412591 4096919 3862961 3854095 3999740 4177523 4412755 4767922 5126005 5282801 5240539
37755E240539j8922J29879J39898k9799j67356j36071k5054M2366N7075L1344
37745E263899n7116j45899r4143P1787J00717j21743l31222k56825r2405k43899
37735D093151o48061p62338l49440J26067J37400j86067l23081j26138P8593O6722
37725B106808j3533J4259P2991J1412j55307k87011k59424l6078K55465L44681
37715B054263J06289k08367k57663q4243j5643j19587j24078P4624K25648J71010
37705A822253Q1603O8669k7565k18966j76034J96597M11833R7711l16037j94086
37695A745978K75181L28904j78207n45911l04804J24437J22265k69867n18499
37686G79477l08847K02825O32278O62067K80088j50850k53051j07581j07446l29032
$$ plain form
37755 5240539 5221617 5351496 5491394 5461595 5294239 5158168 5133114 5175480 5232555 5263899
37745 5263899 5206783 5060884 4966741 5038528 5139245 5017502 4686280 4429455 4337050 4093151
37735 4093151 3445090 2682752 2333312 2459379 2596779 2410712 2087631 1961493 2040086 2106808
37725 2106808 2093275 2107534 2180525 2191937 2036630 1749619 1490195 1454117 1709582 2054263
37715 2054263 2160552 1952185 1694522 1610279 1594636 1475049 1350971 1425595 1651243 1822253
37705 1822253 1903856 1972525 1944960 1725994 1549960 1746557 2158390 2256101 1940064 1745978
37695 1745978 2021159 2350063 2171856 1625945 1321141 1445578 1567843 1297976 779477
37686 779477 470630 673455 1305733 1967800 2247888 2097038 1843987 1736406 1628960 1299928
37676A299928m23304k05411P0439J69971J86191K02746R2351j14398j12317J42898
37666A309094K44387M711j78818k8807P7367j92336m17140j05374L61784K91161
37656A366029j35552j50783K92961M82382K08189P1569L36939M41123K5862l89264
37646B549455k71265R4527J96281J26096K14342L12628Q8118k85467l41594m6443
37636B636678J92027J28164r2182k04313o1730K46571L52558l7200o03350o60581
37626A896642j50318J72678j08644l83611l9040M50312K61803l93299n67530m6038
37616A092955M14537K93956r5104l06317k97172j27195J95874M07169J61086l14043
37606A425746l60061J23709M62623K15165k16436k96665j08242j2088l9832l8479
$$ plain form
37676 1299928 876624 671213 741652 911623 1097814 1300560 1392911 1278513 1166196 1309094
37666 1309094 1553481 1558192 1379374 1350567 1427934 1235598 818458 713084 1074868 1366029
37656 1366029 1230477 1079694 1372655 1855037 2063226 2134795 2471734 2912857 2938719 2549455
37646 2549455 2278190 2372717 2568998 2695094 2909436 3222064 3310182 3024715 2683121 2636678
37636 2636678 2828705 2956869 2864687 2660374 2598644 2845215 3197773 3160573 2557223 1896642
37626 1896642 1746324 1919002 1810358 1426747 1387707 1838019 2099822 1706523 1138993 1092955
37616 1092955 1507492 1801448 1706344 1400027 1102855 975660 1171534 1578703 1739789 1425746
37606 1425746 1065685 1189394 1652017 1867182 1650746 1354081 1245839 1233751 1193919 1155440
37596A155440l8346q4522j3312K49960M38369L04102M97j57806r7550N4498J77349
37585A988679J56053n3930k24687l3078M27646O70674M84134J71448j4042j84403
37575C388494l65466k87931M7348J43237k36294n92453m57036j44774j73998l74085
37565I47042k38455J54006K82334O3348r1780j2420O1624J0649k6620l3557j22569
37554I93602j78946J0258K93093L08403Q5335j0757Q0158N4240j39305j67592
37544A328489Q5803K92705K18057N0709K3277Q3507J08329J03456N1351j16662
37534B229021k88346k40029k8491L5964j00729j30555R1429L00251K62440J04771
37524B235726J9646k1676o7939j5992J52337K41378J47581M2753Q2791J85780
$$ plain form
37596 1155440 1117094 1032572 1019260 1269220 1707589 2011691 2012188 1854382 1756832 1811330 1988679
37585 1988679 2144732 2090802 1866115 1833037 2260683 2931357 3415491 3586939 3572897 3388494
37575 3388494 3023028 2735097 2782445 2925682 2689388 2096935 1639899 1495125 1321127 947042
37565 947042 708587 862593 1144927 1208275 1116495 1104075 1165699 1176348 1149728 1116171 993602
37554 993602 814656 824914 1118007 1426410 1511745 1500988 1581146 1635386 1496081 1328489
37544 1328489 1414292 1706997 1925054 1975763 1999040 2082547 2190876 2294332 2345683 2229021
37534 2229021 1940675 1700646 1672155 1708119 1607390 1476835 1568264 1868515 2130955 2235726
37524 2235726 2255372 2233696 2165757 2149765 2302102 2543480 2691061 2733814 2816605 3002385
37514C002385K49120L15462L71619K72489L7581o3079R8018L05063L64802L70934
37504E324394M08673L24894N4139j26066K4648L06335L56538J41132j05247k45309
37494F464131k78686j90727l0422J3269j38457k77944k13581p5469p8151j65176
37484E028787j64181j24105j97413l23747l32176k48477k13220j99235r9505L240
37474C129968m3953j56776j34887l2483q8961l07457m15720k80374q6282l9582
37464A543493j11020j43404n5740J00032J74848L8924k26187l32787j33536J40621
37454I95244J78729J9248n1190N6470J52127R3337n4484j72318j90343o9972J14929
37443A071777J49557m0821j77961J8962L62145M15140J24748j53501k40270k96378
$$ plain form
37514 3002385 3251505 3566967 3938586 4211075 4248656 4185577 4283595 4588658 4953460 5324394
37504 5324394 5733067 6057961 6112100 5986034 6010682 6317017 6673555 6814687 6709440 6464131
37494 6464131 6185445 5994718 5964296 5977565 5839108 5561164 5347583 5272114 5193963 5028787
37484 5028787 4864606 4740501 4543088 4219341 3887165 3638688 3425468 3226233 3126728 3129968
37474 3129968 3086015 2929239 2794352 2761869 2672908 2365451 1949731 1669357 1583075 1543493
37464 1543493 1432473 1289069 1233329 1333361 1508209 1547133 1320946 988159 854623 995244
37454 995244 1173973 1193221 1142031 1198501 1350628 1443965 1389481 1217163 1026820 956848 1071777
37443 1071777 1221334 1180513 1002552 1021514 1383659 1798799 1923547 1770046 1529776 1233398
37433A233398l46868j42637K99411M83145J00799m26494m64567n196L86122L27155
37423A444268k5412l08846l32212j37385P3783Q7614o2193o5513K20531M33858
37413A328493J49243m13785n59742p3371M36713L85053N879q3696J66196K47430
37403A588413l1247k47645r0086J23324k2176l48417l63286k5684K36542K04690
37393A024428R9323R0885L5309j42961k06040R671K74925L11697J94332J19647
37383A811216K4645k19024m23532k97957N3859K34443J18589l6259l7965K8991
37373A257006O6991J08299J37981P7971O565R4532K63031K20737p8731l42279
37363A812103l93750l69328l29618q4416L62107N86402L09271j25962k22310k5185
$$ plain form
37433 1233398 886530 743893 1043304 1526449 1627248 1200754 736187 730991 1117113 1444268
37423 1444268 1418856 1110010 777798 640413 714196 801810 739617 674104 894635 1328493
37413 1328493 1477736 1063951 504209 430838 867551 1252604 1258483 1174787 1340983 1588413
37403 1588413 1557166 1309521 1219435 1342759 1320583 972166 608880 583196 819738 1024428
37393 1024428 1123751 1214636 1249945 1106984 900944 910615 1185540 1497237 1691569 1811216
37383 1811216 1835861 1616837 1193305 895348 949207 1183650 1302239 1265980 1228015 1257006
37373 1257006 1323997 1432296 1570277 1648248 1654813 1749345 2012376 2233113 2154382 1812103
37363 1812103 1418353 1049025 719407 634991 997098 1583500 1892771 1766809 1544499 1519314
37353A519314O5895k5810m4816M2923j093j81363k00028J2675J53636Q8557J00567
37342A530457L55302N25499L06058j4955N5240M44323O17991M05287K48040N40495
37332E013737J121818J571986J650982J259239L48936p97974j514297j407880
37324G246547r11491p42058r36138r22225n02534j55382k14955l47995j75507
37315B338262Q9976O9474j21735j44700n8958j28153k42944j25693O7646p913
37305A735262j61328Q2193N15610L67687m23442q94698m27911L13112L92851p0298
37295A429038k95613r5146O1662j7097m6801O0929M5322j26295j43750P3619K23771
37284A169639J64514J14650J70966J05372j59631l08330j02300K69945N35361
$$ plain form
37353 1519314 1585209 1559399 1514583 1557506 1556413 1375050 1175022 1187697 1341333 1429890 1530457
37342 1530457 1885759 2411258 2717316 2702361 2757601 3201924 3819915 4225202 4473242 5013737
37332 5013737 6135555 7707541 9358523 10617762 10966698 10168724 8654427 7246547
37324 7246547 6335056 5592998 4656860 3734635 3232101 3076719 2861764 2513769 2338262
37315 2338262 2428238 2497712 2375977 2231277 2172319 2044166 1801222 1675529 1743175 1735262
37305 1735262 1573934 1656127 2171737 2539424 2115982 1221284 793373 1106485 1499336 1429038
37295 1429038 1133425 1038279 1099941 1082844 1036043 1096972 1142294 1015999 872249 945868 1169639
37284 1169639 1334153 1448803 1619769 1725141 1565510 1257180 1154880 1424825 1960186
37275A960186O78800P13102M67966q4127n82530o94348n59516n02042m94457k74738
37265F28296J19309L17527J35308j75948k74155j19979O0916Q2818j3563l9637
37255G20892R7710K39629J37847j94342m16916k60434J02867K42468L637k94804
37245C78554k53811J13074L96908L04288J8847p3083P0458J24828m7772j52442
37235H79849L1460K21784P5863j91784j30508J50418J07986l00171m61042p9486
37225C04369L25780K55353m600N7577L08341K62544n1917j69726R982J20348J3135
37214A431186k5285J61762L15003K08555K599l7987J12269L32893N49502O86585
37204C737082O23038L23407j05884n24497p96259p74826m64295j47436j01032
$$ plain form
37275 1960186 2638986 3352088 3820054 3735927 3153397 2459049 1899533 1397491 903034 628296
37265 628296 747605 1065132 1200440 1024492 750337 630358 691274 774092 760529 720892
37255 720892 818602 1058231 1196078 1001736 584820 324386 427253 669721 673358 378554
37245 378554 124743 237817 634725 939013 957860 884777 955235 1080063 1032291 879849
37235 879849 911309 1133093 1208956 1017172 886664 1037082 1145068 844897 383855 304369
37225 304369 630149 885502 880902 938479 1246820 1509364 1457447 1287721 1297703 1418051 1431186
37214 1431186 1405901 1567663 1882666 2091221 2093820 2055833 2168102 2500995 3050497 3737082
37204 3737082 4360120 4683527 4577643 4053146 3256887 2482061 2017766 1870330 1769298
37195A769298k20330k04567o2839p5052k49952k45176O1516L21034K20372r5997
37185A218307l13319l45034k36328J4269K83664K74823n6433k84749o4787L24277
37175H14690L63210M7519j69774r3850J6157k0335l8411P1044J01511q7928k50226
37164G53607j14218J54660K05240P2017R3712K83478K28952k21337n85522l98875
37154D71714N9649J50323j68531l04570K3171L68468K94980J2652p4027j8439
37144H15390p7138j47759N891K11265J41177n6059J2439K28581J11987k79926
37134I65848l30633J11840M17877J74549j79863j38949O1802m1074l00964k61715
37124D78718K4498J07753r9543k35659r3920J50819K86910K64857J05279p3848
$$ plain form
37195 1769298 1548968 1344401 1281562 1206510 956558 711382 772898 1093932 1314304 1218307
37185 1218307 904988 559954 323626 337895 621559 896382 839949 555200 490413 814690
37175 814690 1177900 1225419 1055645 961795 977952 957617 919206 990250 1091761 1003833 753607
37164 753607 639389 794049 999289 1071306 1165018 1448496 1677448 1456111 870589 471714
37154 471714 531363 681686 513155 208585 231756 600224 895204 907856 833829 815390
37144 815390 738252 590493 596384 807649 948826 892767 905206 1133787 1245774 965848
37134 965848 635215 747055 1164932 1339481 1159618 1020669 1082471 1041397 740433 478718
37124 478718 503216 610969 511426 275767 181847 332666 619576 884433 989712 915864
37114I15864l5904K58852M52081K33573j62424k74057q1729M1999n8094j82561
37104A107600j86397j19149N820J99954K96379J31533j15004j33979K3327O2656
37094A272740k0891K6231J98555K22166N9128n5593q5347j94894k69501m264M44033
37083A592363N08932R6074k00603k4765K10086P5494j64068p6817J85608K10142
37073B412446K9862m5803k8234j24542k29190r4371J34554R4426j67502k60537
37063A721109j08914l3368j57892k31015j18747j4300k6906J8355K03422L15218
37053A566962K08265L5270p0292k07875l94625l83308q0581J69669P3619j17031
37043H00073k1259J87349N1216l19923l01563K34518N90097K45804l32059l80895
$$ plain form
37114 915864 879960 1138812 1590893 1824466 1662042 1387985 1306256 1348255 1290161 1107600
37104 1107600 921203 802054 807874 1007828 1304207 1435740 1320736 1186757 1210084 1272740
37094 1272740 1251849 1278080 1476635 1698801 1757929 1702336 1616989 1422095 1152594 1148330 1592363
37083 1592363 2101295 2197369 1996766 1972001 2182087 2257581 2093513 2016696 2202304 2412446
37073 2412446 2442308 2396505 2368271 2243729 2014539 1920168 2054722 2149148 1981646 1721109
37063 1721109 1612195 1578827 1420935 1189920 1071173 1056873 1029967 1048322 1251744 1566962
37053 1566962 1775227 1810497 1740205 1532330 1137705 754397 673816 843485 917104 800073
37043 800073 778814 966163 1017379 697456 395893 630411 1220508 1466312 1134253 753358
37033G53358M7555K81231J23920N6725L19037M75111J58582k97036l59890n5502
37023A503091J83577J60920J4653j41829k95202l54618k26925l537J68638K84573
37013A293341L36637J82700j58417l18368n4248L03458K96803K9617o9360K2546
37003A864709N703o4562J40133M82741M26144n1683l20539q9201J62847M9355
36993B605647j13963J0316J29101j03706l81886k40501J37812K42147P0315K5085
36983B380367J79044K47632J69606J47360J78926P3206j06757j03803M9847P0152
36973C285580o4543q1768R4971K54502L09782L68229L65872R4772l17154m13481
36963C896762o2014L02170K89311O1214l444J50369L09346L64099L58291L00481
$$ plain form
37033 753358 800913 1082144 1206064 1262789 1581826 2056937 2215519 1918483 1558593 1503091
37023 1503091 1686668 1847588 1862241 1720412 1425210 1070592 843667 840130 1008768 1293341
37013 1293341 1629978 1812678 1654261 1335893 1281645 1585103 1881906 1911523 1842163 1864709
37003 1864709 1870412 1805850 1945983 2428724 2854868 2803185 2482646 2393445 2556292 2605647
36993 2605647 2491684 2502000 2631101 2527395 2145509 1905008 2042820 2284967 2355282 2380367
36983 2380367 2559411 2807043 2976649 3124009 3302935 3376141 3269384 3165581 3215428 3285580
36973 3285580 3221037 3139269 3234240 3488742 3798524 4166753 4532625 4627397 4310243 3896762
36963 3896762 3834748 4136918 4426229 4487443 4483999 4634368 4943714 5307813 5666104 5966585
36953E966585J64187K2344J4177J81230M06638N06777L92640J93663J63894L59430
36943H371565M97444L14230j7262p7359K20072N23479N61489M73021M99256O02205
36933A1968140N83712M20917K81343K74664L40049L56844K82958K02883K65315
36924A4976825N18908P99555Q69541O92922M69681L54504K65386P4770j07661
36915A8914431l0094K99352M95400K51455j87849k83152M2208K43643m5681m20635
36905A9279078l29401q847j56566p51032r67182m57065M8399j53661o97417q23351
36895A4982955n58650m76625o41933o25105m01766m04689o72033p23733m24017
36886A0054404k54854m86145p03360n00027j25629m6963k42646l41737k27431
$$ plain form
36953 5966585 6130772 6153116 6167293 6348523 6755161 7261938 7654578 7848241 8012135 8371565
36943 8371565 8869009 9183239 9165977 9088618 9308690 9832169 10393658 10866679 11365935 11968140
36933 11968140 12551852 12972769 13254112 13528776 13868825 14225669 14508627 14711510 14976825
36924 14976825 15495733 16295288 17164829 17857751 18327432 18681936 18947322 19022092 18914431
36915 18914431 18884337 19183689 19679089 19930544 19742695 19459543 19501751 19745394 19699713 19279078
36905 19279078 18949677 18940830 18784264 18033232 17066050 16608985 16657384 16503723 15806306 14982955
36895 14982955 14424305 13947680 13305747 12680642 12278876 11874187 11202154 10478421 10054404
36886 10054404 9799550 9313405 8610045 8110018 7984389 7937426 7694780 7353043 7125612
36877G125612j36182k57443m88304n63628l34376M1540K11901M1990j90618k00205
36867E250287j24626k46276m51226l94930j07942M4067l5401j07292j15982k36174
36857C474505l88456k91178m9722o8411k84282j86502K33322L22617j38071m72457
36847B151365j92036K10667J34523j52732j10113R4085p316k43397j19929K43343
36837B008460L12271N7364j07974j27859k60823l80909j38309K50308K03938k17525
36827A598942l45040k7701J23283j75265l82394p9036L39679L71572J73883J20855
36817A718778J28347l7373j96430n7247K11662K20844l5257k43284k57046j44098
36807A308896N4835K52139K12611j00852l03267j10277J50215K0311l12407l01851
$$ plain form
36877 7125612 6989430 6731987 6243683 5680055 5345679 5387219 5599120 5641110 5450492 5250287
36867 5250287 5125661 4879385 4428159 4033229 3925287 3969354 3933953 3826661 3710679 3474505
36857 3474505 3086049 2794871 2745149 2676738 2392456 2205954 2439276 2761893 2623822 2151365
36847 2151365 1959329 2169996 2304519 2151787 2041674 2135759 2128443 1885046 1765117 2008460
36837 2008460 2320731 2378095 2270121 2142262 1881439 1500530 1362221 1612529 1816467 1598942
36827 1598942 1253902 1226201 1349484 1174219 791825 712789 1052468 1424040 1597923 1718778
36817 1718778 1847125 1809752 1613322 1556075 1767737 1988581 1953324 1710040 1452994 1308896
36807 1308896 1363731 1615870 1828481 1727629 1424362 1314085 1464300 1484611 1172204 870353
36797H70353K3126R0201k17959l16070Q9883M34590J74157l01655k62362J88978
36787G73242K65867k43139o01187k24866M45114N98240J80499j60960p6931R7479
36777A053358k949k23650k19282J467J52946J09392r413q8748j12203n9677O7600
36766F68841J44025M1647j49493k07662r0986J8295j830o9379q0432n6670m5965
36755A70391l5465l2370p3613q7302O5703L02211K84619j16683n03639l88061
36745d14209J21411L98679J18188l18059l41877L7235L18123K12434m5265j02071
36735a5411P4128K68508L25037K23090m042k47466l13013j18708J47230K33082
36725E72435J40903N9441L5955m5895j67672j39464N7575J65247L5484j19733
$$ plain form
36797 870353 893479 983680 765721 449651 539534 974124 1148281 846626 584264 773242
36787 773242 1039109 795970 194783 -30083 415031 1013271 1193770 1032810 955879 1053358
36777 1053358 1050409 826759 607477 608944 761890 871282 861869 773121 660918 601241 668841
36766 668841 812866 854513 705020 497358 406372 424667 422837 353458 273026 216356 170391
36755 170391 134926 102556 28943 -58359 7344 309555 594174 477491 -26148 -414209
36745 -414209 -292798 105881 224069 -93990 -435867 -398632 -80509 131925 86660 -15411
36735 -15411 58717 327225 652262 875352 871310 623844 310831 192123 339353 572435
36725 572435 713338 772779 808734 762839 595167 455703 513278 678525 714009 594276
36715E94276o7161P2834M5704j11312j65708j06672j28569k27304j69378P2030
36705a91260J95008M4272r2667P9883L55671K86827j35776m23903k70267L9566
36695a12646P8702j06682j34793P8776J98532L7645j12008N2735L20347K57301
36685E57909j10060l12426j36171J05671J16854L4561O8764P9902j26579l37302
36675e8877j97027J84370L37552J30746p6861m9196k049j31340k14390J830L06225
36664B30983L05171L5517j07037N463Q6693l3958j33951k5706Q1505o3317k80267
36653A01096k05290J16333K80439J53474L9073J13273J05653k08507n42984m90738
36643e38178j48673O1211O0826J50485L98276M68698J77169j91587l06923k00547
$$ plain form
36715 594276 527115 599949 645653 534341 368633 261961 133392 -93912 -263290 -191260
36705 -191260 3748 48020 -44647 35236 390907 677734 541958 118055 -152212 -112646
36695 -112646 -33944 -140626 -275419 -196643 1889 39534 -72474 -19739 300608 557909
36685 557909 447849 135423 -748 104923 221777 256338 325102 405004 278425 -58877
36675 -58877 -255904 -71534 266018 396764 319903 270707 268658 137318 -77072 -75242 230983
36664 230983 536154 571671 464634 470097 556790 522832 388881 363175 444680 381363 101096
36653 101096 -104194 12139 292578 446052 485125 598398 704051 495544 -47440 -538178
36643 -538178 -686851 -625640 -564814 -414329 -16053 452645 629814 438227 131304 -69243
36633f9243n4394R8726K23375J37837j69512l33139p6484L02938L03742m4460
36623C19386k37421n7099J60504J11759j9276Q2624L31182L59281N5333k90437
36613H15836l73052j95568N7286K88357M71635M75114J63266k80959m22185j49910
36603H49820P0274j63023n24571m12783P0851K21811j34298l25086O1612M62229
36593A76836K58507j90820j62804K21151K51497j37026k96956j0935J87462j605
36583B95307j62270K6576K25929R2299j20763q4126J6094p8825j28171J64087
36573B46137M92644L50443j49888m43905l48035j58150k9536J52448L10628J78973
36563F01759j52230k40536Q779J55286m8890k30219j5386L29203L01668o8982
$$ plain form
36633 -69243 -123637 -24911 198464 336301 166789 -166350 -242834 60104 363846 319386
36623 319386 81965 24866 185370 297129 277853 360477 691659 1050940 1106273 815836
36613 815836 442784 247216 304502 592859 1064494 1539608 1702874 1421915 999730 849820
36603 849820 920094 757071 232500 -180283 -109432 112379 -21919 -347005 -285393 176836
36593 176836 435343 244523 81719 302870 554367 417341 120385 109450 296912 295307
36583 295307 133037 159613 385542 477841 357078 272952 289046 210221 82050 246137
36573 246137 738781 1089224 939336 495431 147396 -10754 -40290 112158 422786 601759
36563 601759 449529 208993 217772 373058 324168 93949 78563 407766 709434 640452
36553F40452l18128k57902j37315j25122p7688Q3229J48401j9078j88206q9632
36543c40989J43032J57645p5043k13568o4734J36612J01414p6485p4439J67748
36533a38807L46480K10606r9162k34463q0243J21967J11214m7798q2785O0715
36523A67724J18402o7654k36125p0478K62538L00978m247j90453q476J89770M8834
36512E10813k04912j66836O8987J16113k6220k9291J27478J21589r7136j83779
36502B36806N979J78612J15087k2325p9540j77563l57786l66774q5140J79673
36492c72971J44505p386M3227K47662L46476K95845K08743Q2936r0073j53301
36482G45663m6500j9320k33120l91215j84916J21420O3108k31444k14341J62737
$$ plain form
36553 640452 322324 64422 -72893 -198015 -275703 -192474 -44073 -63151 -251357 -340989
36543 -340989 -197957 -40312 -115355 -328923 -393657 -257045 -155631 -232116 -306555 -138807
36533 -138807 207673 418279 319117 84654 4411 126378 237592 189794 107009 167724
36523 167724 286126 218472 -17653 -88131 174407 475385 471138 280685 272209 461979 510813
36512 510813 305901 139065 208052 324165 297945 268654 396132 517721 420585 236806
36502 236806 242785 421397 536484 514159 434619 257056 -100730 -467504 -552644 -372971
36492 -372971 -228466 -235852 -192625 55037 401513 697358 906101 989037 898964 745663
36482 745663 699163 679843 446723 55508 -129408 -7988 55120 -176324 -390665 -227928
36472b27928L40682O5263k13619j04978J10169Q876k55616k35583O7971K28612
36462b16151P4767q1023N5911L47825M44282K40606k4424q2678M3068Q4337j01919
36451G84601l01168k10902J06390K55110L9069k64642k96968q2263R6908J38790
36441B64925J77026K55526K21180o187k62020l36164k14873l2366J13646J89390
36431C70083J45450m3755k58208k81733n1374K11388K23311j6824k13629j41283
36421e6574P7276J47687r717j83193j67522m352J17898J01832J2310k7428M4080
36410E2297J62907J64593n5980l61603m36794j30782L14636M90105K61172j06663
36400C53888k65192j33353Q9586J72129O0718j05536j42035n081J51293J39805
$$ plain form
36472 -227928 112754 178017 -35602 -140580 -30411 -21535 -277151 -512734 -444763 -216151
36462 -216151 -141384 -222407 -166496 181329 625611 866217 841793 759115 802183 886520 784601
36451 784601 483433 272531 378921 634031 673100 408458 111490 29227 126135 264925
36441 264925 441951 697477 918657 912470 650450 314286 99413 67047 180693 370083
36431 370083 515533 471778 213570 -68163 -119537 91851 315162 298338 84709 -56574
36421 -56574 20702 168389 158672 -24521 -192043 -196395 -78497 23335 35645 8217 52297
36410 52297 215204 379797 323817 -37786 -474580 -605362 -290726 199379 460551 353888
36400 353888 88696 -44657 44929 217058 277776 172240 30205 25124 176417 316222
36390C16222l8481k02471k27188j70298j25770q5506m5558j06512k84414l31472
36380a301448j3664M58325N92121K87740K0814J57871L97589K26451k82345n54684
36370a1230l37530N993R6369K6171N7995J63568J45477J7328k9025N3789J21588
36359C10493Q3728N998l2670n0503j10676k23238k96850j94440Q0669K76119J44073
36348g297j73850k56292R634K34160J09050j11887l3900K23448K28194l4527j36660
36337E0073O3730J69468r3457l87700k56214J80572L88781J58301j66241j94434
36327h7121L9979K11730J42897k7438p4690K2877R4728M0647l6305j1199O8282
36316C84387Q4805M6224K0494l2391j65033k58439j77729n3590j13882k62872
$$ plain form
36390 316222 277741 75270 -151918 -322216 -447986 -533492 -579050 -685562 -969976 -1301448
36380 -1301448 -1315112 -856787 -264666 23074 43888 201759 599348 825799 543454 -11230
36370 -11230 -348760 -342767 -246398 -220227 -162232 1336 146813 164141 135116 188905 310493
36359 310493 394221 400219 367549 317046 206370 -16868 -313718 -508158 -427489 -151370 -7297
36348 -7297 -181147 -437439 -427805 -193645 -84595 -196482 -230382 -6934 221260 186733 50073
36337 50073 113803 283271 189814 -197886 -454100 -273528 115253 273554 107313 -87121
36327 -87121 -47142 164588 307485 280047 205357 228234 322962 363609 327304 316105 384387
36316 384387 469192 515416 535910 503519 338486 80047 -97682 -151272 -265154 -528026
36306e28026j85755R4956J82292m5739j86465M2415L24814K68578M4263M9824
36296F1157K09539J30804j88226l41078j65741P3958J74151J97988J56103n4823
36286B53832k99241k40667J18263L47092K05871m2782j12288p2311m4908N3447
36276A66308K04952J47459j47415k66855L872K45862N5037k65311k02321J06177
36266D7765J39425j05906j64955N2166J50106j6700j42721p1418K037J1283J11250
36255A2332K01488j0471l40505k17932L32343N35351N1310m25288k63243J09605
36245a5010p384l93822l37356J36615L60673J59542J3670J23248J39856o2388
36235A17644j09584J53029L20365J02522k06387k57067j69440j73964j39199J27312
$$ plain form
36306 -528026 -713781 -618825 -436533 -482272 -668737 -626322 -301508 -32930 11333 61157
36296 61157 270696 401500 213274 -127804 -293545 -219587 -45436 152552 308655 253832
36286 253832 -45409 -286076 -167813 179279 385150 342368 230080 157769 112861 166308
36276 166308 371260 518719 371304 104449 108321 354183 409220 143909 -58412 47765
36266 47765 187190 81284 -83671 -31505 118601 101901 -40820 -112238 -110201 -98918 12332
36255 12332 213820 203349 -137156 -355088 -22745 512606 563916 138628 -124615 -15010
36245 -15010 -22394 -416216 -753572 -616957 -256284 -96742 -83072 40176 180032 117644
36235 117644 8060 161089 481454 583976 377589 120522 -48918 -222882 -362081 -234769
36225b34769M01747L09617p7536l02759j48109J12200J30037o5231j55027R427
36215b0403J82105N2624k66916l21597L2258L37154J55385k68529l61098p4921
36205e53938J04144k5383r6931J57463M50693M09638J19850r8295j74184k41970
36195E1087l08442k56366p8040J05441J95661J72929R0855P2818J81689K67194
36185D94826J24585j78201l57520l14359k08229j10531Q1051L09533L10898M7390
36175A99443j57266r2752N3483O4863J0092j0563q3019k10121j73496P4664K27736
36164i6936J12233j912J05454J86087r646k18875r7595J49485J10648j03327n6577
36153G9039K34243L22742Q9672r9606l9600L8244n6508j76450j69384j23633j15193
$$ plain form
36225 -234769 166978 476595 399059 96300 -51809 60391 190428 125197 -29830 -20403
36215 -20403 161702 214326 -52590 -374187 -341929 -4775 150610 -117919 -479017 -553938
36205 -553938 -449794 -475177 -572108 -414645 36048 445686 565536 467241 293057 51087
36195 51087 -257355 -513721 -591761 -486320 -290659 -117730 -26875 45943 227632 494826
36185 494826 619411 441210 83690 -230669 -438898 -549429 -468378 -158845 152053 199443
36175 199443 42177 -50575 2908 67771 77863 67300 -15719 -225840 -399336 -324672 -96936
36164 -96936 15297 13385 118839 304926 295280 76405 -21190 128295 238943 135616 79039
36153 79039 313282 636024 725696 626090 586490 624734 568226 391776 222392 98759 -16434
36142a6434l2543J73040L19271K41563K7034j23990j34611p4137m9493j01582
36132B28118j39454k9399J75757K29038L2461j88164k15363j34759q9593L484
36122a27874K06073K88769P7709j64859j21478M1080j5575j60472k7719K51677
36112B47331J87692k24381m33452j84769J41899J75450O344j41915k02082j01724
36102e29607K00774M19766J98480k50478l36223k0976J06937j40568k16698J49662
36092d18931M04438J30484j85138l857K95817R7853l18630k32909K57809L80668
36082D07604l6013l41663j61960J18027J36893P6280J30689J03260j27329k64574
36072D1214r3881R8940q998k38288k20300J6856J67166J56480J41048J22455l4519
$$ plain form
36142 -16434 -48977 124063 443334 684897 711931 587941 453330 379193 329700 228118
36132 228118 88664 59265 235022 464060 496521 308357 92994 -41765 -131358 -127874
36122 -127874 78199 366968 444677 279818 158340 199420 183845 23373 -4346 247331
36112 247331 435023 210642 -222810 -407579 -265680 -90230 -83886 -225801 -427883 -529607
36102 -529607 -328833 90933 289413 38935 -297288 -318264 -211327 -351895 -568593 -418931
36092 -418931 -14493 115991 -69147 -73004 222813 320666 2036 -230873 26936 407604
36082 407604 371591 29928 -132032 -14005 122888 199168 329857 433117 305788 41214
36072 41214 -52667 46273 37275 -201013 -421313 -404457 -237291 -80811 60237 182692 148173
36061A48173k34017j91513Q4653K02721n2287l48638k58318J04393K29115m7161
36051c62879k99151j31215K69852M35559K54320P635j07095j51324j75508j14349
36041c74155j568R655q0659r5993m379K2323m7913j9940J53995K44090J41324
36030e3220L9754L8062n3363k60420k29066J75875M71176K36448j64059j26197
36020G4990K08264K02312j88729l45031l0027K46516J12189j14467q1830l596
36010H0591j59041l01525r7532K13951J80601p7432m2452L22884M63389Q4351
36000F67785l88351m22318q6452J42663N7950j05823j03754p212k8573j84437
35990d58522k70218j39057J07673K54018K19950R3839l7479j59505k24882j32311
$$ plain form
36061 148173 -85844 -277357 -192704 10017 -42270 -390908 -649226 -544833 -315718 -362879
36051 -362879 -662030 -793245 -523393 -87834 166486 174121 67026 -84298 -259806 -374155
36041 -374155 -375723 -366068 -446727 -542720 -547099 -524776 -572689 -592629 -438634 -194544 -53220
36030 -53220 -13466 24596 -28767 -289187 -518253 -342378 128798 365246 201187 74990
36020 74990 283254 485566 296837 -48194 -78221 168295 280484 166017 84187 80591
36010 80591 -78450 -379975 -477507 -263556 -82955 -160387 -202839 120045 583434 667785
36000 667785 279434 -142884 -229336 -86673 -28723 -134546 -238300 -245512 -274085 -458522
35990 -458522 -728740 -867797 -760124 -506106 -286156 -192317 -229796 -389301 -614183 -746494
35980g46494J06051K94030K66523J03058J0372M6025Q3942K5635q4358j58329
35970e3545j68127j25374m9783J4998K7025J0807L2290R4220J23342P8274N727
35959a0146k3063K7704J49286K53758J82437j00399l33024j99173J88421L14285
35949D50086n2492m61448l72667O6097K53839M0082j21432K5651J39524o9470
35939a02230k83312r0952K95836L46435L1939j75343n0946J25770R5498m0575
35929A52120j05774j04728o5188O9631K55825L09074J62408m9326k12678l07135
35919A04229k49883J8780K72922J95861r6296j41149J44200K91973M4677k11140
35909C74174j06036Q8154m3689l23832k96763j4119Q9750l9406l7803J85128K95556
$$ plain form
35980 -746494 -640443 -346413 -79890 23168 33540 79565 163507 189142 104784 -53545
35970 -53545 -221672 -347046 -396829 -381831 -354806 -343999 -311709 -217489 -94147 -15873 -10146
35959 -10146 -33209 -5505 143781 397539 579976 479577 146553 -52620 135801 450086
35949 450086 397594 -63854 -436521 -370424 -116585 -76503 -197935 -172284 -32760 -102230
35939 -102230 -385542 -476494 -180658 165777 197716 22373 -28573 97197 192695 152120
35929 152120 46346 -58382 -123570 -53939 201886 510960 673368 624042 411364 104229
35919 104229 -145654 -126874 146048 341909 245613 104464 248664 540637 585314 374174
35909 374174 268138 356292 312603 -11229 -307992 -322111 -232361 -271767 -309570 -124442 171114
35898A71114J44446L85K8014P533k08555l61999j88780J48665L14541K64585J79934
35887D99883J01210p3411k89564l14335o5558K15363K25038l5357k53725j78726
35877a69182Q0165K02971O6083j37359j96148j30628o4532j5483M9782Q5906N0911
35866a77514J3326L3437M2485k4918j01768j26983j54395j68146O633L85594O23616
35855C51367M23412j7699k76569k62778j76670q4539N2064O6822j96326m26514
35845e47430j55453M42582O36922J79564l03313k31334J28110J73052j14287k47925
35835c9512k4861K39648K26385O856j33733o4150P1238M1412j64928k73992r1982
35824b07619J46375O2718k55146l02907Q3154M22209K70093j51804l24594j50498
$$ plain form
35898 171114 315560 315945 343959 351492 142937 -219062 -407842 -259177 55364 319949 499883
35887 499883 601093 527682 238118 -76217 -141775 73588 298626 263269 9544 -169182
35877 -169182 -89017 113954 180037 42678 -153470 -284098 -348630 -364113 -314331 -228425 -177514
35866 -177514 -164188 -130751 -88266 -113184 -214952 -341935 -496330 -664476 -657843 -272249 351367
35855 351367 774779 757080 480511 217733 41063 -43476 8588 75410 -120916 -547430
35845 -547430 -702883 -260301 376621 556185 252872 21538 149648 322700 208413 -39512
35835 -39512 -64373 175275 401660 408516 274783 210633 281871 323283 158355 -115637 -207619
35824 -207619 -61244 1474 -253672 -556579 -473425 -51216 218877 67073 -257521 -408019
35814d08019N5812R7292M0991n1349j77494k16183j3857L24218M75843K84042
35804D11296o9671k98805k90002j39247j2113J5116N145L0850M1529k3406n0436
35793c79744Q9632K30549Q3986k37780k76576N1413K41190j6268k83356m7219
35783e44173M21337M45420k0790l31379j01279L13531L85282N4327l31655m29610
35773a38989j60080K31671L52388Q6776k14126j83554N3673J17860k6935r4322
35763B4362n02N6095J632m6439r5530k30141k76689j54L64083L17271j03694l17860
35751c07566j19248K7477j53033k48182Q4528M51326L38145o6751k30648j03460
35741c27412j4113j3188R6851K51014J94604l1943j56145j22829n5762P7402L06039
$$ plain form
35814 -408019 -352207 -254915 -213924 -265273 -442767 -658950 -672807 -348589 127254 411296
35804 411296 341625 42820 -247182 -386429 -398542 -383426 -378281 -347431 -305902 -329308 -379744
35793 -379744 -290112 -59563 24423 -213357 -489933 -438520 -197330 -213598 -496954 -544173
35783 -544173 -122836 322584 301794 -29585 -130864 182667 567949 622276 290621 -138989
35773 -138989 -299069 -67398 284990 371766 157640 -25914 27759 145619 118684 24362
35763 24362 23860 79955 81587 35148 -60382 -290523 -567212 -567366 -203283 113988 10294 -307566
35751 -307566 -426814 -399337 -552370 -800552 -716024 -264698 73447 6696 -223952 -327412
35741 -327412 -341525 -354713 -257862 -6848 187756 155813 -332 -123161 -178923 -101521 204518
35730B04518L42372m2541m76536m08968K3949J93175j6160j04045R1890J18859
35720g3487k06276l90634j05234K40855K18840P6702J89322L34545J31760k03299
35710B13094j97226P2201J51012p440o5793K6004N984j27239j22561k3357j07038
35699a82359k82359j67953J82886K81996L7979q3879Q4456J11349j77175k62702
35689d57761J66834N44284K76691k69589l66855r1157o8733l25065k82811J51006
35679g23156L78616J22024j56403r1041M7561j2107k3056K25797M00162J83209
35669C51606j11791n6218J39919P698l20596l07054O6889K52504K4459k16588
35659a69172j56091p715l4372j23173r9711m5454k6366J07060L50437L58074j2501
$$ plain form
35730 204518 546890 504349 27813 -381155 -357206 -164031 -180191 -284236 -192346 -73487
35720 -73487 -279763 -670397 -775631 -534776 -315936 -239234 -49912 284633 416393 213094
35710 213094 15868 88069 239081 231641 165848 191852 197836 70597 -51964 -75321 -182359
35699 -182359 -464718 -632671 -449785 -167789 -129810 -213689 -129233 -17884 -195059 -457761
35689 -457761 -290927 253357 530048 260459 -106396 -197553 -266286 -591351 -874162 -723156
35679 -723156 -344540 -222516 -378919 -469960 -422399 -434506 -457562 -231765 168397 351606
35669 351606 239815 183597 323516 331214 10618 -296436 -229547 22957 47416 -169172
35659 -169172 -325263 -332978 -367350 -490523 -590234 -635688 -662054 -554994 -204557 153517 141016
35648A41016l21327j53244J90826J33165k55680l68378k7326K83807K32845Q4134
35638f0162J19447J56092k3489k01131q8994J55539J96306N3154m0734r8709k49875
35627h2556l22658o6727K92894K59919j54385l82946j41126J91380K13534N1682
35617a40989j964K4702p506o429J19176J70418k4419k40916j81093M2235J16386
35606a30399K7067l8256q3505j77802j39114J63622L69220O6738m26758l93274
35596g62461J69978M68052R7478l79278l44143L1706K59942K91205L05106K05662
35586C43247j20027l76904k43177P2269J56859M6770M8198J30242M4596j21420
35576a9347q5789M9795n2572l06610k88493K3526J99628R6076L7564J62596J97691
$$ plain form
35648 141016 -180311 -333555 -142729 -9564 -265244 -633622 -660948 -377141 -144296 -60162
35638 -60162 59285 215377 191888 -9243 -98237 57302 253608 306762 266028 167319 -82556
35627 -82556 -405214 -471941 -179047 80872 -73513 -456459 -597585 -406205 -192671 -140989
35617 -140989 -142953 -118251 -125757 -132186 -13010 157408 132989 -107927 -289020 -246785 -130399
35606 -130399 -103332 -141588 -225093 -402895 -542009 -378387 -9167 57571 -369187 -762461
35596 -762461 -592483 -124431 -26953 -406231 -750374 -718668 -458726 -167521 137585 343247
35586 343247 223220 -153684 -396861 -324592 -167733 -120963 -72765 57477 102073 -19347
35576 -19347 -105136 -55341 -107913 -414523 -703016 -679490 -479862 -383786 -346222 -183626 14065
35565A4065M9224J5332J80749J94230o7608k06033j8632Q1760j88561l96029j11778
35554d53281K86546K12639j30325j13035K27036K76473p8999k92937j14528P3101
35544a07310K8007K8716K17224K45787n3503k55087m8057J74934k6735l44923
35534a40947k17817J90965K20765k03700m36219j25269K80674K73218L203p7480
35524b32607Q5638J96096J25091J1783m8047r5418j26283p7130R502J9089l1131
35513a63417j7645N4614M8296m4809n6311O6072J33410J9595j01731k1267J48575
35502F5382J28424q3339j89834m2328J38907Q8034j50071l18576k76057r3072
35492g32530R1498J83302J51231M3919k5932K0707J56852K90146L28807K12193
$$ plain form
35565 14065 63289 78621 259370 453600 385992 179959 161327 243087 54526 -341503 -453281
35554 -453281 -166735 45904 -84421 -197456 29580 306053 227054 -65883 -180411 -107310
35544 -107310 -79303 -50587 166637 412424 358921 103834 55777 230711 203976 -140947
35534 -140947 -358764 -167799 52966 -150734 -586953 -712222 -431548 -158330 -155127 -232607
35524 -232607 -146969 49127 174218 186001 137954 42536 -83747 -160877 -151375 -132286 -163417
35513 -163417 -181062 -126448 -78152 -122961 -179272 -113200 20210 39805 -61926 -83193 65382
35502 65382 193806 110467 -79367 -121695 17212 105246 -44825 -363401 -639458 -732530
35492 -732530 -641032 -457730 -306499 -262580 -288512 -267805 -110953 179193 508000 720193
35482G20193k5047k05720j58104M5036J36131n70j93356k69124k72839k69923
35472d93323j53996J28287L49145K77710N7695O602J28266J49921n094j29625
35462C15588j16976p8760m3541Q9087K15101N6078l14698l96489J3271L99740
35452A38401K22004k72853l98391k3333K92657J44926k07292k97743n0159K56825
35442a94958L57553J66699k10365m84161l88714l1529J51777l8695k47119m9179
35432i68691L98921N33262J69382k41237k46497L1790J80513J09630N8251J07538
35422A32862P3182q3189j10839R4423K27976J5083l26090l85397j60503J3982
35412e08510L8637J22936K81736K17163j50597m44555l62015j05453J464K8923
$$ plain form
35482 720193 695146 489426 331322 376358 512489 511919 318563 49439 -223400 -493323
35472 -493323 -647319 -519032 -169887 107823 165518 172120 300386 450307 445213 315588
35462 315588 198612 119852 76311 165398 380499 436577 121879 -274610 -261339 138401
35452 138401 360405 87552 -310839 -334172 -41515 103411 -103881 -401624 -451783 -194958
35442 -194958 162595 329294 118929 -365232 -753946 -785475 -633698 -672393 -919512 -968691
35432 -968691 -569770 -36508 132874 -108363 -354860 -323070 -142557 -32927 25324 132862
35422 132862 206044 122855 12016 106439 334415 349498 23408 -361989 -522492 -508510
35412 -508510 -469873 -346937 -65201 151962 1365 -443190 -805205 -910658 -909194 -880271
35402h80271K17034M62120M41326J49585q2465r0328m1629p1804q8957l4035l9648
35391e9072j74578k53914r4496J76322K59166Q3362r0199r73K69586L79334J50756
35380F45294j88367k86577j10949O9156R8965Q1311P0771n4913k72733k90304
35370b38346P295K78940K11437J4193M5687J90928R3110j69063j99027p376j3480
35359B14298k77426l48761m5565K14067J28152k970J24958K43749J1034l18934
35349e7398k68375Q8308K64010J04923j14000k20705k68482j99482R5693L83455
35339a92053K67898j58301l37504o2014K14738J06155j22228l7994K44376K67369
35329A90442m8780l18275k64561k0312J65770K26017K09869J47050O3894p962
$$ plain form
35402 -880271 -663237 -201117 240209 389794 307329 217001 175372 103568 14611 -19424 -59072
35391 -59072 -233650 -487564 -582060 -405738 -146572 -63210 -153409 -154382 115204 494538 645294
35380 645294 456927 170350 59401 128557 227522 308833 379604 324691 51958 -238346
35370 -238346 -231051 47889 259326 273519 319206 510134 603244 434181 235154 227778 214298
35359 214298 -63128 -411889 -457454 -243387 -115235 -118205 6753 250502 261536 -57398
35349 -57398 -325773 -237465 26545 131468 17468 -203237 -471719 -671201 -575508 -192053
35339 -192053 75845 -82456 -419960 -481974 -267236 -161081 -283309 -321303 -76927 190442
35329 190442 141662 -176613 -441174 -461486 -295716 -69699 140170 287220 351114 343152
35319C43152r0687k07277k58669j09490J70902L19039J99892k3868j27193r3249
35309A22552m6600l6126j6840K3303L9439J200p7691j34181o5375J36851K47144
35298A93676K0250l73433m18158L1691M17009K14156k54969k59821K39127N37925
35288C47453K57177j73322k78969j81155j55581r9018J23398K43415J0629k80849
35278a86822k02719J19189K32131P1560n2516k3520K2601P3528J87923J89068
35268D30423r1569l76909k67288R6704K32350Q6751L0549J42769J30929m1478
35258C73231r6899m5579j73038l66667j86771K64486L35839q3721k94152M3251
35248b30020L01937k3488m16810k13168K84319L55423L8010q4635O2573M7110
$$ plain form
35319 343152 252465 45188 -213481 -322971 -152069 166970 366862 342994 215801 122552
35309 122552 75952 39826 22986 46289 85728 86928 9237 -124944 -190319 -53468 193676
35298 193676 213926 -159507 -577665 -545974 -128965 85191 -169778 -429599 -190472 347453
35288 347453 604630 431308 152339 -28816 -184397 -283415 -160017 83398 94027 -186822
35278 -186822 -389541 -270352 -38221 33339 -19177 -42697 -20096 53432 241355 430423
35268 430423 338854 -38055 -305343 -208639 23711 110462 141011 283780 414709 373231
35258 373231 276332 230753 57715 -308952 -495723 -231237 104602 20881 -273271 -230020
35248 -230020 71917 48429 -368381 -581549 -297230 58193 96203 11568 74141 121251
35238A21251j88299k32643L3767K62174K52714J79327J47412L0913j71153k42316
35228A93147j05347N6534R0429K6933n5134r3941k9762P9624N0361j30163j96416
35217a13735k1794J14551l0325k32966j76235J4800K7418q0349l0618J44696J82946
35206b01611O8480O580L5205M6810O5950J52104J94712J32314J30164K02581J6543
35195H49832m90508p21510k39478M21958M75546N6193j31322l6912j83069n22449
35185e21719m27056J38238M49440K13192l2586L6696L0483k50374l21262O7330
35175f17618L38810K9790l70856k00447L05861M28672O5801k54952k24728k2024
35165e21691J30230J86376J28667l4659j70964j63088o2770L4393J02750Q4123
$$ plain form
35238 121251 -67048 -299691 -265924 -3750 248964 428291 575703 606616 435463 193147
35228 193147 87800 144334 234763 261696 206562 112621 82859 162483 212844 82681 -113735
35217 -113735 -135529 -20978 -51303 -284269 -460504 -445704 -418286 -498635 -529253 -384557 -201611
35206 -201611 -133131 -126551 -91346 -44536 21414 173518 368230 500544 630708 833289 849832
35195 849832 359324 -362186 -601664 -179706 295840 352033 220711 183799 730 -521719
35185 -521719 -948775 -810537 -361097 -147905 -180491 -143795 -113312 -363686 -684948 -617618
35175 -617618 -278808 -249018 -619874 -820321 -514460 -85788 -19987 -274939 -499667 -521691
35165 -521691 -391461 -205085 -76418 -111077 -282041 -445129 -507899 -473506 -370756 -286633
35155b86633q2323k43463j54455R2248J26759r8410j91569L2869K44447J59832
35145d00698k3014k6153P7994J21483J48415J95786J37607k528K1449K01446J79585
35134F31372j04007j88616J23719L09967n7673n32346m37982P7776K98656K2114
35124A42980k65253k09521q25P4424L6352O1625K07824L53534K90668n2771m06963
35113B32074l86265l2097J65218m0869k85230j68471J47168K49332Q7677p9498
35103a10961j18379p5598J539L9917n3428j69209o7216J66558J35185j86827k83799
35092g22218P5710L87194K19475o7750K0228K36335O2981l20348l10605R4148
35082c24850K95403M1744k86917l31123j27437J54619L61804K92529n6515k70426
$$ plain form
35155 -286633 -368956 -612419 -766874 -674626 -547867 -646277 -837846 -804977 -560530 -400698
35145 -400698 -423712 -449865 -371871 -250388 -101973 93813 231420 228892 250341 451787 631372
35134 631372 527365 338749 462468 772435 714762 182416 -255566 -177790 120866 142980
35124 142980 -122273 -331794 -332619 -258195 -221843 -160218 47606 401140 691808 639037 232074
35113 232074 -154191 -186288 -21070 -61939 -347169 -515640 -368472 -119140 -31463 -110961
35103 -110961 -229340 -304938 -303399 -263482 -316910 -486119 -553335 -386777 -251592 -438419 -722218
35092 -722218 -646508 -259314 -39839 -107589 -87361 148974 211955 -108393 -418998 -324850
35082 -324850 -29447 12297 -274620 -605743 -733180 -578561 -216757 75772 19257 -251169
35072b51169j0812L94355L67836l3866k29303l5733J29854M942j56632j10169
35062F9303J062j8508r7974j04165p1179p6343r5746p1808J2399J20102J24254
35051b08603q7862l53811l12045P5197L63592K39898l2681q6961l661r287l831
35040d20055J46424K10815J0596j22349J20828L85764J99217j76165j67796J02671
35030B89950O1461k53842k51848J37027L09305k976l52681l47687j13757J46075
35020c78973M14910N58053L58247k8296k00650j45800j81910k91512j61079J18714
35010F1704J08724j69419k12057Q0858K35341N2765j05484m7861l6730j50918
35000a83077q7290J84168K69053O5833n8139J1039k8298j64358o98L72238L29504
$$ plain form
35072 -251169 -261981 132374 500210 466344 237041 201308 331162 336104 179472 69303
35062 69303 70365 51857 -46117 -150282 -221461 -297804 -393550 -465358 -452959 -332857 -208603
35051 -208603 -296465 -650276 -962321 -887124 -523532 -283634 -316315 -403276 -406937 -416224 -420055
35040 -420055 -273631 -62816 -52220 -174569 -53741 332023 531240 355075 187279 289950
35030 289950 351411 97569 -154279 -17252 292053 289077 -63604 -411291 -525048 -378973
35020 -378973 35937 593990 952237 923941 723291 577491 395581 104069 -57010 61704
35010 61704 170428 1009 -211048 -130190 105151 157916 52432 4571 -32159 -183077
35000 -183077 -270367 -86199 182854 248687 190548 201587 173289 8931 8233 380471 709975
34989G09975j67673l52067M7080K71647j48924n37069k42924K32193J61648j38888
34979a65002L8605M79145M31977p2135l06198m9244K05019J56511K4116k6685
34969G16109j13557k59882l07263k19151q7933P8545K49502K32633k1245k10188
34959E7570j15515M3003K8843K558J16156J08965k00255m27805k01810J51957
34949d36333J28278r4727m661L06059K99047o6088k77806j11751J28286J90877
34939F1181J17719o1646l22612l86565k5811M24599M19724J8761k26403j45662
34929a26715r0511j95602j59516J20882L06710K00722N6273R5523J68919J02705
34919D79390m254k8327l6558r2893j33499j41743j76747j79401m2500J15440P9727
$$ plain form
34989 709975 542302 190235 237315 508962 360038 -177031 -419955 -187762 -26114 -165002
34979 -165002 -126397 352748 784725 712590 406392 357148 562167 718678 742794 716109
34969 716109 602552 342670 35407 -183744 -271677 -193132 56370 289003 267758 57570
34959 57570 -57945 -14942 13901 16459 132615 241580 41325 -386480 -588290 -436333
34949 -436333 -308055 -402782 -407443 -101384 197663 131575 -146231 -257982 -129696 61181
34939 61181 178900 117254 -205358 -591923 -617734 -193135 226589 245350 18947 -126715
34929 -126715 -217226 -412828 -572344 -451462 -144752 55970 112243 207766 376685 479390
34919 479390 475136 446809 410251 317358 183859 42116 -134631 -314032 -356532 -241092 -161365
34908a61365n9586j3318J96958K60097J37582J24957K53726J51039k88746n85147
34898A6197l54664Q7589K03971J1094o0764R8933J63071l3352k06869q7072J44605
34887a7261J31620r9317j64089Q5730L03195J54405j61933k14857r604N6896j20445
34876e5660j92125J0036J57771q31j92983j00294Q6418J8936j91070j73007Q1908
34865e50901K58804K45902J94887J53357L9640q9512j10069q5734j17045p0682
34855a31353J70616L47515J54516j93972k15993Q5987K33739L2292j86977j53156
34845A43214j3724K2334r886l3551r5611j84469j63586J547J85464L13421L86233
34834E51386L14823L6265k26838j83287M1468L1808k52883l65145o0766L02236
$$ plain form
34908 -161365 -220951 -234269 -37311 222786 360368 485325 739051 890090 601344 16197
34898 16197 -338467 -250878 -46907 -35813 -96577 2356 165427 132075 -74794 -161866 -17261
34887 -17261 114359 15042 -149047 -63317 239878 394283 232350 17493 7889 64785 -55660
34876 -55660 -247785 -237749 -79978 -80809 -273792 -374086 -287668 -268732 -459802 -632809 -550901
34865 -550901 -292097 -46195 148692 302049 341689 252177 142108 56374 -60671 -131353
34855 -131353 39263 386778 541294 347322 131329 217316 451055 483347 296370 143214
34845 143214 129490 151824 141938 108387 12776 -171693 -335279 -333732 -148268 165153 551386
34834 551386 866209 902474 675636 492349 533817 565625 312742 -52403 -113169 189067
34824A89067K86757k2694k18962j54902m4285p8359j78400j48139M6542K15997
34814a07378J77491M25q9149l7517n392m7186j7979R3688O9760j04002p3115L10498
34802A70144O01567L56194j83129m50080l46289j86408q5256O3237J70363O6058
34792A76401r7379p4781j2708j61926k87949p046M27562L91723j01117l88758
$$ plain form
34824 189067 475824 453130 234168 79266 34981 -43378 -221778 -369917 -323375 -107378
34814 -107378 70113 70538 -18611 -56128 -61520 -108706 -126685 -32997 36763 -67239 -140354 170144
34802 170144 771711 1127905 944776 494696 148407 -38001 -123257 -60020 110343 176401
34792 176401 79022 4241 -8467 -170393 -458342 -465388 -37826 353897 252780 -135978
$$ [...]
##END NTUPLES=NMR SPECTRUM
##END=
