##TITLE=31Pdec_ABDP2209
 CDcl3, 24 sc
 23.9.2020
##JCAMPDX= 6.0         $$ Bruker NMR JCAMP-DX V2.0
##DATA TYPE= NMR SPECTRUM
##DATA CLASS= NTUPLES
##ORIGIN= UXNMR, Bruker Analytische Messtechnik GmbH
##OWNER= root
$$ XWIN-NMR		Version 3.5
$$ Wed Sep 23 08:41:02 2020 Russian Standard Time (UT+4h)  she@DPX200
##.OBSERVE FREQUENCY= 81.013821
##.OBSERVE NUCLEUS= ^31P
##.ACQUISITION MODE= SIMULTANEOUS
##.ACQUISITION SCHEME= undefined
##.AVERAGES= 24
##.DIGITISER RES= 17
##SPECTROMETER/DATA SYSTEM= spect
##.PULSE SEQUENCE= zgpg30
##.SOLVENT NAME= CDCl3
##.SHIFT REFERENCE= (INTERNAL, CDCl3, 0, 182.463)
##AUDIT TRAIL= $$ (NUMBER, WHEN, WHO, WHERE, WHAT)
$$ ##TITLE= Audit trail, XWIN-NMR		Version 3.5
$$ ##JCAMPDX= 5.01
$$ ##ORIGIN= Bruker BioSpin GmbH
$$ ##OWNER= she
$$ F:/spectra/data/she/nmr/P31/1/pdata/1/auditp.txt
$$ ##AUDIT TRAIL=  $$ (NUMBER, WHEN, WHO, WHERE, WHAT)
(   1,<2020-09-23 08:40:25.59 +0400>,<she>,<DPX200>,
      <created by zg, POWCHK disabled, PULCHK disabled
       configuration hash MD5:
       00 E9 B6 7A A2 85 ED C7 34 08 36 98 17 FE 4E 26
       data hash MD5: 32K
       5A CD F2 E0 B0 7B 94 0D 60 84 46 14 10 26 66 19>)
(   2,<2020-09-23 08:40:28.04 +0400>,<she>,<DPX200>,
      <Start of raw data processing
       efp BC_mod = 2 LB = 1 FT_mod = 6 PKNL = 1 PHC0 = -2745.733 PHC1 = 80.00166 SI = 64K 
       data hash MD5: 64K
       65 C8 71 FD 13 D1 83 19 08 13 E3 B1 D6 2E 7E 30>)
$$ ##END=
$$ 
$$ hash MD5
$$ 26 E9 81 74 79 63 ED 9E CD BD D4 F5 EA CD E6 01
##$RELAX= 
##$RELAX= 
##$RELAX= 
##$RELAX= 
##$RELAX= 
##$RELAX= 
##$RELAX= 
##$RELAX= 
$$ Bruker specific parameters
$$ --------------------------
##$DU= <F:/spectra>
##$EXPNO= 1
##$NAME= <P31>
##$PROCNO= 1
##$TYPE= <nmr>
##$USER= <she>
##$AMP= (0..31)
100 100 100 100 100 100 100 100 100 100 100 100 100 100 100 100 100 100 
100 100 100 100 100 100 100 100 100 100 100 100 100 100 
##$AQSEQ= 0
##$AQ_mod= 1
##$AUNM= <au_zg>
##$AUTOPOS= <>
##$BF1= 81.014009
##$BF2= 200.13
##$BF3= 200.13
##$BF4= 200.13
##$BF5= 200.13
##$BF6= 200.13
##$BF7= 200.13
##$BF8= 200.13
##$BYTORDA= 1
##$CFDGTYP= 0
##$CFRGTYP= 5
##$CHEMSTR= <none>
##$CNST= (0..31)
1 1 145 1 1 1 1 1 1 1 1 1 1 1 1 1 1 1 1 1 1 1 1 1 1 1 1 1 1 1 1 1 
##$CPDPRG= <waltz16>
##$CPDPRG1= <>
##$CPDPRG2= <waltz16>
##$CPDPRG3= <>
##$CPDPRG4= <mlev>
##$CPDPRG5= <mlev>
##$CPDPRG6= <mlev>
##$CPDPRG7= <mlev>
##$CPDPRG8= <mlev>
##$CPDPRGB= <>
##$CPDPRGT= <>
##$D= (0..31)
0 1 0 0 0 0 0 0 0 0 0 0.03 2e-05 3e-06 0 0 0 0 0 0 0 0 0 0 0 0 0 0 0 0 
0 0 
##$DATE= 1600836024
##$DBL= (0..7)
120 120 120 11 120 120 24 19 
##$DBP= (0..7)
150 150 150 150 150 150 150 150 
##$DBP07= 0
##$DBPNAM0= <>
##$DBPNAM1= <>
##$DBPNAM2= <>
##$DBPNAM3= <>
##$DBPNAM4= <>
##$DBPNAM5= <>
##$DBPNAM6= <>
##$DBPNAM7= <>
##$DBPOAL= (0..7)
0.5 0.5 0.5 0.5 0.5 0.5 0.5 0.5 
##$DBPOFFS= (0..7)
0 0 0 0 0 0 0 0 
##$DE= 6
##$DECBNUC= <off>
##$DECIM= 4
##$DECNUC= <off>
##$DECSTAT= 4
##$DIGMOD= 1
##$DIGTYP= 9
##$DL= (0..7)
0 0 52 120 120 21 21 25 
##$DP= (0..7)
$$ [...]
##$SUBNAM2= <"">
##$SUBNAM3= <"">
##$SUBNAM4= <"">
##$SUBNAM5= <"">
##$SUBNAM6= <"">
##$SUBNAM7= <"">
##$SUBNAM8= <"">
##$SUBNAM9= <"">
##$SW= 369.568048894756
##$SWIBOX= (0..15)
0 1 3 0 0 0 0 0 0 0 0 0 0 0 0 0 
##$SW_h= 29940.119760479
##$TD= 32768
##$TD0= 1
##$TE= 0
##$TE2= 300
##$TE3= 300
##$TEG= 300
##$TL= (0..7)
0 120 53 12 22 120 120 120 
##$TP= (0..7)
150 150 150 150 150 150 150 150 
##$TP07= 0
##$TPNAME0= <>
##$TPNAME1= <>
##$TPNAME2= <>
##$TPNAME3= <>
##$TPNAME4= <>
##$TPNAME5= <>
##$TPNAME6= <>
##$TPNAME7= <>
##$TPOAL= (0..7)
0.5 0.5 0.5 0.5 0.5 0.5 0.5 0.5 
##$TPOFFS= (0..7)
0 0 0 0 0 0 0 0 
##$TUNHIN= 0
##$TUNHOUT= 0
##$TUNXOUT= 0
##$USERA1= <user>
##$USERA2= <user>
##$USERA3= <user>
##$USERA4= <user>
##$USERA5= <user>
##$V9= 5
##$VALIST= <valist>
##$VCLIST= <CCCCCCCCCCCCCCC>
##$VD= 0
##$VDLIST= <DDDDDDDDDDDDDDD>
##$VPLIST= <PPPPPPPPPPPPPPP>
##$VTLIST= <TTTTTTTTTTTTTTT>
##$WBST= 1024
##$WBSW= 4
##$XGAIN= (0..3)
0 0 0 0 
##$XL= 0
##$YL= 0
##$YMAX_a= 19730
##$YMIN_a= -7473
##$ZGOPTNS= <>
##$ZL1= 120
##$ZL2= 120
##$ZL3= 120
##$ZL4= 120
##$ABSF1= 0
##$ABSF2= 0
##$ABSG= 0
##$ABSL= 0
##$ALPHA= 0
##$AQORDER= 0
##$ASSFAC= 0
##$ASSFACI= 0
##$ASSFACX= 0
##$ASSWID= 0
##$AUNMP= <proc_1d>
##$AZFE= 0.1
##$AZFW= 0.5
##$BCFW= 0
##$BC_mod= 2
##$BYTORDP= 0
##$COROFFS= 0
##$CY= -3
##$DATMOD= 1
##$DC= 0
##$DFILT= <>
##$DTYPP= 0
##$F1P= 0
##$F2P= 0
##$FCOR= 1
##$FTSIZE= 65536
##$FT_mod= 6
##$GAMMA= 0
##$GB= 0
##$INTBC= 1
##$INTSCL= 5.30512e-09
##$ISEN= 30
##$LB= 1
##$LEV0= 0
##$LPBIN= 0
##$MAXI= 10000
##$MC2= 0
##$MEAN= 0
##$ME_mod= 0
##$MI= 50
##$NCOEF= 0
##$NC_proc= -7
##$NLEV= 6
##$NOISF1= 182.463
##$NOISF2= 159.3651
##$NSP= 0
##$NTH_PI= 0
##$NZP= 0
##$OFFSET= 182.463
##$PC= 4
##$PHC0= -2745.733
##$PHC1= 80.00166
##$PH_mod= 1
##$PKNL= yes
##$PPARMOD= 0
##$PSCAL= 0
##$PSIGN= 0
##$REVERSE= no
##$SF= 81.0140089999434
##$SI= 65536
##$SIGF1= 159.3651
##$SIGF2= -187.1042
##$SINO= 113.3802
##$SIOLD= 16384
##$SREGLST= <1H.CDCl3>
##$SSB= 0
##$STSI= 65536
##$STSR= 0
##$SW_p= 29940.119760479
##$SYMM= 0
##$S_DEV= 0
##$TDeff= 32768
##$TDoff= 0
##$TI= <>
##$TILT= no
##$TM1= 0
##$TM2= 0
##$TOPLEV= 0
##$USERP1= <user>
##$USERP2= <user>
##$USERP3= <user>
##$USERP4= <user>
##$USERP5= <user>
##$WDW= 1
##$XDIM= 65536
##$YMAX_p= 293611482
##$YMIN_p= -25057719
$$ End of Bruker specific parameters
$$ ---------------------------------
##NTUPLES= NMR SPECTRUM
##VAR_NAME=  FREQUENCY,     SPECTRUM/REAL,   SPECTRUM/IMAG
##SYMBOL=    X,             R,               I
##VAR_TYPE=  INDEPENDENT,   DEPENDENT,       DEPENDENT
##VAR_FORM=  AFFN,          ASDF,            ASDF
##VAR_DIM=   65536,         65536,           65536
##UNITS=     HZ,            ARBITRARY UNITS, ARBITRARY UNITS
##FACTOR=    0.456856943014862, 1,           1
##FIRST=     14782.0589164792, 0,            0
##LAST=      -15158.0608439998, 0,           0
##MIN=       -15158.0608439998, -25057719,   0
##MAX=       14782.0589164792, 293611482,    0
$$ Real data points
##PAGE= N=1
##DATA TABLE= (X++(R..R)), XYDATA
$$ [...]
44437 -751846 -2203156 -4703840 -5133780 -3770930 -4095167 -7108629 -9205687 -7183511 -2536847
44428 -2536847 1050715 2120133 1387679 -598397 -3393474 -5676087 -6635928 -7418263 -9122941
44419 -9122941 -10192849 -8072495 -3153301 1165493 2593630 2232873 2247834 3041943 3806846
44410 3806846 4505237 5628993 6351788 4602585 -290300 -5888044 -8595123 -7157424
44402 -7157424 -3387987 388324 3202520 4334097 2270647 -3186089 -8604008 -9280760
44394 -9280760 -4458832 1650495 4687728 4237262 2347202 115943 -2413385 -4425717
44386 -4425717 -4772251 -3853419 -3141434 -2899228 -2073382 -534328 308624 -340280 -1314447
44377 -1314447 -1074215 369296 1879763 2663415 2400407 611468 -2829953 -6553098 -8180785
44368 -8180785 -6626392 -3466710 -1383724 -1369454 -2137968 -2343463 -2390882 -3338937 -4881376
44359 -4881376 -5820287 -6243768 -7500425 -9646796 -10716994 -9586147 -7987009 -8034256 -8904310
44350 -8904310 -8140028 -5790136 -4787452 -6626725 -8721103 -7398729 -2338394 3363077
44342 3363077 6836207 7677801 6790816 4755372 2292364 1191292 2869862 5729957
44334 5729957 5786590 1454090 -3478147 -4006752 -730641 487442 -3419805 -8224258 -8397894
44325 -8397894 -4897314 -3102361 -4479686 -5149850 -3086657 -1731618 -4045531 -6942713
44317 -6942713 -5440824 -38767 4181726 4872914 4707669 6019433 7013944 5107210 1316811
44308 1316811 -1165467 -1375506 -1135750 -1802965 -2792412 -3508123 -4534492 -5881221 -5799143
44299 -5799143 -3106152 308983 1455840 469045 491912 2804678 4649482 3573706 1618004
44290 1618004 2289730 4739320 4656165 991762 -2017118 -921673 2168055 3322835 2741577
44281 2741577 3594014 6161095 6822583 3322935 -1808171 -4409679 -3548229 -1813442 -1663835
44272 -1663835 -2869576 -3599280 -3143659 -2819482 -4017006 -6021745 -6804774 -5881171 -4931181
44263 -4931181 -4991575 -4583368 -1995931 1728953 3933574 3940805 3622410 4302123 4778063
44254 4778063 3129552 -388112 -2931223 -1558637 3651535 8994044 10496688 8086036
44246 8086036 5094009 3375831 1328960 -1937477 -3577486 -1390971 1107676 -1390805
44238 -1390805 -7788510 -11161433 -8014438 -2351878 654583 447112 -1414804 -4817842
44230 -4817842 -8850983 -9895480 -6153989 -1495263 -768320 -3370004 -5339167 -5650659
44222 -5650659 -5876058 -5361473 -2143409 1905723 2335822 -970004 -3244815 -2262421 -1264216
44213 -1264216 -2633684 -3611027 -1339661 1936485 2473890 851370 368952 1703648 2764122
44204 2764122 2426148 1216057 -482845 -1978658 -1381006 1748240 4118147 2461021
44196 2461021 -1367383 -2567098 -46789 2836011 3931650 4604512 5806416 5875868 3792152
44187 3792152 1309399 -33983 -1341939 -3867815 -6347313 -6740363 -4828017 -1500155
44179 -1500155 2654898 6489508 8045031 7005288 5631137 5503750 5266763 3555604
44171 3555604 2042133 2967039 5353879 6492349 5800754 4342744 1906677 -2007309
44163 -2007309 -5229357 -4796125 -1687223 -39412 -1324431 -2895431 -2958923 -3167260 -4789090
44154 -4789090 -5870272 -4508295 -2155774 -1068262 -558856 1541143 5086280 7674708
44146 7674708 7611746 5091246 1573261 -449038 1330783 5957986 8818207 6732855
44138 6732855 2260785 272590 1277251 1403041 -1254051 -3812831 -3137694 -375695
44130 -375695 749579 -1484788 -5459337 -8426812 -8837624 -7065992 -4752404 -3232896
44122 -3232896 -2338952 -1035144 985387 3094460 4847984 6203080 6690995 5671487
44114 5671487 3677489 2311447 2328016 2790696 2617334 2070291 2076499 2703553 3071362 2717260
44104 2717260 2609291 4332033 7861704 10602157 9925823 6766482 4813341 5310517 4939139
44095 4939139 741301 -5045134 -7925000 -7191131 -5482135 -3619976 -432525 2565747
44087 2565747 1590685 -2959804 -5454227 -2990603 11989 -1354939 -4962244 -5495233
44079 -5495233 -3025166 -2387338 -5141762 -7392434 -5997139 -2595727 -289896 312818
44071 312818 330319 438080 829456 1519276 1803105 1002317 125610 918912 2982280 4059224
44061 4059224 3681176 3953953 5634552 6030132 2779116 -2126125 -4372114 -2416337 1383129
44052 1383129 4082490 4788363 4281658 3722309 3979434 5055843 5739813 4524125 1288448
44043 1288448 -2201946 -3716603 -2538404 -136730 1194994 626055 -383994 86746
44035 86746 1953371 3159423 2253787 232325 -583731 823240 2987734 3432892 1341582
44026 1341582 -1443771 -2593491 -2207759 -2289558 -3141689 -2413449 828107 3236873 1255089
44017 1255089 -3168685 -4522252 -1357918 1780996 1120484 -1301275 -1576625 98072
44009 98072 557679 -1136175 -3155379 -4720640 -6903083 -9373149 -9585760 -6500412 -2751448
44000 -2751448 -1375790 -1999804 -2285872 -2119200 -3699368 -7100028 -8294205 -3722053 4184056
43991 4184056 8596582 5890144 -417216 -4410128 -4549618 -3800275 -4505501 -5976834 -6868039
43982 -6868039 -7075528 -6607247 -4894255 -2286551 -432033 -156306 -552639 -1007622 -2262486
43973 -2262486 -4269543 -4870836 -2375678 1790674 4650304 4947071 3524595 1507407
43965 1507407 -421150 -1806567 -2885491 -4550857 -6814855 -8282518 -8093741 -7014470
43957 -7014470 -5510056 -2601618 1604699 4135588 2414040 -1906061 -4831657 -4733991
43949 -4733991 -2748592 241035 3877019 6347244 5677711 3114779 1987371 2776436
43941 2776436 2426407 -752884 -4615564 -6721116 -7412462 -7853195 -7667137 -6460026 -5510436
43932 -5510436 -5789326 -5843456 -3685589 235383 3575824 4762933 3946365 2312380 1483996
43923 1483996 2448916 4143493 4422175 3219559 2881471 4222983 4609072 2024649 -1044608
43914 -1044608 -640303 3076669 6249368 6606861 5355038 4144598 3271184 3170909 4653475
43905 4653475 6656753 6367144 2976490 -712759 -1818195 -651121 1025535 3032516
43897 3032516 5804707 7775791 6612588 2901697 43640 -101408 667697 127626 -908154
43888 -908154 -88678 2658433 4919359 5228280 4763685 5071304 5699147 5221714 3561579
43879 3561579 1869426 596312 -719890 -1611530 -277294 3829303 7880314 7827964 3077815
43870 3077815 -2170994 -3294511 -380979 2338745 2034844 281747 -388220 -719338 -2923328
43861 -2923328 -5808622 -5369409 -839905 3250269 2867940 -423152 -2517642 -2595949 -2863961
43852 -2863961 -4060760 -4630878 -3746234 -2114187 -146673 1830760 2018117 -994121 -4899539
43843 -4899539 -5541413 -2343056 1380751 3660192 5543374 6991222 5740919 2142165
43835 2142165 679464 3670637 7145324 6515798 3213301 1663257 2164032 1370497 -1463254
43826 -1463254 -3221195 -1731355 1686202 4493307 4996630 2534913 -1673878 -4344303
43818 -4344303 -3373165 -580240 1310187 3008811 6534947 10115645 9819783 6032162
43810 6032162 3418619 3656606 2985895 -1217861 -5751998 -6132411 -2552754 1433814 3563785
43801 3563785 3524265 1264398 -2359556 -4621592 -3280272 644781 4046508 4914011 3359335
43792 3359335 866952 -346490 1216193 4270678 5616461 4021202 1399836 -708259
43784 -708259 -3183839 -6329828 -7777665 -5873376 -2706032 -1008400 -286654 959503
43776 959503 1442040 -785371 -4174045 -5711370 -5811194 -6892004 -8090936 -6303444 -2248262
43767 -2248262 -172767 -744583 277686 4319110 6263509 1848099 -5539658 -9614017
43759 -9614017 -9431693 -8375263 -7554138 -5494082 -3066274 -3160104 -5201386 -4999675 -1279224
43750 -1279224 2019501 1792015 114220 -73334 -84730 -2622499 -6173082 -6539770 -3148026
43741 -3148026 137518 665707 -46095 137758 650519 150718 -651956 -315886 590984
43732 590984 204197 -1785441 -3646934 -3724857 -1958847 309055 1210310 -285980 -2989437
43723 -2989437 -4279278 -3206049 -1739265 -1787630 -2399658 -1756318 -629351 -1277455 -3538942
43714 -3538942 -4796680 -3800063 -1907572 -376283 869821 1377964 14532 -2403853
43706 -2403853 -3138837 -1402306 518566 1292559 2609264 5342684 6941526 5469977
43698 5469977 3328327 3442743 4239661 2571302 -312713 -647263 967695 11408 -4194484
43689 -4194484 -6496624 -3559038 976851 1747272 -1264019 -3899787 -3603078 -1015442
43681 -1015442 2473166 5891214 8338274 9719353 11108452 12755837 12845350 9945409
43673 9945409 5540294 2339768 1163428 1165453 1754457 2323533 1605736 -286491 -713990
43664 -713990 1615720 3071498 -654331 -7365018 -10095266 -6697806 -2892042 -3665951
43656 -3665951 -6151610 -4726924 193892 3283390 2534223 1319289 2263786 3756363
43648 3756363 3900621 3965005 5436839 6485366 4501131 779939 -346564 3060657 8119068
43639 8119068 10330211 7762501 2034461 -3406507 -5718852 -4617599 -2435249 -1697709
43631 -1697709 -2677380 -3910657 -4523563 -4765592 -4648971 -3771686 -2528390 -1736977 -855939
43622 -855939 1416226 4280530 5016285 3262474 2592006 5587953 9439023 9468761 5750097
43613 5750097 2723959 2673680 3333347 2594588 1885256 3017402 4615452 4355867 3027976
43604 3027976 3629082 7077242 10976813 12405469 10361176 5810103 851649 -2321009
43596 -2321009 -2972569 -2393642 -2149655 -2202365 -1600926 -246258 1236524 2619309 3680929
43587 3680929 3505803 1815730 169264 -169766 -696188 -3320247 -6118978 -5003095 -206042
43578 -206042 2688062 44420 -4858350 -6867817 -6013353 -5779426 -6398206 -4637598 -20154
43569 -20154 3401084 2832055 648648 434871 1893946 2327372 1409557 1618229 4400265
43560 4400265 8175827 10369100 10022042 8165212 6501405 5914451 5867994 5341081 4345449
43551 4345449 3826563 3997235 3967619 3458289 3418767 4064881 3836610 1684846 -941097
43542 -941097 -2048759 -1903779 -2041571 -2536609 -2413722 -1968156 -2256778 -2762076 -2113692
43533 -2113692 -911533 -1105182 -2465975 -2561735 -745679 789374 847097 1085344 2578327
43524 2578327 3451311 2034270 -126417 -838962 -756559 -1656988 -2993932 -3077500 -2404193
43515 -2404193 -2744998 -3689950 -3189818 -1286312 -300268 -996796 -1266232 575553 3331605
43506 3331605 4785083 4457532 3497781 2769639 1836192 -432487 -4223582 -7550833 -7536504
43497 -7536504 -3738695 835728 3172123 3472696 3476869 3113116 1173863 -1733684 -3570703
43488 -3570703 -3650550 -2623755 -463101 2733210 4692289 3139645 -234254 -1609173
43480 -1609173 -886480 -1654842 -4677234 -5904283 -2796276 1494040 2892580 1932378 1541306
43471 1541306 2212679 2671091 3055639 3987156 4077153 1690245 -1850804 -3728237 -3428379
43462 -3428379 -2496340 -1483345 136877 1717344 1784224 331074 -1372687 -2747707 -3704777
43453 -3704777 -3307188 -852175 2405112 4713555 6139460 7265585 6874060 3843819
43445 3843819 390031 -88147 1755769 1581784 -2510133 -7288488 -8722189 -6372647
43437 -6372647 -2414180 1404738 4470477 6552505 7475128 6798471 3928595 -225994
43429 -225994 -2500444 -737905 2514312 2386744 -1993150 -6432931 -7483380 -6234978
43421 -6234978 -5173002 -4364319 -2824465 -1247574 -905900 -1337447 -1312819 -1012869 -1303079
43412 -1303079 -1711185 -1012925 609518 1562047 861347 -882711 -2341317 -2614431 -1766817
43403 -1766817 -722025 -367579 -594598 -612659 -73018 753605 1520588 1596366 -27514
43394 -27514 -3182977 -5564627 -5234003 -3500622 -3017423 -3636339 -3196128 -2128633 -3362487
43385 -3362487 -6935662 -8924686 -7556170 -6339729 -8330113 -10869463 -9722679 -5742078
43377 -5742078 -3346145 -4171817 -6279283 -8397826 -10759886 -12206311 -10570561 -6370366
43369 -6370366 -2815535 -1635037 -1746079 -2328065 -4058541 -6511130 -7357957 -5570676 -3061970
43360 -3061970 -1732033 -934199 606667 2178591 2265117 1207376 825846 1804494 2939415
43351 2939415 3039502 2508500 2590837 3521899 4096530 3334471 2003840 1544245 1675426
43342 1675426 545749 -2366292 -5206343 -6509616 -7174569 -8162310 -8069039 -5296559 -1318308
43333 -1318308 926968 1208913 1879973 3896241 5633352 5722380 4597669 3038747 1476952
43324 1476952 848388 1719246 2452763 880538 -1954705 -2593063 -148608 2637701 4087876
43315 4087876 5696379 7986099 8121381 4540750 780359 901661 3285384 3192714 331317
43306 331317 -681929 2402868 6017351 6123703 3626959 2057575 2164246 1778753 93245
43297 93245 -967201 -85854 1154955 751300 -483613 -142489 1875725 2839374 909313
43288 909313 -2503175 -4907805 -5462842 -4354930 -1421968 2555002 4732471 3055701
43280 3055701 -543614 -2404346 -1983492 -1632528 -2053571 -1476146 383678 1278763 497652
43271 497652 501362 2707462 4690327 3796331 1043617 -855898 -1217298 -926882 -245398
43262 -245398 791924 1609300 2564418 5008357 8041485 8063014 4106134 536226 1002311
43253 1002311 2712565 1162747 -2033628 -1620282 2407499 4509761 2272783 -520967
43245 -520967 -664378 53617 -776798 -2160329 -2637656 -3187791 -4324289 -3800184 -324691
43236 -324691 3321359 4019529 2773717 2484716 3540236 4680043 6077696 8089677 8672986
43227 8672986 5851243 1723957 226376 1311815 1041408 -2368435 -6052335 -6775004
43219 -6775004 -4666407 -1628839 1218336 2989737 2322343 -654265 -3098908 -2396197
43211 -2396197 321645 1463451 -446818 -3296370 -4744975 -5172857 -5978187 -6271455 -3628000
43202 -3628000 1705733 5699621 5058960 1237924 -1912454 -3141109 -3955534 -4793343 -4401240
43193 -4401240 -3078060 -2948069 -4013326 -3424099 -372757 1694447 186523 -2468491
43185 -2468491 -2846360 -1805621 -1888930 -1912078 1044959 5614727 7304090 5475024 4111384
43176 4111384 5026318 5349031 3364253 2052348 4013880 6650475 5813234 1773165 -1582417
43167 -1582417 -1789841 536398 3467202 4778150 2792235 -1369118 -3810088 -2482281
43159 -2482281 -260936 -862646 -3334591 -3866760 -1993747 -1193593 -3295402 -5838115 -5887996
43150 -5887996 -3633638 -952061 1313392 3171727 4210824 3977852 2788852 1336031
43142 1336031 256785 394741 2220532 4433344 4536134 1871752 -890700 -593171 2409166
43133 2409166 4207810 1669423 -3626611 -6385831 -2956363 4567309 10414540 11237394
43125 11237394 8759456 6047944 3452076 74986 -2730221 -2567574 -116925 1230671
43117 1230671 217878 -762770 181912 1657293 1780177 1213333 1417994 1844486 1094516
43108 1094516 -471274 -1449287 -1753171 -2221972 -2606823 -1994289 -840196 -622047 -1500916
43099 -1500916 -2055767 -1595151 -1330069 -2735702 -5537179 -7693792 -7192586 -4137189 -1183419
43090 -1183419 -1001626 -2883459 -3213971 -279366 2919190 2294400 -2149408 -6819412 -9225248
43081 -9225248 -9707698 -9046283 -7210820 -4821556 -3277147 -2601183 -1242201 1163435 2805755
43072 2805755 2396535 960564 -80509 -730041 -1159427 -598751 967266 1820238 1082224
43063 1082224 610286 2148801 4097267 3803799 2025536 1956696 4099823 5401431 4070992
43054 4070992 2157697 1994818 2755614 2462629 1274319 394911 -764558 -3573742 -6960174
43045 -6960174 -7951172 -5754910 -3109692 -2785719 -4315554 -5035652 -3204075 647032 4426829
43036 4426829 5828984 3922134 244115 -2345293 -2515283 -1512876 -1022103 -1108371 -1001734
43027 -1001734 -667002 -403412 125436 1116619 1697520 1149327 232996 -245811 -1253595
43018 -1253595 -3862822 -6470619 -6210545 -3038710 141873 1629272 2459854 3234925 2485033
43009 2485033 -302038 -2730079 -2674613 -1378678 -1265797 -2424343 -3413705 -3917903 -4248330
43000 -4248330 -3641536 -1586742 245230 -92667 -1817051 -2562154 -1591782 258774 2416299
42991 2416299 3753009 1680729 -4369137 -9860239 -9785692 -5815418 -4315741 -7258598
42983 -7258598 -9970675 -8714252 -5455999 -3293907 -1895629 -104306 1060520 979776
42975 979776 1390109 2815025 2655875 24867 -1356711 981604 3263523 1215510 -2483908
42966 -2483908 -2395478 421162 111544 -3908609 -5664815 -2242318 1803130 1787601 -847703
42957 -847703 -2442983 -2704416 -3154377 -3639599 -3688516 -4494819 -6448343 -7157595 -4967764
42948 -4967764 -2278700 -2275382 -4150766 -4626064 -2713271 33716 2614717 4693741 4701838
42939 4701838 1448317 -2608484 -3191487 86012 2703704 928884 -3682788 -6575099
42931 -6575099 -5314448 -1409666 1760282 2016225 234769 -506143 1499558 4011228
42923 4011228 3315241 -702898 -3954060 -3327374 -489079 918733 253903 -37366 1431245
42914 1431245 2989452 2393215 -266412 -2832459 -3333070 -1393203 1830222 4405932
42906 4405932 4778888 2952731 574467 -498357 259897 1917312 3045304 2521199 -13875
42897 -13875 -3662445 -6428347 -6839599 -5690461 -5407506 -7202209 -9392788 -9133103 -5535867
42888 -5535867 -603254 2782101 3396210 2280553 1145872 404035 -922191 -3242227
42880 -3242227 -5085442 -4621904 -2025920 913673 3217890 5073272 5897076 4483771
42872 4483771 1854864 1320589 3929905 6205348 4899374 2047614 2111492 5384316 7843765
42863 7843765 7055017 4507395 1934344 -901363 -3818599 -5145834 -4638776 -4575948 -6250761
42854 -6250761 -7935742 -7953437 -7081327 -5983580 -3068267 2389268 7212118 7508823 3614384
42845 3614384 -705786 -2732920 -2112065 727012 4491777 6427056 4870764 1918416
42837 1918416 881114 1716979 1745866 204397 -1155682 -1783434 -3204952 -5735218 -7423206
42828 -7423206 -6991619 -5007653 -1543360 4077193 9989372 11606119 7065017 579121
42820 579121 -2039257 292470 3947504 5330944 3512999 -460217 -4368020 -5494965
42812 -5494965 -2767110 1657443 4329501 3995631 2167786 729383 292035 654019 1518566
42803 1518566 2556634 3567739 4658552 5822497 6657094 6967317 7090575 6997621 5753753
42794 5753753 2763926 -989545 -3910804 -5562733 -6519136 -6845856 -5849605 -3314139 -172152
42785 -172152 2076079 2237685 279023 -1991630 -1817319 1720414 6136356 7933994 6343982
42776 6343982 3541591 1498815 202361 -971093 -1911480 -2475649 -3037138 -3418245 -2556071
42767 -2556071 -380155 1045521 -328665 -3866104 -6984889 -7971107 -6713470 -3400875
42759 -3400875 1429167 5636990 6624650 4520711 2283694 1652572 1054666 -955221 -2426448
42750 -2426448 -871688 2100728 2427981 -522075 -3194060 -3347033 -2684308 -2697529 -1550219
42741 -1550219 2281981 6157687 6571231 4623708 4491388 7043352 8482497 5644180
42733 5644180 -156472 -5097892 -6377823 -3399733 2180328 6813272 7427150 4336610
42725 4336610 538640 -1914148 -3120082 -3213053 -1640715 1071665 3410865 5258978
42717 5258978 7478105 8671061 5997348 641125 -1571447 2146850 6799674 6403924
42709 6403924 2634533 1769538 4748526 6041359 2579857 -1754877 -2428126 -438514
42701 -438514 717178 776164 1679113 2891221 1825287 -1459953 -3505831 -2206920 190785
42692 190785 153086 -2724523 -5823120 -6979766 -6224476 -4471402 -2273546 -287339 598315
42683 598315 702913 2016692 5667836 9503372 10046379 6934215 3592263 2966082 4293061
42674 4293061 4958341 3877627 1773357 -416782 -1769474 -1163328 1358716 3800535
42666 3800535 4494991 4380475 5105457 5693990 3668309 -619445 -3551963 -2964080 -940613
42657 -940613 -479101 -1185239 -312025 2712994 4899596 3343462 -873806 -3497387 -1890816
42648 -1890816 1796290 3166396 960043 -1675505 -1773812 -405602 -263209 -1064487 -173784
42639 -173784 2715279 4586617 3463056 1256094 994277 2974262 4974634 5024899 2820755
42630 2820755 -574454 -3388100 -4247378 -3368945 -2023425 -645000 1378602 3876446
42622 3876446 5546024 6078029 6876274 8611351 9714424 8708418 6636261 5559345
42614 5559345 5724210 5852215 5359573 4635418 3823999 2992790 2933566 4073121 4985214
42605 4985214 3781085 859268 -1468206 -2126989 -2212974 -2390900 -1364218 1769720 5048570
42596 5048570 5503780 3299591 2174512 4860921 9269608 10904229 8799407 6893076
42588 6893076 8450777 11137977 10043090 4586685 -664551 -2247389 -1725510 -2179689
42580 -2179689 -3661937 -4317374 -3974941 -4080394 -5231867 -6989343 -9120936 -10891880 -10148689
42571 -10148689 -5652268 155644 3143111 2149021 -365414 -2005129 -2545929 -2545264 -2357230
42562 -2357230 -2872465 -4926914 -7287096 -7149412 -3396462 2125090 6867848 9447323
42554 9447323 9176448 6055991 2003328 12981 976831 2911703 4139320 5422775
42546 5422775 7870008 10408854 10752689 7897308 2923816 -1542050 -2460723 1046363
42538 1046363 5608263 6363932 2922423 269441 2321249 7053192 9993759 10021860 8897692
42529 8897692 7145158 4008555 521786 -955992 -260666 376784 -246793 -1200983 -1764359
42520 -1764359 -2283009 -2430508 -1162237 1047748 2287510 2177269 2430617 3593668 3596355
42511 3596355 963374 -2459431 -3678698 -2183153 54306 1183614 768583 -663328
42503 -663328 -2026881 -2117545 -726746 877125 1196002 5827 -1597629 -2191997 -1082403
42494 -1082403 868172 1552112 -169643 -2625654 -3049634 -1177633 491036 251155 -910950
42485 -910950 -1577826 -1966456 -2572547 -2666314 -1751758 -1065053 -1937316 -3759544 -5058555
42476 -5058555 -5515880 -5482430 -4639014 -2700980 -400976 1693502 4062213 6323031 6098865
42467 6098865 2197965 -2332579 -3185121 -241748 2639527 2863316 1346824 -217762
42459 -217762 -1302420 -1466723 -294447 966612 483124 -711434 742278 5417957 9461712
42450 9461712 9678882 7538991 6087292 5395124 3690913 1111607 -532832 -610884 231143
42441 231143 1917651 4511861 6664626 6818530 5485980 4285541 3349260 1855375 439575
42432 439575 510766 1504930 1524596 720136 1204483 3136227 3767925 1526407 -1468133
42423 -1468133 -2465261 -1557776 -369949 910588 3071888 5587085 6909080 6615657 5626381
42414 5626381 4596201 3492599 2485085 1861883 1085636 -885340 -4147363 -7438035
42406 -7438035 -9113443 -8039530 -4106517 1128952 4801260 5156048 3661563 3448914
42398 3448914 5430218 7179710 6070141 2323372 -1685877 -3965907 -3746968 -918198
42390 -918198 3613346 7225856 7079114 3115336 -1426834 -3321746 -2543561 -1420761 -1365010
42381 -1365010 -1732021 -1730707 -1909947 -3049374 -4621795 -5430562 -5303831 -5105656 -5218811
42372 -5218811 -5099912 -4565786 -4476962 -5376924 -6052342 -4513621 -505234 3803260 6116035
42363 6116035 6419780 6316549 6294495 4987326 1700202 -1584275 -2258083 -779079 -533661
42354 -533661 -3449133 -7173641 -7789538 -4545677 -594084 796930 -345859 -1361674
42346 -1361674 -388014 1442266 1476920 -869279 -2801349 -1337737 2717408 5599850 5359137
42337 5359137 3746982 2748988 1731966 -282210 -1858503 -1414477 -647799 -2374347 -5664526
42328 -5664526 -6673627 -4421823 -2208924 -2371040 -2940775 -1203040 2128667 4351612
42320 4351612 4388368 2992496 1007462 -657237 -744674 729692 1692895 502688 -1900664
42311 -1900664 -3756261 -4914064 -5857791 -6018186 -5200552 -5038332 -6424765 -7010044 -4465898
42302 -4465898 -1193362 -1984748 -7102562 -11519351 -11790754 -10044856 -9584293 -9788334 -7908568
42293 -7908568 -3801590 -106163 1412831 1516687 1759983 2624946 3420198 3261360 2172680
42284 2172680 1263742 1255974 1117141 -596438 -3251379 -4822402 -5153593 -6197097 -8363937
42275 -8363937 -9325261 -7867574 -6239965 -6438253 -6596825 -4106607 -510485 279866 -2290227
42266 -2290227 -5042466 -5937607 -5622701 -4217742 -815159 2863082 2670732 -1832143 -5156088
42257 -5156088 -2874731 2133239 4077425 2516644 1804063 3578853 4772414 3351499
42249 3351499 1364358 760550 166355 -1846856 -3502092 -2712163 -860146 -553887 -1251654
42240 -1251654 -385157 2132304 3801099 3599559 3009641 2805249 1809232 -432428 -2361247
42231 -2361247 -2780638 -2296941 -1531359 -282919 441485 -1729764 -6709007 -10267670 -8739119
42222 -8739119 -3883635 -518452 -492809 -1735740 -2422081 -2921212 -3537092 -3284287 -1817485
42213 -1817485 -347650 414515 1441323 3428410 5190277 5289122 4142903 3192126 2699995
42204 2699995 1723954 55940 -1012409 -309881 1366606 1767590 -95547 -2249808 -1804589
42195 -1804589 1284421 3972398 4301368 4009863 5384202 7266407 6895330 4661546 3548569
42186 3548569 3821409 2099168 -2928583 -7371812 -7236695 -4014709 -2053092 -2168897 -1601983
42177 -1601983 368492 895947 -1282114 -2622941 699293 6821787 9730455 6685081
42169 6685081 1637324 222828 3086867 5958515 5438644 2357742 -801599 -3280284
42161 -3280284 -5392258 -6550072 -6295694 -6116178 -7584932 -9268540 -8311770 -5013596 -2779798
42152 -2779798 -3079313 -3733095 -3338138 -3826814 -6294543 -7474303 -3964929 1912151 4412722
42143 4412722 1909804 -1473855 -1940971 -413270 135966 -967762 -2095586 -2033015 -998797
42134 -998797 418382 2125678 4312874 6761144 8420300 7968920 5152982 1185131
42126 1185131 -2583808 -5722919 -7944225 -8443158 -7238357 -6126428 -6564903 -7260839 -5820630
42117 -5820630 -2484946 -102850 -252140 -1468459 -1885572 -1691437 -1929974 -2360844 -1831132
42108 -1831132 -16691 2220249 3830191 4344410 3947734 3092308 1858259 -123292 -2702936
42099 -2702936 -4657576 -4909446 -3846623 -2499294 -1029959 695703 1752308 1165597
42091 1165597 -116647 -276085 514202 489147 -422674 -339323 937982 833668 -1984540
42082 -1984540 -4875473 -4504356 -1131901 2376628 4415753 5388664 5660919 5075492 4148277
42073 4148277 3838017 4164971 4402805 4366017 4255654 3670226 2155800 376212 -656330
42064 -656330 -1159493 -1893636 -2208270 -575353 2750369 5334529 5507742 4431352 4382787
42055 4382787 5821657 6999361 6075811 3013424 -467354 -2480619 -2609699 -2102332 -2451679
42046 -2451679 -3918907 -5507514 -6034077 -4988725 -2748391 -327060 1354512 2176254
42038 2176254 2468231 2054758 595198 -959737 -684520 1710469 3962772 4217403 3547548
42029 3547548 3744698 3897348 1847984 -1482574 -2443673 44728 2569728 2115396 192572
42020 192572 -270856 -33348 -2216159 -6720977 -9566868 -8423623 -5736234 -4742871 -4785559
42011 -4785559 -3003605 699434 3255061 2895858 1460053 1428813 2649413 3343723 2995971
42002 2995971 2591943 2659731 2609374 1826650 255157 -1889210 -3866946 -4184067 -1986173
41993 -1986173 1363392 3509303 4052890 4841398 6997355 9177492 9440136 7483742 4262130
41984 4262130 720551 -2106383 -3025274 -2008482 -686494 -368495 -499360 -260258 -517525
41975 -517525 -2359071 -4443234 -4021920 -733182 2458565 2646483 -20893 -3241470 -5248038
41966 -5248038 -5776357 -5150142 -3526679 -1276966 363539 -195561 -3066851 -5900287 -5980871
41957 -5980871 -3573982 -1782446 -2441519 -3807274 -3511438 -2015376 -1140879 -701003 688209
41948 688209 2341837 2189559 575808 120555 1220182 949055 -2162619 -5221784 -5028096
41939 -5028096 -2794357 -2207983 -4171698 -6118625 -5929954 -4133563 -2298792 -1305823 -1496123
41930 -1496123 -2832284 -4275159 -4211120 -2312677 -365994 -507952 -2685214 -4301517 -2769166
41921 -2769166 1559241 5561626 6838479 6187371 5584398 4806687 2307508 -970506 -1773121
41912 -1773121 613550 2741564 1926399 -178481 -1360662 -3038374 -6732231 -8858216
41904 -8858216 -4638279 3339322 6524818 1890137 -3529476 -2643827 1989031 3172337
41896 3172337 315578 -437727 3737439 8338112 8804499 6657990 5625183 5420469 3198307
41887 3198307 -779877 -2917857 -1518382 943833 1561407 739266 923281 2921765 4905637
41878 4905637 4722876 2302460 -328484 -1118999 -56531 869084 -117282 -2612427 -4601395
41869 -4601395 -4664026 -3033131 -733674 1419991 2864528 3200401 2525176 1457296 647658
41860 647658 573628 1575152 3359526 4682482 4583328 3873935 4056775 4626079 3193166
41851 3193166 -951926 -5136999 -6453805 -5166633 -3464035 -2187169 -805008 355396
41843 355396 244570 -858905 -1647120 -2117562 -3502825 -5682916 -6809327 -6132980 -5356239
41834 -5356239 -6254099 -8232023 -8973581 -6693018 -1737464 2995571 3817884 262522 -3233708
41825 -3233708 -2170849 1866920 3164359 93778 -2699172 -1584909 911991 855755
41817 855755 -1104036 -2017585 -1736015 -1657507 -964350 1364037 2760657 179610 -4343169
41808 -4343169 -6285492 -5806184 -6755463 -8963390 -7938704 -3242625 -544869 -2738305
41800 -2738305 -5091450 -3110511 70409 -922922 -5103232 -7473854 -7002722 -6375435 -5697073
41791 -5697073 -2658783 1449927 1875965 -2384815 -6324455 -5464810 -877490 3761194
41783 3761194 6561050 7163291 5406141 2511643 1171653 2289797 3451454 2331918
41775 2331918 -184788 -1822661 -1864533 -591722 2118439 5450688 6796534 4928801
41767 4928801 2705824 3700832 6902242 7823886 4763260 849746 -803408 -1068640 -2350414
41758 -2350414 -4407617 -4907797 -3057083 -444730 1458411 2675230 3354157 2838618 990469
41749 990469 -893494 -1679443 -1948917 -2631957 -3048899 -2251316 -1665184 -3616862 -6913546
41740 -6913546 -7144034 -3004925 811928 -97974 -3366426 -3706570 -1395078 -1587190 -5349843
41731 -5349843 -7235047 -3681453 1425029 2949015 1981829 2742174 5152092 5618717 3505012
41722 3505012 1627897 845412 -861068 -3518591 -4122483 -1791737 220525 -330181 -1132098
41713 -1132098 511385 2923173 2660949 3608 -1502109 -229975 1766967 2311981
41705 2311981 2014297 2738556 4604569 5735030 4753209 2667874 1637243 2055011 2083492
41696 2083492 767601 95220 2104951 5103728 5551417 3286366 1526916 1333286 -23903
41687 -23903 -3626018 -5848432 -3766571 -366274 -302720 -2629766 -2425824 1235492 3818250
41678 3818250 2372600 -318974 -333795 2043454 3833101 3871407 3379918 3336053 3404833
41669 3404833 3012242 2072635 837499 -304435 -1242037 -2533686 -4536972 -6031636 -5025916
41660 -5025916 -1446613 2239204 3766974 3342554 2644353 2852767 4271902 6352685 7121032
41651 7121032 4216931 -1959692 -7337876 -8059945 -4456068 231206 3898906 6429919
41643 6429919 7561581 6674008 4757055 4073620 5169801 6226581 6097008 5874186 6273422
41634 6273422 5584818 2278833 -1723176 -2786972 -149072 3285464 4641816 3753264
41626 3753264 2155669 1355746 2431222 5388962 8193225 8251165 5804878 4047263 4708643
41617 4708643 5505633 3710746 368611 -1415406 -894310 365827 1747140 3556808
41609 3556808 4505854 2964776 679065 1193617 3935335 4189570 500460 -2379193 -624737
41600 -624737 2690463 2506150 -715245 -2847437 -2931466 -3180138 -3730191 -2591728 -294284
41591 -294284 410340 -359132 484734 3437754 5286258 4462809 3006322 1887270 -904129
41582 -904129 -5472831 -7778032 -5385907 -1700979 -928123 -1930142 -982137 1805460 3056213
41573 3056213 1693741 -113257 -1012799 -1941756 -3532758 -4892576 -5161352 -4169973 -1733874
41564 -1733874 1676973 3928691 3075021 136550 -1877531 -1630876 -468404 -97591 -1074087
41555 -1074087 -3301777 -6087126 -7715836 -6808626 -4287640 -2452520 -1973636 -1299185 692827
41546 692827 2826532 2995045 682004 -2277341 -3345878 -1893801 -9072 143896 -522625
41537 -522625 681651 3646828 4851100 2482277 -658483 -1446986 -979774 -1998641 -4032680
41528 -4032680 -4542489 -3256467 -1692968 400607 4156954 7839360 8127641 5141100
41520 5141100 2309568 1067084 -355597 -2363780 -2495099 148369 2828851 3426416
41512 3426416 3407157 4403562 4878887 2839210 -401429 -1878957 -978944 459461 995542
41503 995542 722382 331546 373613 798925 591481 -1101622 -3213590 -3787474 -3083043
41494 -3083043 -3457050 -5410668 -6233972 -3967990 -486322 1120821 456173 -613661 -776044
41485 -776044 20696 1448832 2884051 3503025 3201164 2334289 224239 -4143343 -9323035
41476 -9323035 -11724820 -9935059 -6488227 -4087278 -2502257 -716765 550482 596168
41468 596168 587858 1276516 1003929 -1467332 -4091424 -4223987 -2527333 -1484286 -1434606
41459 -1434606 -774308 1066712 3291814 5227853 6022847 4417853 1073061 -760031
41451 -760031 546756 2239071 1627623 822311 2987579 6034872 5239067 1194684 -412328
41442 -412328 2603991 5777725 4870745 1399270 -801735 -825453 -255 1280890 3409560
41433 3409560 5843439 7560735 8363871 8691483 8949587 9295785 9072177 6937562 3214191
41424 3214191 1169368 3326541 7213550 8123485 5820606 4601439 6382245 8122042
41416 8122042 7413941 6237877 6825344 7646790 6483362 4357333 3212800 2283222 127440
41407 127440 -1800569 -1084789 1638859 3894372 5402796 7578000 9736399 9198086 5260689
41398 5260689 372900 -2921638 -4074440 -3550754 -1958784 -485181 -319214 -1126881 -1417718
41389 -1417718 -604950 567383 1658030 3145707 5119524 6587273 6646370 5688311 5083698
41380 5083698 5871460 7587835 8229594 5967703 1244486 -3528036 -6567511 -7837415
41372 -7837415 -7248916 -3778659 2083195 6715430 6685083 3168590 823558 2165510 4918349
41363 4918349 5374037 2879877 157427 -128304 1631449 2591134 1079946 -948261 -249213
41354 -249213 3103136 5402698 4282717 1791543 993184 1670870 1788763 1440940 2169164
41345 2169164 3281428 2376480 -369210 -1737025 -122172 2160717 2464814 1317645
41337 1317645 778503 1171826 1254504 487351 -426715 -628824 295260 2132301 3696691
41328 3696691 3432945 1066863 -1982057 -4109213 -4454206 -2345208 2217338 6721252
41320 6721252 7001408 1848274 -4671092 -7554458 -6465348 -4837708 -4428662 -3761216 -1961824
41311 -1961824 -891874 -2077865 -3961568 -4257250 -3532226 -4188675 -6565839 -8239301 -7266595
41302 -7266595 -4355376 -1385587 720199 1894720 1897701 560921 -1406153 -2844428 -3363548
41293 -3363548 -3562779 -4045735 -4645590 -4702157 -3861916 -2501537 -1383761 -915914 -890519
41284 -890519 -1007517 -1225397 -1255648 -368430 1399889 2409633 1242086 -827203 -1055353
41275 -1055353 690267 1219752 -1448415 -4861583 -5374326 -3134071 -1443212 -1922939 -2789829
41266 -2789829 -1895553 628090 3074535 3975729 3050321 1535489 1340432 2750173 3771738
41257 3771738 3207788 2963258 4841566 6450839 3963831 -1553875 -4785709 -3593151
41249 -3593151 -1443607 -1116884 -526185 2626034 6054342 6320277 4097658 2260705 1002667
41240 1002667 -1246342 -3746996 -4349329 -3496868 -3537754 -4623758 -4940962 -4679279 -5975164
41231 -5975164 -8577727 -9103044 -5551896 171913 4995094 7386493 6799937 3308097
41223 3308097 -1012777 -2845703 -1367691 555972 190482 -1739087 -2844472 -2600177
41215 -2600177 -2375803 -2859779 -3100704 -2061069 -209172 742365 -255202 -1929238 -1653291
41206 -1653291 1273772 4225238 4373316 2404030 1399566 2574114 4176913 4527788
41198 4527788 4056016 4023427 4994016 6801485 8321990 7282517 2506627 -3222358 -4894332
41189 -4894332 -939039 4727991 7466717 6942938 5944798 5728354 4729447 1714414 -1537959
41180 -1537959 -1760452 1670503 4985502 3651713 -2127935 -7275120 -8111211 -6603560
41172 -6603560 -6319386 -6463038 -3656932 1509765 4308760 2743329 344231 591875 2236345
41163 2236345 2365547 1092187 465389 750028 391879 -1491964 -4460460 -7480972 -8973304
41154 -8973304 -7578295 -4251510 -2033255 -2289919 -2746971 -763618 2983655 5679255
41146 5679255 5838839 4136134 2151249 1630222 3441649 5897875 5786149 2497220 -711853
41137 -711853 -1108435 -15946 -12985 -824684 -618152 390429 589136 92827 382682 1552344
41127 1552344 2447316 2965404 3925101 5210300 6119518 6823146 7430651 6582023 3296088
41118 3296088 -642478 -2553385 -2320519 -1593086 -570636 1519387 3557579 3508719 2068573
41109 2068573 2001784 3627272 4300539 3064291 2488507 4487622 7152597 7642257 6115810
41100 6115810 4767560 4411592 4087677 3389372 3384965 5065015 7842295 9995921 10375005
41091 10375005 9307318 7581797 5082498 1613057 -1144309 -652352 2607975 4551338
41083 4551338 2591339 -594137 -712558 2368590 5215567 5872372 5231011 4263412 3216696
41074 3216696 3195587 5162957 7190018 5874203 1058801 -3615691 -5417912 -5192967 -4795356
41065 -4795356 -4448915 -3518874 -1864731 214863 1848339 1658220 -163279 -756817 1732003
41056 1732003 4439267 3302026 -576751 -2507661 -1774346 -2275214 -4941287 -5403763 -1460214
41047 -1460214 2607762 2512772 86717 -870707 -661378 -1193580 -1020330 1987329 5405226
41038 5405226 4904010 929680 -1862230 -1196067 874170 2226249 3125437 4312766 5595684
41029 5595684 6418468 5788573 2551802 -2056172 -3849778 -803378 2950282 2139166 -1868407
41020 -1868407 -2895469 807090 4118580 2746037 -1178299 -3114982 -2119253 -435534
41012 -435534 317408 128706 -650405 -1561748 -1927939 -1638495 -1281840 -1062683 -722633 -689691
41002 -689691 -1727470 -3156830 -3200747 -1639006 -433325 -1064599 -2806848 -4293937 -5258255
40993 -5258255 -5893242 -5790896 -4453348 -2156364 127505 1177894 214706 -1973244 -3230491
40984 -3230491 -2652444 -2121342 -3439788 -4988929 -3912277 -1052066 -449316 -3583848 -7202958
40975 -7202958 -7766699 -5365667 -2300229 -410676 -863273 -3887574 -7328148 -7884045 -5227485
40966 -5227485 -2666025 -2539505 -3533919 -3846842 -3930606 -4132781 -2816197 361947 2130671
40957 2130671 23136 -3060052 -2471832 1518620 4531530 4515777 3390811 2683670 1629684
40948 1629684 85250 -401454 388035 225585 -2263447 -5431289 -6927131 -6344834 -4732412
40939 -4732412 -3301917 -3289102 -5140895 -7173432 -7043871 -5109536 -3962325 -3988314 -2457043
40930 -2457043 1458454 4032465 2099377 -1815859 -2986158 -1263382 -311954 -998004
40922 -998004 -160048 3426188 6186953 4826669 1007758 -1463729 -1611768 -804137 564041
40913 564041 2640549 3677038 1609506 -2175956 -3988298 -3072845 -2541391 -4280654 -6143347
40904 -6143347 -5744797 -4058142 -2962489 -1809693 596995 2567971 1637392 -880969
40896 -880969 -1138920 1511963 3508038 2426956 211511 -171740 1319670 2746543 3108008
40887 3108008 2826458 2757688 3761540 5881124 7421450 6729976 5277948 6241425 9112148
40878 9112148 9156364 4277924 -1097693 -2231266 -1027462 -2371940 -5800821 -6374366 -3235288
40869 -3235288 -1451881 -4122326 -7802332 -8229463 -6379936 -5588210 -5836501 -4739356 -2349410
40860 -2349410 -1202868 -2238970 -3810046 -4661786 -5333118 -6412470 -7543408 -8522110 -9638008
40851 -9638008 -10547052 -10318191 -9023069 -7990440 -8055197 -8619396 -8686174 -7675963 -5064624
40842 -5064624 -781430 3350852 4211740 948796 -2980615 -3157366 581912 4028255
40834 4028255 4034785 2204156 1914576 3259729 3335244 1141336 -686053 -135738 688836
40825 688836 -1302420 -5032197 -6207272 -3208203 794387 2196636 958365 -741919
40817 -741919 -1499354 -841772 1488835 4422259 5394672 3515583 1548493 2344705 4572573
40808 4572573 4910846 3513172 3550337 5318845 5061917 1215316 -2023676 -291077 4488514
40799 4488514 6797906 5102068 2854743 2337263 1484416 -1947952 -6157510 -7472728
40791 -7472728 -5140860 -1804069 112441 633317 905378 1198273 951726 160418 -161543
40782 -161543 746937 1903537 1172631 -1999283 -5022420 -4693056 -1420844 589338 -1713144
40773 -1713144 -6319807 -8664914 -7291812 -5123974 -5005614 -5943942 -4931868 -1276540
40765 -1276540 2530513 3994496 3166175 1605632 15502 -2023376 -4465119 -6264060
40757 -6264060 -6759651 -6606748 -6555736 -5983472 -3797944 -607855 1398432 1198209 330470
40748 330470 622549 1515396 1074569 -791290 -1808004 -372864 2221187 3384791 2272420
40739 2272420 418624 -278556 483623 1455420 1496638 997105 1316096 2642633 3172812
40730 3172812 1350736 -1645643 -3109371 -2284596 -886659 -48111 1070615 2906512
40722 2906512 4130139 4139598 4632832 6557112 7605133 5624079 2823885 3051512 5928638
40713 5928638 7694130 7445732 8007838 10064764 10262626 6885748 2879474 695082 -1490901
40704 -1490901 -5067964 -6862826 -4409071 -1687487 -3673853 -7575387 -6282668 313607
40696 313607 4594217 2601725 -717625 70033 3479511 5560483 6302262 7092170 6081628
40687 6081628 1302354 -4321741 -5995253 -3351164 384435 3592125 6261097 6603105
40679 6603105 2764276 -2690172 -4664367 -1844006 2787078 7065207 10769566 12206602
40671 12206602 9156907 3875159 1723292 3344343 3466917 -342134 -3081019 101300
40663 101300 6258342 8877201 6474215 2651437 71813 -1285254 -1560188 -816514 -428387
40654 -428387 -1289282 -1646899 292338 2994155 3999205 4105476 5490667 7089265 6071187
40645 6071187 3102593 1702102 2575564 2985551 1941686 1520543 2278476 1881148 -191931
40636 -191931 -784672 1910219 4968086 4798490 1766078 -1506812 -3847757 -5239043 -5167727
40627 -5167727 -3693316 -2342021 -1942725 -1432470 -526096 -1192528 -4239985 -6748881 -5646026
40618 -5646026 -2047821 634741 1302635 1200124 916731 264960 -93903 259236 -81913
40609 -81913 -2088719 -3760164 -2877839 -946382 -869488 -1881810 -939646 1497387 1770142
40600 1770142 -638197 -1881783 -80425 1765977 1242487 565913 2185600 4009652
40592 4009652 2833360 -29816 -697073 1042454 1421738 -1560223 -5369861 -6444049
40584 -6444049 -4197332 -939497 744720 208064 -814534 -203961 1614560 1911244 -342086
40575 -342086 -2607595 -2612574 -1861511 -2553709 -2997909 -129752 4418763 5601496 2748047
40566 2748047 1232203 4618100 9501696 10806280 8325578 4625895 29182 -5719125
40558 -5719125 -9360086 -7295073 -2039920 -47719 -2676724 -4505258 -1965716 1505086
40550 1505086 1645639 170958 1344968 4880228 6897103 6314071 5686926 6156424 5859227
40541 5859227 3908034 2242711 2259494 2547017 1583845 434889 983978 2987332 4502226
40532 4502226 4353639 3030043 1791483 1570190 2089913 1854463 -14506 -2000734 -1802011
40523 -1802011 253206 1494484 1058661 1221572 3403153 5488243 5264334 4310944 5552232
40514 5552232 8307554 9052369 6744905 4246200 3929566 4617554 4128050 2787842 2564352
40505 2564352 3657585 3814409 1312595 -2397602 -3875097 -1500314 2651581 5380541
40497 5380541 6107483 6625711 7405375 6453193 2824380 -918550 -1791186 -582366 -631102
40488 -631102 -2997531 -5112982 -4323862 -993082 2277986 3266179 1672404 -1111997 -3599840
40479 -3599840 -5711780 -8034288 -9606804 -8342475 -4547472 -1672000 -1657040 -1878642 492713
40470 492713 3319654 2613370 -595923 -1206478 2315922 6002002 6863993 6648451 7352907
40461 7352907 7344141 4811895 1772096 1269715 2671974 2822239 617735 -2082474 -3270177
40452 -3270177 -2588474 -994246 141586 395271 1209530 3898712 6624661 6072339 2740303
40443 2740303 1008166 2426682 2984930 -190084 -3398117 -1715812 3373731 6565454
40435 6565454 6747998 7117848 8448108 7781191 3997431 -195608 -2539488 -3204915 -1854377
40426 -1854377 2722821 8643025 10932321 7778413 3403300 2407381 4140843 4988855
40418 4988855 3629086 1522654 276986 893001 3832452 7589773 8852199 6295595
40410 6295595 2717481 1281480 1304473 251257 -1689451 -2214942 -1284674 -1434538 -3419463
40401 -3419463 -4573727 -2644640 978697 3309212 3463609 2709713 1778255 -362 -2776053
40392 -2776053 -4871014 -4378994 -1654873 706262 524509 -1987744 -5123953 -7657196
40384 -7657196 -9130287 -8927776 -6463346 -2387534 1396212 3194881 2528906 22412
40376 22412 -2804805 -4011849 -2810612 -689542 143633 -653533 -1690615 -2218958 -2715420
40367 -2715420 -3192673 -2885936 -1935903 -1415347 -1133366 526214 3644436 5590247 4106741
40358 4106741 112650 -3655644 -5349340 -4470327 -1509684 1500167 1808926 -951139
40350 -951139 -3705281 -3364094 -64376 4076637 7606615 9694579 9552166 7942481 7344435
40341 7344435 8324098 7711733 3115617 -2731598 -5507173 -5410953 -5618737 -5923630 -3068536
40332 -3068536 2501766 5696079 4321521 2703235 4824768 7878931 6711175 2083476
40324 2083476 -141817 2666184 6569712 6777289 3531675 630869 -946 -34471 -1354300
40315 -1354300 -2988237 -2677641 -618046 419618 -865332 -2253553 -1434595 541389
40307 541389 1588251 2457221 4755317 6385933 3707233 -1712903 -3843114 -1282003
40299 -1282003 -206078 -5057244 -11261075 -11946626 -7918492 -4975790 -3980879 -603588
40291 -603588 5696722 9538192 7879933 4385997 3116212 3066707 2199511 2356569 5817761
40282 5817761 9988003 10148528 6115390 2263947 1601526 3041227 4097462 3344279 405927
40273 405927 -3775375 -6557845 -5830355 -2862321 -1002350 -1505230 -2564794 -2446807 -1446657
40264 -1446657 -450896 383032 891727 582129 -229130 -284707 1049045 3176623 5423833
40255 5423833 7578847 9258389 10134136 10770953 11702051 11838642 9740498 6405397 4450793
40246 4450793 4282091 3711518 1961875 1032825 1843622 2141291 290409 -1665779 -1289109
40237 -1289109 363057 1035808 1237964 2496100 3485680 1881098 -1003232 -1579816 345010
40228 345010 1324750 -188016 -2106299 -3080320 -4445047 -6496722 -6765276 -3993454 -479354
40219 -479354 1685543 3549153 6145521 7700119 7087809 7138446 10515448 14303447 13162230
40210 13162230 7129850 2016334 1727837 3894747 4125893 1567526 -1306360 -2299374
40202 -2299374 -1193778 991351 3071990 4383789 5008191 5286486 5393701 5699721 6716711
40193 6716711 7929532 7795888 6146321 5311782 6997971 9126898 8192230 4141590 305314
40184 305314 -1307465 -1855018 -2555506 -2575525 -992197 1411566 3408779 4586480 4552380
40175 4552380 2768681 22076 -1772757 -2043946 -1965329 -1698714 446831 4870242 8913178
40166 8913178 9890193 8144727 5675917 3636648 2741721 3998981 6864598 8441487
40158 8441487 6842056 3862550 2051879 812897 -1788922 -4880340 -5983882 -5620147
40150 -5620147 -6840347 -9824329 -10561428 -6273531 567165 5325773 6459274 6129869
40142 6129869 6869787 9080052 11236998 11699529 10536223 9517299 9695322 9631851 7438976
40133 7438976 3993034 2002076 1994000 1726945 80101 -1093182 -180855 1530568 2185224
40124 2185224 2399688 3823484 5988010 6855914 5848341 4320130 3308067 2511042 1448112
40115 1448112 253586 -701435 -965140 15954 2057223 3593313 2909625 2367 -3421713
40106 -3421713 -5480643 -5124663 -2427123 1090145 3058292 2376789 349222 -1178827
40098 -1178827 -2042927 -2982959 -3677763 -3322498 -2447373 -2118820 -1776543 -120391 2070720
40089 2070720 2594774 1524359 1453057 3276874 4628054 3933424 3149711 4213474 5284585
40080 5284585 3560587 116340 -1456525 -342898 987496 1273853 1939417 3555162
40072 3555162 4173887 2568682 497159 77530 921208 1431364 1164336 389870 -917847
40063 -917847 -1999006 -1032938 2021240 3911810 1811280 -2657062 -5597597 -6013057 -5960114
40054 -5960114 -6183328 -4878793 -1191827 2880237 4939684 4461749 2218869 -290020
40046 -290020 -563555 2861690 7225348 7460613 2839916 -1290746 -605361 2231745 1721770
40037 1721770 -2622289 -6332763 -6599968 -4820795 -2768444 -125590 3233163 5632832
40029 5632832 5841979 4869707 4121391 3292599 1420629 -973981 -1948734 -59495 4031168
40020 4031168 7541866 7712992 4912719 2869617 4354391 7424564 7935631 5042316
40012 5042316 1594988 -526594 -2199327 -3761913 -3436310 -573225 2367685 3001129
40004 3001129 2041708 1524999 2131989 3836081 6824908 9858916 10140464 7228544 4911364
39995 4911364 6431004 9667578 10018220 6608773 2661914 872990 1361176 3177485
39987 3177485 4915518 4732145 2521215 890984 1142285 123913 -4978540 -10447519
39979 -10447519 -9870926 -3660885 895998 -288968 -3620921 -4903207 -5139307 -6354006
39971 -6354006 -6706140 -3830697 561912 3378221 4574696 5295519 4427243 1009217 -2270302
39962 -2270302 -2207056 -35474 716772 -178459 -271804 561551 34193 -2160564 -3837528
39953 -3837528 -4009128 -3531999 -2388818 74700 2468869 2631738 1478921 1861135 3712064
39944 3712064 4398212 3947451 5302787 8595815 9978010 7816392 5523122 5901919 6777150
39935 6777150 5033363 1447010 -1445204 -3093536 -3569681 -1605694 2631720 5646993
39927 5646993 5158968 4037488 5829563 8702614 8332332 5113675 3541154 5071500
39919 5071500 6431292 5237894 2917454 1261080 -1728 -1007208 -515368 1666590
39911 1666590 3625966 3905726 2932034 1239710 -1225282 -3342420 -3053177 -382775 2189491
39902 2189491 3215463 3574290 3587394 2069436 -319978 -145682 4011400 8580721 9530405
39893 9530405 7639388 6422214 6775277 6961946 6611302 7209356 8854455 9468033 7600429
39884 7600429 4088971 886058 -312340 1111614 3531636 3577299 -99130 -4268549
39876 -4268549 -4598234 -1027442 2756199 4467387 4817584 4333640 2262598 -597846 -1372050
39867 -1372050 1080082 4467553 6575369 7828841 8776311 7844856 4034560 -337340
39859 -337340 -2294770 -2076277 -1830931 -1862212 -909345 893613 2185784 2822346 3408424
39850 3408424 3028825 479684 -2515573 -2593368 477111 3506778 4901269 6516579 9411391
39841 9411391 11436428 11190779 11051155 13273442 15748983 15202275 12644230 11612847 12147629
39832 12147629 10966072 7626516 6063241 8686439 12637821 13906800 12358599 10560548
39824 10560548 9984482 10702758 12878399 15905581 17397373 15689903 12601311 11317195
39816 11317195 12147780 12780943 12245194 11860577 12135960 11540021 9296112 7092643 6657292
39807 6657292 7324104 7383550 6485614 5296519 3925137 2309472 1462334 2666933 5523070
39798 5523070 8018359 8644721 7693502 6631729 7001966 9654052 13907691 17321997 17437037
39789 17437037 14468415 11671930 12173825 15480836 17784088 15979985 10965608 6547322
39781 6547322 5433505 7040156 9181459 10817090 12466437 14735580 17448071 19803425
39773 19803425 20501290 18321208 13908618 10559281 11432239 15740510 19339234 19595540
39765 19595540 18130543 18085241 20347370 23634823 26882394 29980287 32928144 35616863
39757 35616863 38078169 40241549 42176007 44990275 49991526 56098447 60106843 61271147
39749 61271147 63685398 71531511 83372439 94191616 102156113 109887188 119373820 129586251
39741 129586251 139877686 151926787 166549107 181665996 195453780 208829637 222683751
39734 222683751 235297475 245139458 253847490 263334259 271975783 277319337 280989206 286476526
39726 286476526 292541319 293611482 287791601 280204907 276173184 274391832 269726630 260450380
39718 260450380 249377317 238820640 227621453 213595221 196863420 179862060 164866111
39711 164866111 151992827 139483257 126066142 112950983 102635563 95531922 89075813
39704 89075813 81027496 72447574 66077054 62573405 59806433 55483012 49190343 42137011
39696 42137011 36097849 32437595 31004590 29963639 27577575 24053220 20986388 19459067
39688 19459067 19466948 20477995 21424314 20920916 18917608 17374989 17615313 17853425 15629981
39679 15629981 12054731 10627824 11717977 11606781 8251948 4843243 5428289 9393683
39671 9393683 12897650 14084593 14059696 13689205 12330878 9683500 6644519 4068887 2256726
39662 2256726 1700388 2873108 5163252 7132112 7799659 6946100 4784877 2345941 1330211
39653 1330211 2295918 3811864 4619987 5340478 6398289 5974782 2689710 -964741 -1186731
39644 -1186731 1707770 3878685 3826282 3864260 5193255 5483224 2962922 -469484 -2264734
39635 -2264734 -2546168 -2302617 -809256 2727292 6873371 9522060 10174884 9053367 6030508
39626 6030508 2335266 995448 3103932 5572030 5115495 2665802 1291156 1717148
39618 1717148 2855713 4851955 8066315 10431740 9596993 6908421 5712102 6367038
39610 6367038 6505653 5588176 5260997 5467804 4409301 2691810 3312121 6548129 8687740
39601 8687740 7111718 3281289 -366566 -2955625 -3535582 -965748 2731338 2888850
39593 2888850 -1336841 -4532313 -2088328 3349334 5859221 4162745 1932287 1998219
39585 1998219 3847158 5746778 6118208 3629945 -1137171 -4796624 -4589211 -2066163
39577 -2066163 -919706 -1952831 -2705727 -1269754 2094221 6311078 9785053 10240069
39569 10240069 7314336 4648683 6083495 10176964 12110267 10929384 10598422 12842632
39561 12842632 13412643 8241162 174007 -3963291 -1601164 3302982 5698379 4545097
39553 4545097 2248913 1107630 1541112 3036103 5333437 7889662 8890641 6599259
39545 6599259 2264995 -187824 1092911 3180765 2666923 938999 1735854 4566166
39537 4566166 5250201 3359681 3821664 8796383 12836594 10280003 3955587 1362512
39529 1362512 4060795 6362635 4250999 210221 -1976046 -2435712 -2831113 -2578727 -669702
39520 -669702 1264603 1142332 221699 1398591 4443185 6130835 5081092 3444975 3166675
39511 3166675 3310564 2323302 660289 -465124 -1101785 -1430869 -154648 3555737 7269264
39502 7269264 7066298 2335815 -3205092 -5738615 -4904458 -2663345 -409321 1713197
39494 1713197 3833082 5835811 7246677 7176675 5282168 3041925 2603324 3653889 3160441
39485 3160441 -382722 -3957388 -3317035 1487946 5967631 6374433 3149423 -829320
39477 -829320 -3431712 -3995605 -2526812 358184 3147352 4196552 3116968 1242402
39469 1242402 531057 1711272 3411411 3524047 1641590 -388022 -635581 858050 2675016
39460 2675016 3853873 4327314 4199834 3607949 2975353 2548063 1883416 456850 -1428034
39451 -1428034 -2736779 -2393166 116056 3864517 6121546 4439488 -199458 -3879910
39443 -3879910 -4248556 -2771028 -1562354 -388468 1351767 2235109 1319943 993662 3713356
39434 3713356 7242809 7134884 3402437 637795 1378652 3367612 4077746 4004027 4066104
39425 4066104 3284281 1025510 -1116195 -1556002 -766029 248248 1442057 2650110 3222666
39416 3222666 3603207 4820086 5725957 3787522 -389617 -2782518 -1665327 45699
39408 45699 37864 156947 1978011 2945234 893589 -1001003 1431124 6408041 8557310
39399 8557310 6756775 4722566 4551620 4542358 3511202 2788237 3122741 3325572 2990583
39390 2990583 3483152 5224114 6494303 5719347 2973882 -895039 -4609568 -6357492
39382 -6357492 -5807405 -5578574 -7738963 -9588354 -6735330 -151356 4251375 3786590 2236676
39373 2236676 3323479 5289567 4679168 1950482 -47516 -722226 -1431913 -2095865 -1365821
39364 -1365821 499594 1626691 1242310 430329 258418 669367 1199859 1637818 1902749
39355 1902749 1954886 1822278 1529144 1262876 1443271 2019041 2099577 1236268 475009 805588
39345 805588 1317431 668832 -487180 -850431 -1250774 -2971404 -4164671 -2141914 837794
39336 837794 -851997 -7496716 -12042111 -9435910 -3351426 -181845 -567857 -1137371 -972133
39327 -972133 -1219422 -935022 1198045 2623152 -225217 -5671347 -8527608 -7569670 -6190513
39318 -6190513 -5798914 -4041759 -327046 2203747 1792869 476457 -327829 -2023586 -4512654
39309 -4512654 -4356899 -299208 3489793 3283901 1431752 2136841 4555030 4601815 1617183
39300 1617183 -1384035 -2906438 -3916476 -4198087 -2257830 949482 2349694 1469998
39292 1469998 977466 1577066 432681 -3455213 -6088069 -3677944 1703192 5099490
39284 5099490 5528677 6190270 8573411 10162617 8672276 5476095 3275636 2443618 1557624
39275 1557624 370030 281385 2087918 4744712 6626126 7096451 6550572 5596473 4589995
39266 4589995 3551992 2182307 224565 -1895626 -3102863 -2814074 -1947111 -2238717 -4326639
39257 -4326639 -6828000 -7603070 -5808857 -2611697 -151647 97456 -1503598 -2789029
39249 -2789029 -1579062 1771906 4137356 3074224 107772 -1108752 155153 862961
39241 862961 -737490 -1992535 -113266 2669835 1812974 -2663990 -6015949 -5587616 -3643354
39232 -3643354 -2372250 -471825 2890595 4790587 2979734 518684 1475053 4139346
39224 4139346 3634506 176148 -886061 2449547 5871301 5832711 4492280 4986641 6278674
39215 6278674 6240627 6190777 8099709 9896674 8229150 4488438 3480575 6444608 9585704
39206 9585704 9910456 8716293 8300575 8566948 8526734 8561227 9240153 9640338 8688086 7062816
39196 7062816 6220264 6316940 6468375 6522347 7249394 8839639 10231148 10303378 9358006 9020424
39186 9020424 10474177 12903932 14192686 13364490 11681651 10817321 10656631 9763383 7481412
39177 7481412 4577975 2203531 1236073 2224610 4651809 6337361 4980312 791967
39169 791967 -3212238 -3990078 -1238358 2573544 4597474 4234575 3551678 4554326 6119351
39160 6119351 5101410 1003813 -2523655 -2418873 -448082 -235220 -1630760 -1325553 1687559
39151 1687559 4951166 6951073 8902595 11111777 11160114 7731974 3467886 1668713
39143 1668713 2194469 2808237 2711746 2339802 1188452 -1429418 -4256423 -5183414 -4135230
39134 -4135230 -2843413 -2071525 -1054040 426299 1363173 1249384 967434 1502556 2753239
39125 2753239 3861503 4009761 2950733 1424201 788745 1575299 2893359 3992199 5540361
39116 5540361 8095467 10080696 9101780 5196753 1136572 -760667 -739338 -201940 463132
39107 463132 1884633 4255366 6520488 6915104 4473892 400785 -2573840 -3061042 -2770717
39098 -2770717 -4232375 -7135434 -8533839 -6806362 -3754847 -2134882 -2463913 -3123752
39090 -3123752 -2560984 -523753 1969326 3056319 1378366 -2023812 -4137517 -3579720
39082 -3579720 -2826847 -4977393 -8757820 -9218807 -4135321 2424288 4512346 901385
39074 901385 -4563342 -8160967 -9351347 -8782940 -6181494 -1774437 2024254 2539512 34001
39065 34001 -2469629 -2418870 108578 3019038 4056522 2578835 382792 59202 1683846
39056 1683846 2419117 758448 -595834 1416996 5001884 5752547 3485803 2545331 4803058
39047 4803058 6992113 6736683 6556122 8672092 9944573 6544390 868113 -1334702
39039 -1334702 814807 3155986 3825621 5263310 8303024 9590514 6931493 3016743
39031 3016743 1337261 1708698 2304963 3073345 4323804 4600008 3172996 2566358 5115823
39022 5115823 8483175 8304601 4614470 1911194 2714874 4589270 4462083 2733274 1386949
39013 1386949 471749 -1232714 -3388939 -4212856 -3031568 -1020815 584570 1685713
39005 1685713 2588136 3223107 3498836 3571558 3244557 1750618 -1193389 -4522166 -6782097
38996 -6782097 -7796856 -8546461 -9332921 -9071332 -6974695 -4129054 -2419577 -2232592 -2189783
38987 -2189783 -1120503 536057 1390528 528987 -1711317 -3801352 -4087654 -2621063 -1557789
38978 -1557789 -2446030 -3353955 -690032 5535083 10438277 9897265 5831365 3554312 4761579
38969 4761579 5969996 4125239 873745 -310019 781890 1249388 -398498 -2265967
38961 -2265967 -1998018 134448 2089361 2842370 3056102 3497707 4048441 4258602 3881989
38952 3881989 2770282 1193600 392312 1581064 3819398 4115598 832989 -3800883
38944 -3800883 -5939712 -4402712 -1318466 1098065 2534636 3186610 2514596 579330
38936 579330 -922814 -577060 650453 816115 -20530 68738 1799472 3428396 3185432
38927 3185432 1715307 1249809 3063495 6391103 9200019 9425149 6258399 1218390
38919 1218390 -2615627 -3598711 -3406309 -4642261 -6881604 -7004700 -3844545 -286656 661438
38910 661438 -33136 501405 2263306 2687165 1329606 870236 2631389 4191519 3180267
38901 3180267 967750 354547 1406509 1916301 630472 -2244233 -6406250 -10781378
38893 -10781378 -12642644 -10362194 -6404085 -4605857 -4924256 -4097154 -1300612 653718
38885 653718 343828 -33625 992613 1387519 -336868 -1554309 625919 4197795 4671199
38876 4671199 1479968 -1605977 -2104806 -1464488 -1645114 -2101014 -1572861 -843682 -1808240
38867 -1808240 -4450395 -6234920 -4837904 -879883 2656885 3708360 2946420 1708517
38859 1708517 -594736 -4971025 -9332908 -9508403 -4677752 830836 2728484 1504423
38851 1504423 251064 106000 284608 689150 1552065 1744700 318854 -1179550 -719922
38842 -719922 669224 204183 -2393179 -4789555 -5719620 -5827580 -5187945 -3147836 -656621
38833 -656621 349230 88809 454658 1272521 379420 -2184274 -3673402 -3174963 -2981714
38824 -2981714 -4170241 -4529768 -2713716 -862873 -757432 -668749 1221552 3281725 3389796
38815 3389796 2722288 3135602 3118516 314667 -3553981 -4510724 -2395731 -1148465 -2942219
38806 -2942219 -5476468 -5677755 -3300982 -94502 2470034 3924070 4716175 5640621 6388798
38797 6388798 5423257 2655398 846873 2035548 3796696 2059767 -3004778 -7075023
38789 -7075023 -7390027 -5160532 -2336330 475083 2320185 1758265 -295574 -753215 1067827
38780 1067827 1960549 -272211 -3166470 -3095031 -224929 2387960 2961580 1962381 313244
38771 313244 -1093712 -1067202 636247 2383790 2600076 1872327 1676180 1954667 1611961
38762 1611961 644333 91861 287266 480156 -152674 -1970990 -4594833 -6457249 -5861721
38753 -5861721 -3400184 -1825082 -2398314 -3178375 -2434209 -1616654 -2618385 -4017487 -3112252
38744 -3112252 -435372 1089240 884556 1317858 3675291 6657070 9036465 10738627
38736 10738627 10833533 7591743 1597324 -3815884 -6380990 -6913345 -6631815 -4986496 -1528657
38727 -1528657 2219003 4315093 4241378 2204112 -1480452 -5197466 -6312804 -4128773
38719 -4128773 -877257 1424331 3170781 4977220 5637880 4250878 2438800 2206159
38711 2206159 3003347 2952905 1694541 135027 -1271152 -2152201 -1601029 220034 1490835
38702 1490835 1627442 2679499 5502891 7030627 4727960 1538751 2050735 5163169
38694 5163169 5490153 1611005 -2218906 -3115274 -3173942 -4409300 -4854157 -2501898 529605
38685 529605 1055500 -380385 -820009 567328 1858492 1333444 -873073 -3399912 -4795853
38676 -4795853 -4821679 -4987721 -6425752 -7423636 -5561945 -2284725 -1800921 -4617077 -6233455
38667 -6233455 -4054649 -1328072 -1398021 -2219812 -541638 1999070 1732474 -666598 -1646759
38658 -1646759 -774279 -249739 102992 2070174 4195790 3281584 556289 685133 4099762
38649 4099762 6049157 4683946 4444530 8885451 15006680 17901570 17152954 15403458
38641 15403458 13888978 12670384 12587530 13872973 15073544 15914970 18620020 23626769
38633 23626769 26926068 25276491 21721533 21894218 26458129 31318061 34271226 37100781
38625 37100781 41038210 44060449 43753733 40297256 35715502 31878739 29563369 28071463
38617 28071463 25888911 22913727 21225184 22105766 23480921 22411084 19007977 15474130
38609 15474130 12436391 9236530 6982881 7677677 10272601 11114124 8997733 6627758
38601 6627758 6082051 5832962 3779706 758642 -800167 -93508 1645120 2766244 2289373
38592 2289373 545905 -630940 403205 2845506 4230970 3563331 1966428 263398
38584 263398 -1823556 -3779273 -4188500 -3310703 -3252150 -4506785 -4790360 -2661004 20509
38575 20509 741581 -695517 -3222832 -6083193 -7706475 -5738207 -643705 3018201 1765570
38566 1765570 -2133435 -3966123 -2853790 -1550658 -1348260 -844691 674333 2073749
38558 2073749 2725222 3116531 2930656 1247126 -1128583 -2286628 -2543964 -4339340 -8034127
38549 -8034127 -10503491 -9128125 -5029273 -1210399 549048 46882 -1761174 -2243771
38541 -2243771 1392597 8066372 12316727 10304249 4917250 2258375 3953187 5845973
38533 5845973 4130811 -275899 -4243487 -6473686 -7168052 -5650544 -1099941 4746391
38525 4746391 8142373 7329412 4331223 1902387 247226 -1867556 -4156189 -5196576
38517 -5196576 -5204503 -5895692 -7240824 -6775787 -3205965 1321564 3936504 4352102 4000538
38508 4000538 3551009 3048301 2934463 2861778 950312 -3373765 -7082305 -6808616 -3409303
38499 -3409303 -424578 968917 2089667 2770703 1568423 -55915 1483235 5797766
38491 5797766 7805736 5070519 1495626 1037255 1943589 812972 -1418428 -2053778 -2197170
38482 -2197170 -4500086 -7244068 -6301136 -2393596 -892649 -3856524 -7299970 -7711247
38474 -7711247 -6738583 -7283901 -8691429 -8460839 -6131169 -3107510 -619583 286446 -1308925
38465 -1308925 -4489443 -6557790 -6375181 -5790053 -6366162 -7002542 -6527598 -6044542 -6279288
38456 -6279288 -5134825 -1096514 2955096 3132674 492353 -436046 1474224 2776072
38448 2776072 1492804 87362 929136 2450046 2114872 513480 -105967 442281 611051
38439 611051 139461 488293 2666649 6127904 9293952 10059409 6839100 719673 -4233889
38430 -4233889 -4549374 -833586 3562519 6466288 7811541 7706917 6146140 4489883
38422 4489883 4665539 6343490 7030022 5557219 3305897 1153620 -2280596 -7584056
38414 -7584056 -11803886 -11325760 -6655399 -2032812 -500337 -1235514 -1758574 -994460 316423
38405 316423 978545 517181 -393209 -545723 312572 999634 611368 82536 934100 3080776
38395 3080776 5333332 7588419 10693982 14232013 16349630 16083178 14159314 11310720
38387 11310720 7733522 4501692 3171473 3164149 1954649 -881629 -2315028 -419169
38379 -419169 2147059 1905939 -60604 183791 3289239 5676417 4842512 2562767 1979125
38370 1979125 3727714 5860853 6096163 3705051 522064 -10182 3468112 7705596
38362 7705596 8176690 4870598 2093806 2157110 2401341 -141005 -4030958 -5624225 -4031904
38353 -4031904 -1577741 -534524 -1307060 -2802876 -2982772 -209894 4326598 6802631
38345 6802631 5147937 1957250 1034549 2363686 3004922 1979219 1268793 2143653 3356502
38336 3356502 3435979 2357898 341939 -2688649 -5455175 -5200631 -765235 5362957 9299349
38327 9299349 9319598 6424503 2422949 -1295060 -3537435 -3231801 -279958 3607102 5557920
38318 5557920 3988168 665564 -753214 960052 2876534 1769903 -1434088 -3022014
38310 -3022014 -1593164 608968 1395672 1129227 900063 550368 -238882 -643511 105068
38301 105068 1408631 2406649 3408493 5079610 6964445 7902159 7496155 6425047 5540126
38292 5540126 4964428 3872805 1479702 -1176100 -1346408 1983412 5584381 5346655 1940496
38283 1940496 218161 2492521 5566570 5723747 3554366 1758008 905281 72487 -411784
38274 -411784 257481 1310745 1725960 2212575 3411332 3779898 2154981 743385 2075283
38265 2075283 4354019 3918993 1528233 1565488 4847887 7000490 5228980 2297336 1709018
38256 1709018 2791240 3195181 2977790 3058611 2221541 -822284 -4062010 -4379256 -2283496
38247 -2283496 -1297115 -2847167 -4516169 -3622868 -403829 2743163 3619684 1710578 -1279561
38238 -1279561 -2369788 -126573 3483081 5287825 4723922 3984247 4494279 5022646 3806181
38229 3806181 1093192 -1344026 -2433949 -2735960 -3424683 -4752779 -5498329 -4085785 -506222
38220 -506222 3207702 4864170 4150729 2409337 965741 313176 296067 197800 -809397
38211 -809397 -2316199 -2367612 240623 3765641 5006539 2803452 -1247648 -5197566 -8073384
38202 -8073384 -8878066 -6585703 -2192720 925366 213749 -3306993 -6521417 -7664594
38194 -7664594 -7301123 -6683110 -6416620 -6428557 -6182700 -5032561 -3089277 -1464799 -927118
38185 -927118 -711983 369185 1884005 1999173 -48105 -2644096 -3451815 -1850814 641262
38176 641262 2011882 1526903 141590 -618051 -310829 -88487 -1227008 -3221295 -3990815
38167 -3990815 -2324586 387070 1469258 -139429 -2857404 -4376659 -4109316 -3448739
38159 -3448739 -3918886 -5500070 -6787190 -6490435 -4654637 -2572407 -1589578 -1807583 -1845658
38150 -1845658 -178147 2932683 5028771 3612121 -1041242 -5678484 -7114450 -5250068
38142 -5250068 -2682613 -1640499 -1990272 -2187021 -1290894 339307 1613792 1373572 -863203
38133 -863203 -3959891 -5468086 -4054731 -1486944 -875853 -2744825 -4343982 -3586574 -2075080
38124 -2075080 -2637999 -4915511 -5588317 -2966379 690931 2115422 706450 -1704436
38116 -1704436 -3464833 -4130017 -3682094 -2292647 -840756 -504426 -1531581 -3042709 -4126586
38107 -4126586 -4510025 -4119374 -2821414 -1063303 -180809 -1291933 -3891027 -6124520 -6715354
38098 -6715354 -6186141 -5751361 -5447717 -4325673 -2478491 -1508853 -2156121 -2699390 -1306904
38089 -1306904 743601 303698 -3050904 -5768996 -4605197 -581060 2526958 2564347 736073
38080 736073 -210369 1382698 4519655 6038363 3774113 -253977 -1554253 1015984
38072 1015984 3409467 2149233 -569221 -583749 1437831 1171643 -2109413 -4226045 -2832899
38063 -2832899 -949509 -1704238 -3388603 -2733077 -261623 1055403 656918 432223 881534
38054 881534 486579 -1326979 -3306121 -4455464 -4750627 -3884908 -1603979 632446 588889
38045 588889 -1775231 -4213484 -5299189 -5585313 -5416684 -3984836 -1393786 563131 900344
38036 900344 802591 1219506 1050564 -559076 -1867085 -766449 1670738 2275316 91478
38027 91478 -2481199 -2931984 -1288660 688857 1391868 22936 -3218777 -6801004 -8458501
38018 -8458501 -6826103 -2444529 2581611 5536904 4563864 542624 -2872540 -2722662
38010 -2722662 -268111 606293 -1393486 -3463865 -3136021 -1899329 -2640261 -5175101 -6682825
38001 -6682825 -5815301 -4136699 -3649304 -4775412 -6763579 -8321829 -7790524 -4548514 -618134
37992 -618134 856652 -758151 -3103119 -4413485 -5566901 -7555355 -9001805 -8021989
37984 -8021989 -5169908 -2594008 -1217974 -625994 -838446 -1942324 -2389460 -153481 4051093
37975 4051093 6803072 5972876 3068282 863480 207570 113305 -320799 -1291479 -2755241
37966 -2755241 -4394484 -5539928 -5846224 -5659916 -5319776 -4698464 -3776464 -2883613 -2011919
37957 -2011919 -863175 -31746 -899806 -3507560 -5726631 -5737583 -4331016 -3389233 -3000630
37948 -3000630 -1835779 110702 1154763 519714 -366870 187683 2023938 3570794 3636881
37939 3636881 2323364 798698 498303 1953147 4104253 5232863 4726648 3532908
37931 3532908 2946969 3476841 4669046 5286424 3905142 378661 -3383256 -5280524 -5676894
37922 -5676894 -6767310 -9066883 -10306153 -8715972 -5731209 -3915296 -3485453 -2850423
37914 -2850423 -1815159 -1899732 -3407271 -4498036 -4106125 -3857446 -5437960 -7273974 -6046342
37905 -6046342 -1496184 2283764 1382890 -3225459 -6778566 -6000857 -1938759 2373335
37897 2373335 5386109 7244831 7825005 6433768 3499542 1038184 723794 2276157
37889 2276157 4235587 5500402 5504082 3854020 982677 -1339248 -1520152 -264243 -19989
37880 -19989 -2001519 -4807665 -6512277 -7026337 -7373158 -7481683 -6307390 -4046647 -2486027
37871 -2486027 -2386256 -1931551 813382 4747829 6799918 5919951 4095621 3071462 2220139
37862 2220139 878040 701965 3320002 6774755 7172690 3819659 33226 -1625303
37854 -1625303 -2172160 -3112422 -3344958 -1455185 922401 964526 -1071450 -2257325 -1296035
37845 -1296035 313141 1422222 2699438 4237139 4311981 1871950 -1721668 -4718918
37837 -4718918 -6802587 -7424607 -4529143 2527436 10117735 13342852 11651412 8926320
37829 8926320 7854051 6846661 3491124 -1339149 -4749818 -5836970 -6194173 -6743746
37821 -6743746 -6277825 -3944495 -1505825 -1369146 -2923704 -2854950 369429 4185157 5479395
37812 5479395 4862734 5082446 6138479 5195788 1631644 -1269904 -1163585 -72997 -605880
37803 -605880 -1440863 197919 3514074 5233098 4508036 3039328 1247654 -1548070 -3648288
37794 -3648288 -2392000 586544 498408 -2993444 -4504965 -1489503 1315238 -277950
37786 -277950 -2568874 177351 6132234 8515355 5980450 3840638 5076304 6351726
37778 6351726 4427065 1325183 644282 2464493 4435815 5246365 4859744 3465798 2075942
37769 2075942 2411040 4642349 6684051 6777112 5278025 3245100 1163731 -196800 239553
37760 239553 2054525 3379015 3444532 3114738 2509033 740673 -1338844 -1269169 923806
37751 923806 1988828 470197 -843149 355220 2084239 1820295 871138 1538963 2681712
37742 2681712 2114359 1218259 2697273 5206320 4856072 1412826 -1478514 -2160223 -2731927
37733 -2731927 -4469816 -5444327 -3743559 93843 4611204 8393871 9085098 5003286
37725 5003286 -1192900 -3848780 -881282 3828763 5968315 5720409 5501948 5914209 6494524
37716 6494524 8053408 11190257 13763333 12619588 7521635 1577008 -1900826 -1804767
37708 -1804767 714590 3300675 3971221 2608316 588135 -1178637 -2754636 -3668059
37700 -3668059 -2806141 -661060 167923 -1867175 -4917865 -5936552 -4237293 -1722001
37692 -1722001 -493441 -1271465 -3296574 -4875018 -4756221 -3542567 -2898797 -3234477 -3536624
37683 -3536624 -3555224 -4191222 -5368926 -5842862 -5774642 -6842462 -8689425 -8237114 -4414554
37674 -4414554 -770137 -875215 -3457273 -4800296 -3897661 -2314171 -856782 330496
37666 330496 -110007 -2998966 -5950806 -5800665 -2990396 -445280 955337 2333371 3214964
37657 3214964 2119802 415433 1141551 3544732 3205808 -1242249 -5725613 -6718017 -5636957
37648 -5636957 -5094040 -4569945 -2785337 -1243351 -1967575 -3916877 -4908768 -5237284 -6064706
37639 -6064706 -5898758 -2520601 2395782 4468122 2494405 -223917 -868880 -185219 341153
37630 341153 1281081 3449202 5533208 5600728 3668646 1138350 -1156775 -2751486 -2552850
37621 -2552850 -10918 3327763 5326752 5946218 6500520 6541259 4022023 -810102 -4225667
37612 -4225667 -3367252 -32029 1764349 632084 -1777824 -3829756 -4717610 -3182180
37604 -3182180 1180627 5275396 4752246 -62168 -3825008 -3394679 -1969521 -3418519
37596 -3418519 -5751798 -4320795 483389 3587024 3000361 2608370 6043080 11477927
37588 11477927 14530134 13836797 11637372 10339319 10300137 10206047 8497086 4961223 1341210
37579 1341210 -407447 -381516 -21844 429631 1633918 2434851 410984 -3900272 -6322553
37570 -6322553 -4497465 -1524801 -1691841 -4559911 -6229009 -5153067 -3456530 -2966562
37562 -2966562 -3160612 -3338362 -3822368 -3997368 -1814716 2952751 6812695 6131672 1775419
37553 1775419 -1900957 -2467418 -1786054 -2530127 -4328631 -4873292 -3659687 -2521502 -2547804
37544 -2547804 -2509173 -1094069 917959 1907548 1642828 929877 16295 -1181438 -2045795
37535 -2045795 -2006887 -1614836 -1273071 132144 3147884 5163142 2938244 -2265315 -5346815
37526 -5346815 -4049418 -1897773 -2905714 -6210535 -8287186 -8196668 -7673602 -7345340 -6061564
37517 -6061564 -3845196 -2800860 -4287022 -6800766 -7599708 -5734679 -2884524 -1361722
37509 -1361722 -1581403 -1814703 -590864 1423537 2787454 3544068 4356261 4155565 1321384
37500 1321384 -2830418 -4813919 -3881667 -2919983 -3293773 -2496621 895090 3662145 2685133
37491 2685133 113784 -299926 492377 -980913 -3929113 -4209935 -1637944 -769946 -3397068
37482 -3397068 -5421104 -3390584 123087 597969 -2129216 -4713543 -5278808 -4533541 -3273406
37473 -3273406 -1557897 111432 852044 530432 -328980 -1299147 -1836702 -1105993 977292
37464 977292 3199080 4399031 4721353 4892114 5109904 5310155 5597693 5741730 5230788
37455 5230788 4490701 4867148 6498162 7382630 5760640 2522897 21169 -820172 -973118
37446 -973118 -1417142 -2079279 -2554147 -2874521 -3396673 -4355737 -5467392 -5817409 -4612601
37437 -4612601 -2312424 -421583 219458 311623 814794 1440271 1075661 -681100 -3019485
37428 -3019485 -4815883 -5691655 -6171685 -6745219 -6748188 -4794161 -911794 2438534 2633163
37419 2633163 -129577 -3191704 -4385674 -3416419 -974863 1673654 2620034 1111492
37411 1111492 -558985 567442 3531058 4040527 464070 -3800259 -5445137 -5582505
37403 -5582505 -6482474 -6884353 -4224362 175388 2225653 969760 -368902 377039 1424144
37394 1424144 503146 -1618086 -2798089 -2679272 -2265127 -1687121 -426557 817581 420449
37385 420449 -1779117 -3807078 -3940556 -2801763 -2061303 -1606701 442958 4486918 7737089
37376 7737089 7141790 3156502 -1000571 -3243845 -3868491 -3442242 -2170480 -1666577 -4276206
37367 -4276206 -9194657 -11875869 -9289570 -3666874 941716 3554492 5248829 5632775
37359 5632775 3813568 1392075 764648 1302852 925681 689896 3371473 7422937 7321258
37350 7321258 1523464 -4309663 -4493611 -94495 4246384 6846408 8715249 9484261
37342 9484261 8108188 6325208 6890219 8494684 6693046 724126 -4428320 -4558138
37334 -4558138 -1707159 -654881 -2221210 -3148786 -1569524 693284 1559301 1634302 2413294
37325 2413294 3473171 3341646 2220050 1849176 2722947 3129970 1472053 -1670015 -4404355
37316 -4404355 -5559276 -5294517 -4492476 -4024118 -3833336 -2537100 779773 4042500 3471110
37307 3471110 -1392453 -6015302 -6257537 -3555371 -2033832 -2197942 -1341019 641235 614693
37298 614693 -1905366 -2968570 -445907 2035492 592448 -2729256 -3166947 -457923
37290 -457923 1355671 303064 -1293045 -796444 1860910 5306245 7800826 7244305 3089052
37281 3089052 -1649331 -3214314 -1971325 -1322988 -1929271 -1140750 1184186 1229116 -2181486
37272 -2181486 -4254813 -1244082 3032536 2495213 -2013194 -4372629 -2834705 -2248672
37264 -2248672 -6160818 -11907541 -15272075 -15724748 -14751240 -12573193 -9353382 -6952821
37256 -6952821 -6537150 -6388767 -4821168 -3468658 -4687901 -7127088 -7295253 -4891840 -3082070
37247 -3082070 -3300410 -3180591 -811573 1793432 1516210 -1257732 -3036384 -1667182 1387627
37238 1387627 3358049 3452345 3092554 3407085 3550648 1975243 -1381337 -5177707 -8399685
37229 -8399685 -10424522 -9673286 -4830481 1709015 4555589 1777942 -1768107 -681028
37221 -681028 3353505 4187376 343113 -3289837 -3100094 -1106291 -96864 893960 3358168
37212 3358168 5287374 4063364 987527 -637476 -384596 -460619 -1773726 -3194959 -3870081
37203 -3870081 -3721164 -2611478 -1334690 -2024239 -4889948 -6199771 -2969819 1680309
37195 1680309 2007428 -2150723 -5193060 -4040262 -1906988 -2397836 -4177099 -4082157 -2342506
37186 -2342506 -1702583 -3173906 -5095049 -5353752 -3113184 399868 1948251 -975708
37178 -975708 -6428782 -9215199 -7031079 -2957783 -312162 1996388 6273145 10724504
37170 10724504 11046922 6356150 373775 -2949708 -2597909 73280 2575858 2489192 -118357
37161 -118357 -1854220 75753 3666421 4494114 1868283 -503209 -126596 1277730 1245530
37152 1245530 -29707 -1254001 -2407531 -3695615 -4119043 -3051895 -1808693 -1902116 -2947877
37143 -2947877 -3767560 -4165682 -3982469 -1957246 2232103 5955182 6184455 3453964 806279
37134 806279 -735623 -2834471 -6007815 -8324569 -8819918 -9171318 -10333600 -10280963 -7483935
37125 -7483935 -4315079 -3889415 -5075384 -4191719 -902708 1426338 1367166 1406756 3111626
37116 3111626 4136766 2346669 -183931 -240393 1708410 2892713 2792636 3049102 3974754
37107 3974754 4453195 4581907 5160445 5152425 3156799 979637 1700058 4026069 3131891
37098 3131891 -1666959 -4679166 -1703181 3843113 5842482 3322684 -180520 -2450553
37090 -2450553 -3656429 -3268127 -247051 3983785 6190853 5080169 2032152 -1330966
37082 -1330966 -3838276 -3933785 -1158783 2019107 2807736 2088457 2805401 4920625 5565518
37073 5565518 4127028 3240827 4074850 4464339 2914524 838515 -655734 -2602892 -4900781
37064 -4900781 -4749828 -958893 3225410 4434973 3638575 3322516 2962037 1026367 -752778
37055 -752778 427991 3184924 3428998 776286 -1022559 -521733 -957811 -4571358 -8433719
37046 -8433719 -8559766 -5503343 -2980310 -2539525 -2368402 -669798 2169881 4755139 6268446
37037 6268446 6599200 6024174 5131064 4529630 4456244 4730577 4862440 4284990 3079856
37028 3079856 2292652 2486686 2166537 -603781 -4673797 -6181210 -3747350 -1004906 -1651785
37019 -1651785 -3902509 -3140324 956096 3898750 3178951 1442605 1414975 1542474 -493089
37010 -493089 -2928686 -2325010 914624 3301938 3710674 4167761 5276860 4831568 1930244
37001 1930244 -1069010 -2243852 -2651029 -3262875 -2274616 1882170 6980797 9318300 8214209
36992 8214209 5698461 3130922 867860 11068 1243785 2517802 1118427 -2100301
36984 -2100301 -3629267 -2508811 -1408080 -2085866 -3133492 -3220515 -3242444 -3655006 -2895214
36975 -2895214 -752396 -453091 -4293285 -9098456 -9352218 -3967819 2872901 6960095
36967 6960095 7390289 5164925 1575089 -1529151 -2491644 -1984073 -2641892 -5622864 -8919374
36958 -8919374 -9906164 -8289326 -5690470 -3518041 -2325204 -2343017 -3311818 -4057071 -3327538
36949 -3327538 -1258248 538094 515698 -1381306 -3806511 -5230843 -4985025 -3385798 -1302174
36940 -1302174 233862 474391 -341488 -897554 -188012 981293 785208 -1104536 -2847797
36931 -2847797 -2839040 -1761597 -1369731 -2054475 -2700161 -2426505 -1400740 -198569 777784
36922 777784 1472722 2352979 3936442 5669203 6172925 5319721 4828230 5640166 6120178
36913 6120178 4657394 2738417 2940518 4708601 5070900 3288411 1561919 815436 -633400
36904 -633400 -3012562 -3421207 -600436 1822815 231911 -3138682 -3233784 232135 2535434
36895 2535434 1153370 -1159915 -1616342 -1675808 -3654240 -6050762 -5522610 -1972586 1537101
36886 1537101 3408765 5109652 7921420 10678511 11696423 11024720 9569973 7447625
36878 7447625 4635845 2252125 1591458 2329394 3009422 2968406 2438253 1134543 -1352884
36869 -1352884 -3518894 -2417476 2574387 8007823 10034913 8831452 7572085 7745683
36861 7745683 7709245 5825108 2716302 -240292 -2595773 -3936237 -3217356 -602392 1524189
36852 1524189 1348917 435413 1605933 4646606 6543844 5988251 5114761 5980213 7536774
36843 7536774 7519367 5702889 3611914 2100727 990164 499784 1282142 3034599 4344382
36834 4344382 4044101 1996857 -1081355 -3650764 -3828918 -1308768 1508603 1930594 466505
36825 466505 138149 2152805 4344779 4600598 3623077 2942390 2286477 1010575 411887
36816 411887 1814128 3347518 1973686 -1253151 -1488140 3025972 7508647 6565033 1416396
36807 1416396 -2013314 -1321900 -368008 -3144995 -8052918 -10358486 -8521555 -5436106
36799 -5436106 -3900975 -3512131 -2790291 -2213095 -3261299 -5422099 -6264823 -4665344 -2279879
36790 -2279879 -1134458 -1040578 -394110 1389134 3411931 4712740 4970524 4101502 2323847
36781 2323847 577017 -176207 -187115 -625118 -1984508 -3549411 -4398199 -4120171 -2691851
36772 -2691851 -717530 235884 -1163453 -4117344 -6088406 -5558495 -3550360 -2089064
36764 -2089064 -2010595 -2516439 -1997082 742963 4903943 7338460 5404576 545060 -2657467
36755 -2657467 -1560583 2090966 5244195 6761463 6545807 4082181 -109931 -3616043
36747 -3616043 -4929147 -5300278 -5690002 -4345332 -574266 1560535 -1945182 -7755795
36739 -7755795 -8172867 -1710354 4638510 5106762 1904608 -252235 -1296844 -3356164
36731 -3356164 -5090647 -3799132 -1025158 -652452 -2169231 -1060154 3595638 6703525
36723 6703525 4064583 -1928925 -5698018 -4985740 -1871887 643735 894821 -1157293
36715 -1157293 -3818434 -4709910 -3446156 -2374819 -3395002 -5323447 -6053611 -5940558 -6657079
36706 -6657079 -7533534 -6003074 -1991039 892157 -150621 -3290510 -4343808 -1731331
36698 -1731331 2299363 4673513 4276367 2073054 -232349 -1495089 -1871664 -2415445 -3596993
36689 -3596993 -4533272 -4165966 -2716036 -1243792 -257177 299586 149076 -906216 -1819809
36680 -1819809 -1075791 1020251 2235139 1287340 -401547 -800604 -59964 132358 -616939
36671 -616939 -796493 599239 2286023 2095464 -286689 -2774764 -3302259 -2299708 -2002941
36662 -2002941 -3284337 -4395622 -3791127 -2992524 -4633073 -8089857 -9621840 -7389790
36654 -7389790 -3794734 -1631556 -518059 834418 1295898 -588558 -2810320 -1970138
36646 -1970138 1378367 3222584 2146742 1088602 2080519 3152116 2594695 2759052 6188100
36637 6188100 10311965 10062873 4964959 -177248 -1840168 -1618014 -2559199 -4689989 -6016924
36628 -6016924 -5856607 -4979206 -3723017 -2147098 -1316703 -2206718 -3522302 -2803275 35027
36619 35027 2408606 2898994 2955859 3433981 2101370 -2593115 -7164435 -6456291 -978404
36610 -978404 3214995 2746453 952806 1859652 4055285 3825147 1411623 65485 609149
36601 609149 1118846 1105025 1857055 2879361 2069173 -220271 -1221237 -607485 -1407550
36592 -1407550 -4711227 -7151494 -5665957 -1696300 1466170 2752712 2550906 589739
36584 589739 -2731353 -5048234 -4826216 -3847663 -4451002 -5846040 -5697898 -4025763 -2959389
36575 -2959389 -3579785 -5208996 -6859395 -7452245 -5887329 -2917432 -1450017 -2771280
36567 -2771280 -4166168 -2827547 -240352 470975 -268001 118040 1035483 -660810 -5000022
36558 -5000022 -8322162 -8824087 -8450951 -8406296 -7069274 -4005333 -2025860 -2795293 -3632248
36549 -3632248 -1529289 2061782 3371921 1595022 -689872 -1390236 -878796 -574104 -1202031
36540 -1202031 -2178967 -1909582 460792 3039535 2492143 -1620766 -5484860 -5460144 -2400112
36531 -2400112 48748 55110 -1411207 -3080354 -4607856 -5691433 -5985468 -6013211 -6641927
36522 -6641927 -7427766 -6752397 -4097966 -1382165 -1317572 -4385714 -7748934 -7815942 -4277917
36513 -4277917 -764064 -480906 -2164974 -2232937 -242299 601941 -1346421 -3519607 -2981007
36504 -2981007 -315255 2047902 3156833 3297159 2517749 1498127 1924316 3684581 3628099
36495 3628099 -142581 -4484946 -4957997 -2119798 -596757 -2539546 -5593747 -7266130
36487 -7266130 -7723743 -7743316 -7156998 -6268921 -6052849 -6081586 -4852396 -2836374 -2316704
36478 -2316704 -3364702 -3235957 -1101789 148006 -1055032 -1685356 912001 3872354
36470 3872354 2881477 -665061 -1511372 1190219 2658328 282152 -2293029 -1128082
36462 -1128082 1980921 2744909 881998 -464548 -297686 -726072 -2565168 -3792539 -3392044
36453 -3392044 -3530271 -5899038 -8112857 -6370434 -799988 4287267 5517191 3925739
36445 3925739 2824782 3686097 5094344 5006388 3057640 694242 -471579 -259879 149129
36436 149129 -147847 -659564 -488630 -13179 -620484 -2684462 -4719101 -4948862 -3106275
36427 -3106275 -359000 1891110 2767034 2224002 1230978 1077026 1794616 1758335 -306817
36418 -306817 -3281877 -4695983 -3807471 -2442435 -2212414 -2006553 414377 4697900 7495531
36409 7495531 6508203 3557705 2089159 2389180 1444148 -2302268 -6445037 -8079570 -7694513
36400 -7694513 -7563450 -7743598 -6373323 -3406609 -1260459 -1411702 -2689364 -3564804 -4041413
36391 -4041413 -4468508 -4433494 -3882260 -3706344 -4210215 -4492429 -4233812 -4493543 -5769302
36382 -5769302 -6914130 -6989522 -6485931 -5748985 -4261914 -2652331 -2880084 -4660293 -4503724
36373 -4503724 -1011344 1541522 -1356190 -7338048 -9832442 -6832923 -2340401 755950
36365 755950 4086526 8723675 11412946 8822766 2594377 -2744577 -5036577 -5335983
36357 -5335983 -5125339 -4978391 -4940659 -4426138 -2599559 -68618 1152968 621172 652305
36348 652305 2813329 4970948 4113767 774933 -1851700 -2241169 -1412673 -223841 1348965
36339 1348965 2436193 1701215 -69497 -486182 594129 269366 -3215713 -7732061 -10126849
36330 -10126849 -9816878 -7939732 -4900368 -951789 2219919 2981654 2110412 1479119 1044342
36321 1044342 -542897 -2881283 -4110459 -4186435 -4909196 -6194344 -5415399 -1635031 2477171
36312 2477171 4572221 5476047 6009549 4245869 -772536 -5518697 -6567400 -6498567 -9965283
36303 -9965283 -15227470 -15870434 -11060394 -7271922 -7969207 -8437366 -4609944 -698770 -2317417
36294 -2317417 -6785906 -7167950 -3074916 -303387 -1057964 -1638503 70873 1542977 1301013
36285 1301013 1674396 3843684 5357337 4938366 4990378 6672278 7025794 4140044 926899
36276 926899 80147 -793050 -4588891 -8568730 -8020156 -3943940 -1625823 -2439388 -2402078
36267 -2402078 909623 4933294 6695803 6514494 5473825 3102632 -3794 -559955
36259 -559955 2999920 6546673 4634130 -1592811 -4683770 -268835 6815642 8251617
36251 8251617 2480407 -3845313 -4429268 -98771 4177211 5951683 6242269 5906196 4824934
36242 4824934 4066037 5038791 6127566 3829544 -1655475 -5439657 -4268033 -673412
36234 -673412 1291028 1417848 1732931 2301812 2110399 2151651 3908133 5925950 5460081
36225 5460081 2835077 821805 185257 -748203 -2267092 -2477996 -724518 1278128 2364346
36216 2364346 3291926 4630123 5841557 6977416 8633723 9626975 7587148 2909867
36208 2909867 -646659 -773100 383107 -352050 -2834113 -4451358 -3661991 -1084637 1479898
36199 1479898 1762038 -1597043 -6840776 -9839968 -8719711 -6304727 -6186041 -7827040
36191 -7827040 -7837354 -5141539 -2410731 -2509520 -5460253 -8965967 -10397656 -8338760 -3717078
36182 -3717078 456090 1781736 1052336 1025634 2718141 4374694 4348394 3365118 2978187
36173 2978187 2966560 1708904 -1207650 -4106772 -5257540 -4770958 -3716934 -2062080 1152524
36164 1152524 5444319 8181161 7400910 4556343 2978356 3806049 4980840 4550169 3359363
36155 3359363 3428884 4736754 5078796 2948997 -589829 -3198187 -3713791 -2847788 -1806971
36146 -1806971 -942245 -31046 678765 564919 -243821 -739920 -320266 693138 2155371
36137 2155371 4471785 7063035 7883937 6024862 3727236 3820220 5723310 6146404 3619934
36128 3619934 124701 -2055940 -2946611 -3633963 -4299660 -4544610 -4353788 -3878288 -3281514
36119 -3281514 -3211328 -4149423 -4993933 -3920382 -1179595 737475 533348 -88394 833559
36110 833559 2622404 3246348 2281508 1211549 1576792 3721026 6445524 7346425 4885315
36101 4885315 748242 -1615928 -1590006 -2244073 -5209412 -7295784 -4791502 758302 4207018
36092 4207018 3326739 702221 -512361 133360 1564233 3101384 4410609 5174062 5425049
36083 5425049 5170382 3742043 795250 -2246269 -3239134 -1824339 417704 2164352
36075 2164352 3300732 3812477 3288770 1772256 -13349 -1384177 -1895582 -1315068 -373679
36066 -373679 -713524 -2692605 -4124346 -2949469 -336417 920257 350698 -159308 379033
36057 379033 1474720 3350429 6532798 9270306 8969445 6914542 7704137 12260506 15071671
36048 15071671 11282691 3795429 -207756 1720605 5252962 5735060 3417716 1620662
36040 1620662 1975192 2838894 1750295 -1370240 -3905426 -3886255 -3112924 -5231236 -10454388
36031 -10454388 -14435000 -13598348 -9507634 -6144584 -4797266 -4068074 -3423662 -3716496 -4764022
36022 -4764022 -5224196 -4833702 -4446070 -4030633 -3020376 -2412968 -3747648 -5867648 -5722913
36013 -5722913 -3023745 -963458 -1102108 -703892 2805759 7508247 9750800 9067316 7438427
36004 7438427 5427171 2452784 -169193 -181510 1733556 2458333 1215013 583299 1973342
35995 1973342 3361592 2967852 2130333 2472892 2851339 1603276 -356335 -1418574 -2288216
35986 -2288216 -3925869 -4186604 -531904 4646261 5879684 2379262 -247596 2342949
35978 2342949 7385715 9076657 5672481 -9915 -4850647 -7253193 -6386737 -2854436
35970 -2854436 437509 759340 -1198354 -2541076 -2195206 -1602698 -1763220 -1968854 -1641814
35961 -1641814 -1168739 -295396 2307959 6745422 10461090 10409515 6337939 1219129 -1601051
35952 -1601051 -1503577 -650234 -781213 -777996 1142631 3421444 2265708 -2436275 -5674847
35943 -5674847 -4050410 -807710 -707381 -2552291 -1487699 2864922 5969841 5783707
35935 5783707 5138044 5924945 6206370 4855253 4099631 4896124 4233147 163457 -4362294
35926 -4362294 -6063169 -6137573 -6768992 -6246766 -2177434 2943903 4366514 1948654 -188563
35917 -188563 -32693 647870 601646 896410 2230316 3901204 5572425 7034448 6562705
35908 6562705 2825994 -1908885 -3946512 -3205295 -2478020 -2226687 -551319 1769517 1424942
35899 1424942 -1232784 -1403471 2708576 6590251 6385282 4610925 5323647 7550099 7833831
35890 7833831 6200376 4884173 3401325 -88192 -3749840 -3418894 1111868 5476629
35882 5476629 6771599 6273283 5440715 3169083 -1171710 -4989891 -5192992 -2136358 989350
35873 989350 1858300 844703 -243965 -379275 -446079 -2225202 -5794790 -8478731 -7614758
35864 -7614758 -4088379 -1561891 -2079213 -3914896 -4044393 -1322724 3108592 7058551
35856 7058551 8342056 6050666 1775943 -1266252 -1113189 1387824 4015783 5246141
35848 5246141 4696636 2746005 456614 -855184 -625809 663333 2202708 3297660
35840 3297660 3377909 2532241 1744684 1374561 -180140 -4492002 -9896994 -12522877 -10969363
35831 -10969363 -7703433 -5136404 -2963869 -673563 260864 -938902 -2004126 -1068612
35823 -1068612 -533691 -3744046 -8992955 -11118789 -8929700 -6573830 -6586860 -6096903 -2345932
35814 -2345932 1844829 1816811 -2043746 -5147438 -5370144 -4959755 -5726210 -6043022 -4046973
35805 -4046973 -1162195 -342563 -2083528 -3984800 -3766874 -1362091 1820125 4592949
35797 4592949 6732379 8681825 10886968 13225231 14871095 14754838 12354616 8222594
35789 8222594 3661008 -343669 -3738736 -6608494 -8114712 -7254000 -4762192 -2920437
35781 -2920437 -2769915 -2828478 -1692624 -559390 -1349829 -3313552 -3879980 -2594403 -1645542
35772 -1645542 -2097726 -2149079 -256171 2147678 2626030 919810 -1354087 -2973792 -3659579
35763 -3659579 -3401606 -2598496 -1985734 -1388979 258087 2628075 3445909 1793874 131537
35754 131537 831560 2434374 2123347 370278 -430984 -932729 -4058490 -9076087 -11001551
35745 -11001551 -7506497 -2540224 -736198 -1401201 -889075 1540665 3450415 3318875
35737 3318875 1930891 425103 -671735 -985798 -665637 -493886 -244814 1703961 5442790
35728 5442790 7980632 6955061 4217333 2903520 2512756 416326 -2842803 -3928183
35720 -3928183 -2249298 -934493 -1613405 -2216473 -1240416 -439060 -1374390 -2577999 -2373616
35711 -2373616 -1665292 -1525696 -638114 2148721 4961021 5518525 4804583 5153850 6210043
35702 6210043 5919315 4365869 3307510 2581927 339328 -3227687 -5507478 -5226205 -4001404
35693 -4001404 -3695387 -4433872 -5541614 -6303569 -5616357 -3082653 -597612 -530351 -2169360
35684 -2169360 -2484853 -666700 908906 768352 326910 751193 912531 18795 -588640
35675 -588640 -135051 -200494 -1706832 -2769306 -1965976 -1080923 -1665206 -1497463 1748683
35666 1748683 5387981 4769669 357370 -2894182 -2976372 -2893766 -4719886 -6401990 -6275059
35657 -6275059 -6450801 -8819860 -10853915 -8768863 -3065201 2022393 3505170 1761514
35649 1761514 -1242630 -3618831 -4231313 -3661679 -3766725 -4627195 -3191584 2694423 9839606
35640 9839606 12258830 8361490 3038701 1784859 4711816 7467521 6628317 2862869
35632 2862869 -584859 -1447106 -361431 468341 240814 399882 2047584 3666845 2933040
35623 2933040 225904 -1538056 -665985 1435122 2473458 1660437 -691273 -4115415
35615 -4115415 -7306396 -7956640 -5017260 -481153 2572557 3365400 3552092 4312598 4940908
35606 4940908 4603107 3923027 3747912 3243363 701134 -3671142 -6992015 -6576267 -3066311
35597 -3066311 239631 1119700 510344 586751 1870355 3166160 3634917 3662083 3907745
35588 3907745 4721178 6470685 9126124 11209002 10509100 6650773 2036615 -549609
35580 -549609 -532562 924779 2910147 4955973 5891339 4308336 616659 -2545369 -2718177
35571 -2718177 35045 3563012 5795252 5926222 4068679 913210 -2047593 -3013105
35563 -3013105 -1573966 417062 699571 -644106 -1401324 -500860 338999 -714492 -2567850
35554 -2567850 -2657694 -753003 939448 1437571 2256511 4215859 5391636 3973921 1408679
35545 1408679 583246 1965631 3617691 4237223 3972850 2734108 209181 -2296630 -2499684
35536 -2499684 -401023 1104373 -82025 -2626618 -3935647 -3455248 -2483401 -1964338 -1995645
35527 -1995645 -2621205 -3547977 -3621520 -1993173 557593 2646175 4121009 5605337 6771224
35518 6771224 6662085 5440231 4136842 2787841 657863 -1581184 -2013947 -466868
35510 -466868 765270 317074 -121843 1234954 3005435 2800135 1533419 2532748 6228244
35501 6228244 8573993 5993181 7854 -4532898 -4699537 -1646183 1632554 3288829
35493 3288829 3521807 3465545 3476028 2632133 428034 -1373621 -152597 3705803 6081619
35484 6081619 3851249 -761288 -2602627 48875 3743276 4866517 4274414 5437668
35476 5437668 9035898 11344248 8546699 1706049 -3734887 -3726690 -30740 2178864 629750
35467 629750 -1953938 -2377177 -1245253 -1058686 -2004024 -2323824 -1816821 -1869588 -2218477
35458 -2218477 -891255 2093916 4103744 4078712 4264969 5958377 6468231 3107541 -1955376
35449 -1955376 -4168467 -2798975 -1400167 -2457329 -4665550 -5865534 -5963806 -5970194 -6068464
35440 -6068464 -5735115 -4698476 -3240291 -2309234 -3093039 -5238782 -5981455 -2932181 2385462
35431 2385462 5847104 5664792 3765717 2027964 8762 -2457212 -3310139 -1162269
35423 -1162269 1891999 2880340 1974043 1365108 1246946 -78165 -2393700 -3023725 -875089
35414 -875089 1557231 1666217 353085 387966 2281006 3765522 3178643 1615017 1129855
35405 1129855 1901501 2210916 982480 -640290 -746734 788308 2012716 1297877 -655731
35396 -655731 -1766327 -1177922 -199270 -528785 -2106534 -3231363 -2725813 -1393824 -800382
35387 -800382 -912269 -97779 2011857 2981834 559712 -3416904 -4448799 -1190607 2508803
35378 2508803 2755583 675169 59586 1525568 2149064 519842 -1148787 -721090 917529
35369 917529 2061615 2906496 4068743 4300209 2201113 -865410 -2113462 -1135994 -59491
35360 -59491 -157626 -698613 -1201549 -2250326 -3485135 -3371367 -2056161 -1911468 -3590856
35351 -3590856 -4044116 -932145 3015949 3254307 -183334 -3043758 -3103888 -2229110 -1823046
35342 -1823046 -359481 2755128 4487343 2371868 -978620 -953021 2725766 6019895
35334 6019895 6413212 5533591 5591750 5989395 4682666 1216700 -2791454 -5341177 -5567520
35325 -5567520 -4171643 -2609401 -1524110 -432508 441146 -860933 -5618457 -11717125
35317 -11717125 -15331560 -15070731 -12574993 -9401855 -5763538 -2389482 -835626 -1085689
35309 -1085689 -1282527 -917949 -1935435 -5259147 -8451586 -8703971 -6503513 -4479177 -3919492
35300 -3919492 -4182595 -4480821 -4617698 -4693005 -5139460 -6126848 -6423496 -4600331 -1983552
35291 -1983552 -1851980 -4466762 -5985176 -4415335 -3278598 -6083919 -10296624 -11186916
35283 -11186916 -9188424 -8130381 -7775010 -4338072 1633145 4288498 961344 -3923315
35275 -3923315 -5742145 -5501112 -5895540 -6143744 -4520996 -2486466 -2289439 -3049396 -2769101
35266 -2769101 -1792065 -817416 1792258 6608560 9537450 6581778 651314 -1648121
35258 -1648121 610994 1882918 -1004141 -4628037 -5118941 -3645951 -3133393 -3278210 -2057693
35249 -2057693 219712 1431545 894384 -209393 -751826 -353762 964022 2586252 3645137
35240 3645137 4306835 5476575 6739227 6476700 4794465 4021403 4998035 5292766 2983342
35231 2983342 -97838 -1276274 -1146898 -1952609 -3493436 -3812437 -2852407 -2167113 -1693783
35222 -1693783 -165375 1603484 1336623 -670881 -1627128 -822491 -487687 -1097985 244460
35213 244460 4656146 8239744 7092361 3047066 1039544 2360947 3907616 3225254
35205 3225254 984148 -1345633 -3252467 -4265309 -3799316 -2543841 -2042154 -2403286 -2225290
35196 -2225290 -1157108 -589775 -1158519 -1419718 24735 2575419 4717973 5697476 5227340
35187 5227340 2939071 -699263 -4015587 -5847295 -6685726 -7040906 -5800146 -1843464
35179 -1843464 3312002 6284443 5439395 2496275 206923 -570024 -878250 -1383601 -1113034
35170 -1113034 1048090 4057850 5110255 3029264 348820 593133 3848546 6676738
35162 6676738 6394555 3553041 -112762 -3829017 -6700934 -6751913 -3216375 1447408 3880073
35153 3880073 3397893 1629561 -312363 -2187497 -2982091 -1430075 1776808 4243913
35145 4243913 4450049 2629772 -392266 -3330470 -3986718 -1210965 2701901 4131836
35137 4131836 2883624 2142521 3250541 3678618 1545459 -860240 -361238 2447730 4292278
35128 4292278 3527036 1037267 -2032462 -5058531 -7011170 -6865460 -4840782 -1859746
35120 -1859746 1705330 5391954 7610102 7109495 5055529 3811449 3798235 3241818 1035332
35111 1035332 -1738289 -3386372 -3488871 -2984988 -3204709 -4621499 -5758184 -3992079 1255537
35102 1255537 6776861 8731476 7162371 5396793 5030263 3910117 -1289 -4816593
35094 -4816593 -6565111 -4046567 -291662 893030 -1038394 -3187859 -2794081 -346300
35086 -346300 1520529 1873017 2722436 5823675 9784516 11766304 10960876 8788382 6603323
35077 6603323 5016330 4585114 4970852 4056827 431264 -3550826 -3966911 -790237 1657371
35068 1657371 389198 -2773870 -4373804 -3373349 -786361 2205306 3997251 2570744
35060 2570744 -2108347 -7025108 -9138062 -8404716 -6761812 -5687194 -5854924 -7202626
35052 -7202626 -7894353 -5368696 -228855 3112402 1854352 -1304160 -2227726 -1013607
35044 -1013607 -351871 -264337 1352569 3967508 4598084 2774253 1363433 1969000 3097597
35035 3097597 3509912 3802712 3755123 1762766 -1617353 -2994642 -956481 1489645 1472124
35026 1472124 433851 1126138 2801089 2501341 -323613 -3451406 -5335598 -6319130 -6746136
35017 -6746136 -6057645 -3904893 -860649 1905192 3071747 2120537 404430 -80063 407678
$$ [...]
##END NTUPLES=NMR SPECTRUM
##END=
