##TITLE=31Pdec_ABDP0406K
 CDCl3, 124 sc
 7.06.2021
##JCAMPDX= 6.0         $$ Bruker NMR JCAMP-DX V2.0
##DATA TYPE= NMR SPECTRUM
##DATA CLASS= NTUPLES
##ORIGIN= UXNMR, Bruker Analytische Messtechnik GmbH
##OWNER= root
$$ XWIN-NMR		Version 3.5
$$ Mon Jun  7 10:55:59 2021 Russian Standard Time (UT+4h)  she@DPX200
##.OBSERVE FREQUENCY= 81.013821
##.OBSERVE NUCLEUS= ^31P
##.ACQUISITION MODE= SIMULTANEOUS
##.ACQUISITION SCHEME= undefined
##.AVERAGES= 124
##.DIGITISER RES= 16
##SPECTROMETER/DATA SYSTEM= spect
##.PULSE SEQUENCE= zgpg30
##.SOLVENT NAME= CDCl3
##.SHIFT REFERENCE= (INTERNAL, CDCl3, 0, 248.564)
##AUDIT TRAIL= $$ (NUMBER, WHEN, WHO, WHERE, WHAT)
$$ ##TITLE= Audit trail, XWIN-NMR		Version 3.5
$$ ##JCAMPDX= 5.01
$$ ##ORIGIN= Bruker BioSpin GmbH
$$ ##OWNER= she
$$ F:/spectra/data/she/nmr/P31/1/pdata/1/auditp.txt
$$ ##AUDIT TRAIL=  $$ (NUMBER, WHEN, WHO, WHERE, WHAT)
(   1,<2021-06-07 10:55:06.20 +0400>,<she>,<DPX200>,
      <continue with go, POWCHK disabled, PULCHK disabled
       configuration hash MD5:
       00 E9 B6 7A A2 85 ED C7 34 08 36 98 17 FE 4E 26
       data hash MD5: 32K
       FA 72 6D 17 42 66 DC 56 65 D6 CA 6F 8B A6 B3 9A>)
(   2,<2021-06-07 10:55:09.93 +0400>,<she>,<DPX200>,
      <Start of raw data processing
       efp BC_mod = 2 LB = 1 FT_mod = 6 PKNL = 1 PHC0 = -5820.564 PHC1 = -25.12524 SI = 64K 
       data hash MD5: 64K
       E6 02 EC 13 B4 6F 62 E4 35 C0 F2 A3 07 14 E9 CA>)
(   3,<2021-06-07 10:55:26.98 +0400>,<she>,<DPX200>,
      <pk PHC0 = -1.09496 PHC1 = 0 
       data hash MD5: 64K
       0B 02 48 7C 06 E3 74 05 EA 53 EF 3D 46 71 AC 7D>)
(   4,<2021-06-07 10:55:30.07 +0400>,<she>,<DPX200>,
      <abs ABSG = 5 
       data hash MD5: 64K
       EA 3B AE 4A C8 61 5C CB 98 32 33 1E 14 13 B6 84>)
$$ ##END=
$$ 
$$ hash MD5
$$ C2 6C 23 39 C6 5F FB C1 FA E8 38 0C BD 56 AF 89
##$RELAX= 
##$RELAX= 
##$RELAX= 
##$RELAX= 
##$RELAX= 
##$RELAX= 
##$RELAX= 
##$RELAX= 
$$ Bruker specific parameters
$$ --------------------------
##$DU= <F:/spectra>
##$EXPNO= 1
##$NAME= <P31>
##$PROCNO= 1
##$TYPE= <nmr>
##$USER= <she>
##$AMP= (0..31)
100 100 100 100 100 100 100 100 100 100 100 100 100 100 100 100 100 100 
100 100 100 100 100 100 100 100 100 100 100 100 100 100 
##$AQSEQ= 0
##$AQ_mod= 1
##$AUNM= <au_zg>
##$AUTOPOS= <>
##$BF1= 81.014009
##$BF2= 200.13
##$BF3= 200.13
##$BF4= 200.13
##$BF5= 200.13
##$BF6= 200.13
##$BF7= 200.13
##$BF8= 200.13
##$BYTORDA= 1
##$CFDGTYP= 0
##$CFRGTYP= 5
##$CHEMSTR= <none>
##$CNST= (0..31)
1 1 145 1 1 1 1 1 1 1 1 1 1 1 1 1 1 1 1 1 1 1 1 1 1 1 1 1 1 1 1 1 
##$CPDPRG= <waltz16>
##$CPDPRG1= <>
##$CPDPRG2= <waltz16>
##$CPDPRG3= <>
##$CPDPRG4= <mlev>
##$CPDPRG5= <mlev>
##$CPDPRG6= <mlev>
##$CPDPRG7= <mlev>
##$CPDPRG8= <mlev>
##$CPDPRGB= <>
##$CPDPRGT= <>
##$D= (0..31)
0 1 0 0 0 0 0 0 0 0 0 0.03 2e-05 3e-06 0 0 0 0 0 0 0 0 0 0 0 0 0 0 0 0 
0 0 
##$DATE= 1623048741
##$DBL= (0..7)
120 120 120 11 120 120 24 19 
##$DBP= (0..7)
150 150 150 150 150 150 150 150 
##$DBP07= 0
##$DBPNAM0= <>
##$DBPNAM1= <>
##$DBPNAM2= <>
$$ [...]
##$SUBNAM3= <"">
##$SUBNAM4= <"">
##$SUBNAM5= <"">
##$SUBNAM6= <"">
##$SUBNAM7= <"">
##$SUBNAM8= <"">
##$SUBNAM9= <"">
##$SW= 501.771253377433
##$SWIBOX= (0..15)
0 1 3 0 0 0 0 0 0 0 0 0 0 0 0 0 
##$SW_h= 40650.406504065
##$TD= 32768
##$TD0= 1
##$TE= 0
##$TE2= 300
##$TE3= 300
##$TEG= 300
##$TL= (0..7)
0 120 53 12 22 120 120 120 
##$TP= (0..7)
150 150 150 150 150 150 150 150 
##$TP07= 0
##$TPNAME0= <>
##$TPNAME1= <>
##$TPNAME2= <>
##$TPNAME3= <>
##$TPNAME4= <>
##$TPNAME5= <>
##$TPNAME6= <>
##$TPNAME7= <>
##$TPOAL= (0..7)
0.5 0.5 0.5 0.5 0.5 0.5 0.5 0.5 
##$TPOFFS= (0..7)
0 0 0 0 0 0 0 0 
##$TUNHIN= 0
##$TUNHOUT= 0
##$TUNXOUT= 0
##$USERA1= <user>
##$USERA2= <user>
##$USERA3= <user>
##$USERA4= <user>
##$USERA5= <user>
##$V9= 5
##$VALIST= <valist>
##$VCLIST= <CCCCCCCCCCCCCCC>
##$VD= 0
##$VDLIST= <DDDDDDDDDDDDDDD>
##$VPLIST= <PPPPPPPPPPPPPPP>
##$VTLIST= <TTTTTTTTTTTTTTT>
##$WBST= 1024
##$WBSW= 4
##$XGAIN= (0..3)
0 0 0 0 
##$XL= 0
##$YL= 0
##$YMAX_a= 5306
##$YMIN_a= -3164
##$ZGOPTNS= <>
##$ZL1= 120
##$ZL2= 120
##$ZL3= 120
##$ZL4= 120
##$ABSF1= 248.5645
##$ABSF2= -253.2056
##$ABSG= 5
##$ABSL= 3
##$ALPHA= 0
##$AQORDER= 0
##$ASSFAC= 0
##$ASSFACI= 0
##$ASSFACX= 0
##$ASSWID= 0
##$AUNMP= <proc_1d>
##$AZFE= 0.1
##$AZFW= 0.5
##$BCFW= 0
##$BC_mod= 2
##$BYTORDP= 0
##$COROFFS= 0
##$CY= -3
##$DATMOD= 1
##$DC= 0
##$DFILT= <>
##$DTYPP= 0
##$F1P= 0
##$F2P= 0
##$FCOR= 1
##$FTSIZE= 65536
##$FT_mod= 6
##$GAMMA= 0
##$GB= 0
##$INTBC= 1
##$INTSCL= 5.30512e-09
##$ISEN= 30
##$LB= 1
##$LEV0= 0
##$LPBIN= 0
##$MAXI= 10000
##$MC2= 0
##$MEAN= 0
##$ME_mod= 0
##$MI= 50
##$NCOEF= 0
##$NC_proc= -8
##$NLEV= 6
##$NOISF1= 182.463
##$NOISF2= 159.3651
##$NSP= 0
##$NTH_PI= 0
##$NZP= 0
##$OFFSET= 248.5645
##$PC= 4
##$PHC0= -5821.659
##$PHC1= -25.12524
##$PH_mod= 1
##$PKNL= yes
##$PPARMOD= 0
##$PSCAL= 0
##$PSIGN= 0
##$REVERSE= no
##$SF= 81.014009
##$SI= 65536
##$SIGF1= 159.3651
##$SIGF2= -187.1042
##$SINO= 113.3802
##$SIOLD= 16384
##$SREGLST= <1H.CDCl3>
##$SSB= 0
##$STSI= 65536
##$STSR= 0
##$SW_p= 40650.406504065
##$SYMM= 0
##$S_DEV= 0
##$TDeff= 32768
##$TDoff= 0
##$TI= <>
##$TILT= no
##$TM1= 0
##$TM2= 0
##$TOPLEV= 0
##$USERP1= <user>
##$USERP2= <user>
##$USERP3= <user>
##$USERP4= <user>
##$USERP5= <user>
##$WDW= 1
##$XDIM= 65536
##$YMAX_p= 318516315
##$YMIN_p= -80458067
$$ End of Bruker specific parameters
$$ ---------------------------------
##NTUPLES= NMR SPECTRUM
##VAR_NAME=  FREQUENCY,     SPECTRUM/REAL,   SPECTRUM/IMAG
##SYMBOL=    X,             R,               I
##VAR_TYPE=  INDEPENDENT,   DEPENDENT,       DEPENDENT
##VAR_FORM=  AFFN,          ASDF,            ASDF
##VAR_DIM=   65536,         65536,           65536
##UNITS=     HZ,            ARBITRARY UNITS, ARBITRARY UNITS
##FACTOR=    0.620285442955139, 1,           1
##FIRST=     20137.2065510759, 0,            0
##LAST=      -20513.1999529892, 0,           0
##MIN=       -20513.1999529892, -80458067,   0
##MAX=       20137.2065510759, 318516315,    0
$$ Real data points
##PAGE= N=1
##DATA TABLE= (X++(R..R)), XYDATA
$$ [...]
42229 32585756 32156358 28786880 27511700 25391939 18474908 8741892 1471864 -2433362
42221 -2433362 -7280119 -14584052 -18932228 -16099170 -11232933 -11816367 -14734083 -9601539
42213 -9601539 4451172 15045458 12767952 2290284 -7084235 -13309987 -17867348 -18061783
42205 -18061783 -11458959 -2954057 725529 382897 1357065 4245957 5374190 3912625
42197 3912625 1777668 -1669095 -8241253 -15318200 -17604574 -14088260 -8311895 -2426218
42189 -2426218 4140477 10403138 12843457 9453985 2046545 -5447048 -9431228 -8974335
42181 -8974335 -7401369 -9224188 -13754576 -15134867 -10903532 -6079035 -5294525 -5772374
42173 -5772374 -3193545 -108574 -1837262 -6802260 -8062140 -3527920 1575278 2359128
42165 2359128 -730387 -4468605 -5921021 -3256534 2246142 5335643 2007378 -4740118
42157 -4740118 -8268365 -7033692 -5981579 -9217874 -14946858 -18092558 -15167685 -6587513
42149 -6587513 3331196 8944100 8144397 4449450 2906661 5101134 9227065 12621898
42141 12621898 12593261 7795329 943035 -3198984 -4698849 -8849751 -16666172 -20652069
42133 -20652069 -15324922 -6838851 -5162949 -10396825 -14353746 -12948195 -9049595 -5034450
42125 -5034450 -1212757 -1008293 -8474228 -19126337 -21689037 -12387624 -1062268 869645
42117 869645 -6095310 -11782737 -8881554 58715 6713789 6042564 1266864 -569910
42109 -569910 2250901 4711612 3983050 4105559 7541770 8389575 1675514 -5686866 -3344665
42100 -3344665 6141230 10876584 8458456 8421334 14269724 16518951 8991970 105074
42092 105074 -171668 4632767 4533958 -1624637 -7038893 -8236046 -6928518 -4175379 -654910
42083 -654910 54305 -4049779 -8026783 -6338381 -2256981 -3135775 -7887159 -7925509 -1015204
42074 -1015204 4406611 1462530 -5604761 -8182241 -4615824 -238714 896321 -139856
42066 -139856 -537008 442481 1387588 811908 -1115391 -2532513 -1839101 275862 1529932
42057 1529932 897063 -310587 -763084 -1462401 -4397835 -8857492 -10563018 -5986297 2641859
42048 2641859 8421829 6930893 1044876 -2811903 -2224069 -694365 -2539451 -8025350
42040 -8025350 -13829457 -16740515 -16397537 -15037693 -14462795 -13380299 -9422931 -4058534
42032 -4058534 -2246235 -5513062 -9273290 -10037046 -10606869 -13079239 -11772946 -1458146
42024 -1458146 10534347 10795799 -1871558 -15025077 -20368758 -21461887 -20762946 -12276256
42016 -12276256 5108415 18412500 15946183 4167552 -2381441 -1985913 -4123417 -11172836
42008 -11172836 -15708416 -15080318 -14933327 -16374806 -12630283 -2831338 2647289 -2464530
42000 -2464530 -9089593 -5523949 5054731 8907527 101820 -13708775 -22284404 -22022245
41992 -22022245 -14092314 -470010 15094572 26238105 28223224 22762639 16595470 14472477
41984 14472477 14290735 10501240 2324027 -3829862 -1890156 6206147 13437175 16298862
41976 16298862 16202074 13872630 8437669 2308725 276551 1725627 348820 -5103710
41968 -5103710 -6766038 145841 7459070 4501348 -5699436 -10305152 -5387882 -571107
41960 -571107 -3260994 -8009277 -6693563 -1713476 -1574601 -7561443 -12799799 -13430237 -13293643
41951 -13293643 -15970054 -18081098 -14239548 -5511779 1185058 1555982 -1314026 -1573673
41943 -1573673 1879265 4430978 2363390 -1426087 -523621 6140857 11357554 8011534
41935 8011534 -1146897 -5858751 -913134 7455585 9883268 5347287 617957 372505
41927 372505 2966608 5935289 9971262 14900040 16452957 11508827 3733233 -781244
41919 -781244 -1573600 -2110900 -1350414 5652376 17162290 22506374 15615875 5314428
41911 5314428 4888101 14142302 19621239 12461740 -1481649 -11234878 -13751691 -13578678
41903 -13578678 -14456530 -15995662 -15856957 -11297612 -1033516 10786873 15389373 8950547
41895 8950547 -714954 -2429599 4541377 10748597 10323586 7755475 8825963 10805276
41887 10805276 6264198 -6183967 -18970632 -22821604 -15338749 -3257203 3609068 2348337
41879 2348337 115213 4427766 12203919 14362158 10372623 9238326 13722793 14040799
41871 14040799 3907272 -6656242 -5095947 3912338 5490339 -2230908 -6517937 -1866680
41863 -1866680 1700948 -3249987 -9015446 -6673504 -1297227 -2162085 -5625404 -508456
41855 -508456 13150023 23024171 21757026 14642518 8884181 4960526 1696868 1210407
41847 1210407 3675643 3617057 -2557398 -9553134 -9725280 -3895442 502440 708221 1188328
41838 1188328 3703499 1686081 -10254857 -24882985 -27638653 -14323057 2553835 8709280
41830 8709280 4745889 2068726 5189614 6868142 2137956 -2148064 1916922 9481059
41822 9481059 9076392 19348 -6170736 -2667023 3753364 4694213 2833967 5642943
41814 5642943 12121139 14921866 13494169 15384686 22999608 27869015 22602677 11896809
41806 11896809 5449826 4554082 3154607 -173574 320789 7365493 15159908 16914929
41798 16914929 12759216 7285985 3619939 2782786 4716123 6651357 4328864 -1822181
41790 -1822181 -5692300 -4196824 -2386248 -5351404 -9987709 -10988486 -10525186 -14149890
41782 -14149890 -20341376 -22935415 -21955841 -22524701 -23831251 -19642421 -10878222 -6924292
41774 -6924292 -11069962 -14543242 -9890053 -1428014 3361624 4645236 5568540 4069838
41766 4069838 -2385391 -9137507 -9845175 -6347379 -5416893 -8115656 -9552129 -7743058
41758 -7743058 -6084000 -7262022 -9837503 -11015765 -9484061 -6030751 -3405575 -3876191
41750 -3876191 -5629335 -4703717 -1536070 -1018240 -4904990 -10132544 -15793191 -23469575
41742 -23469575 -28508466 -22155366 -7704081 -2045001 -11918734 -20705808 -11601494 6782222
41734 6782222 13831832 7272936 1279815 -179067 -6530215 -17450164 -18284397 -3930645
41726 -3930645 11083891 14078649 10401660 9857358 10911172 8300080 4939708 5712921
41718 5712921 7878649 6974820 5229031 6211888 7946404 8371749 10470692 15014908 15825583
41709 15825583 9844454 4398342 6009388 8915975 4008108 -6465605 -12461528 -10009799
41701 -10009799 -2972688 4879086 11191052 12387629 8121959 4920911 7427367 9856850
41693 9856850 4775089 -3472389 -4139369 3487026 9598725 9198808 7316128 7445849 4843115
41684 4843115 -4512503 -15844015 -21708093 -21247257 -18164406 -12825130 -2596048 9858940
41676 9858940 14547144 5249755 -9317813 -12410225 74285 12699713 10636687 438500
41668 438500 65891 11907587 19910619 14368720 4410344 733638 305724 -3319711
41660 -3319711 -7144220 -6928535 -7791249 -14769876 -21112548 -17836781 -8019709 -362058
41652 -362058 4332935 8609617 7972287 -1358298 -10684708 -9331158 -1850923 -148680
41644 -148680 -3337011 -1455221 4671715 4995646 -103132 -92195 5201661 3628319 -7931611
41635 -7931611 -17602785 -18034424 -15297548 -13461538 -7252736 3010287 5557094 -4510945
41627 -4510945 -15144710 -15180729 -9387457 -6073968 -2573068 5506266 11895061 9120513
41619 9120513 1498046 -3074150 -6121539 -11686010 -14340579 -7126773 4397624 8952670
41611 8952670 6230382 4673289 5922165 3658464 -3622136 -9868467 -11305604 -9787040
41603 -9787040 -6764131 -2210258 1205590 813274 -133686 2973712 6804375 3875513
41595 3875513 -4629937 -8628833 -3283425 4181347 4519316 -2355425 -9194227 -10683372
41587 -10683372 -8268803 -7282781 -10358248 -13818008 -12257270 -6647608 -3714380 -5945601
41579 -5945601 -7912229 -5681039 -3605005 -6617725 -11474867 -11863220 -7309514 -803195
41571 -803195 7062503 14518451 15111185 6732907 -928684 1810700 9574585 10084360 4129111
41562 4129111 4023328 12645288 18067040 12177524 2305406 -937935 2537763 6312281
41554 6312281 7018976 4199483 -2448854 -10042221 -12347264 -7537995 -1161926 2394650
41546 2394650 5582683 10675264 13470017 9804167 3223023 -173657 -654728 -2316854
41538 -2316854 -4608809 -3040383 2821702 7808895 7669780 3045539 -2952435 -7556487
41530 -7556487 -8513441 -4479855 3549824 12156915 17263523 16502466 11209009 5816831
41522 5816831 3396596 2435894 686001 563282 5488998 11510810 10228312 2324292
41514 2324292 -91033 9825926 21755642 21211888 9683534 2093175 6006808 13399694
41506 13399694 14194538 8747532 3226012 -23892 -2220241 -3255975 -2632500 -2389527
41498 -2389527 -4142153 -4819527 285535 10652852 19697420 20517044 11120700 -3996722
41490 -3996722 -15436322 -15129457 -4881282 3539625 1290339 -6483525 -7785317 -373840
41482 -373840 5906163 3907251 -1512398 -2275747 1376546 3137281 -121130 -6378161
41474 -6378161 -12424108 -15340504 -13086704 -7671419 -4483557 -4810700 -3547992 1308641
41466 1308641 3169503 -2039276 -5576662 2821402 17313825 21753157 11859198 -575557
41458 -575557 -5723682 -5003014 -671934 9348400 20943664 22003659 9826513 -1200363
41450 -1200363 698319 7447237 5114797 -3613190 -4935023 3305466 8965598 4631884
41442 4631884 -3371852 -6361434 -3818572 -696150 -1652114 -8760694 -18379079 -20707712
41434 -20707712 -9738109 6608315 13875909 8871577 2353482 3083576 7485234 8228468
41426 8228468 5974445 7168359 13370413 17632161 12331348 -378764 -7958439 -691719
41418 -691719 14910122 22014277 14518042 4189421 2514216 5145925 2750707 -2184301
41410 -2184301 -1818671 973291 -2024026 -7356139 -4736090 2772282 943107 -11630831
41402 -11630831 -19223176 -13353470 -5055503 -5744047 -11072136 -12964638 -13735287 -16778764
41394 -16778764 -15034357 -2150572 13095919 16716000 8365009 -1295362 -7203681 -12295315
41386 -12295315 -16947813 -17733890 -15380031 -13980605 -12871573 -7888086 -169299 4184060
41378 4184060 3042436 200104 -721978 1736937 8712794 17510466 18687335 6021409
41370 6021409 -10942938 -14249266 67857 15249972 13414707 -4453435 -22281337
41363 -22281337 -27501875 -20940614 -11297229 -4960958 -1493578 3054871 9242190 11770018
41355 11770018 5840240 -4865463 -10210667 -4780441 5805187 11487551 8479961 1296930
41347 1296930 -4134986 -6166077 -6100214 -4476631 -1392773 720076 -1589265 -7554720
41339 -7554720 -11469257 -9593389 -5078374 -2696364 -1125187 4839669 15553128 24910938
41331 24910938 27328269 22250538 12665980 3916199 2411386 8840337 13422817 6058360
41323 6058360 -8317398 -13959186 -6184458 1579404 -2153980 -10471390 -10495671 -3553249
41315 -3553249 -1070233 -5409335 -7905130 -5262435 -5650170 -15199310 -27598574 -32305933
41307 -32305933 -27618837 -20770199 -18136321 -19250571 -18983308 -12796842 -553073 12644759
41299 12644759 19271204 14983196 3254639 -5820886 -3875271 6912461 15316074 13640795
41291 13640795 6385256 2839523 3897442 2201938 -5794423 -14802512 -18294888 -14966116
41283 -14966116 -7073667 1151633 2875144 -5987581 -19065370 -24558370 -19857988 -13631772
41275 -13631772 -11892990 -11071663 -7299228 -2405721 2985857 11570680 19864089 18293666
41267 18293666 7269051 1095088 7492256 15365148 13271065 7720010 9729576 14198610
41259 14198610 9027851 -2959206 -8392885 -5012285 -2644823 -5513991 -8968661 -11709957
41251 -11709957 -16381824 -19656536 -16403211 -12104685 -15866038 -22390203 -17738219 -3604723
41243 -3604723 1933541 -8331899 -19369902 -16129010 -3143512 5307573 3371240 -4755992
41235 -4755992 -12180925 -12968392 -6215227 631204 446563 -1502524 5050343 16275164
41227 16275164 16719525 2932102 -10656700 -13879512 -13554463 -17576459 -20980870 -16520310
41219 -16520310 -6799209 2471326 10108152 13380987 6820660 -5347957 -9089126 -1789090
41211 -1789090 574309 -11569624 -23746245 -19073408 -4774195 -30489 -6709812 -10285004
41203 -10285004 -4354361 3155079 5835768 5464177 3352724 -2015508 -8346150 -10632332
41195 -10632332 -8432474 -4048835 3667193 15077185 23154091 20861743 12053919 5822588
41187 5822588 3520933 603192 -2976382 -4530502 -6827455 -13623048 -20206175 -19049460
41179 -19049460 -11972981 -6632154 -4572416 -2959562 -3292658 -6796186 -6517593 2525627
41171 2525627 10423884 4937884 -7334554 -9691178 -2327240 -1074233 -9404284 -12917664
41163 -12917664 -5636677 -890257 -8144159 -17713371 -18746722 -15954496 -16680112 -15720208
41155 -15720208 -6303939 5145637 8346287 4315909 -522292 -6735093 -16473857 -23612931
41147 -23612931 -21776976 -15908645 -14025103 -13488246 -7485027 766132 3525077 3373709
41139 3373709 8158091 14343339 11192017 1205847 59485 12604141 24007365 21727367
41131 21727367 13457410 13233980 19210653 17662016 4634216 -8722444 -12543851 -9494733
41123 -9494733 -6311190 -2645469 4916994 12594406 11894795 2410714 -5396110 -3200417
41115 -3200417 5056240 10190131 10005584 8767593 8256880 6609959 4249471 3538137 3170594
41106 3170594 270262 -2257759 1314546 8623144 10271011 3906062 -1918561 -1284004
41098 -1284004 1043743 -158370 -1671169 247231 1509681 -2361508 -7612119 -9262254
41090 -9262254 -10121869 -14139182 -17166925 -14181546 -10045113 -12118045 -16571053 -13822864
41082 -13822864 -4761251 434140 -1765133 -5171916 -6241486 -7879244 -10449916 -10327751
41074 -10327751 -8601652 -10210688 -13033774 -9327367 -96811 4064391 -226121 -3835967
41066 -3835967 -1092956 1743653 366056 1825419 10795756 17717121 12010313 -1207203
41058 -1207203 -8650459 -6202771 1501294 11416102 20624719 21658883 12332233 4352684
41050 4352684 7931126 13014592 2565638 -18413224 -26471380 -13955392 16798 -771100
41042 -771100 -7343769 -3733591 8132882 16255522 19787057 25653586 30568845 23893862
41034 23893862 7175739 -4765516 -4541744 -976771 -3111191 -6917349 -4604161 1712847
41026 1712847 4365214 3192738 5353992 13196123 19580925 16851734 5917375 -5621110
41018 -5621110 -11468565 -10572802 -5170144 1737786 6559274 5628667 -1577439 -9849710
41010 -9849710 -11420935 -3361744 9051083 17353267 17388742 11087098 2755846 -3838467
41002 -3838467 -5623692 -1257426 6211171 10092055 6585362 342398 446184 9212664
40994 9212664 17358074 13764844 -482835 -11954507 -10042783 1832165 12762032 17388235
40986 17388235 17156918 12490199 2209625 -9482650 -14204643 -10423850 -6209790 -7434318
40978 -7434318 -10061104 -8839689 -6715306 -8568883 -10949555 -6600372 3522701 10832354
40970 10832354 10395551 4584399 -3028738 -9750916 -10675313 -2231041 9895375 14152495
40962 14152495 6791985 -4175083 -10377093 -11627696 -10914545 -8312377 -3916744 -583809
40954 -583809 793457 3367309 7206780 5608382 -5669667 -19731985 -25372206 -19900583
40946 -19900583 -9721211 -890816 4778208 6243614 3076362 -778734 657101 7098996
40938 7098996 10557071 5177774 -4305607 -7492157 -1100388 6229026 3601888 -8894619
40930 -8894619 -19314912 -16913103 -3383672 10852178 18481752 19565252 16690578 12121900
40922 12121900 9595870 12633645 19182199 22459309 18394393 8211050 -5800807 -20587189
40914 -20587189 -28418469 -21748664 -5189778 5940154 3942465 -2202364 -1682670 2519497
40906 2519497 688785 -8084253 -16884620 -22245772 -24636496 -21804205 -12191172 -2760496
40898 -2760496 -3040551 -11728787 -17955334 -15403620 -7109288 2536148 11549482 16737944
40890 16737944 15592270 12044705 11848020 12893632 9637281 5885602 10790777 21295949
40882 21295949 22814650 11783956 3352124 8649661 17139858 12852204 -1425900 -9252432
40874 -9252432 -4151307 4581002 7080914 2674939 -4571819 -10019547 -8226173 2046073
40866 2046073 11558505 8062342 -7717875 -21243063 -22104500 -15357238 -10775520 -8208112
40858 -8208112 -1264631 8625079 11610592 4147905 -3678115 -706240 10042883 15604772
40850 15604772 11244723 6461075 10205851 17288916 15859138 4140353 -8090302 -13135330
40842 -13135330 -12579136 -10596939 -7957131 -4917693 -3137378 -1544939 3358502 9417387
40834 9417387 7656970 -5285995 -19065633 -20941594 -11823897 -4002725 -4786519 -9571288
40826 -9571288 -11189748 -9426747 -8774683 -11060043 -13718943 -14112332 -13175327 -13935999 -16667122
40817 -16667122 -17066696 -11247534 -1692406 4930861 5818174 4035084 2055507 -1732360
40809 -1732360 -8067997 -13234000 -13699196 -10635638 -6951162 -3601572 -1381226 -1664737
40801 -1664737 -2285077 1762199 9385061 11547262 4343085 -2593603 808105 9030299
40793 9030299 8886129 274892 -3551114 3213591 10438506 8203637 531456 -3273633
40785 -3273633 -2421344 -2217850 -4165002 -6549683 -10418578 -16337141 -17895719 -8014131
40777 -8014131 7982528 14941927 7175301 -2430241 1227387 15233231 22964828 16379688
40769 16379688 4486755 -1784799 -3143503 -4656153 -3853737 3466098 10522577 5311692
40761 5311692 -11256865 -24922772 -27511778 -24755658 -21410680 -12580665 2252329 10110192
40753 10110192 2393005 -8068293 -3268055 12896116 20206651 11591686 -129767 -4923024
40745 -4923024 -7427291 -12381822 -14645531 -11153613 -9110881 -13241168 -16205620 -11374239
40737 -11374239 -5214173 -6299827 -10430979 -8513383 -2636176 -1246073 -2317031 4786319
40729 4786319 20778866 32269450 29101328 16500200 6092604 1941578 -207544 -4647648
40721 -4647648 -10798663 -14404342 -11884592 -5122822 -1225434 -4171958 -7841427 -2616608
40713 -2616608 10862305 20541486 17642345 7079731 -276975 -1135833 -476078 -1482002
40705 -1482002 -1187255 2990404 7339120 5835860 -1831211 -9463280 -11632805 -9344172
40697 -9344172 -7552075 -9054793 -12512764 -15040525 -14503111 -10056965 -2964270 3152374
40689 3152374 5058483 3216772 983633 1021427 3764704 7561261 8018577 205187 -13963675
40680 -13963675 -23304957 -19024896 -7314955 -2222627 -6247482 -7916768 -658784 7122526
40672 7122526 6307542 890416 -677880 953270 1079127 1931222 6920491 9807778 3013500
40663 3013500 -6720239 -5302570 6753432 13620242 7185074 -2879806 -5914022 -4147002
40655 -4147002 -3704093 -3301636 13036 2880573 1807528 201192 1323553 746327 -5910288
40646 -5910288 -13456943 -14199436 -10089178 -8889614 -11468675 -11796691 -7565898 -2333254
40638 -2333254 1769003 5476581 7214453 4382060 27635 634327 6019272 8304028
40630 8304028 2900362 -5390938 -9441043 -7805457 -3475116 581427 1894360 -1535081
40622 -1535081 -8518611 -14094366 -13769991 -7093166 3161611 12821140 17229536 13797400
40614 13797400 4906970 -4079603 -10262879 -14353466 -16750161 -16159513 -12883382 -10075687
40606 -10075687 -10339004 -13371249 -17433513 -20580942 -20501491 -16499158 -11940459 -11157024 -13355037
40597 -13355037 -13216758 -8162964 -1232341 3837619 6143499 5471757 1532272 -3115450
40589 -3115450 -4347649 -2694983 -3062244 -5829803 -4382567 4363426 13075174 13705319
40581 13705319 9041744 7060428 7492840 3188549 -6369446 -12757235 -11630697 -8959323
40573 -8959323 -9889034 -9377524 -1296208 8493212 7968926 -2972702 -10022474 -3512788
40565 -3512788 7946875 9640169 1330695 -3718049 966311 6335757 2882430 -4889340
40557 -4889340 -6360377 -788310 3631541 3111355 1304094 797837 1172831 4900696 14734439
40548 14734439 24205793 21968324 8902697 -381062 1588555 4197467 -3295123 -13625664
40540 -13625664 -12899815 -2380168 4239081 1214010 -4161456 -4996410 -1920081 2565007
40532 2565007 6631939 6523663 833015 -3814319 -1118656 3082070 -823505 -8184628
40524 -8184628 -5421385 6404683 10894811 3250641 -1045632 6471462 10328224 -2953232
40516 -2953232 -17909900 -10775693 12043281 20573765 5264366 -9346122 -1293485 18592005
40508 18592005 25280883 13978207 499540 -4955741 -7855096 -13757866 -17176093 -11882485
40500 -11882485 -3493828 -3097770 -11011145 -15025002 -6868574 5643737 8364838 -229332
40492 -229332 -7397643 -4467199 1201032 -1955931 -11898254 -15838647 -8921744 -441532
40484 -441532 588899 -2365501 -658693 6017199 10279471 8515521 4921902 4177884
40476 4177884 5720438 6738472 6285296 3917309 -1945341 -10241684 -13941116 -5687475
40468 -5687475 12238808 27305220 28213122 15127487 -2436656 -14778707 -17246464 -10670124
40460 -10670124 -1547469 565166 -8000448 -18756598 -19362769 -8915569 791193 777206
40452 777206 -4770470 -7047504 -5382515 -5658944 -9895068 -13752167 -12954875 -7333038 326433
40443 326433 5521009 4092042 -2599134 -6719478 -3210779 2211731 515159 -6804141
40435 -6804141 -9126030 -2427197 4722770 4049102 -874643 -1389572 3154055 5824552
40427 5824552 3221187 -543707 -1279945 -751924 -2920302 -7192933 -8534602 -3949708
40419 -3949708 3333395 7488972 7279787 7519186 12103357 17399178 15742707 5708047
40411 5708047 -4360408 -5106579 3407345 12490650 15126278 12451558 9321636 6740684
40403 6740684 2325618 -2673035 -2079974 6454022 15183187 14257698 4777600 -2320226
40395 -2320226 -1107254 2364890 930473 -2539670 -772274 5703868 9279626 6263071
40387 6263071 407922 -4015683 -6685221 -8570476 -9976072 -11499631 -12488703 -9236777
40379 -9236777 -22961 8942273 9420097 3217225 664151 5297305 8422308 3092718
40371 3092718 -4417153 -4049662 2616830 4696245 -2475300 -11775189 -14467557 -10004908
40363 -10004908 -4241538 -2018225 -3473184 -5536820 -5677432 -4857191 -6655373 -12643752
40355 -12643752 -19390998 -21251798 -15667793 -5286059 3854173 5811616 -1227828 -12677342
40347 -12677342 -20702476 -20915774 -14750278 -5220358 6312833 17614601 23690925 21303026
40339 21303026 13705431 7404840 4823133 2892190 -1427595 -6686270 -8494728 -4485148
40331 -4485148 2621073 7278754 7138062 5486326 5553314 4479758 -2211159 -11167874 -13327582
40322 -13327582 -7014581 -1317321 -2640169 -5553908 -3098134 1094667 -119433 -3503512
40314 -3503512 356468 10929983 16878974 12110256 2818267 -3673493 -7869183 -12190819
40306 -12190819 -14365460 -12162769 -8930555 -9120739 -12229819 -14950093 -15366103 -12171650
40298 -12171650 -4823694 2225781 1520692 -6389590 -10090782 -2099905 8815780 8643238
40290 8643238 -1924781 -8209737 -1623390 10357353 16221285 14350301 11032298 10488411
40282 10488411 11767799 12400983 10983899 7355319 2605223 -1773979 -5361152 -8067500
40274 -8067500 -8446955 -5685550 -3006867 -4823032 -9436722 -9193788 -592279 9519560
40266 9519560 11509676 4485622 -3203549 -3778188 2458958 8670457 8350410 1081766
40258 1081766 -7165251 -9843754 -6094628 36274 5714845 11068555 14803734 13394144
40250 13394144 7073752 1752953 1361597 2787036 2675522 4160927 10308689 15035929
40242 15035929 9378116 -4504986 -14503962 -14630901 -11649985 -13177443 -16754046 -15161502
40234 -15161502 -7129337 1944519 6352937 3626503 -4775891 -13029616 -14586322 -9581212
40226 -9581212 -5576885 -8017438 -13459819 -15660977 -14566407 -14515086 -16116109 -15120329 -8705825
40217 -8705825 849612 8423792 9741734 4276026 -3290531 -6462206 -4160689 -2190699
40209 -2190699 -4910180 -8505149 -6377079 1265735 7682237 8118096 4099252 269728
40201 269728 517042 6161658 14375528 19025552 16204933 8430906 1023969 -4463113
40193 -4463113 -10619871 -18896238 -25982594 -25102321 -11508976 10165668 25079556 21422691
40185 21422691 5951963 -1632089 6898250 18672873 19858403 14401380 12804529 12626069
40177 12626069 5005746 -5993710 -7833948 -1048568 1039088 -4729632 -5591633 5798788
40169 5798788 19942325 26796436 29206275 31731860 28985004 16003442 800204 -4724379
40161 -4724379 -460910 4478640 4992476 2919264 1563170 4096736 12610315 22893342
40153 22893342 25665433 18495693 10129331 7576094 6806020 2821918 -128771 2639014
40145 2639014 5734138 2565117 -2614004 -2785853 -1370609 -4975978 -9434676 -7189543
40137 -7189543 -3364569 -8627685 -19282737 -21651776 -15506625 -14861463 -22906601 -24868745
40129 -24868745 -12921068 -1286017 -5138439 -17095189 -18157528 -4511357 9578055
40122 9578055 12360170 7104157 3890818 6414119 8970363 3944821 -8201524 -17126814
40114 -17126814 -13919087 -3213469 2068620 -1761054 -5200471 -1657102 1873667 -3623414
40106 -3623414 -14586051 -20097855 -16940491 -11227540 -7795852 -5623600 -2677009 1165687
40098 1165687 5796405 10467385 12188688 9087756 4870017 5370006 10326623 12390058
40090 12390058 5402535 -8443636 -20296165 -22643485 -16186973 -9028324 -7418025 -7696576
40082 -7696576 -1222400 12091216 20752147 15430271 730884 -11354867 -15328582 -13725651
40074 -13725651 -8782843 -641774 7305683 9555931 6636062 5567401 9628306 13192716
40066 13192716 10252160 3504155 236017 1810103 2360934 -2457575 -9804905 -13952395
40058 -13952395 -13163840 -10165788 -7647945 -6117940 -5718405 -6934183 -8264564 -6048963
40050 -6048963 635487 6716683 6445626 1424124 -740845 3549856 9386624 10730449
40042 10730449 8258900 6464200 6079359 4168254 478206 -1432508 -246692 198043
40034 198043 -3619297 -9241355 -10904268 -6622908 -3408 4479845 5375907 3370187
40026 3370187 -286069 -2825689 -406277 7050697 12943022 10131786 127760 -7860956
40018 -7860956 -7885235 -3150353 374985 1325330 890805 -1914329 -8183535 -15357412 -20010151
40009 -20010151 -21596866 -19246369 -9059372 8791524 23661477 23805340 11411169 126618
40001 126618 -2444579 -1275717 -2012303 -2051030 2620458 9444931 13192112 12449287 8524566
39992 8524566 3203413 541769 4591244 11955838 13583060 7996230 4808998 9562108
39984 9562108 13882430 9091202 1351113 1638482 6448747 2746210 -9348306 -13600902
39976 -13600902 -956484 16403911 21032373 11782449 1684849 -446876 1827792 1167125
39968 1167125 -3573186 -7374422 -5638154 947758 7068579 7651482 2501545 -3579740
39960 -3579740 -5273217 -1636631 2942205 2893246 -2680681 -8878450 -10895015 -9490754
39952 -9490754 -7884871 -5353117 573926 6401386 5030237 -2236889 -4583071 2853347
39944 2853347 10802069 10117092 6136053 8757023 14417017 10801856 -2863240 -13321446
39936 -13321446 -12074459 -5158772 -1560255 -2016236 -2928246 -2669789 -235117 4806704
39928 4806704 8172964 4655199 -1648453 -419029 8381537 12192212 5315797 -1401568
39920 -1401568 1298534 5480661 977438 -4426869 3573946 19974886 24583854 11757609
39912 11757609 -1359500 4194 10312337 17200263 18849901 18539059 13392295 929901
39904 929901 -10182587 -8698725 2727941 10517900 8468432 3222880 1532684 1993637
39896 1993637 1764885 2673800 6130487 8459609 6470949 3180418 2938585 4144682 1919634
39887 1919634 -3953413 -8635808 -9013070 -6729495 -4533731 -3008720 -1228795 1940124
39879 1940124 7239110 13413180 16631236 14221652 8693910 5043882 4213180 2761691
39871 2761691 -632425 -2621179 -889478 1531637 634038 -2791844 -5102514 -5293178
39863 -5293178 -4876706 -4014008 -2100150 -1389045 -4961237 -10162472 -9202216 411455 9637492
39854 9637492 7075212 -6433935 -17098442 -13415921 1411459 14598427 18260435 14777416
39846 14777416 9337073 3031577 -4530078 -10444170 -10978460 -7117888 -3603455 -3134453
39838 -3134453 -5079206 -9086674 -15309461 -20616720 -19799318 -13056745 -8026512 -10457737
39830 -10457737 -15624254 -13747178 -3239283 6084593 4594774 -5418787 -12658853 -10777464
39822 -10777464 -5832346 -7404329 -14739277 -17195693 -9377345 709385 3351850 1259690
39814 1259690 3695360 9781283 8754096 -2215706 -11874264 -11340151 -6772655 -8260552
39806 -8260552 -14261489 -16546951 -14695941 -14652925 -15837676 -11204290 -532990 6647861
39798 6647861 4321602 -1879901 -3695007 -1206087 -201978 -2649474 -4616716 -2449816
39790 -2449816 2155638 3765074 -585855 -7164813 -9104119 -4751769 424244 1882407
39782 1882407 1873159 3988476 6455578 6138972 5180944 7060209 9323623 7584714 3844757
39773 3844757 2715254 2350769 -1170232 -3294415 2754825 10264356 4693324 -12197259
39765 -12197259 -19876007 -7852824 7911993 8043124 -3904354 -11804121 -12687793 -14914992
39757 -14914992 -17410226 -10092109 5936412 16732668 16820799 15801092 18632979 15438999
39749 15438999 282727 -13706848 -11304555 1934947 8482975 5143130 4775871 12888275
39741 12888275 18765010 14132184 6369179 4946813 6309605 3441550 1469033 9057665
39733 9057665 18937859 14141765 -4968783 -16617842 -7237385 9277710 12411641 3135249
39725 3135249 -2809818 -1179010 -1867022 -8674576 -13592046 -12519886 -11337280 -12573170
39717 -12573170 -9880667 -1215100 5157418 4620231 4481024 10197835 14264955 8774716
39709 8774716 -252548 -2281164 1440083 2641827 952110 1574694 2529749 -2529439
39701 -2529439 -10743314 -12110997 -5225013 588888 -59167 -2454750 -2153556 -1578853 -3256327
39692 -3256327 -4905175 -4601574 -4125007 -4827100 -6156903 -9091965 -14172216 -15947652 -7806770
39683 -7806770 6627319 15879441 16001329 14007185 13880367 10369039 1263128 -5445676
39675 -5445676 -3802425 470835 637504 117539 3572396 5386707 -1118853 -9219015
39667 -9219015 -6770750 4473965 10557229 5514423 -2455355 -5813505 -6430886 -6371319
39659 -6371319 -1519664 9216990 16896362 12513015 -657932 -10998605 -11918071 -6581138
39651 -6581138 -1950943 -2357675 -6998950 -10421333 -7312763 609581 4909680 184915
39643 184915 -9342737 -15847819 -17161590 -16129808 -14005066 -9947430 -5466096 -3681185
39635 -3681185 -4257623 -3763865 -1024887 2318318 6088907 10988110 13822386 10117885
39627 10117885 3052102 2305082 10396621 17673326 16592004 13464766 17119186 22032002
39619 22032002 15334475 -1404536 -11379797 -6237993 2392896 1284920 -5809270 -7269025
39611 -7269025 -2508088 -55029 -1885560 -2029015 855084 1095018 -2967075 -5747030
39603 -5747030 -4532861 -3957150 -7088669 -9748684 -7682413 -3016346 398094 2531519
39595 2531519 4473979 5713306 7726227 14262792 23333153 24808879 12509932 -5276153
39587 -5276153 -13934296 -8909586 1432102 7011827 4755122 -1845041 -6297193 -3315828
39579 -3315828 5760649 12703804 11514077 6017400 4093853 6714475 8093665 4832462
39571 4832462 -1121646 -7438084 -13056216 -15401294 -12177400 -5964348 -1279916 2408652
39563 2408652 8317197 13927818 13294140 8152562 7096680 11333097 11733265 4916749
39555 4916749 1325562 8611524 16329134 9500997 -7977471 -17247124 -10678798 -895868
39547 -895868 -1080905 -8056504 -10826939 -7046048 -3133196 -3153487 -5288132 -7228563 -8757610
39538 -8757610 -9295415 -7436174 -3393178 742126 3146268 3129314 997860 -1355057 -1518920
39529 -1518920 -119458 -831236 -4070822 -3749088 4711055 14911505 14777770 2531299
39521 2531299 -9064106 -8385049 -107098 1370434 -8374260 -17781013 -14759656 -2182607
39513 -2182607 6934641 6452508 2688405 2928540 5444101 4944248 2576436 3603660 7508350
39504 7508350 8398176 5676497 6056217 11872317 15268711 9791918 1306470 -350349
39496 -350349 4110153 6224171 3992690 2941299 3795272 486945 -7099209 -9190982
39488 -9190982 -208620 12033977 17570785 17126967 16404731 14498574 7619793 137763
39480 137763 1350257 11635106 20282406 18389324 8084203 -1776992 -4383080 553718
39472 553718 6802910 6556361 -941385 -7302818 -5419646 984955 3530049 1501687
39464 1501687 844253 3441935 5779307 6901178 8809024 9260065 3345426 -7012993
39456 -7012993 -14003028 -15391559 -16192377 -17980550 -16410566 -11084138 -7452225 -6537296
39448 -6537296 -3879335 -1432340 -7509957 -20192349 -24990935 -16356681 -6920607 -5514422
39440 -5514422 -1441317 15186979 31657354 29807438 14536335 4692373 2977710 -2682049
39432 -2682049 -12090795 -11773740 -1747391 1427452 -6063650 -6458440 9187275 23226216
39424 23226216 18168944 3352816 -2034805 1318249 -1070047 -11039770 -16952691 -15024091
39416 -15024091 -13626571 -16853132 -19022575 -17088744 -15745087 -17439268 -17794925 -14218150
39408 -14218150 -10526767 -9664322 -8682809 -4248957 2054265 6590212 8097734 7868573
39400 7868573 8510005 12434522 18387901 20719884 16129140 9437280 7690696 10120146
39392 10120146 9808373 4374393 -1413713 -3811502 -4667996 -6643164 -9027293 -9851989
39384 -9851989 -8466658 -5480306 -3139845 -4516779 -8487381 -8062160 553399 9864285
39376 9864285 9894515 3604028 3913022 14434980 23198924 19270043 7057106 -1061943
39368 -1061943 314135 7139149 12668300 11580156 2219660 -10326508 -17216419 -15615064
39360 -15615064 -11397752 -9720106 -9172060 -8631200 -11696630 -18109673 -19026737 -10071903
39352 -10071903 -2347117 -8644534 -22661955 -25293900 -11328220 3388241 4577724 -2808480
39344 -2808480 -6000160 -3662731 -4165149 -9793240 -12829435 -7378016 2067375 6334116
39336 6334116 2501561 -3024530 -1574896 8301008 18607675 19919416 11392186 1084046
39328 1084046 -3606502 -2995454 -1648534 -1209678 310302 3756745 6722562 6476159 3111400
39319 3111400 -520581 -929694 3724055 11985802 19353255 21200642 16362687 8022422
39311 8022422 1105669 -1350931 -38729 1458457 -649418 -7287432 -14884176 -17146403
39303 -17146403 -10379607 1800718 10374388 9277207 1225597 -6097655 -7966847 -4259369
39295 -4259369 4217850 15382662 22336850 17557508 3596606 -6745438 -5399945 1431038
39287 1431038 3981491 3016529 5292723 9915959 9736968 4341081 643262 367399 -1911847
39278 -1911847 -6332676 -5068572 3441355 9000163 5580432 2486638 9869896 21335287
39270 21335287 22839029 13693802 6083735 5946683 6881243 3517848 -849513 -2930762
39262 -2930762 -5503290 -9911449 -10531977 -2933959 7394208 10223775 2277761 -9565306
39254 -9565306 -14927317 -8497076 5048970 13797847 10110009 293998 -1770200 8156275
39246 8156275 19238313 19471053 9282040 -2085610 -8190364 -8650411 -5344778 -1111517
39238 -1111517 330230 -1718870 -2527276 2684033 12225831 19641141 20119577 13207657
39230 13207657 2442043 -4987981 -2358562 8668823 17779614 17831797 13055817 10928153
39222 10928153 11016914 8828533 6097243 7775713 11058473 7876609 -1282832 -6239336
39214 -6239336 -2297817 2862505 1822799 -1432313 655416 6545592 8539985 5389913
39206 5389913 4557084 11560921 21937773 25747453 18589501 6822650 896980 3385447
39198 3385447 6436803 3369223 -1499111 -509016 3542209 963187 -8047745 -11709935
39190 -11709935 -4911618 2393999 1415829 -1705038 2086250 8122447 5964359 -1945001
39182 -1945001 -3686181 2384790 5528444 1214807 -1787811 3028562 9290670 9264252
39174 9264252 6257044 7173834 9788581 6993388 -23105 -2282966 3655383 10453623
39166 10453623 9831401 2493106 -4313157 -5967258 -4113390 -2118623 -245565 2390138
39158 2390138 2691458 -4410289 -16256720 -20074428 -7320230 11930790 18140116 7050397
39150 7050397 -4413649 -1558331 8233716 7894672 -3901153 -11886301 -6915928 3151814
39142 3151814 8304321 10894866 17745772 25050900 21592213 5738805 -9846997 -13290370
39134 -13290370 -7221809 -2919162 -4496397 -5216317 502634 7715970 7664670 467880
39126 467880 -4739955 -2367120 2539452 2408609 -2023249 -3669490 341271 5595427
39118 5595427 8086271 9671323 13258982 16282032 13112137 2982606 -7872562 -12415825
39110 -12415825 -9235900 -2715910 1379330 321756 -3588318 -4839576 -329538 6128170
39102 6128170 7017917 45499 -8533684 -11562003 -9448006 -7655057 -7917784 -7144220 -4731400
39093 -4731400 -5003985 -10226986 -16107101 -17472616 -14589945 -10572187 -6468389 -3031451
39085 -3031451 -3439881 -8716945 -13326154 -11572996 -6412253 -5125713 -7661040 -7260825
39077 -7260825 -2676508 -542666 -2952778 -1905509 8033828 18879421 19037115 9661950
39069 9661950 2851932 5250644 11392661 13761775 12170900 10285829 8179037 3101280
39061 3101280 -4203827 -8293992 -5206763 2347321 8038961 9525733 10120930 11866125
39053 11866125 10854017 3734457 -3853090 -2476506 6902195 11550279 3611504 -8049231
39045 -8049231 -8609271 3832211 16611313 18421463 11203427 5536309 7870869 13808639
39037 13808639 13469830 3784759 -6010315 -4962794 4407165 8621651 2574158 -2876674
39029 -2876674 1933403 10205076 10051071 3323288 422766 1450096 -2499974 -10863631
39021 -10863631 -12429189 -4699551 1236056 154282 1583509 10948617 16474712 7413058
39013 7413058 -6158128 -6804069 4726937 13333240 14053289 15632930 20709227 19833172
39005 19833172 8895966 -2434862 -5720523 -4604494 -3782851 850831 11635205 18825322
38997 18825322 12543793 -1567181 -10065685 -9944593 -7453416 -3420062 5801615 14303939
38989 14303939 9901285 -5003297 -11141445 1291097 17059108 17363990 6162797 1240662
38981 1240662 6466122 9614188 5451179 3217417 7447739 7468133 -4950557 -19481135
38973 -19481135 -20862977 -11450071 -7141745 -13576985 -19241973 -14006680 -3505602 412077
38965 412077 -4002908 -9029567 -10545983 -12247470 -16479390 -18313940 -13415063 -7489163
38957 -7489163 -10564097 -21666722 -26752489 -16339984 511884 7050784 399329 -6591208
38949 -6591208 -4374988 2489625 6283978 7984888 11891142 15869754 14875015 9529607
38941 9529607 3860030 -1749110 -8198797 -11945839 -9652236 -5893585 -7708062 -12956221
38933 -12956221 -12758017 -5087145 2602584 4705262 3052940 270707 -3820460 -7220454
38925 -7220454 -5874202 -2064693 -4413107 -14849765 -22888388 -18695972 -6203174 2800794
38917 2800794 3273463 -297048 -2562022 -3003224 -4016499 -6750437 -8084423 -1529051
38909 -1529051 14747387 30431721 31090432 17332592 7963804 16993859 34014437 36975769
38901 36975769 20648097 1680330 -3965079 1908962 7423274 6037992 -719603 -9176423
38893 -9176423 -15568403 -15576318 -8168371 622179 2448500 -4028494 -11505109 -12406085 -6416320
38884 -6416320 1132319 5575782 5603867 2176302 -1603459 -823181 6195567 12740506 9110828
38875 9110828 -4251264 -14428781 -11400592 -1034271 3555811 -221005 -3574431 -1327044
38867 -1327044 1904165 1589323 107632 284072 -46073 -2302864 -2267281 3827521 12931441
38858 12931441 19622246 23008782 24999504 25442714 23203186 18971110 13573371 6815582
38850 6815582 848604 294085 5299457 8734814 4592564 -4324849 -10770049 -11305327
38842 -11305327 -6873777 112396 5136966 3087278 -4471267 -8133967 -2458015 5103292
38834 5103292 3050954 -9597453 -23143066 -28561892 -23914168 -12812696 -1961811 2494998
38826 2494998 654271 -2013944 -3680774 -8117754 -14101458 -12084007 1031918 12720355
38818 12720355 10867920 1429602 -2096443 -110745 -3079724 -10692545 -11676655 -3924106
38810 -3924106 1755091 564291 993750 8181073 13791628 9620941 199335 -5799359
38802 -5799359 -7766323 -9101895 -8001386 -51864 13772838 26716452 31233210 23324077
38794 23324077 6999014 -5410122 -4557905 3796730 6114721 433021 -2323150 2511672
38786 2511672 6181285 3079571 1007951 6808793 13280698 10344334 320008 -7595820
38778 -7595820 -10204684 -8374307 -523890 11239230 15967000 7207474 -3891623 -1548438
38770 -1548438 12157450 20607365 16629184 9993813 9969338 12697860 10364760 4028803
38762 4028803 1249354 4993975 9405899 6273634 -5014265 -14821575 -13839306 -6245992
38754 -6245992 -5418702 -14056123 -18314819 -8919543 1750644 -4017141 -22364852 -32189010
38746 -32189010 -24166195 -10472064 -4421501 -4812154 -4819692 -3748232 -2988645 6181 5890624
38737 5890624 8368858 2264620 -8047202 -14343484 -14897524 -14015483 -14778671 -17113606
38729 -17113606 -20110728 -21730352 -18754994 -11368169 -5693598 -7494415 -14570928 -19182117
38721 -19182117 -17376900 -12562655 -9614448 -8148464 -3252961 7402129 18471477 21110062
38713 21110062 13354664 3779151 1501504 4319879 1771386 -9948326 -21690975 -22505523
38705 -22505523 -12998994 -3823764 -2752904 -6827215 -7511527 -1500929 5231033 4788457
38697 4788457 -2234687 -6667244 -2457112 4989614 5895679 -886226 -7119637 -6668387
38689 -6668387 -2212216 435755 -234056 -1887030 -2622106 -2130711 -505726 2227462 6127368
38680 6127368 10897975 14203400 11767509 2182524 -9011533 -13545912 -8959049 -319962
38672 -319962 5813741 5869132 -1007421 -12493717 -21717352 -21213518 -10679781 1498921
38664 1498921 5533325 -2105180 -16602754 -27417037 -25388122 -12176066 -970695 -2321008
38656 -2321008 -11074416 -14137101 -9175186 -5991418 -8986250 -9511486 -74156 13437198
38648 13437198 20214695 18138118 12597415 7890462 6283328 10141817 18076743 23239545
38640 23239545 21628687 17781464 16505632 14578387 7957824 1527004 2193563 6476534
38632 6476534 5582054 379681 3754 6087871 10055142 7795205 5693815 8046681
38624 8046681 8719745 1524325 -9060155 -14437629 -13288898 -9832513 -5718917 -716151
38616 -716151 2189394 -326829 -5889844 -9590186 -11426064 -14052689 -14557430 -6585699
38608 -6585699 8083420 17881068 15370640 7025397 3793052 6091328 5132678 -2237589
38600 -2237589 -7711682 -3009606 8391841 15516492 12906859 4754120 -2366473 -5774510
38592 -5774510 -5628661 -2663114 1066426 2840555 2829561 3906589 6030956 4669890 -2046301
38583 -2046301 -8286748 -7123871 369877 7288070 9847681 8855697 4463577 -3370794
38575 -3370794 -9603431 -7319767 1704621 6888820 2626495 -4478804 -6392185 -4779534
38567 -4779534 -4924468 -4552828 2055671 11762286 14567939 8497138 3256562 5900643
38559 5900643 10551031 7626395 -2021570 -8479525 -5793831 2100398 7948607 8893074
38551 8893074 6632435 3453692 652923 -81479 3880537 13569012 25244709 31656966
38543 31656966 28460421 18705918 8899397 1446611 -5824842 -12897952 -14893184 -8382947
38535 -8382947 2819827 11002779 11908788 7034295 1025359 -1184306 2592359 8737841
38527 8737841 9986700 3552631 -4817965 -7551622 -3636544 2536362 7555360 10129008
38519 10129008 9075841 5876037 7002851 16845125 28849827 30819808 20158393 7341741
38511 7341741 2195907 2965157 2377493 -937544 -2305603 414139 3091696 593209
38503 593209 -6361590 -11043151 -8734740 -4446454 -7982377 -18727511 -22099845 -8714426
38495 -8714426 8734671 9635097 -6265658 -19164728 -18240824 -13743481 -15096445 -14523809
38487 -14523809 -3461827 9725126 13154059 11010646 13492595 16624171 10526466 1086612
38479 1086612 2790922 12754434 13224208 1004132 -6909240 -1845523 2983108 -3879610
38471 -3879610 -13638514 -14472828 -11395740 -14254789 -18293944 -12980046 -1868760 2690348
38463 2690348 -133650 -58506 5624283 7955416 1672403 -6945971 -9851762 -6427524
38455 -6427524 -1271070 823727 -2610025 -8708378 -10060606 -4019502 1729004 -110504
38447 -110504 -3902685 1237216 13795797 21207590 18556362 14027839 13578835 12030752
38439 12030752 4557639 -2972651 -2261056 5651876 13372383 16595432 14863576 7863907
38431 7863907 -2913086 -12169171 -15475813 -13274867 -7177338 2901658 13863294 17672628
38423 17672628 11156998 3071283 3701871 10374765 11336359 2310109 -9234803 -15996315
38415 -15996315 -18382815 -18675134 -15863511 -9824674 -4289114 -1749920 -376990 953057
38407 953057 182004 -1778842 1030970 9773915 14883945 7951591 -4748893 -9915732
38399 -9915732 -5850378 -2941663 -6110184 -8740741 -6974617 -7876460 -16331001 -23744517
38391 -23744517 -19405227 -6208849 4925162 10829930 15526978 18503465 16239934 13106972
38383 13106972 16803066 22679027 17459000 1859327 -5858023 4017258 17525604 18654379
38375 18654379 13039165 15450850 23474937 21768888 8064917 -3834771 -7261913 -10707949
38367 -10707949 -18215832 -18893078 -5558174 9529161 10487956 1163331 -931737 9689753
38359 9689753 19974584 18013273 7840318 333302 -2348159 -6198498 -13023800 -16503348
38351 -16503348 -12161660 -5761479 -6421527 -12822407 -13075664 -1331655 11684143 11783671
38343 11783671 1376425 -3199659 5638432 17221999 19310990 14008422 10062818 8179280
38335 8179280 4214907 927843 4119588 9266709 4739056 -10129817 -21514609 -19398823
38327 -19398823 -9698026 -3155712 -1066617 1175665 3830684 4597422 5518915 9272232
38319 9272232 11794417 7339277 -1058500 -5055021 -4252519 -6625215 -14217264 -17468955
38311 -17468955 -8100233 8764269 20102512 18682094 8217157 -1063157 345332 13352971
38303 13352971 26540004 25418708 9058335 -7770645 -12939206 -10934623 -12380271 -16177210
38295 -16177210 -11903396 2832851 17420571 20922189 12099478 -3319061 -17958204
38288 -17958204 -24932985 -22208401 -16379098 -15836896 -19554272 -19520712 -14376810 -11533138
38280 -11533138 -13827325 -14294383 -9090102 -6116732 -13202302 -24746422 -28616431 -21738059
38272 -21738059 -11004084 -2288645 3756066 7468914 8966110 9680484 9451479 4561881
38264 4561881 -5527072 -13036864 -11051799 -4810711 -4510080 -8349903 -3795791 12485319
38256 12485319 26904033 26590610 16204400 9589587 10464257 10522795 4735520 -781104
38248 -781104 1180821 7485957 8752019 2551921 -3259132 -1622719 3989623 4770066
38240 4770066 -1100785 -6505525 -5421540 304945 5404181 7641353 7758429 7078772
38232 7078772 7306117 8855733 7942596 446316 -9510381 -11461752 -2402895 8462547
38224 8462547 13151557 14642905 16703690 13810480 2218076 -7170199 -1904507 10484951
38216 10484951 10612168 -3763730 -13971790 -8816861 174679 -632893 -6133066 -3700467
38208 -3700467 5713415 11011053 8951098 5768560 4083334 371230 -4853899 -5106577
38200 -5106577 1579678 8472521 9755443 8046848 8294811 9013166 5305538 -1130421
38192 -1130421 -1322236 9112398 21479933 22662852 11586805 1208112 2162363 10342771
38184 10342771 15000454 13491397 10995705 9809549 7959917 6605749 8926280 11041031
38176 11041031 3775345 -13467302 -28591235 -30525572 -21098361 -10111840 -4036830 -2278979
38168 -2278979 243707 8600443 21232808 27925264 20781567 6538767 -496018 2653858
38160 2653858 6315623 6093690 8811564 17014671 21546466 16534933 9328152 7354789
38152 7354789 6736803 2738121 -308706 452804 -1957277 -10296864 -12749251 -1001253
38144 -1001253 12384928 11344934 1547361 -352867 5371841 5757749 2128599 8661570
38136 8661570 23725724 26802341 9980834 -8280279 -9576034 1664705 11285362 15690789
38128 15690789 17981791 16722937 10678340 5746968 6755098 9363866 8171038 5466575
38120 5466575 4730392 3427863 -338950 -2095986 522756 1779636 -1790815 -3700745
38112 -3700745 686176 3426951 -3639487 -13031655 -11122010 899610 8693333 5763306
38104 5763306 631040 2367454 9266615 14181773 13498952 8606738 3981833 5035614
38096 5035614 13372341 23722961 29048565 27845948 23386653 18412481 14767380 15054498
38088 15054498 19229734 22111889 19576797 14523035 11591040 9834180 6936317 6243241
38080 6243241 11199716 16327269 13549150 5365948 1199942 1718794 -1302959 -8444228
38072 -8444228 -8808014 2645243 15387367 18192792 14713083 15729523 22616415 27786456
38064 27786456 27412893 24612834 21865604 18353230 14484218 12271216 10809430 6960626
38056 6960626 918283 -3920239 -6553759 -8112007 -5729590 5831751 23247244 32541702
38048 32541702 24640254 8777964 2536273 10141626 19016478 18539419 12994004 11344812
38040 11344812 12250544 7728441 -2456214 -9602673 -8818003 -4559275 -1999361 -180109
38032 -180109 3563388 8619538 13809865 19675509 24768939 25037045 20681365 18192434
38024 18192434 20863471 22525576 16546658 6463964 724919 210334 -1476888 -7214129
38016 -7214129 -13318502 -16549440 -17133462 -14843292 -8827119 -2080167 260355 -1496554
38008 -1496554 -1359327 3398771 8427920 9438684 8020155 7493926 7198796 4429427 -421892
37999 -421892 -3671225 -2409321 2366866 5871974 3371539 -4067489 -8702514 -4119433
37991 -4119433 6554730 13844776 12680186 6313474 509066 -1491688 1388181 8171467
37983 8171467 14838202 17707147 18229453 20075639 22065898 20018658 15592030 15600202 20398183
37974 20398183 20745277 10680235 -2799688 -8378893 -4058423 3322824 8409834 11213208
37966 11213208 12816745 12864452 11130706 7959275 3322624 -2258492 -6674965 -8004492
37958 -8004492 -6461403 -3532738 -640623 793082 248785 -252356 2085309 7025974
37950 7025974 12033347 16514253 21490122 25413721 25299900 22080162 19190763 15826650
37942 15826650 8652145 841587 697651 8758115 15295534 14451220 11638290 12304700
37934 12304700 13764574 14745749 21558151 34722390 40268695 28105250 11155211 10481006
37926 10481006 25830897 36949553 32233585 20134081 11780544 8137871 7353218 10150863
37918 10150863 13052977 9202052 1363416 1831803 13146450 20975456 14278748 1704377
37910 1704377 -1744681 4626507 10454239 11152329 10125288 8509898 3781959 -2807740
37902 -2807740 -6303006 -5323715 -2742460 256591 5297196 12779579 21080436 28436502
37894 28436502 32421888 30619129 25546823 24862056 31788959 39364147 39642972 34464515
37886 34464515 30872768 30207627 29372944 29184949 32290200 34780647 29668080 18972687
37878 18972687 13436217 18557386 28423712 35138192 37233757 36583880 33906536 30637852
37870 30637852 29817401 31927407 34041905 34966718 36460024 37742202 34574058 26603992
37862 26603992 20136288 19962522 23333797 26059113 29717935 37250940 44744346 44316629
37854 44316629 35122095 26614768 29368386 44809651 64695439 79207001 84629434 83427361
37846 83427361 78366365 69618890 58968372 52712167 55282505 62139218 65460282 66196681
37838 66196681 72855616 87314215 100541455 106110540 109596362 118457794 129780203 136075962
37830 136075962 137884979 141490970 147558108 151623968 154166798 160309812 169391421 174620663
37822 174620663 175200202 179734799 193816604 212072666 227387898 241169277 258284649
37815 258284649 276980287 290926481 298693963 304843500 312326087 318479379 318516315 310333423
37807 310333423 297060790 286908106 287707696 298221794 307233800 304847796 292475860
37800 292475860 278403616 267041248 257581535 249916096 244865415 239919174 231704856 222264262
37792 222264262 216118454 211419163 201654016 186718592 173896262 165999631 157568109 146243639
37784 146243639 138173545 136153447 131919787 119146393 106122965 104023005 107994518 103236738
37776 103236738 87764408 75009209 72158335 69675578 58112666 43968698 40063378
37769 40063378 47559307 56752118 61276926 62726837 63481908 63389862 63473479 65535369 66415244
37760 66415244 58835271 41527113 24664817 20738861 30792052 42852989 44365306
37753 44365306 33907831 19984933 11145253 10082721 15284171 23130266 27585566 23456115
37745 23456115 13375251 7242067 10561476 17201314 18417388 14800871 12959386 14270230
37737 14270230 14941274 14356820 14288240 12004909 4700909 -449055 6823739 21881901
37729 21881901 27653571 18790881 9484747 11038248 15915221 13714794 9630118 13604705
37721 13604705 21419779 21992075 16839946 16768488 23126507 27384941 27397508 29530318 34578927
37712 34578927 35042390 28129102 20042522 15531244 13128835 11602853 11209098 8294317
37704 8294317 -782549 -10086911 -9738484 -1668658 2424533 166233 2164960 13339882
37696 13339882 24058773 25230348 19860123 13375890 4371370 -7450972 -14851965 -13025417
37688 -13025417 -7212013 -3017846 1870207 9060563 12453851 8778482 6069485 11770638
37680 11770638 20201842 21722545 16918857 11564337 5056103 -4689182 -11664825 -9971913
37672 -9971913 -6522289 -12121591 -22994763 -24632980 -13022012 350736 4837410 863029
37664 863029 -6431003 -12732477 -12527390 -2238341 11793246 17449000 12062627 5990247
37656 5990247 8323883 16068988 20344384 16989886 7934865 -2598981 -9946626 -10845305
37648 -10845305 -6267638 -682046 2073438 856922 -3058619 -5950226 -4154839 230738
37640 230738 -105939 -7484779 -14198845 -12700197 -5478507 1237847 7035571 12411376
37632 12411376 11649361 2100450 -5456044 245633 11544930 10998392 -1712482 -8963890
37624 -8963890 -2483123 6125378 6716733 5327469 9347743 12906544 7997700 -1016549
37616 -1016549 -5139739 -4541091 -4499542 -4654757 -1827256 2322146 4934520 7753718 11743893
37607 11743893 11948308 5528212 -1073202 -1145466 1906808 1620411 87014 3072976 8536689
37598 8536689 10244870 9232747 11343020 15759307 16250607 12730461 11736439 15150451
37590 15150451 17180898 13580433 6486371 -754817 -6834917 -9859994 -7969653 -3547762
37582 -3547762 -1020087 136014 4291744 10989442 13822084 9812255 4021078 1960984
37574 1960984 2220385 195153 -4214954 -6684624 -5035511 -2278426 -2059981 -2732233 1392661
37565 1392661 11591336 20128580 18347021 8704023 3190747 8229289 16552479 16976373
37557 16976373 7483855 -4569785 -10623480 -6185110 6564505 17378385 14834580 -310158
37549 -310158 -13868268 -15240878 -9495251 -6615239 -6345258 -2792152 2345796 2597783
37541 2597783 -1016041 -2103941 -1018638 -3241811 -6943263 -4453998 3282937 5972191
37533 5972191 59656 -5836420 -5055442 -1622609 -318479 1553283 6338378 9219559
37525 9219559 6755987 4849482 9911090 17265351 16625303 6324521 -4842443 -8533097
37517 -8533097 -4366135 2272905 5722220 4174837 1176779 1921434 6534511 9473506
37509 9473506 7249831 3592816 4588257 11437242 20157019 25585467 23637668 13042780
37501 13042780 -1811795 -11816205 -10322210 422382 10861645 12114414 3567930
37494 3567930 -6035556 -6866827 739691 6568701 5081985 4148888 12474622 23773447
37486 23773447 24301912 13468898 4311969 3572232 5000454 4871184 9437665 20836616
37478 20836616 29116307 27015417 21371779 20700797 22167292 20844494 21031726 26329014
37470 26329014 28454665 19957651 9565906 9350672 13743164 8856789 -2271156 -3336894
37462 -3336894 7775625 15501262 12911849 11379860 17519406 19468114 7202239 -8847579
37454 -8847579 -13254345 -8676416 -8930834 -16214975 -20162626 -16679086 -13762577 -17117245
37446 -17117245 -20803392 -16532104 -5856173 1656293 -11422 -6974438 -10785171 -8272001
37438 -8272001 -3738679 -1056466 2273092 9347852 16124516 16301606 11548203 8382522
37430 8382522 6223551 -784915 -9470810 -8011808 5017152 14721902 10639810 1914081
37422 1914081 1877370 7904445 9057107 5400990 5113168 7724179 5654325 -4304 -495904
37413 -495904 4040134 3977231 -2063364 -3699634 2777361 6566649 -159093 -9297487 -10328129
37404 -10328129 -6691768 -8079061 -13537033 -13652482 -5981269 2078296 4952933 5113021
37396 5113021 7062673 11330983 15671446 18126023 17792306 14765351 9666554 2814980
37388 2814980 -4522263 -8282471 -5131363 1177527 2454119 -2205633 -3321852 5611367
37380 5611367 17000339 17862118 6260685 -7490313 -13936255 -12642392 -8515876 -5707878
37372 -5707878 -5092873 -3969576 896593 7393851 8469597 2261389 -2498415 2806443
37364 2806443 14204250 20540557 18517362 14208671 11374960 7414745 1257216 -3349063
37356 -3349063 -4233154 -3391502 -1700233 2071508 5513549 3084560 -5219007 -12137202
37348 -12137202 -12495211 -8390316 -3333101 2109662 6569101 6743383 3251703 1565166
37340 1565166 4233944 8089724 11234826 15593851 19862357 18198736 10194553 4111017
37332 4111017 4872396 6316575 1318416 -7250021 -11729899 -9477731 -2202719 7066669
37324 7066669 11089786 2101037 -14086224 -18293450 -3037120 12779111 8298938 -8501814
37316 -8501814 -11677976 5742745 24354532 27411695 19027584 10349250 4553685 1884730
37308 1884730 5207992 12200204 12853355 2676400 -10268104 -17856932 -22420489 -27977548
37300 -27977548 -30079188 -23304990 -12333384 -6516124 -7360442 -8760017 -6653976 -2372348
37292 -2372348 1230247 2283606 638585 -1105162 -175273 1509872 -473173 -5557054
37284 -5557054 -9358259 -12583900 -19665658 -27254354 -25884954 -16928098 -14285126 -21956599
37276 -21956599 -24447268 -11215336 3128726 -255981 -13786686 -14089200 2093880 14423236
37268 14423236 11277481 4007642 3889743 4596223 -2476508 -11261754 -12190858 -9101238
37260 -9101238 -11385480 -16443504 -13579275 -2132365 6704232 6166376 1776781 957953
37252 957953 3121109 4020129 4092429 6856890 11201628 10859755 3169447 -5230833 -5410010
37243 -5410010 2117747 7650069 5695043 2382164 5090251 10116120 8596767 1712629
37235 1712629 -197083 5577013 8515952 462031 -11536784 -14560087 -6470055 3584352
37227 3584352 7701675 5539536 89312 -6258645 -11096036 -12176210 -9615990 -5826337
37219 -5826337 -2980864 -1647013 -1120765 -282832 595946 -942258 -5502619 -7211363 1247740
37210 1247740 16818689 25656835 19362669 6206457 -232497 1213831 1600587 -1101855
37202 -1101855 1718278 14462168 28524784 33106081 28019403 20450835 14250956 8690078
37194 8690078 4691220 5618993 11864400 18913162 21375623 16945681 7546363 -1031532
37186 -1031532 -2516647 3243939 8521910 6805732 2536279 6005382 17930705 25871701
37178 25871701 19838782 5963502 -1638720 588450 3083340 -956866 -5563674 -2067108
37170 -2067108 6868280 10238907 3783250 -4596689 -5493992 948689 7004078 6976395 2147537
37161 2147537 -1551534 1859254 14060143 29279814 36844655 31169460 19336561 14196920
37153 14196920 18421093 20385536 9851585 -6683417 -13368601 -6167832 2296521 1709461
37145 1709461 -998005 6863202 23123290 32219413 26478993 15721700 12912540 19113750
37137 19113750 27757870 36131096 44608123 49153378 43969076 31111397 20061788 16723511
37129 16723511 18253656 19225435 17285399 11879037 3536460 -3217299 -1847886 7677716
37121 7677716 16665499 17777878 13646183 11347378 11948980 11111176 7830660 5945887
37113 5945887 6752021 6344386 2587929 -233513 2566586 8636532 11424382 8822322
37105 8822322 4667385 2130912 325201 -1319443 -31511 5326978 9346117 5317959
37097 5317959 -4925701 -11140021 -6169571 5989288 15546869 17684031 15525786 14107340
37089 14107340 14197583 12338284 6063456 -1315027 -2568192 4850068 13743821 14959654
37081 14959654 9505193 6812302 10071685 11261834 4767813 -2379683 -1439302 3734273
37073 3734273 3634439 -271726 1559040 8593381 8800854 -1769440 -10933967 -8166128
37065 -8166128 370290 2979346 86978 792914 7501565 14265952 17299995 17576126
37057 17576126 14609440 6719746 -2709742 -7250209 -6137551 -3979274 -1963771 2593420
37049 2593420 7218489 4139067 -7116289 -15251144 -11375443 -1663737 1136489 -5050663
37041 -5050663 -10445192 -8038241 -2070272 -597021 -5107806 -10390528 -11594242 -8495471
37033 -8495471 -4008002 -773232 602277 893242 458520 -1332895 -4524649 -7264825
37025 -7264825 -7348990 -4918947 -2445050 -1920882 -3056634 -4298604 -4623292 -4320940 -5120948
37016 -5120948 -9266630 -16493057 -21655651 -18198191 -5984889 6381237 9862329 4578692
37008 4578692 -1431025 -1674963 4041127 13000987 22240241 27121104 23479256 14576079
37000 14576079 10647660 16497863 23639845 20980056 10226240 2915349 3342980 3588137
36992 3588137 -2411100 -8692981 -6943361 -256581 611978 -7224278 -14311217 -11412615
36984 -11412615 -1613315 3647545 -913521 -7616815 -5635942 4118293 8749823 209908
36976 209908 -12645888 -15097358 -6749528 -1421527 -5958427 -9679719 -986288 14013814
36968 14013814 19265910 10838333 522392 -2147870 -1290335 -5136603 -13376050 -19538987
36960 -19538987 -20816805 -19202481 -15267842 -7126681 3931587 11724119 11593466 5998561
36952 5998561 1195520 -53333 407148 1218608 3436160 6362423 6087646 1625417 -1279961
36943 -1279961 2161073 6663361 2403486 -10353584 -19523217 -16452419 -6449265 -417007
36935 -417007 -1616823 -5508108 -8075068 -8491908 -6422873 -2397713 482187 -222965 -2305830
36926 -2305830 -1565645 3002279 9474629 15977267 20125609 18414952 10188756 -282245
36918 -282245 -9270497 -17718407 -25761469 -27785656 -19633387 -7479373 -1805672 -3974378
36910 -3974378 -6040755 -3140414 1045551 1190442 -3651699 -10990798 -16438100 -15370113
36902 -15370113 -8905194 -6204739 -13702249 -24427238 -26898290 -22406355 -22098842 -27362957
36894 -27362957 -26675208 -15168148 -3928823 -3237137 -7954210 -7813018 -2677806 1639991
36886 1639991 4840678 9356463 11784180 6876149 -3401416 -12645308 -18354036 -20876256
36878 -20876256 -18766534 -12448729 -7537424 -6621951 -2921906 8949834 21037200 21367698
36870 21367698 11205051 1489952 -4930229 -14397506 -26329593 -29920393 -20485803 -7925670
36862 -7925670 -3813514 -8068236 -12632243 -11811221 -5748985 816741 1692208 -3429087
36854 -3429087 -5566259 2059720 11067466 7440931 -6721254 -14911636 -11452529 -8678984
36846 -8678984 -13150809 -12499857 2295221 17493152 16167891 5255419 3327832 9014220
36838 9014220 3793689 -15485296 -29188302 -24350462 -12204021 -8169673 -10515019 -9746816
36830 -9746816 -6388652 -6357256 -7103570 -1802219 6799691 8600870 903846 -8561504 -13024808
36821 -13024808 -12899222 -10241548 -4610703 3306140 9377626 10171529 6517320 1430983
36813 1430983 -3202804 -6903990 -9503433 -10858180 -11019918 -10598704 -10868324 -12181542 -12329799
36804 -12329799 -9193328 -5667384 -7909946 -16057623 -20449617 -11648666 7225619 22040488
36796 22040488 21444559 7390900 -6952585 -8713367 2870862 14879310 13997607 2242587
36788 2242587 -5329435 177992 11761170 19206688 22392536 24832314 22953244 13086905
36780 13086905 2870377 2386627 7458027 5780317 -2029688 -2838794 6753874 14667186
36772 14667186 13716883 11852043 15192714 15893651 6801452 -4638533 -8633045 -8457072
36764 -8457072 -11406929 -13828281 -8740128 -919130 -84959 -4386998 -4840032 -2115525
36756 -2115525 -4311882 -10429848 -11017482 -5225567 -3161686 -9428153 -16573243 -17336880
36748 -17336880 -12878301 -7156117 -3098240 -4883805 -13138300 -17683087 -7710624 9534731
36740 9534731 14146832 780317 -13892726 -16032986 -12137453 -13686243 -18215817 -17030651
36732 -17030651 -11262236 -8105034 -8242760 -7711577 -6270113 -4534501 809460 9246679
36724 9246679 10373519 -3198806 -21346128 -26013953 -13101995 4342627 12551622 8614350
36716 8614350 -1500725 -8493922 -5940341 1973987 2427286 -9766198 -23341307 -25853514
36708 -25853514 -20772732 -18879104 -19818370 -16111328 -10216022 -11193610 -16562801 -14701734
36700 -14701734 -5869216 -3165902 -9195064 -9683011 2531688 13704020 9896847 -2045743
36692 -2045743 -6499584 -1516676 3671286 5666917 8032419 10435425 9384190 7132534
36684 7132534 8733800 12061728 10965777 6727237 5942757 7723692 3899392 -6843159
36676 -6843159 -15408991 -15699751 -12116423 -9695008 -5844517 1891944 7395830 3616955
36668 3616955 -5700418 -10196032 -6641434 -944904 2125501 2762752 -562535 -11741912
36660 -11741912 -26843979 -32311667 -21362684 -6108333 -3180885 -10466152 -10094997 4715390
36652 4715390 18456949 14515143 -2810682 -16033868 -16956111 -11760376 -8409936 -9060193
36644 -9060193 -12783723 -16718050 -15652722 -8438995 -3034555 -6820240 -14365739 -15035682
36636 -15035682 -10669145 -12750735 -21608279 -23216292 -11207753 2025908 3877258 -1232243
36628 -1232243 -2911198 -2253766 -5966179 -10855852 -7837116 2146442 8347037 5406412
36620 5406412 -975081 -2748826 3320396 14975748 24018260 20069393 2777994 -13257276
36612 -13257276 -14218083 -3947397 3693722 4074021 1868086 -2983726 -14090155 -25224024
36604 -25224024 -24711782 -14643207 -9397899 -11765173 -7747403 8414172 21308395 16944775
36596 16944775 3332788 -4372610 -6490617 -11562857 -16729393 -12579750 -1878013 3105630
36588 3105630 -475193 -4093760 -3042957 -118822 4398414 12770867 20227380 18913455
36580 18913455 11945087 10197735 14182809 13302528 5279701 1027804 5417687 8331361
36572 8331361 2319575 -4776921 -4432349 -2335952 -7192380 -14409476 -13314701 -3869829
36564 -3869829 4889426 7398094 2964305 -8496643 -21594679 -23461642 -8955027 8019696
36556 8019696 11315046 5019941 4620181 10957716 10966044 2562825 -1069630 4822790 7716366
36547 7716366 -7010 -6847411 -619618 12469954 19154751 18923300 19700354 21420079
36539 21420079 17217590 7133114 -914655 -2385407 158350 2847704 3024268 -1515307
36531 -1515307 -9039028 -12324434 -6954706 1886017 6858434 8219892 9049810 6369031
36523 6369031 -2878540 -11343013 -9275780 -1306347 -1456548 -10084516 -10547858 5119504
36515 5119504 20641890 16496601 -2654024 -14991749 -11869299 -6549840 -10905039 -16960418
36507 -16960418 -10088600 7695945 19292175 15471460 5098868 -216054 -1561655 -5905080
36499 -5905080 -11466240 -10431972 -3222284 974147 -1662518 -5131860 -5670846 -8247800
36491 -8247800 -16087905 -22374330 -19394429 -10019527 -3268309 -2738903 -5301789 -7314550
36483 -7314550 -6672958 -2414392 2719057 3051712 -2388305 -7447928 -7953870 -7198261 -7490879
36474 -7490879 -3595694 8081618 20080590 21986941 13139741 113125 -12399583 -20245377
36466 -20245377 -16689771 -1390001 13046405 14595526 7404891 3466318 4522994 4351951
36458 4351951 3173626 5491003 8017538 4830922 858927 4437240 10227022 7414545
36450 7414545 1656208 7670279 20558432 18484872 -1974898 -17631594 -14309331 -6844773
36442 -6844773 -10638015 -15709977 -7349423 5500554 4374388 -7814741 -11908178 -2688114
36434 -2688114 5782747 3556674 -2617137 -1787019 6968923 14716206 11589418 -3307726
36426 -3307726 -18292981 -20369531 -11693998 -5769922 -5413373 1217799 16877664 24823009
36418 24823009 14088228 -566708 162188 11822077 16437627 10196095 2436744 -3888283
36410 -3888283 -11323274 -14870287 -9710557 -5862801 -14740505 -26236780 -20800913 -777559
36402 -777559 12824203 12778387 11090604 12166638 6291342 -5979399 -8512494 2792645
36394 2792645 10189888 2689800 -6529970 -3751015 3729185 4189446 2300209 6905818
36386 6905818 12406069 9831871 5139002 8625856 14633386 9669683 -4629228 -13663581
36378 -13663581 -12345435 -9860191 -12137475 -13258746 -6896533 3670206 10383904 9611712
36370 9611712 4983734 4043943 10761210 19141846 18378315 7420232 -1493167 1466222
36362 1466222 10962447 15567451 13077950 9195136 6781895 5240270 6150156 10470098
36354 10470098 13201689 9296024 2466554 554862 4742479 10401060 14996432 17276350
36346 17276350 12881228 650527 -9763258 -7631144 2689276 6389109 -904483 -8193446
36338 -8193446 -6759637 -1182232 1547978 3219885 7517546 9949743 3855827 -7045823
36330 -7045823 -10393459 308729 17843420 28826957 26497856 15388071 4730736
36323 4730736 -1568048 -7210536 -15538385 -22404955 -20807618 -11138832 -1605099 2174589
36315 2174589 2974819 5518330 8984565 9376677 5912557 959406 -4236234 -9428621
36307 -9428621 -12123107 -9197106 -2307905 2654546 3320360 4169802 9143388 14646418
36299 14646418 15089642 12955351 15691013 21970841 20195365 5925205 -7276917 -4096063
36291 -4096063 9868819 13690534 -459560 -16511707 -16557017 -3452803 6208716 4370341
36283 4370341 -2626106 -6574724 -6269913 -4281301 -2626195 -2973321 -5609388 -6994891
36275 -6994891 -3145669 3317536 4377493 -2736016 -10354395 -9653160 -2482834 993769
36267 993769 -3668931 -8637212 -4338885 6838288 13005998 8692634 1875412 2114955
36259 2114955 7724872 10883268 10905005 13294266 17027382 13518846 1192844 -8542404
36251 -8542404 -6092455 2572190 4687539 -1253253 -4759689 792288 9571098 12090126
36243 12090126 6958505 1084373 1146481 7251900 13825449 15220372 10627133 4207341
36235 4207341 1087988 3533643 9892909 15725235 16804341 13232993 10125710 11931845
36227 11931845 16768188 18967301 16127825 10411505 4502082 808778 2953805 11591330
36219 11591330 19069716 15632300 2407377 -8767640 -10624067 -8431040 -9642461 -12967670
36211 -12967670 -12779158 -8615403 -4678610 -3696465 -5765121 -10099440 -14611293 -16816582
36203 -16816582 -16938725 -16228587 -12231007 -2546861 6337048 3727930 -8917664 -16928880
36195 -16928880 -12508890 -4705432 -2713943 -1515732 5727834 12517273 9827305 3278563
36187 3278563 4428477 11105815 11983143 6399486 3424316 3588673 -1534288 -11227042
36179 -11227042 -13597714 -4432617 6791669 13294987 18841009 24449308 22166220 9986087
36171 9986087 30549 1859352 7833844 5838692 -1551889 -2594278 3770629 5866623
36163 5866623 -3053463 -14551132 -15214603 -2059143 15079594 24584303 24267087 20738915
36155 20738915 18769188 15479034 7596994 -580104 -2572454 724880 4500511 9467761
36147 9467761 17874023 22877069 15085298 61225 -5089935 3946473 12255569 9310679
36139 9310679 3859103 5971018 9106180 3807795 -2957989 735298 9224061 7046197
36131 7046197 -4583526 -8381406 1339301 9888701 5650684 -3695487 -5893737 -1873105
36123 -1873105 707017 1712972 5790872 11730339 14495208 14172526 14481872 14988295 12474675
36114 12474675 8422224 7973851 11883098 15470733 15485140 12797947 8503684 2686141
36106 2686141 -2496661 -3726129 -2010022 -3012333 -10001115 -19509569 -25346134 -24193140
36098 -24193140 -16507335 -5234886 4915753 9688913 8274240 2540114 -5999166 -15167711
36090 -15167711 -19473594 -14557371 -4882374 -163255 -2178647 -2722371 2002213 4042443
36082 4042443 -2617611 -9748490 -6414923 3394570 6519959 259753 -6181731 -7808013
36074 -7808013 -8151115 -7678003 -1804000 7431692 11493960 10725019 15317107 25386879
36066 25386879 25246789 6958868 -14100492 -19527756 -12501102 -8225661 -9049549 -5122568
36058 -5122568 5623811 14213324 15446859 12398219 7408641 1012898 -1654319 3945322
36050 3945322 11142433 9557167 2680681 4163824 15786751 23797208 20241424 13366184
36042 13366184 11427124 10030076 3429720 -3680997 -5270580 -5034509 -7941705 -8624899
36034 -8624899 235339 12970784 16101712 6731178 -4391959 -8362375 -7721684 -8411282
36026 -8411282 -9605952 -6573055 -209818 1790948 -5573027 -16823779 -20878345 -13808922
36018 -13808922 -3425665 809819 -904834 -1329553 2512751 6242616 5850307 3006696
36010 3006696 1283269 974329 -453265 -4551652 -9192585 -9369679 -2697625 5147204
36002 5147204 4794410 -4547455 -12622458 -11978123 -7762403 -7456750 -8098159 -3369582 2480402
35993 2480402 64538 -8784049 -12643590 -7688730 -1506044 194651 -622398 -1992814
35985 -1992814 -4286457 -4734979 -733802 2086407 -2625787 -7740803 -848532 13827106
35977 13827106 19204696 12612934 9508743 15298105 15311487 2721250 -5197409 5700824
35969 5700824 21122204 19533421 5242387 -329496 8482914 17868697 18708034 15457156
35961 15457156 12748809 9697551 7451483 8591377 9055255 2617213 -7377324 -12002755
35953 -12002755 -11029449 -11829851 -15450774 -15525395 -10533692 -5894946 -3909900 -2097868 -1087503
35944 -1087503 -3492982 -5458303 -792856 6115653 3651172 -8495542 -15761210 -8172435
35936 -8172435 5996678 11262269 2724033 -11811103 -22173364 -24121724 -20578006 -17279526
35928 -17279526 -15886365 -12194187 -3314402 6580963 11825544 12640482 11422791 6424669
35920 6424669 -3056149 -9468639 -4805734 6933224 15137413 18352727 23300057 28844333
35912 28844333 23926762 4822816 -16296650 -25167158 -20297311 -10159061 -2389966 167554
35904 167554 -1806516 -5191928 -6876752 -6243254 -3112530 4146298 13720587 17569334
35896 17569334 11316575 3607278 5938812 15577321 19739701 15332680 11611238 12680741
35888 12680741 11477152 4470133 -1578012 -3142547 -6894435 -15319435 -17784536 -6587905
35880 -6587905 7752717 9329139 -1428702 -10727461 -12094148 -12184236 -16679560 -20941284
35872 -20941284 -17558834 -6976327 2591560 3580509 -3589768 -10884661 -11170621 -6200466
35864 -6200466 -3490754 -5930574 -9506412 -11423390 -13256359 -13793290 -7072987 7071676
35856 7071676 17692826 15407663 5486455 499603 3397038 6072327 2872159 -2836816
35848 -2836816 -5885573 -5806718 -4320659 -2038627 -291155 -2090427 -8120901 -13937153
35840 -13937153 -13870007 -7295116 271935 2385616 -2153423 -8151968 -9288963 -4634127
35832 -4634127 696137 1423894 -2464572 -6578624 -7214531 -4613429 -1518541 658137
35824 658137 3228757 6828665 7768261 1393128 -9717069 -15272745 -8986334 2192626
35816 2192626 5626111 -1870103 -11784568 -15851166 -14135510 -10683310 -7273652 -4030863
35808 -4030863 -1823817 -1139277 -1151889 -1568481 -3062589 -5160625 -6469508 -7401532 -9442477
35799 -9442477 -11362812 -9989811 -5712272 -3376939 -6023873 -10798642 -12691300 -9749321
35791 -9749321 -3257019 4742077 12392582 17936865 19943832 17670376 12125774 7078992
35783 7078992 6279978 8048820 6140720 -1281163 -7794813 -7880890 -4994700 -4414791 -2949648
35774 -2949648 5492579 17141178 21381063 16140828 10585409 11346858 14965709 15909615
35766 15909615 13769815 9931239 4620749 46350 -200765 2792111 4085463 3218089
35758 3218089 4710933 8866804 9863705 5106033 -1255628 -6198354 -11011648 -14407200
35750 -14407200 -11623776 -3895002 211706 -2841318 -6435005 -5133079 -1910566 645681
35742 645681 6131526 14702392 17643791 10212554 1536206 2273249 9245431 11849378
35734 11849378 7924533 3629051 2228579 2271480 3131749 4009952 1260595 -5376745 -8220331
35725 -8220331 -1527383 8496545 11952640 8593948 3840904 -2631888 -12465357 -17394003
35717 -17394003 -6915111 13639821 26562826 24733449 18337097 16284723 14234708 6405482
35709 6405482 -2683917 -6105040 -5090895 -3721817 -757553 4516274 4982193 -5072484
35701 -5072484 -17159281 -16500511 -2573421 8939092 7453553 1128102 3413347 13568095
35693 13568095 19525554 16475970 12157162 12591877 12215137 3684232 -8741985 -12996346
35685 -12996346 -4280143 9442074 16502757 12303732 2158133 -3563309 860801 9027179
35677 9027179 8555141 -1967101 -8837463 -2724388 5625782 1094984 -10378062 -8897167
35669 -8897167 7584117 17223882 5580652 -13875648 -20228086 -12300120 -3438775 -170353
35661 -170353 93634 -2513656 -9779898 -16680354 -15616473 -8231630 -3194570 -3293092 -3350868
35652 -3350868 -114919 3422661 3195947 -1969838 -9874178 -14129237 -8064397 5183903
35644 5183903 12063660 5125720 -5793466 -7448949 -1972264 -830728 -5296849 -6345736
35636 -6345736 -1511203 2343894 3339621 7706181 15753446 17637781 8481479 -2873321
35628 -2873321 -6547505 -4524649 -4202262 -5976163 -4532924 1915272 10114745 16636670
35620 16636670 19176566 15609317 6871814 -662411 -579336 5575539 9363247 5694536
35612 5694536 -761407 -1943313 2200043 2941047 -4949925 -14725807 -16503046 -11384851
35604 -11384851 -9184133 -13205093 -16622345 -15171993 -12900835 -11630950 -6134164 3517758
35596 3517758 6387643 -2331566 -9110129 -326515 15165446 17570644 5603143 -2944593
35588 -2944593 696669 5401019 1371681 -3724765 1713389 14719122 22492996 19555625
35580 19555625 12246063 9103061 12020860 15490456 12365885 1988038 -7689474 -9104656
35572 -9104656 -4658569 -2530488 -4803203 -6340158 -4602512 -3098217 -4300257 -5837885
35564 -5837885 -5126899 -2456170 1086277 3973376 3339064 -955594 -3035064 2087920
35556 2087920 10587267 15712698 18348194 22866045 25879912 20634122 10877179 7431365
35548 7431365 10716065 10265455 3526725 637100 5938351 9152142 2673745 -4853677
35540 -4853677 -1941822 8604542 16081658 17585811 16958443 14000928 5514411 -5728637
35532 -5728637 -12167102 -10907272 -5814494 -932420 3631684 9809492 18035473 24655853
35524 24655853 23134378 11491930 -2172973 -7374367 -4144501 -1320391 -2656815 -4017996
35516 -4017996 -4580269 -8957593 -15531128 -15545554 -8739820 -6389276 -11584185 -10756160 4285764
35507 4285764 19307319 17262381 4306791 -849370 3764720 3550128 -6236007 -13160207
35499 -13160207 -8433354 1274589 6905211 8094796 6221852 -1052379 -11609487 -15837349
35491 -15837349 -9804224 -3444878 -7265327 -16936768 -19867974 -13124820 -5519388 -2951697
35483 -2951697 -897505 5572214 11228207 6604295 -7549784 -18526783 -16793336 -7906730
35475 -7906730 -4177463 -7468958 -8111320 -1355426 4211093 -147026 -8821868 -8770719 2602841
35466 2602841 14929109 19078127 15655132 8637175 -1113345 -12186098 -18807882 -16673585
35458 -16673585 -9960250 -7105030 -9893222 -11212843 -5119401 4351383 7961646 3632860
35450 3632860 -759997 1074318 3932059 -2052254 -16708947 -28811062 -30664215 -26865538
35442 -26865538 -25065869 -24239279 -18475512 -8813187 -3566136 -6774605 -12642018 -13509627
35434 -13509627 -8837467 -3444832 -312761 623562 -2035417 -11401647 -25565075 -34459509
35426 -34459509 -28934104 -12803991 -368567 279718 -3664757 -1379275 5834049 7588531
35418 7588531 803484 -5548858 -3385323 3984623 7538003 3659518 -3951952 -9970529
35410 -9970529 -11631925 -9268284 -5273106 -1914692 333561 1453627 221098 -3751406
35402 -3751406 -7967566 -10228513 -11795722 -13462284 -11510844 -3620246 3782913 1968177
35394 1968177 -7332270 -14001460 -14176704 -13464182 -14391244 -11081680 -675524 8786468
35386 8786468 7834690 -2874722 -14938402 -21012281 -18164053 -8400674 773312 1921363
35378 1921363 -3441793 -7140414 -6755336 -7906929 -12285997 -13292252 -7945992 -3356591
35370 -3356591 -5018926 -7255135 -2435139 7621796 16391718 21786813 23546920 18464185
35362 18464185 6180081 -5727328 -9900235 -8112575 -6451421 -6826634 -8109774 -9328853
35354 -9328853 -7127647 2137250 12959788 13086020 1621900 -6253276 -883570 7352710
35346 7352710 5753043 -579943 -201299 3785090 847182 -7137224 -11015557 -13401452
35338 -13401452 -23539000 -36190969 -35157771 -18495226 -2602690 1172235 -1859808
35331 -1859808 -4290157 -7289687 -12119298 -14561882 -13364667 -13341013 -15844744 -16205811 -13553820
35322 -13553820 -12723435 -13904993 -11498286 -5843738 -4265232 -7212967 -5864602 1927894
35314 1927894 5920693 -52262 -7655847 -7673581 -3588900 -3036950 -4584289 -2338727 2684470
35305 2684470 4473760 1142054 -4181130 -7738440 -6294823 862051 7516615 4834241
35297 4834241 -5788089 -11888778 -7401760 -2794798 -10029396 -24220742 -29905671 -21828014
35289 -21828014 -10080145 -5471230 -7578123 -8602957 -4081316 2393864 3581251 -3082470
35281 -3082470 -12250686 -17048353 -16934831 -15714452 -13726403 -8035518 130952 5161173
35273 5161173 5278197 4238101 3485253 -187794 -6949047 -11162308 -9584386 -5997628
35265 -5997628 -4478747 -4056694 -3080674 -2771007 -3086022 -827520 4704095 9166459 8892612
35256 8892612 4470160 -2366442 -9431986 -11420291 -4495555 5400380 7724469 2400888
35248 2400888 -109324 4253077 7749242 5952830 5223042 8724267 8146355 -1120971
35240 -1120971 -8184874 -1829119 11417159 16639921 11125251 3593295 -1521488 -6770746
35232 -6770746 -12291675 -15042666 -15473737 -15997486 -15492077 -13141751 -13370720 -18346572 -20757807
35223 -20757807 -14192701 -5796867 -6886625 -14583955 -15544693 -6364132 2423250 2947774
35215 2947774 -1231018 -4533446 -6849601 -8915085 -8962754 -6727898 -4067108 -606099
35207 -606099 4456797 6380685 -1220359 -15699941 -26095239 -25484245 -16243797 -3775820
35199 -3775820 7134566 10425527 2684769 -9662597 -15320577 -11623722 -5555410 -1145120
35191 -1145120 5011454 14393902 22310642 25891322 27981539 30151377 29468795 24691527
35183 24691527 18186186 10135560 -548709 -8128380 -3551495 10409421 18518342 13132677
35175 13132677 4571767 4536074 9192324 8048409 1546414 -1293068 1821688 4032248
35167 4032248 644638 -5226169 -7944678 -5023468 1295886 4554122 -964981 -12363305
35159 -12363305 -19138753 -15573209 -7266430 -1713508 1083500 3415710 2841508 -1635086
35151 -1635086 -2684417 6197887 18533212 21448132 12030392 -1337771 -11231759 -16054676
35143 -16054676 -15492521 -10710896 -7194707 -8036706 -6717801 3088704 13240392 9719903
35135 9719903 -5178987 -13983086 -9546120 -4028465 -6952462 -9650744 -1332291 12086354
35127 12086354 17618811 14590549 11617407 10942396 8910039 7470153 11639373 17375358
35119 17375358 14910358 4527653 -2533665 -343610 5163007 7867753 8970421 9189243
35111 9189243 3914786 -7670043 -16984965 -17008063 -12826379 -13678784 -19006329 -20576254
35103 -20576254 -15859224 -10649917 -8289009 -4469189 3873800 10416480 6232298 -6677375
35095 -6677375 -14361670 -6167260 11772705 22472801 17271981 4524839 -2491936 -1096648
35087 -1096648 2041958 3299377 5416439 9325264 10784411 7305480 2150280 -1177643
35079 -1177643 -2906179 -2970539 893118 7327854 9563949 4577731 -907355 428380
35071 428380 5224631 4062112 -4871195 -13410096 -14140461 -7991262 -1189968 671039
35063 671039 -4586746 -14636690 -23462169 -25822820 -21204421 -12526218 -3353974 1856432
35055 1856432 -999129 -9918070 -15869002 -12901547 -6074690 -3384043 -3093410 2939772
35047 2939772 14992442 23515927 22144625 14519291 6618865 410733 -2230147 2323865
35039 2323865 12216197 17530431 11408880 -11363 -4538295 1362709 9456265 9922244
35031 9922244 949230 -10814215 -16556009 -12970981 -5622210 -3451874 -8730748 -14688570
35023 -14688570 -14612671 -10115252 -7169390 -6284871 -1444965 10311985 21709140 21136868
35015 21136868 6366741 -10336950 -14377745 -5502215 2910351 2707653 1744093 9809471
35007 9809471 20724887 19670728 5887762 -4759960 -1869368 6892735 10197463 9071910
34999 9071910 10619246 14330006 14385444 10369418 6513578 3698198 400205 -1414243
34991 -1414243 458457 1852205 -2545368 -9109645 -9627330 -5356948 -6919283 -17878861
34983 -17878861 -27180677 -22629371 -6253109 8146523 9215641 -2905753 -18134197
34976 -18134197 -24647720 -18902317 -9445707 -7716257 -14377625 -19334206 -15988775 -8766895
34968 -8766895 -3712845 607657 6712076 9477378 3054753 -7095262 -9349165 -2522598
34960 -2522598 2719369 567506 -2033308 1449648 5588593 2271085 -5310714 -7352914
34952 -7352914 -2542526 863545 -2096962 -7561092 -10348219 -9543918 -5900787 -542961
34944 -542961 2975306 2042099 818720 5211178 11799779 11213761 4006452 1779060 8262512
34935 8262512 11518996 2737244 -8703523 -9889995 -4534214 -5132946 -11794944 -13559251
34927 -13559251 -7044917 796222 6778640 13914819 19866721 17386705 8312588 3800058
34919 3800058 7594027 11601974 11246244 11799845 14616414 11011077 -2207962 -13479029
34911 -13479029 -12815857 -7374850 -9493566 -16847698 -16715205 -5687857 6419815 11050729
34903 11050729 9799816 8188963 7480681 4616329 -2940757 -13275045 -20599178 -21268480
34895 -21268480 -18375781 -16569411 -13779683 -4617192 8858238 18470050 22313108 25498947
34887 25498947 27339014 20726120 8308621 4737227 14772871 23233567 18072132 10345723
34879 10345723 16172691 29336148 30106437 15561521 2437952 1284529 5174011 5737197
34871 5737197 4801121 5847647 6693649 6071729 7651737 12525437 15751301 14717394 13758233
34862 13758233 16213235 18225060 15011113 8506424 4309534 3961111 3850688 587979
34854 587979 -4656238 -7502262 -6357687 -6036149 -11932007 -20562048 -21765234 -12349932
34846 -12349932 -662880 5833124 9309043 12677757 11638762 4204607 -1028834 2473024
34838 2473024 6132695 -743786 -11424489 -10757386 519531 7460123 5256214 3977160
34830 3977160 7521444 5985745 -5518339 -16496944 -17443455 -13441693 -12880330 -13789247
34822 -13789247 -10643507 -5719867 -4237013 -4806766 -3170463 -368325 55684 -1138826
34814 -1138826 -946424 496519 1355046 1702650 2200651 2508091 3156751 4913254 5096990
34805 5096990 26278 -7570557 -9945723 -4866304 1731211 5022922 5825915 4312755
34797 4312755 -1999977 -10906624 -14996523 -12778813 -12055893 -17296668 -21607603 -17158786
34789 -17158786 -6760203 1122238 3379659 2693171 1596134 928567 625538 -767875
34781 -767875 -3505081 -3168222 3878660 11692242 10335887 1091327 -4562247 -3135184
34773 -3135184 -3872451 -11243005 -16105144 -11301428 -3397357 -150998 1936035 7633800
34765 7633800 11650850 8466504 3586698 3301573 2564388 -4436409 -10570756 -6584755
34757 -6584755 1853650 2549063 -3725874 -6762743 -4931147 -4770604 -6541525 -5206532
34749 -5206532 -3003331 -6297053 -12019419 -11585780 -6197767 -3762561 -3190297 2291812
34741 2291812 8541823 5484853 -1847054 2565096 17985670 24243556 12891015 346024
34733 346024 215891 2305465 -6799941 -19263567 -19823056 -11974974 -11333213 -19723759 -23920898
34724 -23920898 -17456524 -8018726 -3342518 -2719314 -3414686 -4674229 -3928975 2004735
34716 2004735 10434279 14607469 12546234 7773957 2053624 -5318098 -11478244 -11334407
34708 -11334407 -6051349 -3089253 -6031866 -10454285 -11582046 -10334454 -9677365 -9865580
34700 -9865580 -9483814 -7586522 -3803565 267739 409044 -4518804 -7308091 -252030
34692 -252030 11207828 11822601 -2735175 -17329515 -16380881 -4379314 1766373 -3490103
34684 -3490103 -8942848 -4482301 6074081 13120555 14008974 12385249 10364392 7576202
34676 7576202 5139167 4707099 4507658 1323148 -3621323 -5360719 -2701493 -745785
34668 -745785 -3728253 -8745177 -9783705 -5784662 -1101637 803308 10638 -3340134
34660 -3340134 -10367769 -19305061 -24267309 -21884203 -16204909 -12492181 -8780931 -346874
34652 -346874 8246663 4807669 -12795690 -28734336 -26773196 -10633354 2375917 5006434
34644 5006434 6159977 13061291 19790706 18994441 14632477 14186459 15268387 10536853
34636 10536853 2149059 23452 5777944 8765261 1232257 -10495827 -14680812 -8853383
34628 -8853383 -998064 1024836 -2976887 -7454801 -7672682 -4257557 -2122816 -4668022
34620 -4668022 -9567026 -11561308 -8610008 -3420810 113289 -344652 -5194862 -12214285
34612 -12214285 -17012951 -17106802 -14580140 -11906045 -7332514 1132896 9237362 10154759
34604 10154759 4097906 -2059227 -4883919 -7255334 -10126339 -9083562 -2350961 4433187
34596 4433187 5842209 3849745 2977018 2866988 497700 -3867307 -7667801 -10075491
34588 -10075491 -10726917 -7198252 1689639 11961089 18053992 19036587 17988367 16728893
34580 16728893 14450231 10417229 5122989 -449785 -4810309 -6593461 -6876705 -9051339
34572 -9051339 -14672126 -21193892 -25017188 -24503217 -19141267 -9148891 2342396 9997973
34564 9997973 11411496 9239826 7464281 8771452 15397731 26763006 35121306 30832062
34556 30832062 15471621 2836577 2189102 7232435 7611186 4240575 4513069 7627663
34548 7627663 5601630 -2683873 -8649129 -6370841 207927 4228678 3560750 -440342
34540 -440342 -6097548 -10868300 -11983964 -9910997 -8083853 -7980620 -7550978 -5336997 -2866516
34531 -2866516 -1952988 -2545989 -4038039 -5807330 -5850175 -2211224 2937059 3917942 -1356119
34522 -1356119 -7152684 -5906266 2051828 7652254 3175326 -8720524 -18262293 -19692506
34514 -19692506 -15584664 -10133125 -3834272 1955954 1231215 -8684252 -18948357 -18010708
34506 -18010708 -7693257 -1265753 -4881010 -10660947 -10645579 -7662138 -7685415 -10149665
34498 -10149665 -11528548 -11195498 -8514355 -1561633 6081013 5529717 -4286806 -12246222
34490 -12246222 -10785453 -7122115 -10463323 -17281954 -19598752 -19169490 -21318452 -22371441
34482 -22371441 -16854021 -10719168 -12421371 -15890419 -8831704 5046327 9611837 1655303
34474 1655303 -5120032 -3590849 -2949269 -9587362 -14722409 -9724749 -527046 3168536
34466 3168536 2906185 5627516 10196555 9587264 2614598 -3907238 -2982966 5931830 15557922
34457 15557922 15738098 4844043 -4725035 -592670 10715840 10332119 -5762403 -19509423
34449 -19509423 -16470500 -5791035 -4999969 -15228111 -23346223 -22211738 -16805403 -13028166
34441 -13028166 -10538543 -6611743 -505568 6059562 9485745 7535298 4059615 5824223
34433 5824223 12132129 14293705 9350951 6147334 11088743 15925945 9467540 -4234255
34425 -4234255 -10721072 -5696982 260848 -1970448 -8495357 -10017093 -4597644 564391
34417 564391 -3015540 -16993056 -33912655 -43014588 -40028613 -30385243 -21873192 -17040758
34409 -17040758 -14522390 -13405431 -12450294 -8874474 -2767991 282223 -3879523 -10736223
34401 -10736223 -12077077 -6702495 -972880 649589 678542 3561249 8980381 11551180
34393 11551180 6413598 -4762470 -14032579 -15710062 -13632212 -15437154 -20290584 -19508801
34385 -19508801 -10893047 -3698232 -4615521 -7065372 -1770361 8494889 13288919 9141152
34377 9141152 1404045 -4843580 -7185821 -2444487 9476950 19916404 19422878 11521426
34369 11521426 9250220 16590728 22277325 15425675 -22884 -11220507 -12154755 -8837337
34361 -8837337 -10567388 -18923837 -25653014 -21794621 -8919608 1875493 4026157 3590484
34353 3590484 8558378 15334356 14162298 5151981 -1018933 1356081 6142285 6271005
34345 6271005 3156851 1454737 1261968 266703 -1031784 -465713 2606680 7905139 14685802
34336 14685802 19585481 17890376 9513130 801965 -1238111 5953488 20444968 35664574
34328 35664574 40653480 28420984 6916924 -5722393 -1376266 9110694 12011822
34321 12011822 8233371 7047763 9027103 6679159 -349502 -3054765 1714309 4363594
34313 4363594 -3539239 -15811258 -19250695 -10811142 -214260 3350920 864497 -1294128
34305 -1294128 -885806 -1275109 -5140176 -10074326 -11616719 -9345537 -7741228 -10007829
34297 -10007829 -12840890 -10266037 -2565082 2350294 -1444110 -9893305 -14019926 -10928423
34289 -10928423 -5241244 -455057 5221388 12579805 16432856 11337531 -566376 -11592458
34281 -11592458 -16473341 -14624161 -7007356 3790941 11444000 10272884 3152496 -246747
34273 -246747 4570192 11118768 10854255 3944269 -2380890 -3200688 256798 4109232 5294206
34264 5294206 2654640 -2043506 -4728311 -3384717 -1091522 -2017681 -5147135 -5104045 753073
34255 753073 8774451 12926985 10277482 2877268 -3320478 -1815847 8417153 19091398
34247 19091398 18483628 3997631 -13553285 -21429151 -18682468 -14097656 -11993191 -7175566
34239 -7175566 3605473 12395923 9168531 -3545268 -13442626 -14781362 -13005087 -12034173
34231 -12034173 -7254097 3577563 11539924 7559592 -3289456 -7890436 -2331274 5904432
34223 5904432 10540902 11570489 8805232 949068 -7571145 -8754369 -2920668 265322
34215 265322 -4054746 -9356207 -9329877 -7089756 -6792329 -4456744 4196716 12503265 9488574
34206 9488574 -4077874 -15048182 -14256584 -7018475 -4722008 -9848419 -13129204 -5642462
34198 -5642462 9002940 18129437 15832695 9811438 8627863 8718792 2533183 -5639165
34190 -5639165 -4736214 3721442 6180425 -586181 -3203124 5687140 13517494 7221251
34182 7221251 -5916082 -10245547 -5252711 -2201399 -3382507 -380177 8723243 14324108
34174 14324108 8983732 -3622708 -14626422 -17931553 -13097856 -6417257 -6694544 -14115277
34166 -14115277 -17860731 -11639874 -5011831 -9601408 -20760708 -25337155 -22097468 -19925356
34158 -19925356 -19725690 -14669085 -7104239 -7615912 -15254271 -15754522 -4080839 6997406
34150 6997406 7119983 2415633 1408022 452887 -6341630 -13295069 -10706098 368892
34142 368892 10231799 12516428 7178994 -3002132 -12624019 -15638366 -12516987 -10165796
34134 -10165796 -10972970 -9252856 -2562705 2761145 3210245 5216613 12580056 16503353
34126 16503353 8718350 -3337598 -6340839 -474328 2917223 -844623 -5987400 -7922056
34118 -7922056 -7549189 -5144816 -123568 3659638 1513606 -3958694 -6961546 -8939938
34110 -8939938 -14877868 -20615407 -16046052 -2424586 5693505 160452 -9599712 -11060825
34102 -11060825 -5286283 -1626791 -2465069 -2116202 2216089 6576528 7272171 5741205
34094 5741205 4744877 3225017 -2349728 -11796450 -18421471 -15266451 -4910310 927601
34086 927601 -4601181 -13269367 -11892480 -715668 6718683 2842055 -4014439 -2912050
34078 -2912050 4913319 11193178 13850358 16356043 17935128 14168491 6470043 1945399
34070 1945399 2723871 3476064 1716854 2701255 10031204 18321296 20914208 19472178 19177613
34061 19177613 18632888 12863547 4576263 3302572 11574156 19336608 15914197 2870921
34053 2870921 -8648462 -10463418 -4704411 -854927 -6526695 -18466669 -23123869 -11170934
34045 -11170934 8457976 16337582 6643310 -4842234 -1773626 11986461 20403512 16902603
34037 16902603 7612072 -2046646 -11700069 -18463278 -17348227 -10967247 -8608608 -13115222
34029 -13115222 -17682142 -18023936 -18183855 -20665222 -20310359 -13477027 -5321226 -1947845
34021 -1947845 -2099769 -2501024 -4813807 -10574270 -14907183 -12546020 -6060757 -1838582
34013 -1838582 -1690302 -3891881 -7902019 -12089134 -11782093 -6402615 -3601572 -8601386
34005 -8601386 -14220647 -10558391 -701191 3453267 -1348909 -7138986 -8538435 -7899920
33997 -7899920 -5866290 1686221 13664081 20510372 16208023 6504537 636575 827842
33989 827842 3726019 6160336 5512924 129676 -6703453 -8762934 -6436544 -7856924
33981 -7856924 -16106923 -22326946 -17832690 -6798677 701833 2934138 4946862 6837951
33973 6837951 3872479 -2894325 -6005172 -2690625 1644563 2628343 2197761 2691164 2676044
33964 2676044 1172521 -465969 -3405426 -11091144 -20701852 -22156401 -11064214 3413189
33956 3413189 9759949 7754737 4053894 -462898 -9362664 -19377770 -21275044 -13444726
33948 -13444726 -5859763 -7233220 -14774461 -20197073 -20373045 -17747986 -14098738 -8615758
33940 -8615758 -978851 6504442 9846450 6647808 -15882 -2306356 4314272 14821973
33932 14821973 20854030 21785012 23214315 25185145 20950797 9942950 2656358 6740069
33924 6740069 15326544 16235714 7697893 -2024770 -6602963 -6287324 -3746946 -1918801
33916 -1918801 -3647025 -7664461 -7603548 -605147 6502459 6097834 1442695 1969562 9562388
33907 9562388 17560609 21443534 21873501 18151099 8040565 -4678023 -10732749 -6163842
33899 -6163842 2900581 7771355 5158850 -1987060 -6764941 -2980765 6901285 11121021
33891 11121021 3020829 -7358894 -5762416 5012288 8859773 1120534 -4696122 1328571
33883 1328571 10649776 10467017 2020063 -4165581 -3610443 244479 4103859 6780628
33875 6780628 6386065 1880378 -4400849 -9315144 -11622266 -10594403 -5923607 -69132
33867 -69132 4041582 7670188 12601767 14145574 6904920 -3006255 -3184117 6242165 12113473
33858 12113473 9739241 10149709 19709963 27744746 24223243 15987473 13492539 13595760
33850 13595760 8826082 2976204 3019362 4803911 1774470 -640753 4566766 9040058
33842 9040058 466182 -14878881 -20052957 -14191729 -11342875 -14105584 -9934176 3633876
33834 3633876 11229082 4327252 -4492838 -1714357 7591296 11362883 9552726 9393235
33826 9393235 10283337 5807356 -3536399 -10019420 -9570008 -5698920 -3329877 -3904289 -6388952
33817 -6388952 -9710666 -13539625 -17286120 -18563931 -14777122 -7823693 -3797604 -5026119
33809 -5026119 -6966927 -7066275 -9840603 -16054210 -15056865 209279 17054348 17242343
33801 17242343 3953006 -2427624 5286025 13267533 11466704 6583715 4014649 -3562449
33793 -3562449 -18509031 -26294618 -15821979 1488021 8345718 6478297 8162097 11524881
33785 11524881 3773513 -13912514 -23581793 -15231144 311510 7755433 5185837 40164
33777 40164 -3747584 -7334932 -10332545 -9363317 -3242292 3605737 4553985 -1915092 -9211204
33768 -9211204 -9323366 -2353217 4270034 6455289 7944781 11957116 14374076 10034441
33760 10034441 1458957 -4239704 -4706556 -3854996 -5475212 -8908592 -10214016 -5960613
33752 -5960613 2412880 7717236 3967169 -5630906 -12339265 -13333107 -13011772 -13036959 -10208925
33743 -10208925 -6015593 -7461883 -13910781 -14121706 -3018897 9408425 14110471 16505075
33735 16505075 23094262 25782931 14583896 -2192035 -7594983 -1193757 3020542 1487573
33727 1487573 4833865 15375656 20218260 13226287 6929761 12568886 21795827 20325917
33719 20325917 10005144 4257513 7628021 12688705 14347161 14759999 13651908 5368298
33711 5368298 -9906664 -20390615 -15398198 -6287 10277813 8990457 5580683 9897822
33703 9897822 16737189 13765215 1695874 -4346294 3949809 15834205 17233986 10505875
33695 10505875 8539111 14177362 17284594 11457175 2505530 -2087582 -3007030 -4282541
33687 -4282541 -5513130 -3925255 -155923 2129531 379888 -4904871 -10174595 -10325409
33679 -10325409 -3483205 5185930 8054662 4085761 -307768 -8853 3154319 4522429
33671 4522429 2558609 -906740 -3493053 -3860930 -2317055 -417609 1052059 2600253
33663 2600253 3379125 982841 -3688254 -5512801 -3138453 -3003082 -9370686 -15537570
33655 -15537570 -13458708 -7522602 -7504978 -10616137 -4388107 11715472 22110560 17486603
33647 17486603 8506307 9270809 17382044 19988216 12557163 2067013 -4171398 -4579451
33639 -4579451 -809994 4272481 7725510 9718347 13179892 17919336 19546102 16630685
33631 16630685 13024706 10253890 5072137 -1487829 -1689970 5822702 9700348 1768640
33623 1768640 -8775240 -8227252 826970 4368089 -1256079 -6041562 -3950042 -551786
33615 -551786 -1113032 -2607979 -1391882 338147 -133824 -1517053 -2854598 -6027012 -10668255
33606 -10668255 -12191405 -7910430 -551160 6213791 11117702 13268758 12204811 10836930
33598 10836930 12334946 13244039 6712805 -5774023 -13476881 -10155237 -1673053 3308543
33590 3308543 2895565 -1408403 -9290217 -17144280 -16894022 -6942298 1929629 -345079
33582 -345079 -9735533 -16401866 -20167858 -26020657 -28739991 -17587758 2777525 12031551
33574 12031551 1323467 -12803514 -11836418 -1695913 -1540779 -12888226 -17600667 -7097792
33566 -7097792 4075772 1423159 -7018436 -4105221 9616142 18148551 15499275 12233164
33558 12233164 14614955 13426578 1353992 -11748703 -12866459 -6027633 -4541455 -8116457
33550 -8116457 -3125512 14356852 30279539 31590442 22064872 13408883 9920017 9014230
33542 9014230 9599518 11651824 11787996 6714510 -1174321 -6971052 -9279893 -8243686
33534 -8243686 -1274204 12731823 27135896 32351182 26609992 16666597 8267351 1203324
33526 1203324 -6148260 -12634711 -16043873 -15618481 -12317743 -9196828 -10417089 -15870071
33518 -15870071 -17890773 -8899038 7140237 16586017 11655512 -575130 -7490660 -5083207
33510 -5083207 986663 5129902 7270672 9003109 9109265 5346707 -968451 -4614110
33502 -4614110 -1601369 5813477 10450106 7454930 -196712 -4587154 -1347648 5660759
33494 5660759 8499931 3434687 -5266057 -9595721 -5641041 3005146 9388759 9565874
33486 9565874 4253476 -3693021 -10641733 -12443419 -7838922 -2097925 -2596276 -9029809
33478 -9029809 -12655596 -7968939 -375745 1784692 -1599571 -4663881 -5463361 -7054854
33470 -7054854 -10529580 -13534273 -15207057 -16739720 -17309780 -15035444 -11615179 -10107119
33462 -10107119 -8292627 -834799 11306859 20323462 21764702 18738984 14446138 7967828
33454 7967828 358137 -2715041 761061 4405766 2162939 -3536238 -7466801 -10127476
33446 -10127476 -14460666 -18650292 -19103002 -17371080 -17245765 -17267663 -12822533 -4259531 3124489
33437 3124489 5993480 4526904 -791136 -7660083 -9428139 -1902201 8047857 9060940
33429 9060940 1178877 -3441799 1889940 8707043 6045088 -4427531 -12532803 -13811613
33421 -13811613 -12116030 -10512578 -7334563 -1905884 1893326 527579 -3835988 -5408679
33413 -5408679 -1063199 6921332 13747931 16533750 15685857 12641170 7623757 623023
33405 623023 -6481214 -11138334 -13705637 -17195652 -22087508 -23940949 -18967686 -10380101
33397 -10380101 -5306949 -5295574 -4135078 2723625 10416125 10820406 4476585 304964
33389 304964 2781277 5976871 3923834 674901 3166304 8255084 6344740 -2781769
33381 -2781769 -8039687 -3790801 1143177 -2814732 -11223634 -12960607 -7080940 -2798713
$$ [...]
##END NTUPLES=NMR SPECTRUM
##END=
