##TITLE=31Pdec_ABDP0102
 CDCl3, 51 sc
 1.03.2021
##JCAMPDX= 6.0         $$ Bruker NMR JCAMP-DX V2.0
##DATA TYPE= NMR SPECTRUM
##DATA CLASS= NTUPLES
##ORIGIN= UXNMR, Bruker Analytische Messtechnik GmbH
##OWNER= root
$$ XWIN-NMR		Version 3.5
$$ Mon Mar  1 11:47:21 2021 Russian Standard Time (UT+4h)  she@DPX200
##.OBSERVE FREQUENCY= 81.013821
##.OBSERVE NUCLEUS= ^31P
##.ACQUISITION MODE= SIMULTANEOUS
##.ACQUISITION SCHEME= undefined
##.AVERAGES= 24
##.DIGITISER RES= 16
##SPECTROMETER/DATA SYSTEM= spect
##.PULSE SEQUENCE= zgpg30
##.SOLVENT NAME= CD3CN
##.SHIFT REFERENCE= (INTERNAL, CD3CN, 0, 248.564)
##AUDIT TRAIL= $$ (NUMBER, WHEN, WHO, WHERE, WHAT)
$$ ##TITLE= Audit trail, XWIN-NMR		Version 3.5
$$ ##JCAMPDX= 5.01
$$ ##ORIGIN= Bruker BioSpin GmbH
$$ ##OWNER= she
$$ F:/spectra/data/she/nmr/P31/1/pdata/1/auditp.txt
$$ ##AUDIT TRAIL=  $$ (NUMBER, WHEN, WHO, WHERE, WHAT)
(   1,<2021-03-01 11:46:15.82 +0400>,<she>,<DPX200>,
      <created by zg, POWCHK disabled, PULCHK disabled
       configuration hash MD5:
       00 E9 B6 7A A2 85 ED C7 34 08 36 98 17 FE 4E 26
       data hash MD5: 32K
       0D BF 60 C5 2C 78 DF 8A F2 D4 7E 30 7F DA 71 AF>)
(   2,<2021-03-01 11:46:18.82 +0400>,<she>,<DPX200>,
      <Start of raw data processing
       efp BC_mod = 2 LB = 1 FT_mod = 6 PKNL = 1 PHC0 = -2848.978 PHC1 = -105.3975 SI = 64K 
       data hash MD5: 64K
       BC 52 4E 36 B1 BE 44 4D 9B 23 2D 30 E9 DA E5 30>)
(   3,<2021-03-01 11:46:46.78 +0400>,<she>,<DPX200>,
      <pk PHC0 = 14.64734 PHC1 = -141.8 
       data hash MD5: 64K
       3F F7 85 6D EE 6E 6C E9 16 E8 BC 55 73 3D 80 5E>)
(   4,<2021-03-01 11:46:50.39 +0400>,<she>,<DPX200>,
      <abs ABSG = 5 
       data hash MD5: 64K
       17 8F CE 76 C4 04 1B 44 F5 5C 4A B3 00 4D B1 BA>)
$$ ##END=
$$ 
$$ hash MD5
$$ BF 87 D2 7F 49 A4 41 BD 7F 56 31 D6 78 7E 0E B1
##$RELAX= 
##$RELAX= 
##$RELAX= 
##$RELAX= 
##$RELAX= 
##$RELAX= 
##$RELAX= 
##$RELAX= 
$$ Bruker specific parameters
$$ --------------------------
##$DU= <F:/spectra>
##$EXPNO= 1
##$NAME= <P31>
##$PROCNO= 1
##$TYPE= <nmr>
##$USER= <she>
##$AMP= (0..31)
100 100 100 100 100 100 100 100 100 100 100 100 100 100 100 100 100 100 
100 100 100 100 100 100 100 100 100 100 100 100 100 100 
##$AQSEQ= 0
##$AQ_mod= 1
##$AUNM= <au_zg>
##$AUTOPOS= <>
##$BF1= 81.014009
##$BF2= 200.13
##$BF3= 200.13
##$BF4= 200.13
##$BF5= 200.13
##$BF6= 200.13
##$BF7= 200.13
##$BF8= 200.13
##$BYTORDA= 1
##$CFDGTYP= 0
##$CFRGTYP= 5
##$CHEMSTR= <none>
##$CNST= (0..31)
1 1 145 1 1 1 1 1 1 1 1 1 1 1 1 1 1 1 1 1 1 1 1 1 1 1 1 1 1 1 1 1 
##$CPDPRG= <waltz16>
##$CPDPRG1= <>
##$CPDPRG2= <waltz16>
##$CPDPRG3= <>
##$CPDPRG4= <mlev>
##$CPDPRG5= <mlev>
##$CPDPRG6= <mlev>
##$CPDPRG7= <mlev>
##$CPDPRG8= <mlev>
##$CPDPRGB= <>
##$CPDPRGT= <>
##$D= (0..31)
0 1 0 0 0 0 0 0 0 0 0 0.03 2e-05 3e-06 0 0 0 0 0 0 0 0 0 0 0 0 0 0 0 0 
0 0 
##$DATE= 1614584775
##$DBL= (0..7)
120 120 120 11 120 120 24 19 
##$DBP= (0..7)
150 150 150 150 150 150 150 150 
##$DBP07= 0
##$DBPNAM0= <>
##$DBPNAM1= <>
##$DBPNAM2= <>
$$ [...]
##$SUBNAM3= <"">
##$SUBNAM4= <"">
##$SUBNAM5= <"">
##$SUBNAM6= <"">
##$SUBNAM7= <"">
##$SUBNAM8= <"">
##$SUBNAM9= <"">
##$SW= 501.771253377433
##$SWIBOX= (0..15)
0 1 3 0 0 0 0 0 0 0 0 0 0 0 0 0 
##$SW_h= 40650.406504065
##$TD= 32768
##$TD0= 1
##$TE= 0
##$TE2= 300
##$TE3= 300
##$TEG= 300
##$TL= (0..7)
0 120 53 12 22 120 120 120 
##$TP= (0..7)
150 150 150 150 150 150 150 150 
##$TP07= 0
##$TPNAME0= <>
##$TPNAME1= <>
##$TPNAME2= <>
##$TPNAME3= <>
##$TPNAME4= <>
##$TPNAME5= <>
##$TPNAME6= <>
##$TPNAME7= <>
##$TPOAL= (0..7)
0.5 0.5 0.5 0.5 0.5 0.5 0.5 0.5 
##$TPOFFS= (0..7)
0 0 0 0 0 0 0 0 
##$TUNHIN= 0
##$TUNHOUT= 0
##$TUNXOUT= 0
##$USERA1= <user>
##$USERA2= <user>
##$USERA3= <user>
##$USERA4= <user>
##$USERA5= <user>
##$V9= 5
##$VALIST= <valist>
##$VCLIST= <CCCCCCCCCCCCCCC>
##$VD= 0
##$VDLIST= <DDDDDDDDDDDDDDD>
##$VPLIST= <PPPPPPPPPPPPPPP>
##$VTLIST= <TTTTTTTTTTTTTTT>
##$WBST= 1024
##$WBSW= 4
##$XGAIN= (0..3)
0 0 0 0 
##$XL= 0
##$YL= 0
##$YMAX_a= 5139
##$YMIN_a= -5058
##$ZGOPTNS= <>
##$ZL1= 120
##$ZL2= 120
##$ZL3= 120
##$ZL4= 120
##$ABSF1= 248.5645
##$ABSF2= -253.2056
##$ABSG= 5
##$ABSL= 3
##$ALPHA= 0
##$AQORDER= 0
##$ASSFAC= 0
##$ASSFACI= 0
##$ASSFACX= 0
##$ASSWID= 0
##$AUNMP= <proc_1d>
##$AZFE= 0.1
##$AZFW= 0.5
##$BCFW= 0
##$BC_mod= 2
##$BYTORDP= 0
##$COROFFS= 0
##$CY= -3
##$DATMOD= 1
##$DC= 0
##$DFILT= <>
##$DTYPP= 0
##$F1P= 0
##$F2P= 0
##$FCOR= 1
##$FTSIZE= 65536
##$FT_mod= 6
##$GAMMA= 0
##$GB= 0
##$INTBC= 1
##$INTSCL= 5.30512e-09
##$ISEN= 30
##$LB= 1
##$LEV0= 0
##$LPBIN= 0
##$MAXI= 10000
##$MC2= 0
##$MEAN= 0
##$ME_mod= 0
##$MI= 50
##$NCOEF= 0
##$NC_proc= -5
##$NLEV= 6
##$NOISF1= 182.463
##$NOISF2= 159.3651
##$NSP= 0
##$NTH_PI= 0
##$NZP= 0
##$OFFSET= 248.5645
##$PC= 4
##$PHC0= -2834.331
##$PHC1= -247.1975
##$PH_mod= 1
##$PKNL= yes
##$PPARMOD= 0
##$PSCAL= 0
##$PSIGN= 0
##$REVERSE= no
##$SF= 81.014009
##$SI= 65536
##$SIGF1= 159.3651
##$SIGF2= -187.1042
##$SINO= 113.3802
##$SIOLD= 16384
##$SREGLST= <1H.CDCl3>
##$SSB= 0
##$STSI= 65536
##$STSR= 0
##$SW_p= 40650.406504065
##$SYMM= 0
##$S_DEV= 0
##$TDeff= 32768
##$TDoff= 0
##$TI= <>
##$TILT= no
##$TM1= 0
##$TM2= 0
##$TOPLEV= 0
##$USERP1= <user>
##$USERP2= <user>
##$USERP3= <user>
##$USERP4= <user>
##$USERP5= <user>
##$WDW= 1
##$XDIM= 65536
##$YMAX_p= 403527045
##$YMIN_p= -79191703
$$ End of Bruker specific parameters
$$ ---------------------------------
##NTUPLES= NMR SPECTRUM
##VAR_NAME=  FREQUENCY,     SPECTRUM/REAL,   SPECTRUM/IMAG
##SYMBOL=    X,             R,               I
##VAR_TYPE=  INDEPENDENT,   DEPENDENT,       DEPENDENT
##VAR_FORM=  AFFN,          ASDF,            ASDF
##VAR_DIM=   65536,         65536,           65536
##UNITS=     HZ,            ARBITRARY UNITS, ARBITRARY UNITS
##FACTOR=    0.620285442955139, 1,           1
##FIRST=     20137.2065510759, 0,            0
##LAST=      -20513.1999529892, 0,           0
##MIN=       -20513.1999529892, -79191703,   0
##MAX=       20137.2065510759, 403527045,    0
$$ Real data points
##PAGE= N=1
##DATA TABLE= (X++(R..R)), XYDATA
$$ [...]
40296A658940j518486p33321N17000R40049M33710k92707q27143q39344J39778
40287e21524J564018J692264j6792j542022j026225L39091K23330j102578j420717
40278a811155l08573M95745L15975L77765J114795J249613K64580n49571l96019
40269G53155k04716o05598o86765J16546P70126N02697J80048N07750N35551n25261
40259A343533j486741r13041M93566R83409L63697j79978j99926k57846m87488
40250c40815m30254j29293p7389j79466R9750O48697P97874M39452J56314K68328
40240A253198N03284N36827K22886n23189j449423j829087j228246j52345O24631
40231b041464R68490J015817M84697p19875j647964j174705L73096J467540J292529
$$ y = [1658940, 140454, -592867, -75867, 864182, 1297892, 1005185, 178042, -661302, -521524, 1042494, 2734758, 2717966, 1175944, 149719, 488810, 712140, -390438, -1811155, -2119728, -1623983, -1308008, -930243, 184552, 1434165, 1698745, 1149174, 753155, 548439, -57159, -743924, -627378, 142748, 645445, 825493, 1333243, 1868794, 1343533, -143208, -1056249, -562683, 420726, 784423, 604445, 404519, 146673, -340815, -771069, -900362, -977751, -1157217, -1057467, -408770, 389104, 828556, 984870, 1253198, 1756482, 2293309, 2516195, 1993006, 543583, -1285504, -2513750, -2666095, -2041464, -1072974, -57157, 427540, -292335, -1940299, -3115004, -2741908, -1274368, 18161]
40222A8161N01547k2892k37037m55773o02332m57317j70823j2341J22758M80596
40212h35453Q32176O05885j84060o10301N690Q31868L50702j314863k034499n22376
40202b875231J468831J335331o08836j535221k63146J179511Q49923l58820o02258
40193a409916K531J31906k53345j11396O13009R36591N89598K48881J54601p2685
40183H29775k90711J06202Q97854J063917K94680n97370r39163q71532o35441
40174a41789k00615J93711R6185k93481k03550M73848Q42098K45119q17346j338239
40164a144059q54066K95173J235068J084597j48879j232303j000053N7519L89992
40155a317011l84806r20969j54807J155285J541074P23350l18820o86666l05571
$$ y = [18161, 519708, 496816, 259779, -195994, -798326, -1255643, -1426466, -1438807, -1316049, -835453, -3277, 602608, 418548, -191753, -186063, 645805, 996507, -318356, -2352855, -2875231, -1406400, -71069, -679905, -2215126, -2478272, -1298761, -448838, -807658, -1409916, -1407385, -1275479, -1528824, -1640220, -1027211, -90620, 498978, 747859, 902460, 829775, 539064, 645266, 1543120, 2607037, 2901717, 2304347, 1365184, 493652, -141789, -342404, -148693, -52508, -345989, -549539, -75691, 766407, 1011526, 194180, -1144059, -1998125, -1702952, -467884, 616713, 467834, -764469, -1764522, -1707003, -1317011, -1701817, -2622786, -2777593, -1622308, -81234, 642116, 323296, -363370, -668941]
40146f68941L67955Q03912O78579R2087m98055o86263l93545J71056N51260K14074
40136F32119q12197j544800r45072O79377J808119J466959K81160m83553l64791
40127G17321J50382M22163J96436k98377m71101R0580R53743J095496Q7947j344189
40117A600401k173469k032502j111691K60785J453362J566622M19656q29074q61086
40108a706996J44593Q31981N85333J83377L22495M91569k2697p90093q76624m14222
40098a251284l98188r43536r21279K55829J506974J485917L84323n24928o34149
40089a040321l70035j58041J7909J64970K60259N62960J131614J259651L68078
40080B197044p69464q76059j18746J43079m46149q30829n26158l07980m71088
$$ y = [-668941, -300986, 502926, 1181505, 1273592, 775537, 89274, -304271, -133215, 418045, 632119, -180078, -1724878, -2669950, -1990573, -182454, 1284505, 1565665, 1082112, 717321, 867703, 1289866, 1486302, 1187925, 716824, 807404, 1761147, 2856643, 2944590, 1600401, -573068, -2605570, -3717261, -3456476, -2003114, -436492, -16836, -845910, -1706996, -1562403, -730422, -145089, 38288, 360783, 852352, 829655, 39562, -837062, -1251284, -1649472, -2593008, -3514287, -3258458, -1751484, -265567, 118756, -406172, -1040321, -1410356, -1568397, -1550488, -1385518, -1125259, -562299, 569315, 1828966, 2197044, 1427580, 551521, 432775, 575854, 129705, -701124, -1227282, -1535262, -2006350]
40071b006350k04738N64498N96946l48276n69508P72287J811962Q25827q08102
40062F34546q02136K99461K41159j025937j422103l50192N80650M80308K06169
40053a158075K02321j87248p87785l77751R55067J497359O66266j09832j4683
40044F85639o4950p76074r70222j68093J31178q75169j494708k59557J488149
40035b303807J768799R89911N84103K20874j053536k120768j104887J211306K075709
40026B67704P71874o20053o26427r3240p746Q3389N72091O45222k01262r96581
40016b05029q17440k80504l31542n33485J14558J263614J481918L23379r78761
40007C6708j098644j31179Q19652J039494P09132K46712k64080q02340j018626
$$ y = [-2006350, -2211088, -1646590, -1049644, -1397920, -1967428, -1195141, 616821, 1442648, 634546, -167590, 131871, 373030, -652907, -2075010, -2425202, -1844552, -1364244, -1158075, -955754, -1143002, -1930787, -2308538, -1353471, 143888, 810154, 700322, 685639, 620689, -155385, -1125607, -1293700, -1162522, -2037691, -3532399, -3791956, -2303807, -535008, 454903, 1039006, 1259880, 206344, -1914424, -3019311, -1808005, 267704, 1039578, 419525, -206902, -300142, -307888, -224499, 347592, 992814, 791552, -205029, -1022469, -1302973, -1634515, -2168000, -2053442, -789828, 692090, 1015469, 36708, -1061936, -1193115, -373463, 666031, 1375163, 1621875, 1357795, 555455, -463171]
39998d63171o07018R1917L99190K19810J27842M38807P46424N66603n9316p67285
39988F93803j163166q42065J89519R90975M72907r91349j695012q04997N54457
39979b594928J038183Q19617O98099N13995k66505j080386q02375M83012J433007
39970B41719J142745J3324r86992j198365n67463K87217N15900K9063l49017j23343
39960i95212J84172J26583J49779N08640M48380m01839r06363j37403Q09703M84837
39950B71277l13923K35392J672754J639799l40913j892984j249747L99351J005483
39941A426489L86054l15019n89393p45531r11930q67391m81626J70404P57641
39932a170302P10299n9029o03111o8080Q22134O61632l89422p83257o6084N49326
$$ y = [-463171, -1070189, -978272, -579082, -359272, -231430, 207377, 953801, 1520404, 1461088, 693803, -469363, -1311428, -1121909, -130934, 341973, -649376, -2344388, -3149385, -2594928, -1556745, -737128, -39029, 474966, 208461, -871925, -1674300, -1191288, 241719, 1384464, 1397788, 410796, -787569, -1355032, -1067815, -551915, -522852, -871869, -995212, -811040, -684457, -534678, -26038, 422342, 20503, -885860, -1023263, -213560, 271277, -42646, 192746, 1865500, 3505299, 3164386, 1271402, 21655, 421006, 1426489, 1812543, 1497524, 908131, 162600, -749330, -1616721, -2098347, -1927943, -1170302, -460003, -519032, -1122143, -1190223, -368089, 293543, -95879, -879136, -945220, -395894]
39922c95894M09044L70370Q84194R47085n0614j038257r60987l72297j90859j79770
39912e77985J23222J93805m39448j012179p04725n4291R4631R7819O02797J032967
39902f43387N00584m48642n51506J65972N63776K82955R5528M60617Q99186Q43391
39892B168474K83224l81265o13930k04329J83213l51913j359481j240350K66477
39883a249880J231346L26922j009645q23847L25752O33903K03257M63740J138997
39874A240545N40839j184778j819927n60005P04937M19312m71968m54178K83919
39865a301304P31506P47781O38087K02305o21752j092488p02190j18647j62347
39856a679049n19459l24342N38739J439090J812443J420538L35005q56028j350093
$$ y = [-395894, 13150, 383520, 1267714, 2214799, 2164185, 1125928, 164941, -207356, -398215, -577985, -454763, -260958, -700406, -1712585, -2417310, -2471601, -2376970, -2279151, -1676354, -643387, -142803, -591445, -1142951, -976979, -413203, -130248, -34720, 425897, 1325083, 2168474, 2451698, 2070433, 1456503, 1252174, 1435387, 1083474, -276007, -1516357, -1249880, -18534, 308388, -701257, -1525104, -1199352, -565449, -362192, 101548, 1240545, 1781384, 596606, -1223321, -1783326, -1078389, -659077, -1131045, -1585223, -1301304, -569798, 177983, 816070, 1018375, 396623, -695865, -1398055, -1516702, -1679049, -2198508, -2522850, -1984111, -545021, 1267422, 2687960, 3022965, 2166937, 816844]
39847H16844j008961m12751R4734O27020R25245M28718m77980n32923M52599R34142
39837A846687j59955j631310j565945O9192J547096J614299N55108o46036j252165
39828C76971j032066l06027L07453N37376N80648M49478r0803o50963k96521Q66869
39818G42415J250823p2531j700420j642542q4749R97325O36988j63480k68375
39809c04546J45022L20698Q2567k35664l95528l89011l07275k64084k58695j55224
39799a761740N6416K28451M17567P88220R68526L05954q02007q74281N01629J544147
39789A372882N99168j294991j808879o83797K35558J01500N1860P78119J209880
39780E61300N00372m41031n47800k91253n11698p62942k38743N68001O23124J50701
$$ y = [816844, -192117, -604868, -510134, 116886, 1042131, 1470849, 992869, 459946, 912545, 1846687, 1686732, 55422, -1510523, -1441331, 105765, 1720064, 2275172, 1629136, 376971, -655095, -961122, -653669, -116293, 464355, 913833, 823030, 172067, -124454, 742415, 1993238, 1920707, 220287, -1422255, -1507004, -509679, 127309, -36171, -304546, -159524, 161174, 243741, 8077, -387451, -776462, -1083737, -1347821, -1606516, -1761740, -1705324, -1476873, -1059306, -271086, 697440, 1003394, 201387, -672894, -171265, 1372882, 1972050, 677059, -1131820, -1815617, -1580059, -1478559, -1426699, -648580, 561300, 1061672, 620641, 72841, -218412, -730110, -1493052, -1731795, -1163794, -540670, -389969]
39770c89969K05008Q04753R12101J68378o25789q34144o92980n53140l66366j16840
39760a488988K9247J43411M05029N45797J93358k72738j17802M75988N69617M9536
39750E32455r9953N08781Q66447J36108r75873j250788n82861K27018N93818L04845
39740B59997o54907j575613j202875M75459J534733N88608r10223o34409J016376
39731a102854J530419L09598n17148J81092O71511m62539j663313r32021P88507
39722a196748J168326K45680L6722R39763J156711j40233j407961j182327r6091
39713d76158M34681J73949j69595j60568J18897L52689J08432o42526r95139m7336
39703a302674J487084J756710K28292j463234j622152m24347P84584J147367O80979
$$ y = [-389969, -184961, 619792, 1531893, 1700271, 1074482, 240338, -452642, -1005782, -1372148, -1488988, -1459741, -1316330, -911301, -365504, -172146, -444884, -562686, -86698, 482919, 532455, 432502, 941283, 1807730, 1943838, 967965, -282823, -865684, -638666, -44848, 259997, -394910, -1970523, -3173398, -2697939, -1163206, -574598, -1484821, -2119230, -1102854, 427565, 737163, 220015, 401107, 1072618, 610079, -1053234, -1985255, -1196748, -28422, 217258, 253980, 1193743, 2350454, 2210221, 802260, -380067, -476158, -41477, 132472, -37123, -197691, -78794, 273895, 382327, -260199, -1255338, -1302674, 184410, 1941120, 2169412, 706178, -915974, -1340321, -555737, 591630, 1272609]
39694A272609j23619n55004k76666N3895l62071r47989m05396R57761J286350
39685H99870J20944o55209J45949R91834K24723j067275q43660N23955R98043
39676A339174J80776m81791m03975m36034p36416l06568R16045J444266M57673
39667A973150q73936j069056j94827O41480P51535K25891m53301p00784k54210
39658D5942M54034P73257O18254K96778j16542n56049n79185q4157J28501m13619
39648E67214p11291K10450J289004P36477r85213j615810n58530L57770J9201
39639f90728l71285K32210P97164J83701p16381m90937M23167N89308j05741o07047
39629g56569n67319n40105o25939k91803N20352J165528J205122P96671K30507
$$ y = [1272609, 1148990, 593986, 317320, 371215, 9144, -938845, -1344241, -386480, 899870, 1020814, 365605, 511554, 1503388, 1728111, 660836, -182824, 341131, 1339174, 1519950, 1038159, 634184, 198150, -538266, -844834, 71211, 1515477, 1973150, 1099214, 30158, -164669, 476811, 1228346, 1454237, 1000936, 300152, 45942, 499976, 1273233, 1891487, 2188265, 2071723, 1515674, 936489, 852332, 980833, 567214, -144077, 66373, 1355377, 2091854, 1106641, -509169, -1067699, -709929, -690728, -1062013, -829803, -32639, 151062, -565319, -1056256, -633089, -43781, -149522, -756569, -1323888, -1863993, -2489932, -2781735, -2261383, -1095855, 109267, 905938, 1136445]
39620A136445l19036o60275o60293l76569Q4526N74060P12926K24771m56492n76056
39610c15993j53502R3272j7589K4197K16175o7615o44450l88350Q31169J482322
39600A059636N63137q10025j081356l99739O8257k7562k57760m03298k78841N45408
39590a022143J717695J772552J02408j669473j685000l70749M99261M24192K24256
39581g001J66456j66240n36316k95282K55996K79068p6601j1920L91755M70062
39571D69977L97090P03651Q20043r0709j226297j091626j00733J941p42400m93075
39561a352138R42456J355986j89851j496153n90548J180609J343650l3025r42492
39552B18494o33295j29315j16052j78321j4979P5291k1855n0678J8590M1621J83943
$$ y = [1136445, 817409, 157134, -503159, -879728, -795202, -221142, 491784, 716555, 260063, -315993, -469495, -376223, -393812, -369615, -153440, -221055, -865505, -1253855, -422686, 1059636, 1622773, 812748, -268608, -668347, -600090, -627652, -885412, -1288710, -1567551, -1022143, 695552, 2468104, 2570512, 901039, -783961, -1154710, -655449, -231257, -7001, 159455, -6785, -543101, -838383, -582387, -303319, -379920, -391840, -85, 469977, 867067, 1570718, 2390761, 2300052, 1073755, -17871, -118604, -116663, -859063, -1352138, -409682, 946304, 756453, -739700, -1330248, -149639, 1194011, 1160986, 218494, -414801, -544116, -660168, -838489, -853468, -778177, -800032, -850710, -832120, -790499, -606556]
39541f06556N64052O72516Q848r09371j068526l98057J72539J10571q9898J48442
39531a395440O21779P75833N36352K91772K31260Q1320l97658q81987p94966j97910
39521a129645P7883m35302r74787m77479Q20112J524815Q94543k72612p78583
39512g51055l65535L75503Q15941O62940L4577n12851m50458K3895J99996j13227
39502h0274l40346p7600L59441N51157M92847K41288k80905p94220o44550K84721
39492b88441J183367J243619N28715l62012r75497j096786p25626k40797p1660
39483h05118n3121K82895P30383N76336j31611n10016k98437k55513o80069p84908
39473a929179j78979L19598J96817K36550Q96633J047836j64270j394632r22467
$$ y = [-606556, -42504, 630012, 638860, -270511, -1339037, -1737094, -1564555, -1453984, -1543882, -1395440, -773661, 2172, 538524, 830296, 1061556, 1142876, 745218, -136769, -931735, -1129645, -1051762, -1487064, -2461851, -2939330, -2119218, -594403, 300140, 27528, -751055, -1116590, -741087, 74854, 737794, 772371, 259520, -190938, -167043, 32953, -80274, -420620, -498220, -138779, 412378, 905225, 1146513, 865608, 71388, -573162, -288441, 894926, 2138545, 2667260, 2305248, 1329751, 232965, -492661, -733458, -805118, -858239, -575344, 155039, 731375, 599764, 89748, -208689, -464202, -1144271, -1929179, -2108158, -1788560, -1591743, -1355193, -458560, 589276, 425006, -969626, -1892093]
39464a892093M64882N81576o05629r24021L69523J313596M20762r82862r50457
39455b204723J69729O77516K98165J77401N88898M90746m71212j077818l09623
39446a660921J054997J462976O13313l77626n79637k34933q7775l43676n83445
39437g36727m09174Q5174M02200J41366m88089p49100k17915N91148Q49737N36507
39427E127L18519L50356N9888o38277r17707l93799Q2954j59181l39653M55716
39417a176057J444667J121322l48399j268347q46727K6143M99129P34206Q86957
39408A072894N91909l8417j84270L72278Q29789O94764L95177J94542k68851r34661
39398B725154j108928p65440p10951r91502o52590L55312P47610J49733q3806
$$ y = [-1892093, -1427211, -845635, -1451264, -2375285, -2005762, -692166, -271404, -1254266, -2204723, -2034994, -1357478, -1059313, -881912, -293014, 197732, -273480, -1351298, -1660921, -605924, 857052, 1470365, 1092739, 513102, 278169, 190394, -153282, -736727, -1145901, -1060727, -658527, -517161, -1005250, -1754350, -1972265, -1381117, -531380, 5127, 323646, 674002, 733890, 95613, -822094, -1215893, -1132939, -1292120, -1631773, -1176057, 268610, 1389932, 1041533, -226814, -1073541, -1047398, -548269, 185937, 1072894, 1664803, 1626386, 1442116, 1814394, 2644183, 3338947, 3734124, 3928666, 3659815, 2725154, 1616226, 850786, 139835, -851667, -1504257, -1148945, -401335, -251602, -335408]
39389c35408O65243R56814j39125j088890l63967Q53589O08852n96537q80605
39380c20034j71394J69182O8338M88731R97228K67204j176890j356169r8077O28743
39370e03138k3842o47611k64696K49582K60255N92537J513751J586459P056j619317
39360A151036j475325k09091K40819m30912q12058j42052P36608Q01812J66174
39351B7011k83303m4938M27198L03216m47409q17903j55055O85489M68859m97930
39341c34765p97170j20841L56996j7135m68634l08328N1856J90623M57768R45519
39331d4111R45984K77033n8563M79739Q13275o7490j237884j101710R5211N43069
39321F44553m85157j645483j452511j55154Q51761Q67059M64269L80040M91585
$$ y = [-335408, 329835, 1286649, 1147524, 58634, -305333, 548256, 1157108, 560571, -320034, -491428, -322246, -253908, 234823, 1232051, 1499255, 322365, -1033804, -1131881, -503138, -526980, -1174591, -1439287, -1189705, -929450, -336913, 1176838, 2763297, 2770353, 1151036, -324289, -533380, -292561, -723473, -1535531, -1677583, -940975, -139163, 27011, -256292, -301230, 125968, 429184, -18225, -836128, -991183, -305694, 163165, -334765, -1131935, -1252776, -895780, -912915, -1381549, -1689877, -1638021, -1447398, -989630, -44111, 901873, 1178906, 1120343, 1600082, 2413357, 2345867, 1107983, 6273, 101484, 644553, 159396, -1486087, -2938598, -3093752, -2241991, -1374932, -910663, -530623, -39038]
39312c9038L09604O7367M31589J088660P96698n50463j188530j7593J308258O41169
39302B847721j167213j376495L39150J359995K87210j046857q03031R1116J4720
39293E46316n50325k97269L54882J31952o76629p42328l5087K75833o2270j05968
39283a160893N10005R95428P20237m252n56530o18095k26977J66496k0980o47148
39273h42709p88913q5969O12140N86155K81992J84465k03151j101184j348637
39264b705811r9831J350179J226490L1146k96625N27409R79892M96108K04639
39255A713596O26530O93732k58283j224971j128434l67464O9339J5173q2072M3072
39245A00218M37911R65436J042894J77777r79888j104045n2895P71894L74999
$$ y = [-39038, 270566, 337933, 769522, 1858182, 2654880, 2104417, 915887, 898294, 2206552, 2847721, 1680508, 304013, 643163, 2003158, 2290368, 1243511, 440480, 531596, 546316, -4009, -301278, 53604, 185556, -491073, -1233401, -1268488, -992655, -1054925, -1160893, -650888, 344540, 1064777, 1060525, 503995, -114100, -341077, -174581, -195561, -842709, -1631622, -1717591, -1105451, -519296, -237304, -52839, -255990, -1357174, -2705811, -2805642, -1455463, -228973, -197827, -494452, 32957, 1012849, 1508957, 1713596, 2340126, 3033858, 2775575, 1550604, 422170, 54706, 124045, 139218, 57146, 100218, 538129, 1503565, 2546459, 2724236, 1744348, 640303, 587408, 1359302, 1734301]
39236A734301n68038r72398q39401p11146n11902J02240P94237Q84215L86523
39227B98631r828J26965N54905P45165L41413n85265j465249j626933r95998j86119
39217b802313K52487L75735M81453N67136M36710J19813r4012J8763L61936N63439
39207B81147L29729j65998m11906k02949R3486J02344o7620j55564j65560j29709
39197d92600O9149K76446Q9135k43687K04446J407076J720450Q9302j915431j910183
39187g05897p9517J104289M56225n56438l56614O72518J346864J322165P40283
39178C943878l69999j436272j362166j68281N74687l3907p69767k54121P62138
39169H86190O19044n51474j050874k24066P34169O49031k26781r19970r23358
$$ y = [1734301, 1166263, 193865, -645536, -1356682, -1868584, -1766344, -972107, -87892, 298631, 288803, 415768, 970673, 1715838, 2057251, 1471986, 6737, -1620196, -2616194, -2802313, -2549826, -2174091, -1692638, -1125502, -688792, -568979, -662991, -644228, -282292, 281147, 610876, 444878, 32972, -169977, -76491, 25853, -41767, -197331, -362891, -492600, -423451, -147005, -57870, -301557, -97111, 1309965, 3030415, 3119717, 1204286, -705897, -785414, 318875, 775100, 218662, -137952, 534566, 1881430, 3203595, 3943878, 3573879, 2137607, 775441, 607160, 1181847, 1147940, 378173, 124052, 886190, 1505234, 953760, -97114, -321180, 412989, 1062020, 835239, -84731, -1008089]
39160a008089m25151K8059Lk91576j07219O84561J085792L14430q22580r23671
39150a465441l9096M75706Q6634k32414K65874Q74201N85772l76118r57948p20751
39140a503581j91206J1012j26051j22180M50744J450304K066716J467962k59449
39131C244271j959255k364438j197021O22044J728314J431622L40156k76545l933
39122A565215J86935n60542j422247q82260Q15311J585841L84226j162829j053099
39113e43449K28850O48051k02152o85957P6210Q34746L34396p03047q46257j45189
39103a003798K44446j8526k35598o9684M9105j15864k56899j73974N0759M62120
39093a067913R89931R91388L4098j045434j044777k38141O1319k52987K1567R78257
$$ y = [-1008089, -1433240, -1405181, -1405178, -1696754, -1803973, -1119412, -33620, 280810, -541770, -1465441, -1504537, -1028831, -942197, -1174611, -908737, -34536, 551236, 175118, -782830, -1503581, -1694787, -1683775, -1809826, -1932006, -1481262, -30958, 2035758, 3503720, 3244271, 1285016, -1079422, -2276443, -1654399, 73915, 1505537, 1845693, 1569148, 1565215, 1752150, 1191608, -230639, -1112899, -297588, 1288253, 1672479, 509650, -543449, -314599, 333452, 131300, -554657, -478447, 356299, 690695, -12352, -858609, -1003798, -759352, -777878, -1013476, -1083160, -1034055, -1149919, -1406818, -1580792, -1530033, -1067913, -77982, 913406, 947504, -97930, -1142707, -1380848, -1319529, -1572516, -1550949, -572692]
39083e72692J052981k91198j288812n88493N34610L75206l71008p2930P79167
39074d43169M48910q20354j062720O5091P15175m1099q26120l64868O75222J102699
39064e51233Q50416L94737p7444k34586L34901J060130P72336l83188r83581p19067
39054D63421q34895j504962j037415J014676K241784Q18010j401406j590867j84346
39045b016000L40321k35568O6223J438229J643997q8589j429513m51021J473155
39036G41234J832235M26940r79396j357428j127289p76077k78955J91096J64857
39027a162783k75139l18291N40472J679694J930717R16343m77523j150037j063538
39018F19915r74655r95388l60908R60586J513940K82196j415374j419724K08392
$$ y = [-572692, 480289, 189091, -1099721, -1688214, -1153604, -778398, -1149406, -1222336, -443169, 5741, -814613, -1877333, -1812242, -1097067, -1138166, -1964286, -2329154, -1653932, -551233, 299183, 693920, 616476, 381890, 716791, 1776921, 2549257, 2166069, 1182488, 463421, -371474, -1876436, -2913851, -1899175, 342609, 1160619, -240787, -1831654, -2016000, -1675679, -1911247, -1845024, -406795, 1237202, 1148613, -280900, -731921, 741234, 2573469, 3000409, 2021013, 663585, -463704, -1239781, -1518736, -1327640, -1162783, -1437922, -1756213, -1215741, 463953, 2394670, 3311013, 2833490, 1683453, 619915, -354740, -1350128, -1711036, -750450, 763490, 1045686, -369688, -1789412, -1581020]
39009a581020J246004N06360o88913p72628j11015P5826k32394j72453L26752
39000a403481M70879m1631o23845p20884l47406K63237Q72199J096096O72915
38991B38079l1632k62551K36922Q89802R34172K17663o62528r04671l13179L51841
38981F93918J43321p78400j111107j26088J092728R54603l56068j007677j18368
38972f13138R39894N73562o29574p70353M79897J335146N15826r22187j222709
38963c13636m05259J18770j26718j91421M26587Q27264K10928p45165q71430j77930
38953a248010L50738K24831j18497j45650K03367O48500P52593K01461o15266
38944B54067p03140K26360J030934O05933l72777l70722N67192P74660m16778
$$ y = [-1581020, -335016, 171344, -517569, -1290197, -1401212, -1325386, -1557780, -1730233, -1403481, -932602, -974233, -1598078, -2318962, -2666368, -2403131, -1530932, -434836, 238079, 206447, -56104, 180818, 1070620, 2004792, 2222455, 1559927, 655256, 342077, 693918, 837239, 58839, -1052268, -1178356, -85628, 868975, 512907, -494770, -613138, 326756, 900318, 270744, -499609, -19712, 1315434, 1831260, 909073, -313636, -718895, -600125, -726843, -918264, -491677, 335587, 546515, -198650, -1070080, -1248010, -897272, -672441, -790938, -936588, -733221, -84721, 667872, 869333, 254067, -449073, -222713, 808221, 1414154, 1041377, 670655, 1237847, 2012507, 1595729]
38935A595729j532520j158033j578L50582j63084k43123O14214J411127J155232
38926B028546R3772q12712r88485n53765N074K38462O6738j75018j72662l0400
38916c00450j9140j06691p2530P2938J86227L60200P05893Q54473K80553p76814
38906A184659j294310o49529N74802J253398Q78115j66647j132900j405563p84816
38897a542791L18071J103939J103924N54704r4026o72264r65806m51180Q66857
38888B21428J696298O71272j542410k537108j135772R81660J541769O46166J45038
38879F88341O55168R51846L48516j71756J02980J79392q87749k027573j564034
38870a724869O6804P68115j50816j048298m93252P25375R75136J43367m54598
$$ y = [1595729, 63209, -1094824, -1096402, -745820, -908904, -1152027, -537813, 873314, 2028546, 2122318, 1309606, 321121, -232644, -227570, 10892, 77630, -97388, -270050, -300450, -319590, -426281, -498811, -425873, -239646, 120554, 826447, 1680920, 1961473, 1184659, -109651, -759180, -184378, 1069020, 1947135, 1780488, 647588, -757975, -1542791, -1224720, -120781, 983143, 1537847, 1443821, 771557, -194249, -645429, 221428, 1917726, 2588998, 1046588, -1490520, -2626292, -1644632, -102863, 543303, 688341, 1343509, 2295355, 2643871, 2472115, 2575095, 2754487, 1866738, -160835, -1724869, -1658065, -889950, -1040766, -2089064, -2582316, -1856941, -881805, -738438, -1193036]
38861a193036o9245N75232L85342p12787j680922j445357k028J506702J883864
38852g52235J028766j23151o60573l98233K96977Q51086O89275k76723j227131
38843e71942j098579R7478J177125J257096P25092L98416L57906J59974k96157
38834B206409p29005r68629r68676o49434j95389j04006m17342l88931M09691
38825a805312J145496P85535k59122o32584n1612L54335j02507o25755k55301
38816a446827O95515J210292R42403L39338j63293m45792n01128m55178n63479
38807c88149p87925o66978l025O66000P50809M35177K75618K76735J6094m89339
38797H5017p46436n79945k78558Q8811P44547J371367J031085m75316j736984
$$ y = [-1193036, -1262281, -687049, -301707, -1014494, -2695416, -4140773, -4142801, -2636099, -752235, 276531, 153380, -507193, -905426, -608449, 242637, 931912, 655189, -571942, -1670521, -1573043, -395918, 861178, 1586270, 1984686, 2342592, 2502566, 2206409, 1477404, 508775, -459901, -1109335, -1304724, -1408730, -1826072, -2215003, -1805312, -659816, 125719, -133403, -765987, -817599, -463264, -565771, -1191526, -1446827, -751312, 458980, 1401383, 1740721, 1577428, 1131636, 630508, 175330, -388149, -1176074, -1843052, -1846077, -1180077, -429268, 5909, 281527, 558262, 574356, 85017, -661419, -1241364, -1519922, -1431111, -686564, 684803, 1715888, 1240572, -496412]
38788d96412j118748J055116K531846J674746n92858j927359j325761j9304M20053
38779B01319L3302k7399O09930J075036O42511k85514q70073q44000m51584M9278
38769A32806L68078J61904m37630o86857j61173N55812O78026L06757M9415m7967
38759I19171l48197o78163m87804J20292M33536K28265l1083j15030k44558l20698
38749e24269P5453P43617R31051N72203M11365O02359L68402m80475r49630m76627
38739A273449P4361r0547l83622o4946L61783K25449Q2429N75040Q62038j06607
38729B808827j499850j661543p31561k24986l30323J76532J306967J458254J24393
38720A426710j133749j180077p66927o04127j644J275063J703556K85038j370203
$$ y = [-496412, -1615160, -560044, 1971802, 3646548, 3053690, 1126331, -199430, -218734, 201319, 234621, 207222, 817152, 1892188, 2534699, 2249185, 1379112, 535112, 83528, 132806, 500884, 662788, 225158, -461699, -622872, -67060, 610966, 917723, 967138, 919171, 570974, -107189, -594993, -474701, -41165, 187100, 156017, 40987, -203571, -524269, -448816, 294801, 1225852, 1798055, 2209420, 2811779, 3180181, 2699706, 1750076, 1273449, 1347810, 1257263, 873641, 808695, 1170478, 1395927, 1478356, 2053396, 2915434, 2808827, 1308977, -352566, -1084127, -1309113, -1639436, -1462904, -155937, 1302317, 1426710, 292961, -887116, -1654043, -2258170, -2259814, -984751, 718805, 1003843, -366360]
38711c66360j152030M45706J260307O70356j24934m85396q95723j282078p93282
38702b723434M16818R22041J20130p76651m97339O28013J400865J275419N51664
38693A317526k65214p64958p69257m96065k11422K57279J036594J403186N06487
38684B014156j029538j475961l91131O24343K94014m66611j86874P23034P55931
38675H61363p1721k20343P20854J187218J03224j293318j217331O1647P27225
38666H58818N7528q01589p17972l0086K74722k7074l64393k53667K54320P16189
38656c3204O33203l1850n65065k05726P55701J216220P50693N6138l50211q22213
38646A403686j424771j289537j15575Q08021L98902l87055j17586O06867J90511
$$ y = [-366360, -1518390, -1072684, 187623, 857979, 733045, 247649, -648074, -1930152, -2723434, -2306616, -1384575, -1264445, -2041096, -2538435, -1910422, -509557, 765862, 1317526, 1052312, 287354, -481903, -977968, -1189390, -932111, 104483, 1507669, 2014156, 984618, -491343, -882474, -258131, 35883, -430728, -617602, 105432, 861363, 789642, 569299, 1290153, 2477371, 2580595, 1287277, 69946, 131593, 858818, 916346, 114757, -603215, -633301, -358579, -385653, -750046, -1003713, -749393, -33204, 599999, 568149, 3084, -202642, 553059, 1769279, 2519972, 2576110, 2225899, 1403686, -21085, -1310622, -1426197, -618176, -219274, -606329, -723915, -117048, 73463]
38637G3463j020775j170186q5515M51156j22015k85230N88095J022883L11805
38628b36319p798R03169J286764j30185j491032p78304O00232J96030j110435
38619g67878n86641J437462J857816q7198j589978p94609O89394Q99807L12812
38610A370987P8253j12439o99542p66487K93040J110269J68635j716289k375747
38601b649320j099902Q12295J787936J273942j61725j216903q93155K81980P77883
38592a086969K02836j51235N27336J175340O01811n55656q80847l12593P7773
38583d02204j44293m56530m87302m06664l70101k83243K5355P18332J624167J909390
38573A726907R12921n62229r68112k88530j15735r73377j375421m65698L78673
$$ y = [73463, -947312, -2117498, -2203013, -1751857, -1873872, -2159102, -1571007, -548124, -236319, -244117, 659052, 1945816, 1815631, 324599, -453705, 146527, 342557, -767878, -1354519, 82943, 1940759, 1853561, 263583, -531026, 158368, 1058175, 1370987, 1449240, 1336801, 637259, -129228, 163812, 1274081, 1442716, -273573, -2649320, -3749222, -2936927, -1148991, 124951, -36774, -1253677, -2146832, -1864852, -1086969, -884133, -1035368, -508032, 667308, 1269119, 713463, -167384, -479977, -402204, -546497, -1003027, -1490329, -1896993, -2267094, -2550337, -2524982, -1806650, -182483, 1726907, 2639828, 2077599, 1109487, 820957, 705222, -268155, -1643576, -2109274, -1730601]
38564a730601R132l65966N63435J586914R95629k23317o807R94522L87869j610357
38554F00453k083732r495K108511K050329O33214m60762j138553j711379j389151
38545a400565K33160J702493J471018Q7583q15577p83473m73952k30997l6000
38536b46310j43209n43126m52198N25075J373821R56742k41035p85274k48241
38527A96245N64629R22848O92690p5262j096459j654940j290585m47668J56930
38518b031572L73481L30968N1073n7093O69031J697308J255270j011836k675174
38509a398544j611041O98625J229565n5486n02774O64579J196312j25755j291805
38500a196324m30070J095463R60867n29248j289575o97475J14131M61595O56756
$$ y = [-1730601, -1721469, -2087435, -1524000, 62914, 1058543, 835226, 828419, 1822941, 2210810, 600453, -1483279, -1492774, 615737, 2666066, 3299280, 2838518, 1699965, -11414, -1400565, -1167405, 535088, 2006106, 2093689, 1278112, 494639, 20687, -210310, -246310, -389519, -932645, -1384843, -859768, 514053, 1470795, 1229760, 444486, 196245, 760874, 1683722, 2376412, 2301150, 1204691, -450249, -1740834, -2188502, -2031572, -1658091, -1327123, -1276050, -1333143, -664112, 1033196, 2288466, 1276630, -1398544, -3009585, -2310960, -1081395, -1136881, -1639655, -975076, 221236, 95481, -1196324, -1626394, -530931, 429936, -99312, -1388887, -2086362, -1972231, -1510636, -853880]
38491h53880P59404N04897K48556N04689P86874L06291m60329l84188L34547L75579
38481B122440n05600j062111n74854J57671K45974j23149l67887k80152K02883
38472a84785R46629J159140J80645j103550j056224K11454P56765k25625j133865
38463d49416o13081L09753J76812l92487K53Q91945P12447m87700j157777q08218
38453a817469m33054l84211J65184J264624J565096M14247r40037j162567o49764
38444a977951n35185q01312m93852O56468J773908J878283Q40508n88392j402486
38435f50011j165908l64260K48410N36288P88214Q59750L03758o26272r99855
38426a069886m97729J16012J36547j98704l14753p8637L81448R26770J113741
$$ y = [-853880, -94476, 410421, 658977, 1163666, 1950540, 2256831, 1796502, 1412314, 1746861, 2122440, 1616840, 554729, -20125, 137546, 383520, 260371, -107516, -387668, -184785, 761844, 1920984, 2101629, 998079, -58145, 153309, 910074, 684449, -449416, -1062497, -752744, -575932, -968419, -968166, -76221, 636226, 148526, -1009251, -1817469, -2250523, -2634734, -2469550, -1204926, 360170, 774417, -165620, -1328187, -1977951, -2513136, -3314448, -3808300, -3151832, -1377924, 500359, 1340867, 752475, -650011, -1815919, -2180179, -1931769, -1395481, -607267, 252483, 556241, -70031, -1069886, -1567615, -1451603, -1315056, -1513760, -1828513, -1907150, -1525702, -598932, 514809]
38417E14809M07819q61616j505660r40372O1469N69812O52278P42244P12435L74869
38407G28087J41959K90075K52837l69943p72368r1485R41944Q81760j71484o62044
38397A169338J0894O43137K08415o09097o14714J09723M93409K694q75387j353132
38387h14720r71031K12920J536085K025132J244486k12202j332293j616299j206612
38378a134534m32192L68153P93286O33903J67497j15775m8500J89511M36235N94618
38368A452202M42861j40860p54819p54368j02565M75325L83427j92024p35892
38359G3287j029931r59211k32762J024089J764419J020592o18799j451750p98667
38350a208733J85175K49675k68282k42865M23479P83673L97023r4891o3443K21560
$$ y = [514809, 922628, 61012, -1444648, -2385020, -2323551, -1753739, -1101461, -359217, 353218, 728087, 870046, 1160121, 1412958, 1043015, 270647, 179162, 1121106, 2002866, 1831382, 1169338, 1180232, 1823369, 2031784, 1422687, 807973, 917696, 1411105, 1413799, 538412, -814720, -1785751, -1572831, -36746, 1988386, 3232872, 3020670, 1688377, 72078, -1134534, -1566726, -1198573, -405287, 228616, 396113, 280338, 231838, 421349, 857584, 1452202, 1895063, 1754203, 999384, 245016, 142451, 617776, 1001203, 809179, 73287, -956644, -1915855, -2148617, -1124528, 639891, 1660483, 1041684, -410066, -1208733, -1023558, -773883, -1042165, -1285030, -861551, -77878, 319145, 224254, 160811, 382371]
38340C82371J46327l07955o12912m87889k53241k80560l36635J17236R03220J012995
38330B82957N3865p88037k64743Q39981O27475q79922j451326j0419J634024J617165
38320A661020P26299N28568M79730p03218k000425j310387P67945J360959k87005
38311A223486j680227r89615N19768J011752O65991M20720J65466l49207n08149
38302D79985j41588k51467j087343j173871K15219J317619M98358q97949n27078
38293a568115J207030J766430L02801j389037j653407p74541J63447O24104N25755
38284g95533o435n07709n43215k10657K21466P51947J194161J021261L19323n2030
38274A392579O873n80610j925475k196642l78827J544444J282690j98715l27130
$$ y = [382371, 528698, 220743, -392169, -880058, -1133299, -1413859, -1750494, -1633258, -730038, 282957, 336822, -451215, -715958, 124023, 751498, -128424, -1579750, -1590169, 43855, 1661020, 2387319, 2915887, 3395617, 2692399, 691974, -618413, 149532, 1510491, 1223486, -456741, -1446356, -926588, 85164, 751155, 1171875, 1337341, 988134, 479985, 338397, 86930, -1000413, -2174284, -1959065, -641446, -143088, -1041037, -1568115, -361085, 1405345, 1708146, 319109, -1334298, -2108839, -1945392, -1321288, -795533, -801968, -1309677, -1852892, -2063549, -1842083, -1090136, 104025, 1125286, 1444609, 1392579, 1399452, 818842, -1106633, -3303275, -3682102, -2137658, -854968, -1053683, -1380813]
38265a380813Q63538J070877k01485r91379m31592L4740l81676m16440O33139
38256a201091J327444M78360q18968r41174j3485P84070R24584N61634r150k09029
38246H83195L17203O53563m10192k041830k008950k27900P25912k64640q59206
38237c232845P80969K533325J501870j179057j921920j06864J338784O38741o23182
38228b70179n73895K89754O17381L80696K10740k2708o35468j071144o50865J74800
38218a550888L69364j99775o79427m96460L0146L72497M93877O44045Q08748O88603
38208D80730J81496l42640l79165J56603Q17246J036287N84667k59216q30925
38199A445083n50586L95862R61685K82941j161508j913534j196501K29094J059493
$$ y = [-1380813, -517275, 553602, 352117, -639262, -1070854, -1036114, -1417790, -1834230, -1201091, 126353, 604713, -214255, -1155429, -1168914, -384844, 539740, 1101374, 1092224, 883195, 1200398, 1853961, 1443769, -598061, -2607011, -2834911, -2108999, -2373639, -3232845, -2451876, 81449, 1583319, 404262, -1517658, -1624522, -285738, 353003, -270179, -844074, -554320, 63061, 443757, 654497, 631789, -3679, -1074823, -1725688, -1550888, -1181524, -1381299, -2060726, -2557186, -2527040, -2154543, -1660666, -1016621, -207873, 480730, 662226, 319586, -59579, 97024, 914270, 1950557, 2535224, 2276008, 1445083, 894497, 1290359, 2252044, 2534985, 1373477, -540057, -1736558, -1507464, -447971]
38190d47971Q57106J73553l57519o06190p17103o36937o5689J017700J854384
38181A071334J397010l19193j721502j342807K52649J044479J21019j252351j472331
38172b221693o10240J14519K33753M11188J038065J411566P71210l95395q27045
38163g4072k22184L08030n7646m80086K21452J402676J261919k98071j256578
38154H05440n64813J96337m69180j312826l48612J696583K260497O80048j217780
38145A725694j985854j801431r53605N79055J827769J416045p2294m83650N85685
38136H37414J106343J0985j076189o59507L00423L65226m0819M7407J67722m21846
38126F37159j029461p27053o0390R2509J86997Q54966J257230M26074p49145p75275
$$ y = [-447971, 409135, 582688, 225169, -381021, -1098124, -1735061, -1800750, -783050, 1071334, 2468344, 2149151, 427649, -915158, -662509, 381970, 502989, -749362, -2221693, -2831933, -2717414, -2483661, -2072473, -1034408, 377158, 1148368, 752973, -74072, -296256, 11774, -45872, -525958, -304506, 1098170, 2360089, 2062018, 805440, 240627, 436964, -32216, -1345042, -1693654, 2929, 2263426, 2943474, 1725694, -260160, -2061591, -3015196, -2436141, -608372, 807673, 735379, 251729, 837414, 1943757, 1954742, 878553, 219046, 519469, 884695, 843876, 891283, 1059005, 637159, -392302, -1119355, -1179745, -1087236, -900239, -45273, 1211957, 1638031, 888886, 113611]
38116A13611J2698J42973n28604q72019m84880P1893N71496J044182R17712j47562
38106H41500j084359p19019K67550L38547m81627r30004o96031m22178l0935R10832
38096b005724J560543P30654p76725j057061k24046j57098j004059p16838J227616
38087b422738K439177J299614m20959m56859M53258J69664j141231j349191J50306
38078a278959J536682J299745J32680m41898j23845K36908J13830r4529J02018
38069A482632M03595Q7476q34687j363195p29650N32512J209235Q15026r0489
38060A512455o95644n53447K33209Q97675N18229p48201j492725q47133K41700
38051i33882M87199K04608M27001Q02980J60099j163803j500198m48434N67482
$$ y = [113611, 126309, 269282, -259322, -1131341, -1616221, -1544328, -972832, 71350, 989062, 841500, -242859, -961878, -694328, -355781, -837408, -1767412, -2463443, -2885621, -2916556, -2005724, -445181, 285473, -491252, -1548313, -1772359, -1929457, -2933516, -3650354, -2422738, 16439, 1316053, 895094, 438235, 891493, 1061157, -80074, -1429265, -1278959, 257723, 1557468, 1690148, 1248250, 1124405, 1361313, 1475143, 1380614, 1482632, 1886227, 1973703, 1139016, -224179, -953829, -421317, 787918, 1602944, 1512455, 816811, 263364, 496573, 1394248, 1912477, 1164276, -328449, -1175582, -933882, -446683, -242075, 184926, 987906, 1148005, -15798, -1515996, -1964430, -1396948]
38042a396948O46793M88817O16182L63635n18244r26177j86584O07823K84712
38033a9991m86180k84712Q02291J328068N63781o20386r44993j94931N82924K73961
38023I99832q41114j208471p3516J231122J101319O6300k12498J98995j86159
38014A075810j228941j022475O55977J455289K04585j031465l77336P77155L90543
38005H99142o18657j74605J041743O30880j314541k195887j055552J96963J76097
37996b414417l0785P20435J509431J043203j24307n70792k33149k50836j000609
37987a351826j439745n20883J323146K411358J582762l68843j449425q09726L24436
37978b98746N02047l5099j72195J33906M0617m78044n39630R8347O71815O77732
$$ y = [-1396948, -750155, -261338, 354844, 718479, 200235, -725942, -912526, -304703, -19991, -506171, -790883, 11408, 1339476, 1903257, 1282871, 337878, 142947, 725871, 999832, 158718, -1049753, -1123269, 107853, 1209172, 1275472, 1062974, 1261969, 1075810, -153131, -1175606, -519629, 935660, 1140245, 108780, -268556, 508599, 899142, 280485, 105880, 1147623, 1778503, 463962, -1731925, -2787477, -2590514, -2414417, -2445202, -1724767, -215336, 827867, 703560, 132768, -100381, -351217, -1351826, -2791571, -3312454, -1989308, 422050, 2004812, 1635969, 186544, -623182, -298746, 203301, 168202, -3993, 129913, 170530, -307514, -847144, -748797, -76982, 600750]
37968F00750M04690J18273k51193n41354m51045k14156k57502l27620J7485L18113
37958e83559j10381o59694j37616J067463J270032J40734p39267m44433K4657
37949a72064j98633l39263L32028R03096L33652o46258o24471L47718J023952
37940I59757P58687n8558p98052r40951k83564M84165K41625q43096j167415q1452
37930a728854R34098O04199q1137L27406J219701J086211J19385l71688k99228
37921A810093m63363o11608l7265M87587k66544j471113j226334K25868R02369
37912f50310N26023O75670J408935R55292o61637j080832K34307P15328q21759
37903A301017j829826m02133J280025P40580n04321P7357J283142M69024j254905
$$ y = [600750, 1005440, 1123713, 872520, 331166, -119879, -334035, -591537, -919157, -901672, -583559, -693940, -1353634, -1491250, -423787, 846245, 986979, 247712, -196721, -172064, -370697, -709960, -377932, 525164, 858816, 212558, -411913, -64195, 959757, 1718444, 1659886, 861834, -79117, -362681, 121484, 363109, -479987, -1647402, -1728854, -794756, -190557, -271694, 55712, 1275413, 2361624, 2481009, 2109321, 1810093, 1346730, 735122, 697857, 1185444, 918900, -552213, -1778547, -1552679, -650310, -124287, 551383, 1960318, 2915610, 2253973, 1173141, 1407448, 2122776, 1301017, -528809, -930942, 349083, 1089663, 585342, 662699, 1945841, 2414865, 1159960]
37894A159960o58779J727898K065121m82104k397148j547692q1063j83337p18666
37885a115810p8475P84697M86174j15928K90999R63670N71702m31374q91952r33535
37875d69832r98073m29423J023297J748399M85728j234201j139425K89075P28481
37866D026l02977j080584o17394L15172R79684J360300J087267k42338j534644
37857c1488j033384R47479K011616R31506p84583j191955k48091Q16284J117561
37848B534945M74729o43700j032183J18367J571578J049147j465187l086936j769063
37839b248303Q54914J809091P00124m38128l68829K26544N46273O75073N65230
37830B321989l20343j712579k189973j008948O22068J046073L21120j39006K56458
$$ y = [1159960, 501181, 2229079, 4294200, 3812096, 1414948, -132744, -213807, -397144, -1115810, -1194285, -409588, 76586, -39342, 251657, 1215327, 1787029, 1355655, 463703, -469832, -1467905, -1897328, -874031, 874368, 1360096, 125895, -1013530, -724455, 4026, -298951, -1379535, -1996929, -1681757, -702073, 658227, 1745494, 1503156, -31488, -1064872, -117393, 1894223, 2825729, 2041146, 849191, 601100, 1417384, 2534945, 3009674, 2365974, 1333791, 1452158, 3023736, 4072883, 2607696, -479240, -2248303, -1393389, 415702, 1115826, 677698, 308869, 535413, 1081686, 1756759, 2321989, 2001646, 289067, -1900906, -2909854, -2287786, -1241713, -920593, -1059599, -803141]
37821h03141O13046J82555m36270l28138K73879M34352N4684j9199N51816R75444
37811A499028N12851m40630r83807q90048n69282k34128K08338N59325K82188
37802e6165p35579j681377j375249M84737K577214K851783P32242j790986k126786
37793a120166j66243J628612J462125K70054j40250K76095K86064l97450q94424
37784A204417p72392m75693k43497J84971P57870J012990Q05464L14031m71893
37775B316268j394197j649813p98029J47849q412o20411r7223J310657J599286
37766H05975K19585q59009j71436J024677Q74750k44234o51637q5850K40885j96987
37756I56719o23979m26500M6895K80226K74522K80613M23595O01627M14853m89992
$$ y = [-803141, -190095, -7540, -443810, -771948, -498069, -63717, -9033, -28232, 523584, 1499028, 2011879, 1571249, 587442, -302606, -871888, -1106016, -897678, -338353, -56165, -791744, -2473121, -3848370, -3363633, -786419, 2065364, 2797606, 1006620, -1120166, -1286409, 342203, 1804328, 2074382, 1934132, 2210227, 2496291, 2098841, 1204417, 432025, -43668, -287165, -102194, 655676, 1668666, 2474130, 2788161, 2316268, 922071, -727742, -1525771, -1377922, -1386334, -2006745, -2103968, -793311, 805975, 1025560, 166551, -4885, 1019792, 1894542, 1650308, 998671, 912821, 1153706, 956719, 332740, -93760, -46865, 233361, 507883, 788496, 1212091, 1813718, 2228571, 1738579]
37746A738579j608219j683493k96368J224849J369215M40832o8526K51471L82954
37737A751294k16371p31134m42990O6229j29686r18432j436287j205910l87667
37728c650954O07030J172528P37438l23433n47124Q31637K312423J671230q59621
37719A951154k417601j165368J187112J674298n5161j683940j587564n20811K12736
37710b405145O00242J144461J502909J026325l025o76685o66291l56839p0497
37701I5455J38341J31313k24803p12978r54950q01646k58552O21328J439343J526312
37691I99163P80029k3230k23978q1444p9972o5516K22581L58888j28086p40158
37681A018277n79756K95072R51038Q80927M69671K48113K85220K18065m71532
$$ y = [1738579, 130360, -1553133, -1849501, -624652, 744563, 1185395, 1116869, 1368340, 1751294, 1534923, 803789, 360799, 427028, 297342, -621090, -2057377, -3263287, -3650954, -3043924, -1871396, -1133958, -1457391, -2004515, -1172878, 1139545, 2810775, 1951154, -466447, -1631815, -444703, 1229595, 1174434, -509506, -2097070, -2617881, -2405145, -1804903, -660442, 842467, 1868792, 1865767, 1189082, 522791, 165952, 95455, 233796, 365109, 140306, -572672, -1527622, -2329268, -2587820, -1966492, -527149, 999163, 1779192, 1755962, 1531984, 1450540, 1370568, 1305052, 1527633, 1886521, 1758435, 1018277, 438521, 733593, 1684631, 2565558, 3035229, 3283342, 3568562, 3786627, 3315095]
37672C315095j817961k719011j769362O28000K035105R35526j070906j436550
37664a900064j42855P71777N21580K47116M94944L15877o04266r80723o0795R54754
37654c82655P89305O3018J02464P74647Q81471J26168o08982p04316m17659r8467
37644E24994K45985M37440K9073q44627j157534k36231J016673J088709R4646
37635A199128j63393R86927J590492o2364k148577j361656J988222L823118J971960
37626G823857r02350j561606o10768l78661q03572m27429K51332k51595j170684
37617A968524n98779Q06964O55554q75266j090905N82710J514667K92884j022740
37608B233613m68136P90086P13077m95511j279990j112853m84163J93873N04112
$$ y = [3315095, 1497134, -1221877, -2991239, -2363239, -328134, 607392, -463514, -1900064, -2042919, -1271142, -749562, -502446, -7502, 308375, -295891, -1276614, -1337409, -382655, 406650, 469668, 572132, 1346779, 2228250, 2354418, 1745436, 1041120, 623461, 524994, 770979, 1208419, 1237492, 392865, -764669, -1000900, 15773, 1104482, 1199128, 1035735, 2022662, 3613154, 3550790, 1402213, 40557, 2028779, 5851897, 7823857, 6921507, 5359901, 4749133, 4370472, 3566900, 3139471, 3390803, 3139208, 1968524, 1369745, 2176709, 2832263, 1956997, 866092, 1448802, 2963469, 3256353, 2233613, 1765477, 2555563, 3268640, 2773129, 1493139, 380286, -103877, 89996, 594108]
37599E94108L4403o53844l15206R98626J599267N28454j071006j655947j090227
37590a031372j43947N76676O78286J37385k38152L39896J238614J153969J58330
37581B869685n12862m96437l87784j15134P46273J353355N81601o25665l99353
37572C013679P96955Q20703m11390r32634m59929o91498j586929j026153J105632
37563F28436K187461J228273L29768O42556N83908n38423r17312Q4111L97099
37554D625877p71214j144206L89254J448800L75248p83108K0198J429753J463043
37545G053645O29055O2244m39875o75077L94963J825412J210835o69155k49528
37536I142519K396364K928842L77297p16484J695073L622249K673358K255348
$$ y = [594108, 628511, -25333, -340539, 658087, 2257354, 2785808, 1714802, 58855, -1031372, -1175319, -598643, 79643, 217028, -21124, 318772, 1557386, 2711355, 2869685, 2356823, 1860386, 1472602, 1357468, 2103741, 3457096, 4038697, 3413032, 3013679, 3810634, 4631337, 4219947, 3287313, 2827384, 2135886, 548957, -477196, 628436, 2815897, 4044170, 4373938, 5016494, 5600402, 5061979, 4144667, 4228778, 4625877, 3854663, 2710457, 3099711, 4548511, 4923759, 4140651, 4160849, 5590602, 7053645, 7682700, 7744944, 7305069, 6629992, 7024955, 8850367, 10061202, 9392047, 9142519, 11538883, 14467725, 14845022, 14128538, 15823611, 19445860, 22119218, 24374566]
37528B4374566M441489O056072N916565P668371J0907019R426728M106780N695145
37520G8592735J6809288K5408582K7992767M1940627P3719236Q9567171M9496639
37513D03527045l2000752r1406159q9718359n2846265k7195187k2469425j8805537
37506F9085361q726248l609153p409545j0037399o673737m124065n872767o240277
37498A6392170k343906O64076m65203k105953j599622j277413k090198j189940
37490E984011J570639J959348j186311l357096j865638M6617n95020j654776m31312
37481D70462J500417J337680m38151j511256j180518j60853R70545J559319R76264
37472C523909q9073k64288J85002k21673j324714j368112r6789P73964M94977
$$ y = [24374566, 28816055, 34872127, 40788692, 48457063, 59364082, 68790810, 72897590, 78592735, 95402023, 120810605, 148803372, 190743999, 264463235, 354030406, 403527045, 371526293, 280120134, 190401775, 137555510, 110360323, 87890898, 69085361, 60359113, 56749960, 49340415, 39303016, 32629279, 28505214, 22632447, 16392170, 14048264, 14712340, 14247137, 12141184, 10541562, 9264149, 7173951, 5984011, 7554650, 9513998, 8327687, 4970591, 3104953, 3151570, 2556550, 901774, 470462, 1970879, 3308559, 2870408, 1359152, 178634, 17781, 988326, 2547645, 3523909, 3434836, 3170548, 3355550, 3133877, 1809163, 441051, 344262, 1118226, 1613203]
37463A613203J40132J97388j38302q31195o46197N18936J191526P32197J41056
37454B918744P8962K9887k79108m36398m41005n56047k77373P76527J428723M41938
37444C684850j105264j213753j63686J87377k51197j6230O75268P4902j526289
37435C45978j574817O07707K311027J267632j244114k403920j315847O03113J544865
37426A41624R00875l33323o09836K10308O39677K9644k07367P86894J344851Q3664
37416B987011j218834m50489Q75292N3321j804092j379816R85383J626761k22419
37407A452118j215527K88016J676047Q76545l42468J04492J182061J009402j41945
37398D888741j078144j564736j420787j12608J391775R42862j223738k012624
$$ y = [1613203, 1753335, 1950723, 1812421, 981226, 335029, 853965, 2045491, 2777688, 2918744, 2997706, 3027593, 2748485, 2312087, 1871082, 1315035, 1037662, 1814189, 3242912, 3684850, 2579586, 1365833, 1202147, 1389524, 1138327, 1122097, 1797365, 1872267, 345978, -1228839, -621132, 1689895, 2957527, 1713413, -690507, -2006354, -1403241, 141624, 1042499, 709176, 99340, 309648, 949325, 978969, 771602, 1558496, 2903347, 2987011, 1768177, 1317688, 2192980, 2246301, 442209, -937607, 47776, 1674537, 1452118, 236591, 524607, 2200654, 3077199, 2734731, 2839223, 4021284, 5030686, 4888741, 3810597, 2245861, 825074, 712466, 2104241, 3047103, 1823365, -189259]
37390a89259j62935J493750M90446j387227j197337N59782J258564L14789p10519
37381D70054r69550q61708n70624o5053J79590r087J14055P72937Q69681j16169
37371a85874q97968m41041L07508K44039J0903M00232N52691l13283r69099j28501
37361a420393J078303Q81523r7044k6570Q93704R33122n6034n58027j50866M8737
37351A526455l16027l22580K32189L22975m01715r47225p11338l96897o08879
37342a623042q14826l77955L45013O26362M46010L45189N46183O97216M66006
37333F56156J20782K29585O76631M93338o97960j579536o60757J308331J982670
37324B529240O63470p84942p80706l3810J58869j05364k70306o53694j386702
$$ y = [-189259, -352194, 1141556, 1632002, 244775, -952562, -392780, 865784, 1180573, 470054, -499496, -1361204, -1931828, -1996881, -1817291, -1826378, -1712323, -939386, -69705, -185874, -1083842, -1524883, -1217375, -973336, -962433, -562201, -9510, -322793, -1291892, -1420393, -342090, 539433, 442389, 415819, 1309523, 2242645, 2186611, 1628584, 1477718, 1526455, 1210428, 887848, 1120037, 1443012, 1041297, 94072, -617266, -1014163, -1623042, -2437868, -2815823, -2470810, -1844448, -1398438, -1053249, -507066, 190150, 656156, 776938, 1006523, 1683154, 2176492, 1478532, -101004, -761761, 546570, 2529240, 3192710, 2407768, 1627062, 1593252, 1752121, 1646757, 1376451, 722757, -663945]
37315f63945j399165p1610J253610J053067q1143n32211q5074L84711O90979J019268
37305A568487P11937o70806j780038j041117O94947J176042J34074n38767J9583
37296B74342N02797q6219q18847n13050M59786Q98763L41950o74895j254113q18026
37286a687512K45280P70007L12821p6954M43325Q72435k6526j235937p23711J128865
37276B2093J751186K98178j083904o82635L70529L65112k83804k33384L57765
37267H81136L91674j14779k38997J09909J59599k60444m75218j43387K87561L55768
37257I52822J36174k7953O3250K76170K07021l06948p39955m98382K9848p0762
37247B1285o23572l80056Q99836J717214J030887q3894j57329M17931L36138l19554
$$ y = [-663945, -2063110, -2134720, -881110, 171957, 90814, -441397, -526471, -141760, 549219, 1568487, 2280424, 1609618, -170420, -1211537, -516590, 659452, 793526, 254759, 274342, 777139, 690920, -127927, -640977, -181191, 717572, 1059522, 384627, -869486, -1687512, -1442232, -672225, -359404, -436358, 6967, 879402, 852876, -383061, -1106772, 22093, 1773279, 2071457, 987553, 304918, 675447, 1040559, 756755, 523371, 881136, 1272810, 1158031, 919034, 1028943, 1188542, 928098, 452880, 309493, 597054, 952822, 1088996, 1061043, 1124293, 1400463, 1607484, 1300536, 560581, 62199, 92047, 21285, -602287, -982343, -82507, 1634707, 2665594, 2581700, 2424371, 2842302, 3178440, 2858886]
37237B858886m84609k47962o31232j401931j127745L01045J141427M74469l47182
37228E35166M5014Q72950O89802j57507k16090N65955P53431k29477j199602j028681
37218F30961j97231O2435n63169j269752j218384l40187P48023J298289R91022
37209A42007J72899m37980l62525K45641P35630N54529j13429m14516J20652P43214
37199A386122L60488p70110j181975l49388M36394Q2879n59854j81017P37060
37190c9401P71795L8430q0645N33983N13927m70589r90067k90679M52542K49298
37180F88594j09225K12914L67062o24448j829321j623407j33946J101135J312546
37171f38096R34026M27518L5584J86951Q38822R49212r3949j146580q63518O0787
$$ y = [2858886, 2374277, 2126315, 1495083, 93152, -1034593, -733548, 407879, 882348, 535166, 580180, 1453130, 2142932, 1985425, 1769335, 2335290, 3088721, 2859244, 1659642, 630961, 433730, 496165, -67004, -1336756, -2555140, -2895327, -2147304, -849015, 142007, 314906, -123074, -485599, -239958, 495672, 1050201, 936772, 522256, 642908, 1386122, 1746610, 976500, -205475, -554863, -118469, -35590, -595444, -776461, -39401, 732394, 770824, 690179, 1224162, 1738089, 1267500, 277433, -13246, 439296, 688594, 579369, 792283, 1159345, 534897, -1294424, -2917831, -3051777, -1950642, -638096, 295930, 723448, 759032, 945983, 1784805, 2734017, 2640068, 1493488, 629970, 690757]
37161F90757q5496j225336j601339n60415O35193R04165N20057l5623p09779j020650
37151b488466k05297J263150J802525R35854j6966l9069K07845j54273p11892
37142E93411o50622j03502L24682N67218Q05517Q38956M51310j26961o10677r68513
37132A120819j042699n51543K45939O27668M05141Q8568r2965m45117r26798j005593
37122a576580n99304j68206K51533R65055J489038R13664l52790p60206J493M40404
37112F04101k37840p92072j27265Q15843P00681k4712r5075M47102O00778J49024
37102B040565l12749n34275o34185m93425j20405l6865m18008n68030j14318J74708
37092a016987k49214n49197Q8460Q70929O56004p6784j21499K86470k0405q76219
$$ y = [690757, 605261, -620075, -2221414, -2781829, -2146636, -1242471, -722414, -758037, -1467816, -2488466, -2693763, -1430613, 371912, 1307766, 1290800, 1251731, 1459576, 1305303, 593411, -57211, -160713, 163969, 731187, 1536704, 2375660, 2826970, 2700009, 2089332, 1120819, 78120, -473423, -227484, 400184, 805325, 893893, 800928, 355811, -570987, -1576580, -2175884, -2344090, -2092557, -1127502, 361536, 1275200, 922410, 162204, 163697, 604101, 366261, -425811, -553076, 262767, 963448, 938736, 843661, 1290763, 1891541, 2040565, 1727816, 1193541, 559356, 65931, -54474, -91339, -509347, -1077377, -1191695, -1016987, -1266201, -1815398, -1726938, -856009, -200005, -276789, -398288, -111818, -132223, -1008442]
37082a008442q84987K30892J097144P77380l8441l35083p8186K35041L88367L49801
37072G33486N1481l55924m95763k28943J87921M14870K51184k49447o21762l24246
37062f37143M51069Q15920M00368j34410k50577l49969p66480q83670k17856M69891
37052a102857K93375k40840q7169N53558O33864K1968m58930m53247k76854K3252
37042a093880N56561P88513J35572q25015r95067m15189j2189P7380M92668J073924
37032b16722Q66919j54719q48087o57120k42405o2403K77610Q25303Q00955m0977
37022E48354p43465n44180M9416K54914J69470K12293K05824k10280p95718r99605
37012a852977o62435j6459N98303P44994J69100o16419o12071L91458J321667
$$ y = [-1008442, -1893429, -1662537, -565393, 211987, 173546, -161537, -239723, -4682, 383685, 733486, 784967, 429043, -66720, -295663, -107742, 307128, 558312, 308865, -312897, -637143, -186074, 629846, 1030214, 895804, 645227, 295258, -471222, -1354892, -1572748, -1102857, -809482, -1050322, -1137491, -583933, 49931, 71899, -387031, -840278, -1117132, -1093880, -537319, 251194, 386766, -438249, -1433316, -1848505, -1860694, -1783314, -1290646, -216722, 650197, 495478, -352609, -1009729, -1252134, -1314537, -1036927, -211624, 589331, 548354, -195111, -739291, -689875, -434961, -265491, -53198, 152626, -57654, -853372, -1852977, -2515412, -2531871, -1933568, -1188574, -1019474, -1635893, -2247964, -1856506, -534839]
37003e34839J068815j28318r67059n82058N25810J053778L56225p32213q62292
36994h02151R108M73593k80903j207219j025226j86727P8582p5034L88440J137060
36984a490477P47338o64699j177204m5733J001838M88471n22780k64625R75518
36975i52353J558357J012666J90424m77047j186733j523060p17361P29266J231702
36966a34139L81346l19325L00131J260783R48973l49853q65635q5571N00363q8982
36956A548091n56682N84304K133131J465434j338669k901080j140779J507312
36948A301062J428304r47639j898135k7553J802946R91108j003754j252775J02148
36939D95712M64662q11956j389295K25306K134447J742321m74035j716819q08663
$$ y = [-534839, 533976, 405658, -561401, -1143459, -617649, 436129, 792354, 60141, -802151, -793043, -319450, -600353, -1807572, -2832798, -3019525, -2940943, -3015977, -2627537, -1490477, -743139, -1407838, -2585042, -2630775, -1628937, -1140466, -1663246, -1927871, -952353, 606004, 1618670, 1809094, 1332047, 145314, -1377746, -2095107, -1365841, -134139, 247207, -72118, 228013, 1488796, 2437769, 2087916, 1222281, 1136710, 1637073, 1548091, 991409, 1575713, 3708844, 5174278, 3835609, 934529, -206250, 1301062, 2729366, 1781727, -116408, -143961, 1658985, 2650093, 1646339, 393564, 495712, 960374, 148418, -1240877, -1015571, 1118876, 2861197, 2387162, 670343, -138320]
36930a38320N17224M74034l76354n06179J16315L85255J25283J32776L64032j73620
36920I20446j420617j815628n88172R16317J179184N49448K08266K16866j3473
36911A52637k00452K78182R08031O86953r0120k51923K41376K84638m01361q57684
36901G50277o18785l35193l19362M8926Q73851J050418r3916j439379j340975
36892a424138K44151J679125J518360K003j295223j200066k61401K8250o07258
36883a316197p43791M78923J717361J292057k09522q69259l82339j18805m94347
36874f45919m27426L70740O91991K7415m60612M967N20618K19770k88993k37274
36864b24723n818l5827J93430R17717J102620K7390j226123j234365l16243J62498
$$ y = [-138320, 378904, 852938, 476584, -29595, 86720, 471975, 597258, 730034, 1094066, 920446, -500171, -2315799, -2903971, -1987654, -808470, -259022, -50756, 166110, 152637, -47815, 230367, 1138398, 1825351, 1735231, 1483308, 1724684, 2009322, 1607961, 750277, 131492, -203701, -523063, -474137, 399714, 1450132, 1356216, -83163, -1424138, -1179987, 499138, 2017498, 2019501, 724278, -475788, -737189, -708939, -1316197, -2059988, -1581065, 136296, 1428353, 1218831, 349572, -32767, -151572, -645919, -1073345, -702605, -10614, 16801, -443811, -438844, 81774, 301544, 12551, -224723, -230541, -266368, -72938, 844779, 1947399, 1974789, 748666, -485699, -801942, -639444]
36854f39444j36369m05990j32640M40879Q91737Q51968J65346n89569m66042M04626
36844C84502P15076l4358o68658l03508J78834k26229q52282o20348J05677M44113
36834h77181O22671J022415P74449p20110j903307r66454J080165J655899M73851
36825A162398l88514j12458r5033r50620j275201l10620N41674J14020n94084
36816a908438k40206P36524J199064J151326J133271R37596K44149m35485o25232
36807B192569p70559j188994j155071j80644Q14699Q41296L36183N3961l83107
36798E60333j276160j395722K24645J963178J484723n54627j304281j53620N08155
36789E6624m72397j034143L82512J860549J045097q61810r49302P40247J403843
$$ y = [-639444, -775813, -1181803, -1314443, -873564, 18173, 870141, 1035487, 445918, -20124, 384502, 1099578, 1065220, 396562, 93054, 271888, 45659, -806623, -1426971, -1321294, -877181, -254510, 767905, 1542354, 822244, -1081063, -2047517, -967352, 688547, 1162398, 773884, 661426, 566393, -384227, -1659428, -1970048, -1428374, -1314354, -1908438, -2148644, -1412120, -213056, 938270, 2071541, 3009137, 3253286, 2817801, 2192569, 1422010, 233016, -922055, -1102699, -288000, 553296, 889479, 943440, 560333, -715827, -2111549, -1886904, 76274, 1560997, 1006370, -297911, -451531, 56624, -415773, -1449916, -1067404, 793145, 1838242, 976432, 27130, 767377, 2171220]
36780B171220K1462j213851n25647R01358J113582J77282o26408r61028j227168
36771a69198j141761j68590J027337J064510j49166j097752o77597L73566O03168
36762c35483j87440q05891l70891N39137Q09578M28198M21895J112344J390737
36753C002184L50330j169130j678711j103685n05507j72720M29241R40852K54220
36744C47074j230463j465985K06863J700623J142850m42522j016327o25736o43158
36735b026781j004629m83553Q09355J414470Q93679K41101o0707m59619o91971
36726a368655K54427K033065K645700J089487j143519k043286j372615k34379
36718a39775N52216Q13305N90416J16897k68891n54685q87063r50970l21320N69093
$$ y = [2171220, 2192682, 978831, 453184, 1354542, 2468124, 2645406, 2018998, 1057970, -169198, -1310959, -1479549, -452212, 612298, 463132, -634620, -1312217, -938651, -335483, -522923, -1328814, -1699705, -1160568, -350990, 77208, 499103, 1611447, 3002184, 3352514, 2183384, 504673, -599012, -1104519, -1277239, -847998, 92854, 347074, -883389, -2349374, -2142511, -441888, 700962, 258440, -757887, -1383623, -2026781, -3031410, -3514963, -2705608, -1291138, -397459, -156358, -217065, -676684, -1368655, -1114228, 918837, 3564537, 4654024, 3510505, 1467219, 94604, -139775, 412441, 1225746, 1816162, 1933059, 1664168, 1109483, 222420, -728550, -1049870, -480777]
36708d80777P97285L28701k6796m1786k33854n59332l57883J93581Q7374o67238
36698i60725p66835K13409R01851K20697r51602j144464k20416Q93033J399078
36689d15974R02560m39893j457463q49611Q86814J741183R93185J75861M56312
36680A992974Q21207Q3844r66801r78040k40245J37298J08268J38805j44104j040435
36670h7229j447931k62943J561544K109810J159848J25117k01741k40076l07618
36661B408781k81028l74035q70485j256211q31053P8956O36984P95044R32414
36652A239367P66864n8118q52030p68370l15315m85362q71126l19301Q62054J127895
36642C26558R8085r08725q81116k19232L22243N12965L31789j03842k53419K14920
$$ y = [-480777, 316508, 645209, 618413, 576627, 342773, -216559, -574442, -380861, -293487, -960725, -1727560, -1514151, -612300, -391603, -1343205, -2487669, -2708085, -1815052, -415974, 486586, 46693, -1410770, -2260381, -1373567, 367616, 1360801, 1536662, 1992974, 2814181, 2898025, 1931224, 953184, 712939, 850237, 958505, 1097310, 953206, -87229, -1535160, -1798103, -236559, 1873251, 3033099, 3158216, 2956475, 2716399, 2408781, 2127753, 1753718, 883233, -372978, -1204031, -1125075, -488091, 306953, 1239367, 2006231, 1948113, 1096083, 327713, 12398, -472964, -1344090, -1663391, -801337, 326558, 424643, -484082, -1365198, -1584430, -1262187, -749222, -417433, -521275, -774694, -559774]
36632e59774O80699M45080m8102J2825L48057K09303j33856r964J93184j57147
36622I80305l78671L32107Q97544q6777j408294o95429J398129J699010m06343
36613B331581j799626o38106P94403Q3581j425284j195265L50468J011942N39823
36604E3517L95684P97985O43330j45863n29844l52780m06208o75177m10636J52268
36594d77724j2154p63869q03551J44304Q23243N13052M5784J67764L18918j11935
36584a56168n05432o2560O70947N09566n12259j102457n56215L16752M68652Q4498
36574h44676R3421N82225O09139k59676j105810r37240j57032J14341k18895k39961
36564b364164L19391O14697J66177l03637q1642M07422M35896K12325L94414Q27579
$$ y = [-559774, 120925, 566005, 517903, 530728, 878785, 1088088, 954232, 944268, 1137452, 980305, 601634, 933741, 1831285, 1744508, 336214, -359215, 1038914, 2737924, 2331581, 531955, -106151, 688252, 771833, -653451, -1848716, -1498248, -486306, 53517, 449201, 1247186, 1890516, 1744653, 1214809, 862029, 455821, -219356, -629992, -477724, -489878, -1253747, -2057298, -1912994, -1089751, -576699, -530915, -363151, -44233, -156168, -661600, -724160, -53213, 456353, -55906, -1158363, -1714578, -1397826, -929174, -844676, -751255, -169030, 440109, 180433, -925377, -1862617, -2019649, -1905308, -2124203, -2364164, -2044773, -1430076, -1263899, -1567536, -1649178, -1241756, -805860, -593535, -199121, 628458]
36554F28458P21697m4010o25518l66553L24408N27376k3091o04015l75326N56733
36544G20159J202869Q71857q9534r55437j475391j579333r01153M59669J231092
36535e15202L41787j213302j382125M483R63087M04570l87802j89988J25691n12153
36525b360954j019700K06502K220304K417768L29277j640140j623965n45729j68692
36516b185329m80822k68710O64048J233369P72087q8658l85819K813M49474M98226
36506B10679L40044L61499M82260K47923m07393q90247p27517k93780k80056o18475
36496a575063n62503J05174O09423K87493l51978k68588O26177J291203R60814
36487A122152J30757k19704N2852K72361N3036k74370l70354l66538m21253l71386
$$ y = [628458, 1350155, 1306145, 680627, 314074, 638482, 1165858, 1142767, 538752, 163426, 720159, 1923028, 2794885, 2705351, 1749914, 274523, -1304810, -2205963, -1746294, -515202, -173415, -1386717, -2768842, -2764359, -1801272, -1396702, -1784504, -1974492, -1848801, -2360954, -3380654, -3174152, -953848, 1463920, 1793197, 153057, -1470908, -2016637, -2185329, -2666151, -2934861, -2270813, -1037444, -265357, -354015, -739834, -737021, -287547, 210679, 550723, 912222, 1394482, 1642405, 1235012, 344765, -382752, -676532, -956588, -1575063, -2137566, -2032392, -1422969, -1135476, -1487454, -1756042, -1129865, 161338, 1122152, 1252909, 1033205, 1086057, 1358418, 1411454, 1137084, 766730, 400192, -21061, -392447]
36477c92447j49079n1029k48789m95813o26459p80980q10397k23546P67974J073354
36467a937211L71093q5680N45667R79597k25091j812675j236226J299358K733460
36458F32292J567117j19169j58935N51889J68147p90128n92046M34843L55143
36449B049153j053647j822086q30526O96058J256805R22162L78744l65523j279775
36440d8635j472823l49981J049989J178747J82163k90053M27840J019149L05470
36431B001866p66488n14920P07732Q14232q00342k084106j261380N58580J141537
36422b03289L45647k54338j74577k61036m35319L48240J630530J448781l73582
36413B071057j378119k09810J124076N23043q35073p55981J10369m10603j930671
$$ y = [-392447, -541526, -592555, -841344, -1337157, -1963616, -2744596, -3554993, -3778539, -3010565, -1937211, -1566118, -1651798, -1106131, -126534, -351625, -2164300, -3400526, -2101168, 632292, 2199409, 2080240, 1921305, 2473194, 2641341, 1851213, 1259167, 1694010, 2049153, 995506, -826580, -1657106, -961048, 295757, 1217919, 1596663, 1231140, -48635, -1521458, -1871439, -821450, 357297, 539460, 249407, 677247, 1696396, 2001866, 1235378, 720458, 1428190, 2242422, 1442080, -642026, -1903406, -1344826, -203289, 142358, -111980, -286557, -547593, -982912, -634672, 995858, 2444639, 2071057, 692938, 483128, 1607204, 2130247, 1295174, 539193, 649562, 238959, -1691712]
36404a691712j948351j28918J006891J52611q44510j55750J258984J466014L98536
36395d86205n93126p90287l79454L59186R63742P08151l28258q57668p2935R78743
36385d98111P99320l97255j104268o87793P5277M38663M83473M01044M8250m52636
36375h94036m96163J63152Q96995R70286M43128r0629l57848n42657p39604p80185
36365a427561o36962n24220m07839J23894J114085J763060J326461K75537k10851
36356A395604J01788K45271l47386r52736p83868j81347J73011L76876O68234
36347F95447M55272p22581j804326j303672L64312J202495M26127n70216m50372
36338a707514L10911O23249M47851L04049J04064m24700q21632m66774L20745
$$ y = [-1691712, -3640063, -3768981, -2762090, -2609479, -3453989, -3609739, -2350755, -884741, -486205, -1079331, -1869618, -2249072, -1889886, -926144, -217993, -546251, -1403919, -1476854, -498111, 301209, -96046, -1200314, -1888107, -1812830, -1374167, -890694, -489650, -441400, -894036, -1390199, -1227047, -330052, 640234, 1083362, 992733, 634885, 92228, -647376, -1427561, -2064523, -2588743, -2996582, -2872688, -1758603, 4457, 1330918, 1606455, 1395604, 1497392, 1742663, 1395277, 442541, -341327, -522674, -349663, 27213, 695447, 1150719, 428138, -1376188, -2679860, -2315548, -1113053, -686926, -1257142, -1707514, -1396603, -773354, -325503, -21454, 82610, -342090, -1163722, -1630496, -1309751]
36329a309751O78473M30219J25475N7428j4621k40854l86055j82957L58405R10076
36319D25838R42243K08828p21017r30951l88364l3508l00297m20134J89540P94993
36309b32829N61640M1833J92272N83426J24955q04445o95883N85247J387967P75282
36299B519465k29224n70289o97215j125460j000551L56092J603442R63999r15942
36290I04317j619282l98021Q96429O76625l08561n54545l0585K89964J41373J077
36280a209K6734P8703L58817R32617R95800j41728j532526j460981K0234Q96975
36270A73436Q2929r38730l91511J086013J499416N25768k74627r1467J20744l39867
36260A452104o12010M7380O56956P423j119465q93252P16974J721545R55245l85786
$$ y = [-1309751, -631278, -201059, -75584, -18156, -32777, -273631, -659686, -842643, -484238, 425838, 1368081, 1576909, 855892, -75059, -463423, -496931, -797228, -1217362, -1027822, -232829, 328811, 370644, 562916, 1146342, 1271297, 466852, -229031, 356216, 1744183, 2519465, 2290241, 1719952, 1022737, -102723, -1103274, -747182, 856260, 1820259, 904317, -714965, -1112986, -216557, 460068, 151507, -403038, -433623, -143659, -2286, -1209, 25525, 104228, 463045, 1395662, 2391462, 2249734, 717208, -743773, -723539, 173436, 256365, -682365, -1073876, 12137, 1511553, 2037321, 1762694, 1671227, 1791971, 1452104, 840094, 887474, 1544430, 1551853, 432388, -460864, 256110, 1977655, 2932900, 2547114]
36250B547114o96775j61554K5341k93764k73572K52725M44167r2603o03470l59947
36240G87662K37745K92558l05335p99611o19559o0369J55472k24845o83046n77674
36230a797002o651K62859j50266o42020m46481L10502R46607J272234J488060
36221A237842J267609Q8987j390007j590858k41455Q66615L04069q68916p10507
36212a036621O61138J376873P28937k0540O0988J97808m52454j197375r41157
36203f22403O167L94559j98722j049249j412976j124489l04919P24798J343953
36194b243281J140277M97026J41932K01256K06238r5275m73434o51827m94445
36185a771533Q9153Q70233J131257M57199m50638n50779K3469J71551l82115o28921
$$ y = [2547114, 1850339, 1688785, 1714126, 1420362, 1146790, 1399515, 1843682, 1751079, 1147609, 787662, 1025407, 1317965, 1012630, 213019, -406540, -466909, -311437, -536282, -1219328, -1797002, -1803653, -1540794, -1691060, -2333080, -2779561, -2469059, -1522452, -250218, 1237842, 2505451, 2594438, 1204431, -386427, -627882, 238733, 542802, -326114, -1036621, -375483, 1001390, 1730327, 1709787, 1770775, 1968583, 1516129, 318754, -622403, -616236, -221677, -420399, -1469648, -2882624, -4007113, -4312032, -3587234, -2243281, -1103004, -605978, -464046, -262790, -56552, -151827, -625261, -1277088, -1771533, -1682380, -812147, 319110, 776309, 325671, -225108, -201639, -30088, -412203, -1041124]
36175a041124j747N97226K71614l65315k44069L55744L62964j77408k28533L16381
36165a54267M06219k00753l38519M83345R10057j34356j380302r23318P27067
36156f04827J213363j69216j431107q24311Q04036J483353P20589m29869j017538
36147b55527q13522R5664J196645J416386K26398j272816j428601k18378O55953
36138c97798Q2897r90604r42042L25852J313382Q99949k54931o03781K45665R54768
36128F33357K58114j134515j328744R0412J338703R18076k92824m98014L13491
36119B98056O06448j22679o65594k09413M10832K32133l01008k75264J00203k9911
36109D3803n74713n56057K67021Q73199M49720l62840l56474M71543Q51271P3020
$$ y = [-1041124, -1042871, -445645, -174031, -539346, -783415, -427671, -64707, -242115, -470648, -154267, 251952, 51199, -287320, 196025, 1106082, 971726, -408576, -1331894, -604827, 608536, 439320, -991787, -1816098, -1012062, 471291, 1191880, 762011, -255527, -1069049, -973385, 223260, 1639646, 1866044, 593228, -835373, -1053751, -397798, -314901, -1305505, -2247547, -1921695, -608313, 291636, 36705, -567076, -321411, 633357, 891471, -243044, -1571788, -1481376, -142673, 775403, 482579, -15435, 298056, 904504, 781825, 116231, -93182, 317650, 549783, 248775, -26489, 73714, 43803, -530910, -1086967, -819946, 53253, 502973, 140133, -216341, 255202, 1106473, 1179493]
36099A179493q82844o51304N70880J276390P08418l27007q59441r08442q05975
36090f99832m15440K48860N34386J47691j64032J68960M87916J13727l12569J64
36080A09831L90884n9688n30051L45656J775789J594508k88200j573916j087684
36071F77129k79848m70527q35226l03670M98099O22554M82933O81340N88849l38365
36061A323268j064032m58994O84328P77629j54086p59889n04021n3072P0091p7464
36051b16242m14221p28639m84747K56918M02861n47759j255234l62715J155676
36042b194102J217949k04563j037673k19066R63381J052326L63713L5314K92328
36033B69607M87431K03771l29497n99853k95026L26966N59389R2205m18898j37589
$$ y = [1179493, 296649, -354655, 216225, 1492615, 2201033, 1874026, 1014585, 106143, -699832, -1115272, -866412, -332026, -184335, -348367, -179407, 308509, 422236, 109667, 109831, 500715, 441027, -89024, 256632, 2032421, 3626929, 3338729, 1764813, 677129, 397281, -73246, -908472, -1212142, -714043, -91489, 391444, 1072784, 1661633, 1323268, 259236, -199758, 484570, 1262199, 1108113, 348224, -155797, -208869, -138778, -216242, -630463, -1359102, -1843849, -1586931, -1184070, -1731829, -2987063, -3349778, -2194102, -976153, -1180716, -2218389, -2437455, -1474074, -421748, -58035, -22721, 269607, 757038, 960809, 631312, 31459, -263567, 63399, 622788, 714993, 296095, 158506]
36023A58506P34248J119021M48578o24694j019669m53987K26550n402r81834j276492
36013a675175q3534J317641J125086k56119p13073K63616Q36758K9236o02185
36004B42251K00709J089483N08659n29867l56216K99947k41611j384369j281946
35995a452960j70126K10019j61683Q3401O50271N8202j049650m90432J390388
35986i32570J790725J89821o69360L47897P07774j097575k398354o17737K245441
35977d33938K623085P19804n08552k30986j68884r12130j101566k71348K94041
35968I526n7017l47393J09846O06211M28286n8343k23998L346M44134Q86379Q79796
35957B680773J81207n86072n72128O8534M28442J73142k78376o92015j122797
$$ y = [158506, 892754, 2011775, 2460353, 1835659, 815990, 362003, 588553, 583151, -398683, -1675175, -1758709, -441068, 684018, 427899, -285174, -21558, 815200, 844436, 242251, 442960, 1532443, 2041102, 1511235, 1155019, 1454966, 1213355, -171014, -1452960, -1623086, -1413067, -1574750, -1491349, -841078, -782876, -1832526, -2322958, -932570, 858155, 1047976, 378616, 726513, 1434287, 336712, -2061642, -2679379, -433938, 2189147, 2908951, 2400399, 2169413, 2000529, 1088399, -13167, -284515, 9526, -47491, -394884, -285038, 321173, 749459, 691116, 467118, 470464, 914598, 1800977, 2680773, 2861980, 2275908, 1703780, 1772314, 2200756, 2373898, 2095522, 1403507, 280710]
35948B80710j213319m81917O36531J044940M40992l26958m95310j97831Q0597
35939b31565J31778l7476k70564j91890L44173P58329L54306n86163j016088n02506
35929a247666K75059N37889L14880J44219L33632O83064O58991r1732j091353
35920E16983j198372r795J208361Q69399p31401j589307o30879Q11720Q09989
35911E6698o02905j588197r43310N15021J177907N78523l66434p04142m19457
35902b296296k1426K58897M61828M64452J46475j18937K20577R70172J165028
35893A250770K88141r19360j250872l90845Q37590J416540J067608L25698j47782
35884B477488k73896m62118p81227o60930J68464Q93963N58363m53529q16383
$$ y = [280710, -932609, -1414526, -777995, 266945, 707937, 380979, -114331, -312162, -231565, -99787, -137263, -407827, -599717, -255544, 502785, 857091, 270928, -745160, -1247666, -972607, -434718, -119838, 24381, 358013, 1041077, 1700068, 1608336, 516983, -681389, -691184, 517177, 1386576, 655175, -934132, -1565011, -753291, 56698, -546207, -2134404, -3077714, -2562693, -1384786, -806263, -1172697, -1876839, -2296296, -2317722, -2058825, -1596997, -1132545, -986070, -1105007, -884430, 85742, 1250770, 1538911, 619551, -631321, -1022166, -184576, 1231964, 2299572, 2625270, 2477488, 2203592, 1741474, 960247, 299317, 467781, 1361744, 1920107, 1466578, 650195]
35875F50195j51492M86431K11686n76441j035142r36621m50658K97453R71561
35866e33028J078055P05984M77437M59589O8422o09618o12681J83685M77310m17377
35856A277778j251192q01760O9242r9703q24045n14118P15520J130181K04186
35847i3911n81826j37362P22793Q10682K85628N0303L43407O58757N06700j80200
35837B384971r49137j008968r9548Q36341O47035l59126p23949L6833P31932L17327
35827A813711o57462j064317p35923k15718K67047O78472O00518k44991j172000
35818g30663j165919l02941K84641j3366m68751j21166Q29969J280012O84137
35809B75953k70149n92314j90428K18953J97944O3061J98979M18598L38975K9676
$$ y = [650195, 498703, 985134, 1196820, 620379, -414763, -1351384, -1802042, -1504589, -533028, 545027, 1251011, 1728448, 2188037, 2256459, 1646841, 1034160, 1217845, 1695155, 1277778, 26586, -775174, -705932, -805635, -1629680, -2143798, -1428278, -298097, -93911, -675737, -813099, -90306, 720376, 1006004, 1056307, 1399714, 2058471, 2565171, 2384971, 1435834, 426866, 327318, 1163659, 1810694, 1451568, 727619, 764452, 1496384, 1813711, 1156249, 91932, -643991, -859709, -592662, 85810, 686328, 441337, -730663, -1896582, -2199523, -1914882, -1928248, -2396999, -2518165, -1688196, -408184, 275953, 5804, -586510, -776938, -557985, -360041, -296980, -98001, 320597, 659572, 689248]
35799F89248j37033o1398O2397J23437R3687j69027o49411q38113k27931Q25198
35789b88946J283909O67152l20437o88047l98810l16450r33174j521802r19932
35780c436537Q31573K104698J432351n57049j672186p76314Q58207J259934J94486
35771B39163q35990o91722J54651N55769K27248n8649L64108J078186J049728
35762B082492M5692r00274q35597k29304j91664o94301o95018J0072M11842Q7884
35752i08176l7593N86649J013005L73844n90183p19599j40526L78126P57929J058449
35742A771925O69920m94285j084829k73754M72917m20266j743887j263060M41521
35733a923798Q23432k97004n50726N67189O48707j160712k106377k13401K225702
$$ y = [689248, 552215, 490817, 553214, 676651, 770338, 601311, -48100, -886213, -1114144, -288946, 994963, 1662115, 1341678, 653631, 254821, -61629, -994803, -2516605, -3436537, -2604964, -500266, 932085, 375036, -1297150, -2073464, -1215257, 44677, 239163, -596827, -1288549, -1133898, -578129, -350881, -409530, -45422, 1032764, 2082492, 2128184, 1227910, 392313, 163009, -28655, -722956, -1417974, -1407902, -996060, -908176, -945769, -359120, 653885, 1027729, 437546, -282053, -422579, -44453, 713476, 1771925, 2441845, 1947560, 862731, 588977, 1061894, 641628, -1102259, -2365319, -1923798, -1100366, -1397370, -1948096, -1380907, -732200, -1892912, -3999289, -4212690, -1986988]
35724a986988K118717K16118n88501J06889L53115m06807q03357l92618k61247
35715a644679o79921n54560M24783J116591Q51467L10829Q6022j07179m20141
35706f16788m71856k33207l5028L56337J258824J755056O09250j396511k001912
35697g75835p12115N35039N12987K88663O92773N49759r50749k161471j338993
35688c359942M47585R82237K67219q7315J36226r6444n28727J03925J372454J406287
35678F43505J26292l98812N10745Q52907o39030k178905j709986n8625O53584
35669b198325K46660K0710J65243j25720n76398r4241J043699J290976K71187
35660D3791o55441n59078m8307K03298M74343Q95046P43568k60139j057821o42894
$$ y = [-1986988, 131729, 347847, -240654, -133765, 219350, -187457, -990814, -1383432, -1644679, -2324600, -2879160, -2454377, -1337786, -486319, -175490, -89468, -196647, -616788, -1088644, -1321851, -1356879, -1000542, 258282, 2013338, 2622588, 1226077, -775835, -1487950, -952911, -439924, -151261, 541512, 1091271, 140522, -2020949, -3359942, -2912357, -1930120, -1662901, -1750216, -1613990, -1710434, -2239161, -2135236, -762782, 643505, 769797, 370985, 881730, 1734637, 1095607, -1083298, -2793284, -2851909, -2198325, -1951665, -1930955, -1765712, -1891432, -2467830, -2562071, -1518372, -227396, 43791, -611650, -1170728, -1219035, -1015737, -541394, 353652, 1097220, 837081, -220740, -863634]
35650h63634M21750Q04837J90462n58115o47772r0553N40411N87038j70167j075090
35640h60833j072352k1969R19826P28850j29683m06289J96709P39407M34712l57690
35630A70688p31645l82723J80308M19289M09650N23700O84070M04528l18919p42044
35620F16902m41797r8757m64869r89038n19846P86944J477047Q86857K1206j01097
35610A173552J63538O0240j84310R2141P31550J015546P72667L70049r4509p75739
35600C324725j429884j521104r58188j95386L51572N69258M36945j8909n69823
35591a0794q58100o48835p228O03541N35340k88148r30138m17594Q32771J364267
35581A75082N88060n37646r57946o72801j10396N42771Q59818J93283j059655
$$ y = [-863634, -441884, 362953, 553415, -4700, -652472, -743025, -202614, 384424, 214257, -860833, -1933185, -1955154, -1035328, -306478, -436161, -842450, -645741, 93666, 528378, 170688, -560957, -943680, -763372, -344083, 65567, 589267, 1273337, 1677865, 1358946, 616902, 175105, 76348, -388521, -1377559, -1897405, -1110461, 366586, 1253443, 1274649, 1173552, 1337090, 1397330, 1213020, 1305161, 2036711, 3052257, 3824924, 4194973, 4100464, 3324725, 1894841, 373737, -584451, -779837, -428265, 140993, 577938, 559029, -10794, -868894, -1517729, -1524957, -921416, -386076, -674224, -1604362, -2021956, -1189185, 175082, 763142, 225496, -732450, -1405251, -1515647, -972876, -113058, 80225, -979430]
35572i79430j350400r3093J202142J041029J25885J5863N32383K51075r27865
35563a82411j558561r68937j26426Q9090M3682L08169O20208N03896J51007J25374
35553i94909N95593J138091J075029J03403j116952j376560m09916N38285L50629
35544i7307l52001k38407O14379R20302K50421m93277o96322p43340q37426m27049
35534b100027O16300J321816Q76024j53449n66629p2115N24727M66006q3723l34105
35524D94825J28216P74259P60530N3381n45643n80267m58007n04571l47763J88576
35514c6464M32055j02692p85922q45327n16682l11365J8970P07475J049336N24629
35504A34013k9932K06620M30634l29301j102670m49508P04908K48354j409861
$$ y = [-979430, -2329830, -2422923, -1220781, -179752, -53867, -38004, 494379, 745454, -182411, -1740972, -2709909, -2836335, -2747245, -2703563, -2395394, -1775186, -1271290, -1120283, -994909, -399316, 738775, 1813804, 1917207, 800255, -576305, -986221, -447936, -97307, -449308, -687715, -73336, 846966, 1097387, 604110, -92212, -835552, -1672978, -2100027, -1483727, -161911, 714113, 560664, -5965, -78080, 446647, 912653, 828930, 494825, 623041, 1397300, 2157830, 2211211, 1665568, 1085301, 627294, 122723, -225040, -36464, 395591, 292899, -493023, -1338350, -1855032, -2166397, -2147427, -1439952, -390616, 134013, 104081, 310701, 741335, 412034, -690636, -1140144, -435236, -186882, -1596743]
35495a596743j591929M11946K119062J675470L61788N8475M32344K06472n14920
35486A561965q31813o69076l55067L26408J327802J577517L65086j284602j822565
35477A95655j133588k68053J60321L33202M75275N80160N58825J93012n89246
35468E05563j174415p68612L45827R93879P32649J82883l75035j250311j894760
35459b702332j034048J007502J963954P47332p95258o23219N83198Q86816Q8543
35450A22488o04301q26363j007890q51828J59897J203544R67060j45539m47001
35441a429933M30680J063795N47489k95584m58962j78885j63075l58378k40622
35432a083475J98848M35627K45920Q4729M37151R64614P47562l82050j291126
$$ y = [-1596743, -3188672, -2776726, -657664, 1017806, 1379594, 1438069, 1870413, 2076885, 1561965, 730152, 61076, -293991, 32417, 1360219, 2937736, 3302822, 2018220, 195655, -937933, -1205986, -1045665, -712463, -237188, 342972, 901797, 1094809, 505563, -668852, -1437464, -1091637, -97758, 634891, 817774, 442739, -807572, -2702332, -3736380, -2728878, -764924, -17592, -812850, -1436069, -852871, 33945, 122488, -481813, -1308176, -2316066, -3167894, -3007997, -1804453, -837393, -982932, -1429933, -999253, 64542, 612031, 316447, -142515, -321400, -484475, -842853, -1083475, -884627, -449000, -203080, -118351, 318800, 1283414, 2030976, 1648926, 357800]
35423C57800r71195p191L57155J42848K44469M77552j20717j040741n78082J120873
35413a7229J677447J93003j076231l44548P62780J07090j203175p82690P83326
35404I9773Q84081o39116j250648o207J004131K22375j007023q51801K40505O41708
35394f62222O9096l98289r5331N86007J041421J164400J193686J172856P31989
35385D803613l69782j515429j660785p52427N1933J4621k55435j25849p9890n78331
35375d67761q83419k54536O35728P92752M77629L24500o8883j043462j439548
35366a927000k21005J348664J328888J82373j27152M58159K46614q68836j091792
35357f71087K911O78753J51069j94073L97746O37455j77895n91975L59271J135172
$$ y = [357800, -613395, -620586, -263431, -120583, 123886, 601438, 480721, -560020, -1138102, -17229, 1660218, 1853221, 776990, 432442, 1195222, 1302312, 99137, -683553, 99773, 983854, 344738, -905910, -912117, 92014, 314389, -692634, -1544435, -1303930, -662222, -593126, -991415, -1086746, -500739, 540682, 1705082, 2898768, 4071624, 4803613, 4433831, 2918402, 1257617, 505190, 557123, 571744, 316309, 190460, 110570, -467761, -1351180, -1605716, -969988, -177236, 300393, 624893, 556010, -487452, -1927000, -2148005, -799341, 529547, 711920, 584768, 1042927, 1289541, 420705, -671087, -668176, 10577, 161646, -32427, 365319, 1002774, 824879, 232904, 592175, 1727347]
35347A727347K33990j110659r02008M03433Q92782L61984J70703N35932L04006
35338B617510o25887q16137K73396J135727M11752j013055j254412j06345P49240
35329A371789J60280r71291j119811l07662J60349j71398l43867J88480N37924
35320d95207R536m95680L3788Q30636N37040m14005m34129N32608Q91815L6369
35310A032771p65142n06299J99055M44235K48815j23188p10090j140983o77083
35301a997909M39503R37199M17326K4762N30655J036867M89080o18223j043751
35292B15509n10428K39723M91036M1642p58855j052883k40761J015143J344907
35283G85033M30570o89710j181999j172158q15261O4605J084960J371498Q87903
$$ y = [1727347, 1961337, 850678, -51330, 352103, 1244885, 1606869, 1777572, 2313504, 2617510, 1991623, 1175486, 1448882, 2584609, 2996361, 1983306, 728894, 622549, 1371789, 1532069, 560778, -559033, -866695, -706346, -877744, -1221611, -1033131, -495207, -485671, -981351, -947563, -116927, 420113, 6108, -428021, 104587, 996402, 1032771, 267629, -238670, -39615, 404620, 653435, 530247, -179843, -1320826, -1997909, -1558406, -621207, -203881, -179119, 351536, 1388403, 1877483, 1259260, 215509, -294919, -55196, 435840, 477482, -281373, -1334256, -1575017, -559874, 785033, 1215603, 525893, -656106, -1828264, -2643525, -2578920, -1493960, -122462, 765441]
35274G65441M26848O1541q51055j866955j543763P7891J064195N43649N0378P22565
35264e49265J214874J02193j387964j117204O54287J715728R75318n96486j573927
35255e62446j286336K1455J160454Q58684m44403p28559P04355J850579Q68800
35246B442583j109438j736183p69041K43056N51466N26071K38208l28877l94440
35237c36595M14939P69086m81766j947958j439952N87020J696302J146712M53557
35228H61345M66065L88678j47382m09237k98964o00865j137233p71535L74157
35219a274971Q15385K64206J36062Q96041J076922j71461j546639j643673q21249
35210b269377n4784M63483O93859L17344k37589L1573P71891L98454j024707j242577
$$ y = [765441, 1192289, 1253830, 402775, -1464180, -3007943, -2930052, -1865857, -1322208, -1271830, -549265, 665609, 767802, -620162, -1737366, -1083079, 632649, 1607967, 1011481, -562446, -1848782, -1827327, -666873, 191811, -252592, -981151, -276796, 1573783, 2442583, 1333145, -403038, -1172079, -929023, -377557, 148514, 386722, 57845, -336595, 78344, 847430, 365664, -1582294, -3022246, -2435226, -738924, 407788, 861345, 1327410, 1716088, 1568706, 1159469, 860505, 259640, -877593, -1649128, -1274971, -459586, -195380, -59318, 836723, 1913645, 1742184, 195545, -1448128, -2269377, -2324161, -1860678, -1166819, -849475, -1087064, -1055491, -283600, 114854, -909853, -2152430]
35200b152430N75380J981149Q59445j182647j343752J44563R47302N48561L71267
35191G48838O23495j9843j521896j961613n32595J097661J245520L02328m48511
35182d66616o11550l98858J57749P52325N50609o44931j678110j363764n7284
35173c760430Q40267O38109L101l1183O90627J246397P13506n10281r21690Q9461
35163a002116J093656M88469j003401j247406R908O99118k19081j053218k85533
35154b519604P67416K02152j037818n82341J254307J718010P5814j123121j66204
35145a411389J186767Q33146k64854r2674P75867L29706j114468j292180J18986
35136i31093R37742J95792l91133L59738J003620J55455r18203m40046P78815
$$ y = [-2152430, -1577050, 404099, 1263544, 80897, -1262855, -1118292, -170990, 377571, 748838, 1372333, 1352490, -169406, -2131019, -2663614, -1565953, -320433, -18105, -466616, -1078166, -1477024, -1319275, -566950, -16341, -661272, -2339382, -3703146, -3760430, -2920163, -2282054, -2278953, -2310136, -1619509, -373112, 340394, -169887, -1091577, -1002116, 91540, 580009, -423392, -1670798, -1660890, -961772, -1180853, -2234071, -2519604, -1752188, -1550036, -2587854, -3170195, -1915888, -197878, -122064, -1245185, -1411389, -224622, 608524, 343670, 250996, 1026863, 1356569, 242101, -1050079, -931093, 6649, 202441, -188692, 171046, 1174666, 1330121, 411918, -28128, 750687]
35127G50687O98836n41367j005284k52908J64203m31635p51462Q5232R99379P57195
35117D72876j25576m16482o3739J07448r0736j45115N8350J07893m3755M7461
35107i1375M24036M49698k19012q97186o51154L67384R63667M39733m35786m73024
35097a23019K84191O92018K22010l48342k49099J30283J3376m74521n55675J6457
35087c92321P11395R45880N31262l29743j028510r11849j49623K38792k11898
35078e96615n96041L641R77311J055276K41183l23503j74212L8075j21632k82305
35068B21178j27305J58653L99220N01595J06045q48661j388478n63522Q35776
35059g05499J025718k10299j201822r02219j41931J37417L01726Q55179J277766
$$ y = [750687, 1449523, 908156, -97128, -350036, -185833, -617468, -1368930, -1283698, -284319, 472876, 347300, -69182, -132921, -25473, -116209, -261324, -202974, -95081, -138836, -91375, 332661, 782359, 563347, -333839, -984993, -617609, 346058, 785791, 350005, -123019, 161172, 853190, 1075200, 726858, 477759, 608042, 621418, 146897, -408778, -392321, 319074, 1264954, 1796216, 1466473, 437963, -473886, -623509, -384717, -596615, -1192656, -1189015, -211704, 843572, 1084755, 761252, 587040, 625115, 503483, 221178, 93873, 252526, 651746, 1153341, 1259386, 410725, -977753, -1541275, -705499, 320219, 109920, -1091902, -1994121, -2136052, -1998635, -1696909, -841730, 436036]
35050D36036J034895N73639L45553o0890q61908j284339q63113m01425n03193
35041a584745l23514Q50394J889306J359695p5160n92996K1553L99789L4986k09937
35031A769371K153k7685l87580j80555O72800Q82228j68808j189666p67418O28564
35021A233404J412886R28653j85394j132513j576856j410700o78029K57450Q87998
35012b63101R61295O25775K93257K99548M71719K20800n74639j134681q59686
35003D0287m17326p36060j232729m81234J282438K017914Q73347l48167J00791
34994A099261J168387O76302j189494k087353j005575M25623N26016j66416r7811
34985f51060R40262J717292J323312J38943q22629r79976n83422l14791m83724
$$ y = [436036, 1470931, 2044570, 2390123, 2329233, 1467325, 182986, -680127, -1081552, -1584745, -1908259, -1057865, 831441, 2191136, 2115976, 1522980, 1544533, 1944322, 1979308, 1769371, 1771524, 1743839, 1356259, 1175704, 1848504, 2730732, 2561924, 1372258, 604840, 1233404, 2646290, 3574943, 3389549, 2257036, 680180, -730520, -1408549, -1151099, -263101, 698194, 1323969, 1617226, 1916774, 2388493, 2609293, 2034654, 899973, 40287, -377039, -1113099, -2345828, -2827062, -1544624, 473290, 1346637, 998470, 1099261, 2267648, 2943950, 1754456, -332897, -1338472, -912849, -386833, -553249, -651060, 289202, 2006494, 3329806, 3468749, 2646120, 1666144, 1082722, 767931, 284207]
34976B84207o39471k03711O00098R12373L84945l62974o18585l93855j06350N9371
34966h3952J06189l1179k70307k36706K51526Q14439R73179P01113K08293m26667
34956B005928j003448j024817l46679L49933L57426r2786k97334j51354J7675
34947a85456K97525Q54595J027218L6133j398657j576623k88253O78194J50969
34938d04355p27068m13995P09833J267063J080404Q68369N17241n55494j710518
34929F31480j622234m80359J27553k77119m70395J32574M13622l08093q18909
34920b671880M297J158772J041990J0147k93459M35234R42685O27961L10171N73451
34910B139369P64781J80818p62912j183472r33951o11562o62770q24175m21344
$$ y = [284207, -355264, -558975, 41123, 953496, 1338441, 975467, 356882, -36973, -143323, -83952, 22237, -8942, -279249, -515955, -264429, 550010, 1523189, 2224302, 2432595, 2005928, 1002480, -22337, -369016, -19083, 338343, 245557, -51777, -203131, -185456, 112069, 966664, 1993882, 2030015, 631358, -945265, -1233518, -555324, -404355, -1131423, -1545418, -835585, 431478, 1511882, 2380251, 2897492, 2341998, 631480, -990754, -1471113, -1343560, -1620679, -2091074, -1958500, -1544878, -1852971, -2671880, -2667583, -1508811, -466821, -456674, -750133, -314899, 627786, 1255747, 1565918, 2139369, 2904150, 3084968, 2322056, 1138584, 204633, -406929, -1069699, -1893874, -2315218]
34901b315218P21455J658062J120630p12302j957462j283112K69330Q09905L24631
34892a364081L44652J185571J411954L92427m81539l7145P73287M46000p55419
34883A915707j407920j028367k38842N27007J150474J144398K12399p82666p22880
34874G69310L4804R5956q62974j681297j458164m93290O02625J483932J614317
34865A05219O06675o57269o62632M76952Q59740l60425j494679q21945Q04767
34856a143597J363910O21768n0520j14440k37319n08733j75348O74206Q44675
34847A274602r3691j065762j138216o62250k39788K23849P65934Q28231K98385
34838A91294N3383N40738P87946o9120j113594q48209M61438J090425L42394o50592
$$ y = [-2315218, -1593763, 64299, 1184929, 472627, -1484835, -2767947, -2498617, -1688712, -1364081, -1019429, 166142, 1578096, 1970523, 1488984, 1451839, 2225126, 2671126, 1915707, 507787, -520580, -759422, -232415, 918059, 2062457, 2274856, 1492190, 769310, 804114, 900070, 37096, -1644201, -3102365, -3595655, -2993030, -1509098, 105219, 711894, 54625, -608007, -131055, 728685, 368260, -1126419, -1948364, -1143597, 220313, 842081, 791561, 677121, 439802, -68931, -244279, 429927, 1274602, 1180911, 115149, -1023067, -1685317, -1925105, -1701256, -935322, -107091, 191294, 244677, 785415, 1573361, 1504241, 390647, -457562, 3876, 1094301, 1436695, 786103]
34828G86103p68975k99639n7063j17743o4052J65906K99182K32585N1426j97593
34818C0137m10885l41945Q9366N78788P54103N54960J62962k19833l70242r3244
34808G34167M77879Q19673N22534k38660r26939j208325j084335o18449J08882
34799a413573P62910Q62834L57815j59978j44479J54040O1679m21705m92933K04727
34789b28663P97120K90055q92843j339490n85523K71284J72305m80343n43516
34780b539614K69616J137290J216722M98591k97926m10169K24576Q26346P03337
34771A628769K62775M01065Q68564L64525j276012k269942j280970M64330Q61048
34762B4152p7771n76237L2822O49262N48742L09863L08940O0150m27940l38900
$$ y = [786103, 17128, -282511, -339574, -457317, -521369, -355463, -56281, 176304, 227730, 30137, -380748, -722693, -633327, -54539, 699564, 1254524, 1417486, 1197653, 827411, 734167, 1212046, 2031719, 2554253, 2315593, 1388654, 180329, -904006, -1522455, -1413573, -650663, 212171, 569986, 410008, 265529, 419569, 481248, 59543, -433390, -228663, 568457, 858512, -34331, -1373821, -1959344, -1688060, -1515755, -1996098, -2539614, -2269998, -1132708, 84014, 582605, 284679, -125490, 99086, 925432, 1628769, 1891544, 2292609, 3161173, 3525698, 2249686, -20256, -1301226, -836896, 24152, -53619, -629856, -597034, 52228, 600970, 910833, 1219773, 1279923, 851983, 513083]
34752E13083K38799K1625j140352j448988K2920J435271Q58294o73944r64567
34743a137859k80709n09986j384352o61067J719260K796442J041389j108097r48823
34734d73802N08518N64628q26706j435527n66473K84442L51980N05079R39743
34725a48118N29194p36676j044593K79200J261975L78210q03850k02369J157689
34716F70662P75343j050942j585542j05018J053135M42987l58757J95253R46982
$$ y = [513083, 751882, 773507, -366845, -1815833, -1792913, -357642, 500652, -173292, -1137859, -1418568, -1928554, -3312906, -3973973, -2254713, 541729, 1583118, 475021, -473802, 34716, 599344, -227362, -1662889, -2229362, -1944920, -1592940, -1087861, -148118, 381076, -355600, -1400193, -1120993, 140982, 519192, -284658, -487027, 670662, 1446005, 395063, -1190479, -1295497, -242362, 200625, -158132, 37121, 984103]
$$ [...]
##END NTUPLES=NMR SPECTRUM
##END=
