##TITLE=31Pdec_ABDE3105
 CDCl3, 24 sc
 1.06.2021
##JCAMPDX= 6.0         $$ Bruker NMR JCAMP-DX V2.0
##DATA TYPE= NMR SPECTRUM
##DATA CLASS= NTUPLES
##ORIGIN= UXNMR, Bruker Analytische Messtechnik GmbH
##OWNER= root
$$ XWIN-NMR		Version 3.5
$$ Tue Jun  1 11:50:31 2021 Russian Standard Time (UT+4h)  she@DPX200
##.OBSERVE FREQUENCY= 81.013821
##.OBSERVE NUCLEUS= ^31P
##.ACQUISITION MODE= SIMULTANEOUS
##.ACQUISITION SCHEME= undefined
##.AVERAGES= 24
##.DIGITISER RES= 16
##SPECTROMETER/DATA SYSTEM= spect
##.PULSE SEQUENCE= zgpg30
##.SOLVENT NAME= CDCl3
##.SHIFT REFERENCE= (INTERNAL, CDCl3, 0, 248.564)
##AUDIT TRAIL= $$ (NUMBER, WHEN, WHO, WHERE, WHAT)
$$ ##TITLE= Audit trail, XWIN-NMR		Version 3.5
$$ ##JCAMPDX= 5.01
$$ ##ORIGIN= Bruker BioSpin GmbH
$$ ##OWNER= she
$$ F:/spectra/data/she/nmr/P31/1/pdata/1/auditp.txt
$$ ##AUDIT TRAIL=  $$ (NUMBER, WHEN, WHO, WHERE, WHAT)
(   1,<2021-06-01 11:49:28.79 +0400>,<she>,<DPX200>,
      <created by zg, POWCHK disabled, PULCHK disabled
       configuration hash MD5:
       00 E9 B6 7A A2 85 ED C7 34 08 36 98 17 FE 4E 26
       data hash MD5: 32K
       0E 65 6C 04 81 66 7E 52 9A 05 F5 D7 25 DD 06 54>)
(   2,<2021-06-01 11:49:32.89 +0400>,<she>,<DPX200>,
      <Start of raw data processing
       efp BC_mod = 2 LB = 1 FT_mod = 6 PKNL = 1 PHC0 = -5755.193 PHC1 = -163.5273 SI = 64K 
       data hash MD5: 64K
       B2 23 A8 4C 0E 0A 4F B9 DC FE 90 6C 40 A2 12 B9>)
(   3,<2021-06-01 11:49:57.84 +0400>,<she>,<DPX200>,
      <pk PHC0 = -95.70448 PHC1 = 215.8 
       data hash MD5: 64K
       B7 39 55 D1 63 CB 05 91 5E 03 A8 E0 F4 CA DE 1D>)
(   4,<2021-06-01 11:50:01.18 +0400>,<she>,<DPX200>,
      <abs ABSG = 5 
       data hash MD5: 64K
       90 8E 9E 3B F4 9A 70 46 D7 01 64 5F 02 EA 42 26>)
$$ ##END=
$$ 
$$ hash MD5
$$ 06 0B C9 D8 95 B2 4B 19 46 B0 58 8A 14 0A 85 8A
##$RELAX= 
##$RELAX= 
##$RELAX= 
##$RELAX= 
##$RELAX= 
##$RELAX= 
##$RELAX= 
##$RELAX= 
$$ Bruker specific parameters
$$ --------------------------
##$DU= <F:/spectra>
##$EXPNO= 1
##$NAME= <P31>
##$PROCNO= 1
##$TYPE= <nmr>
##$USER= <she>
##$AMP= (0..31)
100 100 100 100 100 100 100 100 100 100 100 100 100 100 100 100 100 100 
100 100 100 100 100 100 100 100 100 100 100 100 100 100 
##$AQSEQ= 0
##$AQ_mod= 1
##$AUNM= <au_zg>
##$AUTOPOS= <>
##$BF1= 81.014009
##$BF2= 200.13
##$BF3= 200.13
##$BF4= 200.13
##$BF5= 200.13
##$BF6= 200.13
##$BF7= 200.13
##$BF8= 200.13
##$BYTORDA= 1
##$CFDGTYP= 0
##$CFRGTYP= 5
##$CHEMSTR= <none>
##$CNST= (0..31)
1 1 145 1 1 1 1 1 1 1 1 1 1 1 1 1 1 1 1 1 1 1 1 1 1 1 1 1 1 1 1 1 
##$CPDPRG= <waltz16>
##$CPDPRG1= <>
##$CPDPRG2= <waltz16>
##$CPDPRG3= <>
##$CPDPRG4= <mlev>
##$CPDPRG5= <mlev>
##$CPDPRG6= <mlev>
##$CPDPRG7= <mlev>
##$CPDPRG8= <mlev>
##$CPDPRGB= <>
##$CPDPRGT= <>
##$D= (0..31)
0 1 0 0 0 0 0 0 0 0 0 0.03 2e-05 3e-06 0 0 0 0 0 0 0 0 0 0 0 0 0 0 0 0 
0 0 
##$DATE= 1622533768
##$DBL= (0..7)
120 120 120 11 120 120 24 19 
##$DBP= (0..7)
150 150 150 150 150 150 150 150 
##$DBP07= 0
##$DBPNAM0= <>
##$DBPNAM1= <>
##$DBPNAM2= <>
$$ [...]
##$SUBNAM3= <"">
##$SUBNAM4= <"">
##$SUBNAM5= <"">
##$SUBNAM6= <"">
##$SUBNAM7= <"">
##$SUBNAM8= <"">
##$SUBNAM9= <"">
##$SW= 501.771253377433
##$SWIBOX= (0..15)
0 1 3 0 0 0 0 0 0 0 0 0 0 0 0 0 
##$SW_h= 40650.406504065
##$TD= 32768
##$TD0= 1
##$TE= 0
##$TE2= 300
##$TE3= 300
##$TEG= 300
##$TL= (0..7)
0 120 53 12 22 120 120 120 
##$TP= (0..7)
150 150 150 150 150 150 150 150 
##$TP07= 0
##$TPNAME0= <>
##$TPNAME1= <>
##$TPNAME2= <>
##$TPNAME3= <>
##$TPNAME4= <>
##$TPNAME5= <>
##$TPNAME6= <>
##$TPNAME7= <>
##$TPOAL= (0..7)
0.5 0.5 0.5 0.5 0.5 0.5 0.5 0.5 
##$TPOFFS= (0..7)
0 0 0 0 0 0 0 0 
##$TUNHIN= 0
##$TUNHOUT= 0
##$TUNXOUT= 0
##$USERA1= <user>
##$USERA2= <user>
##$USERA3= <user>
##$USERA4= <user>
##$USERA5= <user>
##$V9= 5
##$VALIST= <valist>
##$VCLIST= <CCCCCCCCCCCCCCC>
##$VD= 0
##$VDLIST= <DDDDDDDDDDDDDDD>
##$VPLIST= <PPPPPPPPPPPPPPP>
##$VTLIST= <TTTTTTTTTTTTTTT>
##$WBST= 1024
##$WBSW= 4
##$XGAIN= (0..3)
0 0 0 0 
##$XL= 0
##$YL= 0
##$YMAX_a= 26903
##$YMIN_a= -27112
##$ZGOPTNS= <>
##$ZL1= 120
##$ZL2= 120
##$ZL3= 120
##$ZL4= 120
##$ABSF1= 248.5645
##$ABSF2= -253.2056
##$ABSG= 5
##$ABSL= 3
##$ALPHA= 0
##$AQORDER= 0
##$ASSFAC= 0
##$ASSFACI= 0
##$ASSFACX= 0
##$ASSWID= 0
##$AUNMP= <proc_1d>
##$AZFE= 0.1
##$AZFW= 0.5
##$BCFW= 0
##$BC_mod= 2
##$BYTORDP= 0
##$COROFFS= 0
##$CY= -3
##$DATMOD= 1
##$DC= 0
##$DFILT= <>
##$DTYPP= 0
##$F1P= 0
##$F2P= 0
##$FCOR= 1
##$FTSIZE= 65536
##$FT_mod= 6
##$GAMMA= 0
##$GB= 0
##$INTBC= 1
##$INTSCL= 5.30512e-09
##$ISEN= 30
##$LB= 1
##$LEV0= 0
##$LPBIN= 0
##$MAXI= 10000
##$MC2= 0
##$MEAN= 0
##$ME_mod= 0
##$MI= 50
##$NCOEF= 0
##$NC_proc= -3
##$NLEV= 6
##$NOISF1= 182.463
##$NOISF2= 159.3651
##$NSP= 0
##$NTH_PI= 0
##$NZP= 0
##$OFFSET= 248.5645
##$PC= 4
##$PHC0= -5850.897
##$PHC1= 52.27271
##$PH_mod= 1
##$PKNL= yes
##$PPARMOD= 0
##$PSCAL= 0
##$PSIGN= 0
##$REVERSE= no
##$SF= 81.014009
##$SI= 65536
##$SIGF1= 159.3651
##$SIGF2= -187.1042
##$SINO= 113.3802
##$SIOLD= 16384
##$SREGLST= <1H.CDCl3>
##$SSB= 0
##$STSI= 65536
##$STSR= 0
##$SW_p= 40650.406504065
##$SYMM= 0
##$S_DEV= 0
##$TDeff= 32768
##$TDoff= 0
##$TI= <>
##$TILT= no
##$TM1= 0
##$TM2= 0
##$TOPLEV= 0
##$USERP1= <user>
##$USERP2= <user>
##$USERP3= <user>
##$USERP4= <user>
##$USERP5= <user>
##$WDW= 1
##$XDIM= 65536
##$YMAX_p= 274448571
##$YMIN_p= -2112179
$$ End of Bruker specific parameters
$$ ---------------------------------
##NTUPLES= NMR SPECTRUM
##VAR_NAME=  FREQUENCY,     SPECTRUM/REAL,   SPECTRUM/IMAG
##SYMBOL=    X,             R,               I
##VAR_TYPE=  INDEPENDENT,   DEPENDENT,       DEPENDENT
##VAR_FORM=  AFFN,          ASDF,            ASDF
##VAR_DIM=   65536,         65536,           65536
##UNITS=     HZ,            ARBITRARY UNITS, ARBITRARY UNITS
##FACTOR=    0.620285442955139, 1,           1
##FIRST=     20137.2065510759, 0,            0
##LAST=      -20513.1999529892, 0,           0
##MIN=       -20513.1999529892, -2112179,    0
##MAX=       20137.2065510759, 274448571,    0
$$ Real data points
##PAGE= N=1
##DATA TABLE= (X++(R..R)), XYDATA
$$ [...]
39656a79165K56172J17291l8034j65308j96005j40798q0546r649J10963J68975
39646a56104L8849j24500n1167J91579K58447N6358j35153j10026L8416J66428
39636A73127K14026Q7458k22230m16862k04586J82125K55904M2128N748J85729
39626C02567R5680l41350n02764o6659L84965K54840j67332k63316m9001N8606
39616b93764L9842J47553K55653L7647l41979l82237n3042J61893N2579o1362
39606d37217M3338J43875L2363j12584n5218J16745J76043R3192j1526p9991j04216
39595a95196l8411J10442J96363R7005q0211j03320N9001J57397J726k28415k11035
39584b34654J0771M7052k05393l11116K1632L58826J51603l18296k90533K44937
$$ y = [-179165, 77007, 194298, 156264, -9044, -205049, -345847, -426393, -436042, -325079, -156104, -117255, -241755, -292922, -101343, 157104, 213462, 78309, -31717, 6699, 173127, 387153, 474611, 252381, -164481, -369067, -186942, 68962, 111090, 116838, 302567, 398247, 56897, -445867, -512526, -127561, 127279, -40053, -303369, -352370, -293764, -253922, -106369, 149284, 186931, -155048, -537285, -590327, -428434, -375855, -437217, -393879, -250004, -217641, -330225, -385443, -268698, -92655, 537, -10989, -90980, -195196, -233607, -123165, 73198, 170203, 89992, -13328, 45673, 203070, 204796, -23619, -234654, -223883, -176831, -382224, -693340, -671708, -312882, -161279, -479575, -770108, -525171]
39574e25171M67169K9810l68879j10867L87017M16818P3571q1608j934n8698k63400
39563c6172l12826k19235k11167j61087J94464N78212M49693o9226k92103m6283
39553a25730J07799j02202j94882J72116N32357L27580k08008m17098j49588J76010
39543A18354K45627J40712M2038m943l0698n8208p7661l3496P2194O2613k05620
39532B70912m94551l75631J18425M11875J78370j67187j05920K02860K41009j0084
39522B70078r4247J09842J89962p4295l08282j32061K38973L33018J03035j10319
39512E25704j47886j61019k01740r1599J88824L30089J35711j23493q0777J69537
39502E43351K13674n4571k93540k36448l6378L5891j9185k4878O1227J18575N2346
$$ y = [-525171, -58002, -28192, -397071, -507938, -120921, 295897, 369468, 287860, 285926, 227228, -36172, -348998, -568233, -779400, -940487, -746023, -167811, 281882, 212656, -79447, -125730, -17931, -120133, -315015, -142899, 389458, 717038, 509030, 91932, -57656, 118354, 363981, 504693, 546731, 541788, 511090, 452882, 375221, 341725, 413919, 476532, 270912, -223639, -599270, -480845, -68970, 109400, -57787, -163707, 39153, 280162, 270078, 175831, 285673, 475635, 401340, 93058, -39003, 199970, 532988, 636023, 525704, 377818, 216799, 15059, -76540, 112284, 442373, 578084, 454591, 373814, 543351, 757025, 702454, 408914, 172466, 136088, 171979, 152794, 127916, 189143, 307718, 360064]
39491C60064j21157l00970l30985j11161K35134M18644K96789K6534j53877j71211
39481A47804r8800m3656r5843k20065j82152J76511N65845M77977j02518n80379
39471D4724n22120j74747K9574Q5426J74932J91854j7734k05457l3125L21177
39461a05496L75305P5366j61256r6477P3652J01571o0041l49338n73085l95004
39451a114803K33120P47501N76617k1045k81845m1395J33213n1254j99140j7683
39441c6714J70720N7000j06909j1034J54870R9687k6022M1503J48413J1844k19721
39430B83637j87880O0814J43583n9611k73485k60504o9736J22943J77751L9748
39420b2740j74968k16988J081K54156L00701J77561M3995p4393j95925k36172
$$ y = [360064, 238907, -62063, -393048, -504209, -269075, 149569, 446358, 472892, 319015, 147804, 49004, 5348, -90495, -310560, -492712, -316201, 249644, 727621, 625103, 44724, -477396, -652143, -622569, -537143, -362211, -170357, -188091, -393548, -426673, -105496, 269809, 345175, 183919, 87442, 161094, 262665, 202624, -146714, -719799, -1114803, -881683, -134182, 442435, 421390, 139545, 98150, 231363, 180109, -19031, -36714, 134006, 191006, 84097, 73063, 227933, 327620, 301598, 343101, 491514, 503358, 283637, 95757, 156571, 300154, 240543, -32942, -293446, -363182, -240239, -62488, -22740, -197708, -414696, -413615, -159459, 141242, 318803, 362798, 288405, 92480, -143692]
39410a43692j57254p2213k0665J14572K80835J83400j80939l01887J16854N67892
39400C86903M23025q5527k32772L0604O1994l08020m32562N7076N65359M24846
39390H90926r9508k94830r2313o676j87012k26262N4235K58297P1112k20975j89663
39379d2669R1385K29223J24998J3078r441q6131k23368k04006K963J03007n4461
39368e5422j87172l5206J77966J01871j40119j44754R9152K17182J06133P6611
39358B16242K48568K99731K0273l10041l59613k00539n7420O4841K06921K18200
39348C47163K2755j39808o6683N9006j686j17031n1030Q4621M8655o9085l4595
39337H2282O5639L709j03577J8781K47945K19382k8604j18652k6386j17359m19420
$$ y = [-143692, -300946, -373159, -393824, -279252, 1583, 184983, 4044, -297843, -180989, 386903, 809928, 724401, 491629, 522233, 584227, 276207, -156355, -99279, 466080, 890926, 791418, 496588, 404275, 397599, 210587, -15675, 38560, 296857, 367969, 146994, -42669, 48716, 277939, 402937, 416015, 406574, 320443, 97075, -106931, -103968, -961, -55422, -242594, -277800, -99834, 2037, -138082, -282836, -183684, 33498, 139631, 216242, 464810, 764541, 784814, 474773, 115160, -85379, -142799, -77958, 128963, 347163, 369918, 230110, 163427, 222433, 220747, 103716, 52686, 137307, 185962, 116877, 82282, 147921, 151630, 48053, 66834, 314779, 534161, 505557, 386905, 360519, 243160, -176260]
39326a76260m63302m4608L98858M37958K12826N3636l0670j50537j89449k9297
39316A9155J48367J26258L51k7904L784l8402j02814r0797q0850j45377j44516
39305c32745J7968J39514K8692j24722l6661J74529J58349j01496k75965k05262
39295e57799n7516L1174J25112K40592K40216P8825q4245j20443r2727r8307j09113
39284d04231m7401R0355K31284K77902J82788M1480K3313J07730M1852k59699
39274B85373m57380k25238J94793K68361m9225k48671n2130J89162Q7030j85412
39264a93337k05467N5354K54468K06192N3973m2022j01003j66606j66733j8990
39254c24171K21225L82093L23439O6301k09003l20027k43257q6598N7560J43548
$$ y = [-176260, -639562, -684170, -285312, 152646, 365472, 419108, 388438, 237901, 48452, 19155, 167522, 293780, 294131, 266227, 270011, 231609, 128795, 37998, -42852, -188229, -332745, -314777, -175263, -146571, -271293, -307954, -133425, 24924, -76572, -352537, -557799, -615315, -584141, -459029, -218437, 21779, 100604, 16359, -104084, -196811, -295118, -404231, -451632, -361277, -129993, 147909, 330697, 372177, 395490, 503220, 545072, 285373, -172007, -397245, -202452, 65909, 16684, -231987, -284117, -94955, -7925, -193337, -398804, -343450, -88982, 117210, 171183, 129161, 28158, -138448, -305181, -324171, -102946, 279147, 602586, 668887, 459884, 139857, -103400, -189998, -132438, 11110]
39244A1110J13669k9546j17221J0872K10841J62129j40660k98839n9651L07517
39234A70221L97458K02245k738j11489k11492k80549j96533j1198Q1774M3300
39224H0999l934l8639j38007k30521j53866K3235N2044p0930n9183J80460L53540
39213d802K34483Q438o0907k7441o6092j23600o9099K155n3936j05754L9727K17118
39201i710J11631j62390j59699J57527K70301r8470m86379l46725J44063L85551
39191a94300K37641Q6073J04454J9371k76192m10933j33373J94752J14810j99325
39181d57022k05386J56413L89539K25683j8036j4230R0262L0455r8744p1479J7880
39170D5335p1597k49269j94849J03667K94414J82849k4555q5555l9107k6861l7679
$$ y = [11110, 124779, 95233, -21988, -11116, 199725, 361854, 221194, -77645, -137296, 170221, 567679, 769924, 767186, 655697, 444205, 163656, -32877, -44075, 37699, 80999, 77065, 38426, -99581, -330102, -483968, -460733, -408689, -479619, -538802, -358342, -4802, 229681, 238119, 177212, 149771, 83679, -39921, -109020, -106865, -160801, -266555, -226828, -9710, 101921, -60469, -220168, -62641, 207660, 109190, -377189, -723914, -579851, -194300, 43341, 129414, 233868, 253239, -22953, -433886, -567259, -372507, -257697, -457022, -662408, -505995, -116456, 109227, 91191, 76961, 167223, 197678, 98934, 27455, 45335, -26262, -275531, -470380, -366713, -72299, 110550, 85995, 440, -38667, -65528, -103207]
39159a03207P697P9174Q5188n841j62635k92584k27641J03570M49129M19697R732
39148C62279l08381j82601J41815J72878j58297m43958l49426K5075L37311L79248
39138b4057K20665P4164N1352N2158n5646j86458j31806Q8003K05668J19797N0537
39127D64377J28288J30884j07572l11416j58717J45787J31799k12600m37556l24321
39117e51047j15272m525J26017L13686L05086o367k85446j97076J06859K25648
39107h2437M6354k07734l03433j53465J87649M73720L97592q92k56348o9351K37546
39096B69201J89902j12542j81469N6571J61465o9356k65872j04842J67415J43743
39086B54216j18264k33358p1776J30639J61107M8087p1856q9034L2871J69196
$$ y = [-103207, -95510, -16336, 68852, 63011, -99624, -392208, -619849, -516279, -67150, 352547, 362279, 53898, -128703, 13112, 185990, 27693, -416265, -765691, -740616, -403305, -24057, 196608, 270772, 322124, 374282, 318636, 132178, 372, 88375, 294043, 413840, 464377, 592665, 723549, 615977, 304561, 145844, 291631, 423430, 210830, -226726, -551047, -666319, -670844, -544827, -231141, 73945, 67578, -217868, -414944, -308085, -82437, -36083, -243817, -547250, -700715, -513066, -39346, 358246, 357354, 101006, 31655, 269201, 459103, 346561, 165092, 221663, 383128, 313772, 47900, -56942, 110473, 254216, 135952, -97406, -169182, -38543, 122564, 170651, 98795, 9761, 42632, 211828]
39076B11828Q9669j97911l05000L7284M60750L60208k09866n30779k42357J41984
39066a84190N4159k55285j66120K88082M67753J30843k23641j47863J34139J60941
39056B58818r1079k85295k35126l8682J44738K07109R5912r7268j66754o7039
39046b74666R46o3638n3741J65674L09951O9421l16089l25736M6887K45495j5901
39035b11397l31335k33525J37075L16419K04333R0700J26426J50058M3415p1967
39025B20202r1471j18658k36587k77712m7809L05134L92874Q9116k78328l39875
39015c83114j21603Q1387J32191J36969J74752J90003J55186J07921N848k10125
39005B69415l77324k35060J26719K78404P1553j08693M0414K40713J18111j47103
$$ y = [211828, 301497, 103586, -201414, -164130, 296620, 656828, 446962, -83817, -326174, -184190, -130031, -385316, -551436, -263354, 204399, 335242, 111601, -36262, 97877, 258818, 167739, -117556, -352682, -391364, -246626, -39517, 56395, -40873, -207627, -274666, -273720, -337358, -391099, -225425, 84526, 153947, -162142, -487878, -440991, -195496, -211397, -542732, -776257, -639182, -322763, -118430, -27730, 98696, 248754, 292169, 220202, 128731, 10073, -226514, -504226, -552035, -246901, 145973, 235089, -43239, -383114, -504717, -423330, -291139, -154170, 20582, 210585, 365771, 473692, 479540, 269415, -107909, -342969, -216250, 62154, 133707, 25014, 65428, 306141, 424252, 277149]
38995B77149j42250M7896O123k46036k59732M8887K30176N4153j36687m4117J28462
38984c5976J10094k791n4073j50770l35028l26090J8172L32143K61716L4062L8906
38973a09635J42317j5105k61789j08561L47419M35052n2273m78789l02948J54849
38963b49463K72123L0450j16170j7526M3360p7295j47383K3367K70343L26301
38953C58107J66402l9937j64620j73466o2558J14139K21845J77058O1798J75k9711
38942F29232j33398k84414l25405j93667Q53J47326K33439K40185J17230o1736
38932C69645j04268K7986J30792P1474o600L6467O8356o8938k42482k46688j65831
38921a30087j91639k32071p5030J79994K59038J78814J37945N9373k28687m44955
$$ y = [277149, 134899, 182795, 188918, -57118, -316850, -267963, -37787, 16366, -120321, -164438, -35976, 74118, 71327, 17254, -133516, -468544, -794634, -776462, -444319, -182603, -148541, -109635, 32682, 17577, -244212, -352773, -5354, 429698, 377425, -101364, -404312, -249463, 22660, 53110, -63060, -80586, -37226, -114521, -261904, -238537, 31806, 358107, 524509, 484572, 319952, 146486, 83928, 198067, 419912, 596970, 658768, 658943, 629232, 495834, 211420, -113985, -307652, -306799, -159473, 73966, 314151, 431381, 369645, 265377, 293363, 424155, 495629, 489029, 525496, 593852, 524914, 282432, 35744, -130087, -321726, -553797, -628827, -448833, -189795, -10981, 126964, 186337, -42350, -487305]
38911d87305j50352L87793L84037k30676n60211r0158N01353M27317k6959j25943
38901B8896R3591P3496j87294k06464L8307J10253k7613J4902K27318J61578j83760
38890A43210k41494J51921M00532Q2539l91592m32407p8715K21361K33018J0641
38880I9014k99226m51165k22967K21662M17876K31623L4446P2984J13306m0379
38870A77174j45220J8820K05626J13377j07327j45096k9197K8274J2836j4056
38860A15211j30643l10365k69378Q1713L48946K03457r7177j43306j52M8494M9319
38849a03881J64675K24301M8658p4802J53150L89884J33974l69600m58719j22361
38839a4721P0321P599J10314L59912K16278l06600m42893Q8000N35274K90231
$$ y = [-487305, -637657, -249864, 134173, -96503, -656714, -746872, -245519, 181798, 154839, 28896, 122487, 195983, 8689, -197775, -159468, -49215, -76828, -61926, 165392, 326970, 143210, -98284, 53637, 454169, 536708, 145116, -287291, -366006, -144645, 88373, 99014, -200212, -651377, -874344, -652682, -234806, -3183, 31263, 104247, 217553, 177174, 31954, 50774, 256400, 369777, 262450, 117354, 88157, 116431, 129267, 115211, -15432, -325797, -595175, -513462, -164516, 38941, -58236, -201542, -201694, -153200, -103881, 60794, 285095, 333753, 258951, 412101, 801985, 935959, 566359, 107640, -14721, 55600, 63199, 173513, 533425, 749703, 443103, 210, 88210, 623484, 913715]
38829I13715k01315k81256j06749j52071k94488j56120J03101R3618n4298K0969
38819a14894J74764M3008j84756m8516K98734K83251r2034k40981q266J00154
38809B10464j59373l56514j47400J98624L29660L07961K66439Q5518k40002l66854
38799A28523j09122J99542K01503K6373l6320l1444j23032j87187l4015J94229
38789B29050K41811J59363J27707O2753j87675m18851l05017K1971J00362j48866
38779a17392k87452l6639L07974L24783L8333j81543j26735M5801O6214j14903
38769h1559k66418j53750J34342K51342N3283j76098j28988O9092P9894q5466
38759c04326q6981J59815L01489Q5210k40703k91271q5237M9471j1316n5579Q2268
$$ y = [913715, 712400, 431144, 324395, 172324, -122164, -278284, -175183, -81565, -135863, -114894, 59870, 102878, -81878, -130394, 168340, 451591, 359557, 118576, 110310, 210464, 51091, -305423, -452823, -254199, 75461, 383422, 649861, 735379, 495377, 128523, 19401, 218943, 420446, 446819, 410499, 379055, 256023, 68836, 34821, 229050, 470861, 630224, 757931, 820684, 633009, 214158, -90859, -68888, 31474, -117392, -404844, -441483, -133509, 191274, 229607, 48064, -78671, -32870, 33344, -81559, -347977, -501727, -367385, -116043, -62760, -238858, -367846, -298754, -218860, -304326, -391307, -231492, 69997, 155207, -85496, -376767, -462004, -412533, -423849, -479428, -397160]
38748c97160K47918J91594n9287k03874m2217K69534M09187K67628K6952j13264
38738E97011j36143j06022m5817j6044j41033l84236m42232j00976L81224N17121
38728A22853K14760j09104j01982R6731J44461j683r7660k5247N6358l492j05895
38717A90100o5386Q8892J33501k8091k11490j95042n862J57756K02587J76065
38707D43030Q4724j11783l24767l70662k20442j8377J62831L37253L59628J7570
38697C59005n05498o45197j87758L48567L84978M4791j28370L3467K40627K89088
38687B33700K36700J29264l1112j04897J3360J15098m7617l01796k84906l8698
38677h0904R0229N3894Q9748J70976N4520j38792l9776K23948J12272l48800m46567
$$ y = [-397160, -149242, 42352, -16935, -220809, -263026, 6508, 415695, 683323, 710275, 597011, 460868, 354846, 309029, 292985, 151952, -232284, -674516, -775492, -394268, 122853, 337613, 228509, 126527, 223258, 367719, 366036, 268376, 243129, 299487, 295995, 190100, 124714, 213606, 347107, 319016, 107526, -87516, -93378, 64378, 266965, 443030, 527754, 415971, 91204, -279458, -499900, -518277, -355446, -18193, 341435, 359005, -146493, -791690, -979448, -630881, -245903, -201112, -329482, -296015, -55388, 233700, 470400, 599664, 568552, 463655, 477015, 592113, 544496, 242700, -42206, -80904, 9325, 63219, 152967, 323943, 378463, 239671, 199895, 423843, 536115, 187315, -259252]
38666b59252N8289M32338J09708l85325k99476J54378K30428j24184k88444j2210
38656c83750L13182L72589K64813J15087q9151k42725j87379m9106p1672j48728
38646a06840l89K27809J08044k89423l73162L9649L68430J58496k02677j12312
38636a82375K93463L73058p670k72592j3429L98413L40865j81962n39538l19207
38626a10974J47360K64102l2606k51005p0562K42156K63474j2820k42845k00364
38616d084L8352K57566K58707l1958m23812n41090k33134J96380L44865J68073
38606B9865r5850k83423l45534k05721J11851L34269K37817k137p2891j6376q5207
38595c93337k13178r4185K25348L37346J47222N5079K64027L87023O9229l87003
$$ y = [-259252, -200963, 231375, 341083, -44242, -343718, -189340, 41088, -83096, -371540, -383750, -70568, 302021, 566834, 681921, 592770, 350045, 162666, 113560, 41888, -106840, -107229, 120580, 228624, -60799, -433961, -394312, -25882, 132614, -70063, -182375, 111088, 484146, 476476, 203884, 190455, 588868, 929733, 747771, 208233, -110974, 36386, 300488, 267882, 16877, -53685, 188471, 451945, 439125, 196280, -4084, 34268, 291834, 550541, 518583, 94771, -446319, -679453, -483073, -138208, 29865, -65985, -349408, -694942, -900663, -788812, -454543, -216726, -218863, -291754, -308130, -393337, -606515, -700700, -475352, -138006, 9216, 64295, 328322, 715345, 784574, 397571]
38585C97571m39149r7389J42867M5240j17386o6775R7675J42795O5785L2372Q8719
38574B92325J15200L3018q4746j40787j55384k00993k42720j59713N4615K27447
38564b61738K14202Q3432j365j1512m0222j02104r0242M8834K08783K40223J18784
38553D07075l5674q4662p385Q2949O9639l6783j38592j87957j98557j50200j0922
38542b91069J48286K03705J54351J00281N2211n1062j42188q1947O2921P4304
38532B29793l9143l4601J16081J33588p9356k48554k15063j87330k61284j59141
38522g45010K03864L80803R6103j77607N2288M04449K00008l61437m59364K5810
38512c80093L41524R4264k04413p5183K04713J94806m969p6988l9687n5754n4628
$$ y = [397571, -41578, -138967, 3900, 49140, -68246, -135021, -37346, 105449, 171234, 203606, 292325, 407525, 440543, 355797, 215010, 59626, -141367, -384087, -543800, -489185, -261738, -47536, 35896, 34531, 23019, -17203, -119307, -209549, -160715, 48068, 288291, 407075, 371401, 286739, 279354, 362303, 431942, 395159, 256567, 68610, -129947, -280147, -291069, -142783, 60922, 215273, 315554, 367765, 316703, 174515, 92568, 155489, 229793, 190650, 156049, 272130, 405718, 326362, 77808, -137255, -324585, -585869, -745010, -541146, -160343, -64240, -241847, -189559, 214890, 414898, 53461, -405903, -380093, -38569, 55695, -148718, -223901, -19188, 175618, 170649, 93661, 53974, -1780, -56408]
38501e6408O6975J63174R0694k1847m0827q7333k43939k79617N163L73335M19032
38490C88402J07139k21215k84360j02205J05617J26566m3115j48957J4710K56106
38480A98688K12753p0705j73986P164O0079k38233m77941k44184J90289K62511
38470b73565l5139j96078K0199L06305L19647J04088r0803j43959r5459q132Q3324
38459i572J42493J25780K6096q3714j00466k3965L3293L7048J02346K45885K50630
38448G45854R774j86169m7559J90759Q4148k83656l96682j29440R0761K7056l9380
38437F5466J01827K33601J82322J17433J15545m4949l52541l75268K3704L22385
38427C89525J29294j82462j28881R6515O2923j22691j24171o9866k40272l81982
$$ y = [-56408, 10567, 173741, 264435, 242588, 201761, 114428, -129511, -409128, -403965, -30630, 388402, 495541, 274326, -10034, -112239, -6622, 119944, 76829, -72128, -57418, 198688, 411441, 340736, 166750, 173914, 233993, -4240, -482181, -726365, -536076, -273565, -308704, -504782, -484583, -178278, 141369, 245457, 154654, 10695, -84764, -92896, -9572, 132921, 258701, 284797, 201083, 100617, 76652, 109945, 146993, 249339, 495224, 745854, 755628, 569459, 521900, 712659, 796807, 513151, 116469, -12971, 77790, 104846, 65466, 167293, 400894, 583216, 700649, 816194, 771245, 418704, 43436, 67140, 389525, 518819, 336357, 207476, 303991, 366914, 244223, 120052, 50186, -190086, -572068]
38417e72068q1736L98478M25378j52k92193k51568k18970k72065p9590L23378
38407f21108M02069K2412k14001J10220N59447N09084K1915l61177l70346j56926
38397i8411O0169J55965P6689p8396q5766J08880K75754K17210K2451j17934j61880
38386C74731j57131j16578o4448m1603j804J10032J63248j3540k78736l05729
38376c31558j14716o8595k18457j35258L44390O91395M30109q8002k01253N3851
38366C61906Q9433k08664l09950K0446K90199Q5328k52281j94264J37359K34629
38356B54141N0800o873J51502J40535j84006m03579j90228J64441K19318L5759
38346B31810l9144K5012N019q2763k4634J33458J26534n6158j73648j91541k70815
$$ y = [-572068, -653804, -255326, 170052, 169900, -122293, -373861, -592831, -864896, -944486, -621108, -219039, -196627, -410628, -300408, 259039, 768123, 790038, 428861, 58515, -98411, -38242, 117723, 194412, 116016, 30250, 139130, 414884, 632094, 654545, 536611, 374731, 217600, 101022, 36574, -5029, -6833, 103199, 266447, 252907, -25829, -331558, -446274, -514869, -733326, -868584, -524194, 167201, 597310, 509308, 308055, 361906, 451339, 242675, -67275, -46829, 243370, 328698, 76417, -117847, 19512, 254141, 304941, 298068, 449570, 590105, 406099, 2520, -187708, -23267, 196051, 231810, 192666, 217678, 222697, 139934, 115300, 248758, 375292, 319134, 145486, -46055, -316870]
38335c16870k98571J9840N05563N45145J9163l91986j85345K21906J94013j50532
38325A62326k48539k9583J02612L7345O0871K36319K65398L8866j58262j09631
38315C57722M7518J15953R8688N8760j3386r5114j07895o2226m7170n7819j4255
38304B80776N1676J7454j18855k11725j51894L5832K30227K69242R0236j08171
38294C84798m9153J78123J60081j83605l72637j00114K21474J02340k11077j50078
38284a9848K29447L81932J81964n570q0801k88532n21382l19288K67471N49479
38274C74872K14504j87281j23647J57867J74836j3069p8037o5816k17385m10130
38264a73286k99272J02496M11044L88739J63657k7256p2741k488O1007J0682r7264
$$ y = [-316870, -615441, -595601, -90038, 455107, 474270, 82284, -103061, 118845, 312858, 162326, -86213, -115796, -13184, 24161, 85032, 321351, 586749, 625615, 467353, 357722, 405240, 521193, 619881, 678641, 665255, 570141, 462246, 400020, 352850, 295031, 280776, 332452, 349906, 231051, 19326, -132568, -96736, 133491, 402733, 492969, 384798, 335645, 513768, 673849, 490244, 117607, 17493, 238967, 341307, 130230, -19848, 209599, 591531, 773495, 767925, 687124, 398592, -122790, -442078, -174607, 374872, 589376, 402095, 278448, 436315, 611151, 598082, 520045, 454229, 236844, -173286, -472558, -370062, 40982, 429721, 593378, 566122, 493381, 490893, 551900, 562582, 465318]
38253D65318j05903r373L4513j8275m6183m1552j46677l15574k75431J3933K01972
38242b43232O9239j13085j9385K12382K14186n9836l14602l12595n7171K86613
38232c37486M66935L08641k7492j51869K2630J21797j03940l45363k08838J44154
38222a10831K38501L09j88429q0504J68737L14326K83604J13406j05606k06630
38212D26883r4054Q4998J08529j4755j02271r8562q9973o8614N6027K11723J90021
38201F09952l2547k23229k16504j18853j00293j43165j19333j1123Q0702J15069
38191a59324J71795K90822L35363J40098j99440l48350j52889J14505J26437j8930
38181C00087J9429K45311L12963J16125l9771R430l643k60211m46021k26260J75149
$$ y = [465318, 359415, 350042, 384555, 366280, 320097, 278545, 131868, -183706, -459137, -445204, -243232, -173993, -287078, -306463, -94081, 120105, 60269, -254333, -566928, -624099, -337486, 129449, 438090, 410598, 258729, 281359, 403156, 299216, -46147, -254985, -110831, 127670, 127979, -60450, -140954, 27783, 342109, 625713, 739119, 633513, 426883, 332829, 417827, 526356, 511601, 409330, 310768, 220795, 152181, 208208, 419931, 609952, 577405, 354176, 137672, 18819, -81474, -224639, -343972, -355095, -274393, -159324, 12471, 303293, 638656, 778754, 579314, 230964, 78075, 192580, 319017, 300087, 319516, 564827, 877790, 993915, 954144, 963574, 959931, 699720, 253699, 27439, 202588]
38170B02588K88979Q4124q2742n2821K0971M7326O1678k4076l04273n23754k95246
38159e77246K57926N24418K26170j94831k40072k9745J3570j33284j33122R4886
38149a91330K32071Q0870j30054j20646K4816N1323k6197K3592J99430K06882
38139C50757n0942k35516o5583K00059J28583j86540k40512P5514K76023M5558
38129B97401k67872k26065K6350P5726o1150m0307J62178K18115L9160q0816R060
38118A51780Q1054l5733j64511j28075o3214j40146k31102j41533K6934N1099
38108e93447j4436N5907K18543J85300p5628k19053n8240R5052r1579l77068k31597
38097a106246L38569O93920M30691m6388j24018J39888J75413j87414m71812l00958
$$ y = [202588, 491567, 575691, 492949, 440128, 461099, 508425, 570103, 546027, 241754, -282000, -577246, -319320, 205098, 431268, 236437, -3635, -33380, -19810, -153094, -286216, -191330, 40741, 121611, -8443, -129089, -104273, -52950, -79147, -55555, 143875, 350757, 299815, 64299, -1284, 198775, 327358, 140818, -99694, -24180, 251843, 297401, 29529, -196536, -170186, -94460, -155610, -195917, -33739, 184376, 223536, 142720, 151780, 232834, 197101, 32590, -95485, -158699, -298845, -529947, -671480, -644546, -593447, -607883, -551976, -333433, -148133, -223761, -442814, -501054, -406002, -497581, -874649, -1106246, -767677, -73757, 356934, 310546, 186528, 326416, 501829, 314415, -157397, -458355]
38087d58355O4379J77002N3600M0789K24470L24108J34050j99299l66198j97463
38077b02917K11452N48845M99342N4321m12419n04026k08981J49163K97458K10486
38067F42724q24k01543k48414q3412J48391K15333P6614o7813l9938J03364J62054
38056G06536K6324k13131l44642k28902M1331K04443J14724q0568j31668j16J35806
38045B30137J48670Q1186j869j09413k10625j80036K1337K06129J53832q0961
38035B58387k02415n7792J39086Q1784j99900l50879j58134J56836K31253K9726
38025g2048j58378j38931j9426L5517N1145J30539K36172K32511Q6399r5253k01770
38014H6477k05577j34291l4201L8828M6869O977j0209O7473K27217L20294J72270
$$ y = [-458355, -393976, -216974, -163374, -122585, 101885, 425993, 560043, 360744, -5454, -202917, 8535, 557380, 1056722, 1111043, 698624, 194598, -14383, 134780, 432238, 642724, 641900, 440357, 191943, 108531, 256922, 472255, 548869, 481056, 441118, 544482, 706536, 732860, 519729, 175087, -53815, -12484, 191959, 306683, 226115, 94447, 94331, 230137, 378807, 459993, 458124, 348711, 138086, -41950, -20613, 185516, 339348, 258387, 55972, -1820, 137266, 219050, 19150, -331729, -489863, -333027, -101774, -72048, -230426, -369357, -388783, -353266, -302121, -171582, 64590, 297101, 383500, 288247, 86477, -119100, -253391, -287592, -248764, -201895, -194918, -205127, -137654, 89563, 409857, 582127]
38003E82127j77340m18873k93275O6470K75505J72197k9887r3998n5820o3293
37993c6187j01067m5756R5101J65367O9943r9874j63445m0408J47667J76837k6451
37982A41727k56618k44321J2405K44334K38018M5026j42963j95227r3815Q6728
37972a64706K11767J96811J00040K3660l1527r3870r0716J8042O3665j09731l04521
37961a81086j82118J79226L15585N9067j90636n5480K99544M68534L40606P4446
37951A127688k15673m61974n19581l27871p6014K1250n33J3142P9112J38966K10256
37940a1232K73759J85953p6070k61930j83073k2931l9476j27323j952K90394L94148
37929D20267J52888j99286l71207l06011j23414L5072Q3864N1566M8996R6273
$$ y = [582127, 404787, -14086, -307361, -240891, 34614, 206811, 176924, 82926, 27106, -36187, -137254, -183010, -87909, 77458, 147401, 47527, -115918, -156326, -8659, 168178, 141727, -114891, -359212, -346807, -102473, 135545, 180571, 37608, -157619, -251434, -164706, 47061, 243872, 343912, 367572, 336045, 242175, 151459, 169501, 233166, 123435, -181086, -363204, -183978, 131607, 190674, 38, -55442, 244102, 712636, 1053242, 1127688, 912015, 450041, -69540, -397411, -473425, -452175, -452708, -439566, -360454, -221488, -11232, 262527, 448480, 372410, 110480, -72593, -95524, -135000, -262323, -264275, 26119, 420267, 573155, 373869, 2662, -303349, -426763, -391691, -307827, -256261, -207265, -110992]
37919a10992P5939m3059q9511M8054K03734J68107o641j29281j46099r8478K2134
37908a06093J58346J19830j13767k28765j5946K36540J50207j34007j84740J5503
37898a02892Q4461q2122j53852M1569K32395J66304j9314p7076m09Q2317J18784
37887B90165Q4507n6166k02193j36869J58400L88060K84627o4327l45802l68265
37877C2137j89375R624J00242J03811J28012J80838J29988o7367k21418j56660
37867D9832J6254P8619M4111P5509J46726P1941j55759l25354l12142j88932m2122
37856e41317R9955J75300J43909R9948J17663O7985j57948l46796k06617J55877
37846c92041L49443K50812Q5835j0279j18876k15124j32797Q3265J76591J07086
$$ y = [-110992, -35053, -78112, -167623, -119569, 84165, 252272, 245631, 116350, -29749, -128227, -106093, 52253, 172083, 58316, -170449, -186395, 50145, 200352, 66345, -118395, -102892, -18431, -100553, -254405, -212836, 19559, 185863, 166549, 89473, 89064, 171381, 290165, 374672, 318506, 116313, -20556, 137844, 525904, 810531, 746204, 400402, 32137, -157238, -147614, -47372, 56439, 184451, 365289, 495277, 427910, 206492, 49832, 66086, 144705, 188816, 264325, 411051, 482992, 327233, 1879, -310263, -499195, -541317, -441362, -266062, -122153, -22205, 95458, 163443, 5495, -341301, -547918, -392041, -42598, 208214, 294049, 283770, 164894, -50230, -183027, -99762, 76829, 183915]
37836A83915J00374J96726J59793n6263j71512o9781j1518j56519k62823j06346
37826a93954J34944J70517m699k13697l36422k78549P928L21064L47300J42385
37816I6817R6250K69805K38293j62694m52939k45380J12481J11321j21370j44065
37806b01481K0925M4745k2103J24636L68078K81304j09175k98669j09859O1652
37796A60053n1150j82783o4184J09869N3514j09918o0134K03089L55659J92344
37786F06359j23925k52431m5922K57917K62909q8344l60428j56603L09623M60939
37776H70094J23777k86562l78197k34448j35271j32070r0822M2877J96507K66924
37766B42809J76052l8623j63194k5731K10432K19050L507r6918K9685P6583j26922
$$ y = [183915, 284289, 481015, 640808, 584545, 413033, 343252, 331734, 175215, -87608, -193954, -59010, 111507, 106808, -106889, -443311, -721860, -713932, -392868, -45568, 96817, 193067, 462872, 701165, 538471, 85532, -159848, -47367, 63954, -57416, -201481, -180556, -135811, -157914, -33278, 334800, 616104, 506929, 208260, 98401, 160053, 108903, -73880, -138064, -28195, 25319, -84599, -144733, 58356, 414015, 606359, 482434, 230003, 184081, 441998, 704907, 616563, 256135, 99532, 409155, 870094, 993871, 707309, 329112, 94664, -40607, -172677, -263499, -220622, -24115, 242809, 418861, 380238, 217044, 191313, 401745, 620795, 624302, 527384, 557069, 633652, 506730]
37755E06730k63123m4968K45308J59790j94594l14396p7403J26205O1616j9151
37745A86014J36577L50658L11368M2509j81812k33306k03412j70453j12072l5872
37735I0199k4466j03040j57082n1752J76690L03583J60255j05198j41956J39332
37725B86565L64302J54804l13748n00641k28225J07581J37535r882l1484O2311
37715B9118Q2020O3611J71557K97528J36333l09441o22510m78732l5155L09777
37705c55894L75412K89571K29948K09646J11226j18527l37029l27537p7530J67855
37695A67141K10793J38399J25610J31211p588k61075m14990l59033j63135R3852
37685c38815L50645M52636K66682p5598k68977j89680K4130K10327K82192J56055
$$ y = [506730, 243607, 198639, 443947, 603737, 409143, 94747, 17344, 143549, 205165, 186014, 322591, 673249, 984617, 1027126, 845314, 612008, 408596, 238143, 126071, 90199, 65733, -37307, -194389, -246141, -69451, 234132, 394387, 289189, 147233, 286565, 650867, 805671, 491923, -8718, -236943, -129362, 8173, -1709, -33193, 29118, 111138, 174749, 346306, 643834, 780167, 470726, -151784, -630516, -665671, -355894, 19518, 309089, 539037, 748683, 859909, 741382, 404353, 76816, -714, 167141, 377934, 516333, 641943, 773154, 765566, 504491, 89501, -269532, -432667, -338815, 11830, 464466, 731148, 655550, 386573, 196893, 221023, 431350, 713542, 869597]
37675H69597j35744l10325j43381J22850O7550k22155k23573J80622M51012J96761
37665H53214k47603l62591j53938L4637P8174O1939n220r9772m7419J74508K46229
37654E32158k4452l00321j89676J16593J45587j03493k07573k5297J40906P7633
37644A62065q1582j58284j20149M1868K87580L88327J53677k15775l36944j75737
37634e4954j9021L6549J52988L08588K41733o6931k70678j65753K7214M7470n5668
37623A81537j16960j13623o7976M9786J67388J05595j14298j93998L1754L12037
37613B41242L02056K1158j96451j23230J29537K61031R7425k05811k94552k9425
37603B02980K95278K94414j4287k70138k81506k11897k24047k15288l9897K02541
$$ y = [869597, 733853, 423528, 280147, 402997, 470547, 248392, 24819, 205441, 656453, 853214, 605611, 243020, 89082, 123719, 201893, 263832, 258612, 158840, 111421, 285929, 532158, 507706, 207385, 17709, 134302, 279889, 176396, -31177, -56474, 84432, 162065, 80483, -77801, -197950, -156082, 131498, 519825, 673502, 457727, 120783, -54954, -73975, -37426, 115562, 424150, 665883, 598952, 328274, 162521, 189735, 237205, 181537, 64577, -49046, -117022, -67236, 100152, 205747, 91449, -102549, -70795, 241242, 543298, 564456, 368005, 244775, 374312, 635343, 732768, 526957, 232405, 202980, 498258, 792672, 778385, 508247, 226741, 14844, -209203, -424491, -464388, -261847]
37593b61847K77185J31697l5082k9478Q2448N5400j66679k90331o9744K40283
37583f6148J79327j75043k36252J68203M53129J94712j61750m7998K62666J49369
37573G20215k52650k79262J04520K51216o4005l37192k61199j43486j70272l1452
37563d63567L76380N70713K36381k21100l13700j60671j10699j39665p7452l0954
37553c34334j25630j67460J2332J93434J48624O6278J76987K79537R8731j60622
37543A87877j11059J63022K33171p731k43640k34414n0756J37664K04175O1979
37533C40288k13373l39875j43629J81276L25722K31681J8168k44766m50243l76950
37523f71701K846L35514L14596J12819P4644J76717J56924J1933m0322P576l5298
$$ y = [-261847, 15338, 147035, 111953, 82475, 164923, 220323, 53644, -236687, -306431, -66148, 113179, -61864, -298116, -129913, 323216, 517928, 356178, 308180, 570846, 720215, 467565, 188303, 292823, 544039, 480034, 142842, -118357, -261843, -432115, -463567, -87187, 483526, 719907, 498807, 185107, 24436, -86263, -225928, -303380, -334334, -459964, -627424, -615092, -421658, -273034, -206756, -29769, 249768, 348499, 187877, 76818, 239840, 473011, 465280, 221640, -12774, -63530, 74134, 278309, 340288, 126915, -212960, -356589, -175313, 150409, 382090, 400258, 155492, -294751, -671701, -668855, -333341, -18745, 94074, 168718, 345435, 502359, 514292, 473970, 481546, 446248]
37512D46248j58514j49496O638Q7606L2222L8995J82827K40914M7530k14286k64278
37501B96406j24737n9810j47359j26029J97502N23972L45997k78060o03242j56918
37491a32278M99589M84573j20491l91321J8986L67689K1059n72922o37187k14348
37481f76651Q9163J08296J63502L19161K88526L0920j40366p8828L2414O5599
37471B01736R0325J11012K9338j11188j56368r8644k0007J29671L69102M30448
37461I75425Q2855l81931m57253j77321n7057k47147l04591L0517L62013K52534
37451G8044r8940j81139Q7356L29083K94357J25335M1052L2834l5002j65388j93585
37440C14007j4354K23225K42685r353k53018k18470J860J01165j6548j59669j69404
$$ y = [446248, 287734, 138238, 144876, 232482, 264704, 303699, 486526, 727440, 774970, 560684, 296406, 171669, 111859, -35500, -161529, 35973, 559945, 905942, 627882, 24640, -132278, 367311, 851884, 731393, 340072, 359058, 726747, 747806, 174884, -462303, -676651, -587488, -479192, -315690, 3471, 291997, 322917, 182551, 103723, 136137, 201736, 292061, 403073, 432411, 321223, 164855, 66211, 46204, 175875, 544977, 975425, 1058280, 676349, 219096, 41775, -15282, -262429, -567020, -536503, -174490, 78044, -20896, -202035, -114679, 214404, 508761, 634096, 675148, 707982, 672980, 507592, 314007, 299653, 522878, 765563, 756210, 503192, 284722, 286582, 387747, 371199, 211530, 42126]
37429D2126r3852r299J12727K57823K64670K6811k91229l96137k08484N6346J66108
37418g2390J22941P1455M7666l2352j43762j06733J22411K78861J11319k11620
37408A87796k62745P1823M11108L46701p1658m12831l38774N7123L54124K59300
37398F01967m0244j06720J38841K93603R8709j55610j53391j15775l50139n46213
37388c34972j95498M44974N81846R4702k77034j11913J28419J2968j54184p52
37378A88556K14462J19294j01397j15501n4112j53627k19753k1129J79905P4960
37368A11658r1885J7110J54362n1605k98791n6218M32038M35025n9962k88123
37358C03609O6872L93420J44191l63815m97014j72635J86307K59052R1164p7507
$$ y = [42126, -51726, -61025, 51702, 309525, 574195, 601006, 309777, -86360, -294844, -238498, -72390, 50551, 122006, 169672, 137320, -6442, -113175, 9236, 288097, 399416, 187796, -74949, -3126, 407982, 754683, 683025, 270194, -68580, -11457, 342667, 601967, 561723, 455003, 593844, 887447, 986156, 830546, 677155, 561380, 211241, -334972, -530470, -85496, 496350, 591052, 314018, 202105, 330524, 343492, 189308, 188556, 403018, 522312, 420915, 305414, 251302, 97675, -122078, -143207, 36698, 111658, 19773, 36883, 191245, 139640, -159151, -215369, 216669, 651694, 591732, 303609, 370481, 763901, 908092, 544277, 47263, -125372, 60935, 319987, 411151, 333644]
37348C33644o4978P6194J02713q3708k37318j17057R9070O5241j64418k01708
37338a92325O5263L19395L20394J97583J31608O5244j02912k69093k58685r6731
37328A79741N207q1732k21565j62825R9672K27671k0949l56822k80113J79844
37318d31871M46324K02947k04008l30750j73589O3100K88209L64202R7589l12292
37308I861l08037J92171N16185K08239k68261k97546k5108R2685J08232K48975
37298D77396K65121r0386l63843n3541M08157K67318k52438k87466K11082M39319
37288A020719J15499j93096j98101k63044m45461k37742L76646O09914J05949
37279H91283l96957k16249K41564K52814p5674j63581K0727N2045j18806j25564
$$ y = [333644, 268666, 344860, 447573, 363865, 126547, 9490, 108560, 173801, 9383, -192325, -127062, 192333, 512727, 710310, 841918, 907162, 804250, 535157, 276472, 179741, 184948, 103216, -118349, -281174, -181502, 46169, 25220, -331602, -611715, -431871, 14453, 217400, 13392, -317358, -490947, -427847, -139638, 224564, 322153, 9861, -298176, -106005, 410180, 618419, 350158, 52612, 27504, 120189, 228421, 477396, 742517, 652131, 288288, 234747, 642904, 910222, 657784, 370318, 581400, 1020719, 1136218, 943122, 745021, 481977, 36516, -201226, 175420, 785334, 891283, 494326, 278077, 519641, 772455, 696781, 533200, 553927, 605972, 487166, 361602]
37269C61602J19240K67177R7334j76561k41483o9888J13529J26340K5655K506
37259F25451Q7478R1177o2004j40942K1821J75063J1870k80192k65908L5567J73368
37248D72749j8590k00247r3348J43026K19993Q3751j17041j98938p6065R2975
37238C08265J7797k65335l18807J5287K38419m0676l77769j67850L17417L59424
37228H6172l236j00789J65815K05687j52669l68117j49008J48960K62285L38729
37218D33829L47013J0438m62824m48184L6769K21892j51078l67126L0502M49859
37208A01090K64146j80085k25196P5118K47358J85939N9551j11812k78502k05129
37198f7522P8258J54998o9391j15354K11147L76822M4742k58076l1790K95206
$$ y = [361602, 480842, 748019, 845353, 668792, 427309, 357421, 470950, 597290, 622945, 625451, 712929, 804106, 742102, 601160, 622981, 798044, 809914, 529722, 263814, 299381, 472749, 454159, 253912, 160564, 303590, 523583, 607334, 490293, 291355, 215290, 308265, 326062, 60727, -258080, -242793, -4374, -45050, -422819, -590669, -273252, 86172, 82936, -17853, 147962, 353649, 200980, -167137, -316145, -167185, 95100, 433829, 780842, 791280, 328456, -119728, -82959, 138933, -12145, -379271, -348769, 101090, 365236, 185151, -40045, 35073, 282431, 468370, 527921, 416109, 137607, -67522, 10736, 165734, 96343, -19011, 192136, 568958, 613700, 355624, 323834, 619040]
37188F19040J06183l25943l27551L9194J69281n6551k30637j92022j16401q204
37178c23611K30890L92444K44078L7440J17339K38500m9477n17364n06065R475
37168a26351L56066K02040m7760l0535N7401l4614j34893r44K28278K44252R015
37157G21955k43651k99946j19288J75164L59789K66472m8361l31903l42323k8672
37147A09236M01951N67954K29675l75964o76514l73513K19094N56111M31454N7821
37137A147305k48051l08655j49851L5849P2724L549n875N0821L7505l5071q544
37126E91706J06178J10448k5474r6921k9843R863m3317m2175M4795M1252q4937
37115E81575j33579n9913p6173k20767k16985M9918K86760K37746M6084k7424
$$ y = [619040, 725223, 399280, 71729, 110923, 280204, 223653, -6984, -199006, -315407, -323611, -92721, 299723, 543801, 581241, 698580, 937080, 887603, 370239, -135826, -126351, 229715, 431755, 383995, 353460, 410861, 376247, 241354, 240410, 468688, 712940, 721955, 478304, 178358, 59070, 234234, 594023, 860495, 812134, 480231, 137908, 109236, 511187, 1079141, 1308816, 932852, 256338, -117175, 101919, 658030, 1089484, 1147305, 899254, 590599, 440748, 476597, 549321, 552870, 546995, 597816, 635321, 600250, 591706, 697884, 808332, 782858, 685937, 656094, 665957, 622640, 580465, 625260, 666512, 581575, 447996, 388083, 311910, 91143, -125842, -75924, 210836, 448582, 494666, 467242]
37105D67242N6499K10770L38679K47951j73694n91094m79149R4843M29432J49746
37095G51225k80159k94412m422J25969k927j29660q1688J03019K96542L12592
37085G96079N3637k45542k30833K5186R3110r8561j23481J84214L80184J20175
37075I54168k77948l45026j13886R6513J77882J68815K8338k02910l00886j76826
37065H234k4028K6054O6602J08868J7611j18761j5462K64160K93018k2375k59323
37054C44598j77613l8504k5857M5992K08437J58744j12237j58989J36182K86760
37044F67513O3216o8469J95633L94536Q5335l91391m92581k76984q5474O8773
37034A60107K48838K17674j37619m23320k78196Q7056K93275L08067K05420q2291
$$ y = [467242, 523741, 734511, 1073190, 1321141, 1147447, 556353, 77204, 172047, 601479, 751225, 471066, 176654, 172232, 298201, 295274, 165614, 83926, 186945, 483487, 796079, 849716, 604174, 373341, 398527, 491637, 393076, 269595, 453809, 833993, 954168, 676220, 331194, 217308, 313821, 491703, 660518, 688856, 485946, 185060, 8234, -15794, 10260, 76862, 185730, 203341, 84580, 69118, 333278, 626296, 603921, 344598, 166985, 128481, 102624, 148616, 357053, 515797, 403560, 244571, 380753, 667513, 730729, 662260, 857893, 1252429, 1337764, 946373, 453792, 176808, 91334, 160107, 408945, 626619, 489000, 65680, -212516, -125460, 167815, 475882, 681302, 599011]
37024E99011m05000l37955J29614M20102K56836Q9045K23551K54727j15895m07004
37014G07032j40076L21732L68002N1739j82876j91245m2422K31341L67407k1208
37004A469426o58232o69276R9114O72406M12370m6772r794J30638j59716m20461
36994H19703q0923L39826R7238l80299j88627M60609N79481M180m95715m95123
36984F60350k71372m9959J90400L04667J58306K2563J26612J51642j64510l84045
36974G44654q3155K98846J62484k02333j71333R2866L7192j99794j06014J70035
36964G43448J10141j50769p5260K56712L19625J09847N2199J56013J01876n3264
36954A570568l9021K0453j05829j86842L0193K05018k7810l13547j64291J74641
$$ y = [599011, 194011, -143944, -14330, 405772, 662608, 751653, 975204, 1229931, 1114036, 707032, 566956, 888688, 1256690, 1308429, 1125553, 934308, 891886, 1123227, 1490634, 1469426, 811194, 141918, 241032, 913438, 1325808, 1279036, 1269242, 1399880, 1240164, 819703, 738780, 1078606, 1175844, 795545, 606918, 1067527, 1647008, 1651188, 1155473, 660350, 388978, 339019, 529419, 834086, 992392, 1014955, 1141567, 1293209, 1128699, 744654, 661499, 960345, 1122829, 920496, 749163, 842029, 879221, 679427, 573413, 743448, 853589, 702820, 627560, 884272, 1203897, 1313744, 1365943, 1521956, 1623832, 1570568, 1531547, 1552000, 1446171, 1259329, 1289522, 1494540, 1466730, 1153183, 988892, 1163533]
36944A163533K16091P8056O0268m2136l71290l99627J88781O68647L24658l13186
36934A573795l38026O9185J54239m9117l3907P9499p0894j60497J94689M60034
36924A879000K7665n52266m17938J27235K43482K9558N9528J13724k29841m16144
36914H64003J74172P96930M32931l28199k13587M90065M69580k65944m96711j0794
36904A912446J97290j38972k51231K3133J1959l25211l05686O8247J24109j01156
36894A214928J8629L30821J69724k09480l9570L58642N4688o54013o43339L43
36884F01373J70000j93520j14821M21098M23258j44200k69018J75010K75254p2403
36874A272031l7471L58245K20254l73175m06761J17092J87953j92671r415O57063
$$ y = [1163533, 1379624, 1457680, 1517948, 1475812, 1104522, 704895, 893676, 1562323, 1886981, 1573795, 1235769, 1304954, 1459193, 1410076, 1376169, 1455668, 1384774, 1224277, 1418966, 1879000, 1906665, 1354399, 936461, 1063696, 1307178, 1336736, 1396264, 1509988, 1280147, 864003, 1038175, 1835105, 2268036, 1939837, 1726250, 2216315, 2685895, 2419951, 1923240, 1912446, 2109736, 1970764, 1719533, 1742666, 1754625, 1429414, 1123728, 1191975, 1316084, 1214928, 1233557, 1564378, 1734102, 1524622, 1485052, 1843694, 1898382, 1244369, 601030, 601373, 771373, 577853, 463032, 884130, 1307388, 1163188, 894170, 1069180, 1344434, 1272031, 1234560, 1592805, 1813059, 1439884, 1033123, 1150215, 1338168, 1145497, 1136082, 1793145]
36864A793145O05764k09575m79385J14503M21113J0381j99789J38778K55626j3737
36854B436824R1022N27506L48503l89904n66602p1687L6716l71875l02605K97953
36844B035851L85508j00627j29888L13591J91788m37694m69530L1984j4473m06560
36834A399950O577Q04362M99323n25018m55265N97772P29819k14268m31861L31012
36824B742403L96812m16114m00665N77053O80200l26096n81164K66969M85540
36815C424938k18170k09775N86184M60033m44288j97381R20504O93280n57293
36806D458032l33375J040429P88355p55309m78301J308680J081335r76555r18975
36797E214316J307460J424616q27072q27580J867009K238264l48576m19116K827411
$$ y = [1793145, 2398909, 2189334, 1709949, 1824452, 2245565, 2255946, 2056157, 2194935, 2450561, 2436824, 2527846, 3055352, 3403855, 3013951, 2447349, 2375662, 2412378, 2040503, 1737898, 2035851, 2421359, 2320732, 2190844, 2504435, 2696223, 2258529, 1788999, 1820983, 1806510, 1399950, 1406527, 2210889, 2710212, 2185194, 1729929, 2327701, 3057520, 2843252, 2411391, 2742403, 3139215, 2723101, 2322436, 2899489, 3579689, 3253593, 2672429, 2939398, 3424938, 3206768, 2996993, 3583177, 4043210, 3598922, 3401541, 4322045, 5015325, 4458032, 4124657, 5165086, 5953441, 5198132, 4719831, 6028511, 7109846, 6133291, 5214316, 6521776, 7946392, 7119320, 6291740, 8158749, 10397013, 10048437, 9629321, 12456732]
36788A2456732L348897K68517N59294N336519O409263K352836L252499J1422829
36780D5407386J4742305J1328472K0690002M9526965O4586991L0353111l4475372
36773B02159860p1620112n5666920k0515549o389858j1488593j2115456m262961
36766B0100411j034841m507605m774685k87192R81699k179055k950623q4668P66176
36757F029617j378788j608936P74895J213866r88938j606613K33252Q68528n24563
36748C012320q05508N73059P07453p22438q66854N27743O60480p24007q65250
36739A496998N70366R01180l42961o72593M39589P00396m21642p94474J30357
36730B007216M31866l50621m25380N53976P96510q5728m20070J90620K83633l58411
$$ y = [12456732, 15805629, 16074146, 16633440, 21969959, 28379222, 30732058, 33984557, 45407386, 60149691, 71478163, 92168165, 141695130, 206282121, 236635232, 202159860, 130539748, 74872828, 54357279, 47967421, 36478828, 24363372, 20100411, 19065570, 14557965, 9783280, 9496088, 10477787, 8298732, 5348109, 5263441, 6029617, 4650829, 3041893, 3816788, 5030654, 4041716, 2435103, 2668355, 3536883, 3012320, 2206812, 2779871, 3487324, 2764886, 1898032, 2425775, 3086255, 2362248, 1496998, 2067364, 2968544, 2625583, 1952990, 2392579, 3092975, 2671333, 1876859, 2007216, 2439082, 2088461, 1663081, 2217057, 3013567, 2927839, 2507769, 2698389, 2982022, 2623611]
36720B623611l33167L67872K26126o81357o34523M27395P19362n3425k96738L14459
36710B679615L77030k96909l39818L01698J90140o21076m62842P28804J072725
36701C629367Q8457n38291o2425K85895m8882k8569N90837N91266k82809o99027
36691C525819j86531J45293j11030q241O08214O50548J5267o3091N92557O69755
36681E838560j31041m75149J39392N66681K79837K21221P43348Q82432L56569
36672H421850J78612O30028P02991J81327J83265R89744J422005J053938R74296
36663A4738056J656534K132919K007452K239854L184753L900079M164504N093634
36655C9117785O938300Q434608R292869J1115256J4696917J8722161K2646881
$$ y = [2623611, 2290444, 2658316, 2884442, 2203085, 1568562, 1995957, 2715319, 2661894, 2365156, 2679615, 3056645, 2759736, 2419918, 2721616, 2911756, 2290680, 1827838, 2556642, 3629367, 3717824, 3179533, 3117108, 3403003, 3354121, 3325552, 3916389, 4507655, 4224846, 3525819, 3339288, 3484581, 3373551, 3365310, 3973524, 4624072, 4639339, 4576248, 5168805, 5838560, 5707519, 5232370, 5371762, 5938443, 6218280, 6439501, 7182849, 8065281, 8421850, 8600462, 9230490, 9933481, 10114808, 10298073, 11287817, 12709822, 13763760, 14738056, 16394590, 18527509, 20534961, 22774815, 25959568, 29859647, 34024151, 39117785, 46056085, 54490693, 63783562, 74898818, 89595735, 108317896, 130964777]
36648A30964777K8350439L6080332L9984826L1292823P775374k0761848l8420561
36641B15266162l6686188k2641639j2260453j4313138k2470446k4816554j8410709
36634F3667035j0552700p429335p330035o069596l683488k611937k871757k676895
36626B0441292j846816j475841j461564r23704j62148p2683l92677l04893j2632
36617A3788334j53667m36099k66264O5514Q6738J68390O97796J176815J226932
36608A6354489J398279J859124J524380j89161j936786k225748j542214j227818
36600A4014545j284471r04405k87916k39994n88279n70841k95798l93284o93746
36591H755811n92347k71570l01177m90526l47183j66961m45206p26073l16965
$$ y = [130964777, 159315216, 195395548, 235380374, 266673197, 274448571, 253686723, 215266162, 178579974, 155938335, 143677882, 129364744, 106894298, 82077744, 63667035, 53114335, 45685000, 38354965, 32285369, 28601881, 25989944, 23118187, 20441292, 18594476, 17118635, 15657071, 14733367, 14571219, 14498536, 14105859, 13800966, 13788334, 13634667, 13198568, 12932304, 12997818, 13084556, 13252946, 13950742, 15127557, 16354489, 17752768, 19611892, 21136272, 20947111, 19010325, 16784577, 15242363, 14014545, 12730074, 11825669, 11537753, 11297759, 10709480, 10138639, 9842841, 9449557, 8755811, 8163464, 7891894, 7590717, 7100191, 6753008, 6586047, 6140841, 5414768, 5097803]
36582E097803L19746K05718m92254p42507l24007K7862k8474j21247r4003j85897
36572C662740l42400k75138j16453j86288k87680m8306K77402J96554p5054O3856
36562B869233N20092O22828K02590k48212m05571l88592l03486j62005j39444
36553B567433l42152m85818l17105r5785j45088k57832j04340J31606J10054l8989
36543A021984l4809o509j44337k08761L564J55891k6767j47646J61980M48383
36533A222973J48878l76635m13264p9196q293j87253j01324J99320J96349n5843
36523E45712J0315L83435M12140m5874l12170K8190M89933M62717M1490k59625
36513A756263k21061m4677M798j11720j97908p9223J21820J49572P8232K34424
$$ y = [5097803, 5417549, 5623267, 5131013, 4388506, 4064499, 4092361, 4063887, 3942640, 3848637, 3662740, 3320340, 3045202, 2928749, 2742461, 2454781, 2406475, 2683877, 2880431, 2805377, 2869233, 3389325, 4012153, 4214743, 3966531, 3560960, 3172368, 2868882, 2706877, 2567433, 2225281, 1739463, 1422358, 1326573, 1181485, 923653, 819313, 950919, 1060973, 1021984, 987175, 980666, 836329, 627568, 631132, 787023, 760256, 612610, 774590, 1222973, 1371851, 995216, 581952, 502756, 494463, 307210, 205886, 405206, 601555, 545712, 556027, 939462, 1351602, 1305728, 993558, 1021748, 1511681, 1974398, 2015888, 1756263, 1535202, 1490525, 1495323, 1383603, 1185695, 1106472, 1228292, 1377864, 1456096, 1690520]
36503A690520N29937L92864l28342r40068q39571l64098j52499j48641P8040M15219
36493C33361L89953L8596j59094j00438j22670l00854l31027j29181K2734j9228
36483c77848q8045p6895p0605q4660l2992M7116N1442M3829J42280K52279K00658
36472F559L4177q7556j64180k44816k08053M0671K90805K56209j4560k19582k01530
36461e11856m9145R3562J40794R0666M5539P9593P4941q8964k30504j01890J19127
36450c38137N0633j93692j25981K27024K61863j69299m09144l9134M28347L74357
36440F6837k3860k35794j96368j53268j38490p6840l8769q326J77911L75039J72500
36429g9428l09721l62986J74981N04479J14284l61698k22006J55221Q2500k19242
$$ y = [1690520, 2220457, 2613321, 2284979, 1344911, 505340, 141242, -11257, -159898, -81858, 333361, 723314, 761910, 602816, 502378, 379708, 78854, -252173, -381354, -358620, -377848, -465893, -542788, -613393, -698053, -731045, -683929, -632487, -588658, -446378, -194099, 6559, 40736, -46820, -211000, -455816, -663869, -623198, -332393, -76184, -90744, -310326, -511856, -561001, -467439, -326645, -235979, -190440, -110847, -35906, -124870, -355374, -457264, -338137, -287504, -481196, -607177, -380153, -118290, -287589, -696733, -735867, -307520, 66837, 42977, -192817, -389185, -542453, -680943, -757783, -796552, -804878, -626967, -251928, -79428, -389149, -752135, -577154, -72675, 41609, -320089, -542095, -386874, -304374, -523616]
36419e23616j39356J45492M7578k76207j85263K66812L98307L4059k96238k47464
36409g75896l372K10840L07996J37807k82237m90136j37559L64785L73041l0624
36399c25355k44699j07253K1581k0377m1714M3658J51891K78839L51149J06700
36389B14420l89829n13774L9525N85804L77151k41515m17404j20081L8894k5561
36379d52370R2505L04962J40374k50531k35968J59542K67162l6950j66708M1831
36369a36151N8046k67724l54340M8051L59181J49227j89179j99352o4625p5091
36359f71957m3182K25467M23300K37182p7348j17605K6546K6627q7503n4110J03861
36348h722J32531O661n2560J7740L3458q6213j59676n0330P8553K2024p8383Q4302
$$ y = [-523616, -662972, -517480, -469902, -746109, -931372, -664560, -266253, -232194, -528432, -775896, -779268, -568428, -260432, -122625, -404862, -894998, -1032557, -667772, -294731, -325355, -570054, -677307, -655726, -676103, -717817, -674159, -522268, -243429, 107720, 214420, -175409, -689183, -649658, -63854, 313297, 71782, -345622, -465703, -426809, -452370, -359865, -54903, 85471, -165060, -401028, -241486, 25676, -11274, -177982, -136151, -78105, -345829, -700169, -652118, -292937, -143710, -332889, -532241, -596866, -671957, -715139, -489672, -66372, 170810, 93462, -24143, 2403, 29030, -58473, -112583, -8722, 123809, 130470, 77910, 95650, 129108, 42895, -116781, -167111, -88558, -66534, -144917, -60615]
36336f0615M07596M02302q374j94427K27718O37263L47268j09276K86317J178734
36326C114506J065678l65033j534022j245498l44546j59291m76626l10617K41270
36317a4179L32534l5487j44699P4690R1315r0009m8175M7359k48826n69727k10106
36306h15310M84899N06570j19037l54083R1379L72757O7395j96181Q010K32109
36296B78508J46559J06850K93128K90818l3743j81894L8511J43534n3205l9050
36286I90016L66113N10366l997n78969n63030j99391m8841j21450j45045j20283
36276H5489j00588N2912K72258J81219k31206m15294j08205K28814J99556O3725
36266B28680J13557R9772k11608m73528k97111Q7546K11041M5108j13936j20178
$$ y = [-60615, 346981, 749283, 740909, 546482, 774200, 1411463, 1758731, 1649455, 1935772, 3114506, 4180184, 3815151, 2281129, 1035631, 691085, 531794, 55168, -255449, -14179, 318355, 282868, 138169, 212859, 304174, 214165, 165990, 213349, -35477, -605204, -815310, -330411, 176159, 57122, -296961, -205582, 167175, 234570, 38389, 46399, 278508, 425067, 531917, 825045, 1115863, 1082120, 900226, 938737, 1082271, 1029066, 990016, 1356129, 1866495, 1862498, 1283529, 720499, 521108, 472267, 350817, 205772, 85489, -15099, 37813, 310071, 491290, 260084, -155210, -263415, -34601, 164955, 228680, 342237, 442009, 230401, -243127, -540238, -452692, -241651, -196543, -310479, -430657]
36256d30657n153J64386K25001M0877j79139q6217K22189L05884R9086n4521q8243
36245B13493k40458l78006j09221L43158K96511j97196l08795J45370L17864j97079
36235a14359o07072k65853K56179K19817p9773k5619J92790Q7451j34751q661
36225d79851K70151K25968k9369r4214k9625q2261p9187J83418L75642J70650
36215D31322r0101J3899J84997l5290l59300k35907J41224J69049j22620k12369
36205a15096k6721Q5588J14161L16141N49986M55161J59204O8926J05679j10113
36195A602916m56820m62403j58929k6393j45099j52376q314m6218k37407j50314
36185b41357K61242N09609L40366L8132j48403l00266m22363l11954J179J80553
$$ y = [-430657, -435810, -271424, -46423, -5546, -184685, -270902, -48713, 257171, 356257, 301736, 213493, -26965, -404971, -514192, -171034, 125477, -71719, -380514, -235144, 82720, -114359, -721431, -987284, -731105, -511288, -591061, -616680, -423890, -336439, -471190, -479851, -209700, 16268, -13101, -107315, -136940, -219201, -298388, -114970, 260672, 431322, 341221, 355120, 540117, 504827, 145527, -90380, 50844, 219893, 97273, -115096, -141817, -56229, 57932, 374073, 924059, 1379220, 1538424, 1607350, 1713029, 1602916, 1146096, 683693, 524764, 498371, 353272, 200896, 192582, 146364, -91043, -241357, 19885, 529494, 869860, 907992, 759589, 459323, 36960, -274994, -273815, -93262]
36175i3262J06391L1277R3581J14351K928n8437J9166N3415p7321k35786k69459
36164c13156j87713m2768J14387J56538J9769j07260j615K36862L16904J67021
36154C58969n4434k38349l19161j55356K30135M59645K54542q3034r0243J16602
36144D79316N5884k68496l44405j6664K31527M3184k80432k85386j9301J32328
36134b72445L2667p7443L1444K51331K57607n7222l55983k33718J96875L95465
36124A68578J51372j27329p7009R1527M8076q8281o9524l4127j87261k87664l3575
36113d45217K97205K15984j60110l00782j25669p589j4564J34203L66928K54434
36103B14823j83865l67125m9327K92849K22684n4408j41467l6661L7326K5397
$$ y = [-93262, 13129, 44406, 137987, 252338, 255266, 196829, 215995, 269410, 192089, -43697, -313156, -500869, -543637, -429250, -272712, -252943, -360203, -361818, -124956, 191948, 358969, 304535, 66186, -252975, -408331, -178196, 281449, 535991, 452957, 362714, 479316, 535200, 266704, -77701, -94365, 137162, 180346, -100086, -385472, -404773, -272445, -239778, -317221, -285777, -34446, 223161, 165939, -190044, -423762, -226887, 168578, 319950, 192621, 115612, 207139, 255215, 166934, 97410, 63283, -123978, -411642, -445217, -148012, 67972, -92138, -392920, -518589, -526178, -540742, -406539, -39611, 214823, 30958, -336167, -385494, -92645, 130039, 75631, -65836, -102497, -65171, -39774]
36093c9774j1173n7594o9535J0912O9578n3797k15938j19280J48205J69279j10650
36082b79767k35737L5489L36297K85001M2329m6272p004p2566k17736k23064n9833
36071d42863Q4158R0228J4190m3295m2611k0305m1942q9314m6402R5533J45060
36060b97563J4335n6341J25201K88083Q0127k84531k94233J3487J00884j33028
36050d43579j65166K01645M23527J43664j24494J79459O64862N23876k20079p24465
36040D59250n26100p7908K2272j82339k35870L6026L34151K90039r3380m17185
36030c91044l04412J56021M81909L64989J5859j69807j17610n3104j07581j93848
36020c18628k21079j89105o5489K03350M98324N37405J98406k73706m96764l49060
$$ y = [-39774, -50947, -108541, -178076, -167164, -97586, -151383, -367321, -486601, -338396, -169117, -279767, -515504, -480015, -143718, 141283, 183612, 137340, 130336, 57770, -159966, -383030, -442863, -358705, -268477, -254287, -297582, -340193, -360498, -402440, -491754, -538156, -442623, -297563, -283228, -339569, -214368, 73715, 153842, -130689, -424922, -411435, -310551, -443579, -608745, -407100, 16427, 160091, 35597, 215056, 879918, 1403794, 1183715, 459250, -66850, -144758, -122486, -304825, -540695, -504669, -170518, 119521, 26141, -391044, -695456, -539435, -57526, 307463, 323322, 153515, 35905, -17199, -124780, -318628, -539707, -728812, -794301, -590951, -92627, 444778, 643184, 369478, -127286, -476346]
36010d76346n9797P6589O792p6550N360J98378K74596R9199j93643l23325j65979
35999f34726J01006K01667Q8178k0087N5381K19285K62799J48768k357j24484
35989B95430k21684k31181q7685R4908J30968M7931K5296N5494m5533k59541l20896
35978e16493j32227R3193J98459K54259K64806R9301j38540j19174J24610J10873
35968B39067k88073m84062n7979M92896M75298O0592n8864K05955L03680J3546
35958I02056k67567k38549p5126m532j1364n9570j71884k26944o8395J65579J91986
35947A35690K9159p9293r4481j23327o4940J97353L86371J68257k13606k47071
35937I4112M158L8493j67352j47665J22028J17783k49105l77164L138L35549J59055
$$ y = [-476346, -536143, -459554, -452762, -529312, -523952, -325574, -50978, 48221, -145422, -468747, -634726, -533720, -332053, -243875, -263962, -208581, 10704, 273503, 422271, 419914, 295430, 73746, -157435, -245120, -150212, -19244, 28687, 53983, 109477, 63944, -195597, -516493, -648720, -555527, -357068, -102809, 161997, 261298, 122758, 3584, 128194, 239067, -49006, -533068, -591047, -98151, 377147, 437739, 378875, 584830, 888510, 902056, 634489, 395940, 320814, 316282, 304918, 245348, 73464, -153480, -221875, -56296, 135690, 164849, 85556, -8925, -132252, -197192, 161, 386532, 554789, 341183, 94112, 98270, 136763, -30589, -178254, -56226, 61557, -187548, -564712, -561574, -226025, -66970]
35926f6970j79831j86944K3553J06757Q1970Q2515q944k30709k90084m6477J88537
35915e26627J89421J67031K34912J05085k60775l32220J11818M17282M2050m73901
35905c25924l26099K51544M07084N4274j27754Q7720K12728K054k02156j93452
35895a59981j91603k52684j01887K43066L38994M9949j84448p5468Q4136J4993
35885b34933o2712Q8171K23498M6308k22033j68700J43003K80888R4377j42516
35875D5351j95654j32762r1805o1634J6700J00832R8901j282j09932j18983k875
35864d53143J45078J90657R1358o4999j59970j54822r3962l1034K4972R5185J74530
35853b36150K09591J53452K7607j01418j87749k15715j87081j48523j61480j67862
$$ y = [-66970, -246801, -433745, -410192, -303435, -221465, -138950, -147894, -378603, -668687, -715164, -526627, -337206, -170175, 64737, 169822, -90953, -423173, -311355, 105927, 147977, -325924, -652023, -400479, 6605, 60879, -66875, 20845, 233573, 235627, 33471, -159981, -351584, -604268, -706155, -463089, -124095, -74146, -258594, -334062, -249926, -234933, -297645, -209474, 14024, 60332, -161701, -330401, -187398, 93490, 187867, 45351, -150303, -283065, -374870, -436504, -419804, -318972, -220071, -221353, -331285, -450268, -453143, -308065, -117408, -26050, -91049, -251019, -405841, -499803, -530837, -505865, -410680, -236150, -26559, 126893, 154500, 53082, -134667, -350382, -537463, -685986, -847466, -1015328]
35843a015328M594L60784N83042L83695o6204l28076k66976j27437o6791J8086
35833e20611J55568J85267R3905Q6563J80015J14014j58759l09260j79428n6179
35823d08905j22478j06250J50466K56578q5610m31300k13577L07760M15754N2157
35813a85405j73225p182J66456J19566J13478K56007K07642j61244l98862j47772
35803b10541K60664L04145J8401j70667j14740k7771m7695r1182r5074r8745q6816
35792c60021J4580J57061J65456k6792k47566k67996q1760P4005K2934r4593k0020
35781f64712J86948J73883j31574k91472J9955M41018L89869o9463l30048j50147
35771d25743Q3211N9205l2349L2289J13159N6651L1530J83442K82586P0745k82452
$$ y = [-1015328, -1010734, -649950, -66908, 316787, 250583, -77493, -344469, -471906, -538697, -520611, -365043, -179776, -85871, 692, 180707, 294721, 135962, -173298, -352726, -408905, -531383, -637633, -487167, -230589, -316199, -747499, -961076, -653316, -237562, -185405, -358630, -365812, -199356, -79790, 33688, 289695, 497337, 336093, -62769, -210541, 50123, 354268, 372669, 202002, 87262, 59491, 11796, -79386, -174460, -273205, -360021, -345441, -188380, -22924, -49716, -297282, -565278, -647038, -573033, -550099, -644692, -664712, -477764, -303881, -435455, -726927, -706972, -265954, 123915, 54452, -275596, -425743, -342532, -283327, -315676, -283387, -170228, -113577, -82047, 101395, 383981, 454726, 172274]
35760A72274m05527k26343L7742K15039K42486Q1207j60585k04429K5812K00918
35750b1406M2595k31655k54985q0532P398N1962K78560N04000K93397k50717m69825
35739a31208j15913K37007P9722k48612j54058K17988K12545k62223n47781k17781
35729i30314L07121M00280Q5736j20760l021J38777L0783j82634k18995q5943
35719e78970j9828r8977j36583J4449K16216K19818R916j64375j09578Q9634K29979
35708c28299K54370K32148J58779l1128k52049k85090r6990N1873k7128j47281
35698d70795l6049J95496J85334r2453k23566L5905L54944K82384j04902l23231
35688a96933j56561J21022K11731J64803J52907J37198j6525k27014k56615o1298
$$ y = [172274, -233253, -459596, -421854, -206815, 35671, 116878, -43707, -248136, -222324, -21406, 21189, -210466, -465451, -545983, -538585, -486623, -208063, 295937, 589334, 338617, -131208, -247121, -10114, 69608, -179004, -333062, -115074, 97471, -164752, -712533, -930314, -623193, -222913, -137177, -257937, -260958, -122181, -91398, -274032, -493027, -578970, -598798, -697775, -834358, -819909, -603693, -383875, -373959, -538334, -647912, -558278, -328299, -73929, 158219, 316998, 285870, 33821, -251269, -348259, -296386, -323514, -470795, -506844, -311348, -126014, -218467, -442033, -406128, -51184, 231200, 126298, -196933, -353494, -232472, -20741, 144062, 296969, 434167, 417642, 190628, -65987, -127285]
35678a27285J25765R9267q7511k47459k68411j29717J31803L57595L24394L9815
35668B18256j53752l612K35437J22834k78492m38332j53468J44785R1938n2816
35658b67222P2752K55392Q8423k37641j81455K06750K88696j28741m47188k21284
35648e71518J61215J40620j65805k58809m7692J58717K20562K43963K31641R6231
35638B09125o2335p6200k9150j01927j91132o1223J92246K30014k89k02531k03724
35627b97126j15886j5933J47131K82228J94005k3894l5979J69661J82143j68300
35617C18050m63477l15057K8609Q2041j30081j71240Q9976L14316K53384P7878
35607H4399K6777M0430o2334k35240k49480k1183K65576L60939J89614j03617
$$ y = [-127285, -1520, 97747, 10236, -237223, -505634, -635351, -503548, -145953, 178441, 218256, 64504, 60892, 296329, 419163, 140671, -297661, -451129, -306344, -214406, -267222, -194470, 60922, 149345, -88296, -269751, -63001, 225695, 96954, -350234, -571518, -410303, -269683, -435488, -694297, -741989, -583272, -362710, -118747, 112894, 209125, 146790, 70590, 41440, -60487, -251619, -312842, -120596, 109418, 109129, -93402, -297126, -413012, -428945, -281814, 414, 194419, 170525, 134546, 304207, 486350, 318050, -145427, -460484, -431875, -349834, -479915, -651155, -561179, -246863, 6521, 84399, 111176, 151606, 89272, -145968, -395448, -416631, -151055, 209884, 399498, 295881]
35597B95881k90565k53362q7413L599n2336j05277M561K00782K61004J35575P976
35586A20425q200l8855j87345k90194j56534Q0857J36160K6241L5379K19964K95048
35575B32946J08684j05557j18705m9928r7607j82889j29334o129q577j15327j18575
35564e90998P0668L27780M46889K61252k01914n76142m25634J52355M93734K06711
35554A64701k70394l17779k7441N8967j21285j13539K09477M01808J82123j22392
35544D4246j17768P8061Q6184j69419m07827l57003j5369L54164M38659J93779
35534A27707p8304j07252O81Q995l1980M5805J06214q1867l10659j59663K46172
35523b34151L14711o2825k78630K2341L61186K11314j75707k46216l0852L3253
$$ y = [295881, 5316, -248046, -335459, -331860, -384196, -489473, -484912, -284130, -23126, 112449, 120425, 112225, 73370, -113975, -404169, -560703, -479846, -343686, -317445, -282066, -62102, 232946, 341630, 236073, 117368, 67440, -30167, -213056, -342390, -348519, -357096, -472423, -590998, -520330, -192550, 254339, 515591, 313677, -262465, -688099, -535744, -42010, 164701, -105693, -423472, -450913, -391946, -513231, -626770, -417293, -15485, 166638, 44246, -73522, 4539, 90723, -78696, -486523, -843526, -858895, -504731, -66072, 127707, 49403, -57849, -57168, -48173, -80153, -34348, 71866, -10001, -320660, -480323, -234151, 80560, 17735, -260895, -238554, 122632, 333946, 158239, -87977, -118829, -85576]
35513h5576r6167n4143K27467L55130Q5349l02896l85348j03577K13834K28205
35503H2278n2158k65498j14481K16154K58416p9459l47877k01151J13740J79798
35493b10238L2650n114R2546O6817j10640j61071K0059J71790Q9033m6789M2142
35482a8815K74704K81087q0817m71323m60156q7180J78154P5694j06445j4828
35472d29925K08691J94712q931k5340J77297K17098l0723k11560j02023M7483
35462C6779O601o3342l384K3195q3864q8190J23310K29339J0431k19630j47797
35451a76552p216r5446j67122R7307L88256K27051j50500j37420J83642J47729
35441C09729l32099n44421j07649M12917L50186j57461m77993l19871Q0801L52229
$$ y = [-85576, -181743, -235886, -8419, 346711, 432060, 129164, -256184, -359761, -145927, 82278, 30120, -235378, -349859, -133705, 124711, 45252, -302625, -503776, -390036, -210238, -177588, -182702, -90156, -23339, -133979, -295050, -274991, -103201, -14168, -60957, -18815, 255889, 536976, 456159, -15164, -475320, -562500, -384346, -308652, -415097, -429925, -221234, -26522, -35453, -60793, 116504, 333602, 302879, 91319, -10704, 36779, 43380, -19962, -23346, -151, -84015, -172205, -48895, 180444, 190875, -28755, -176552, -183768, -279214, -446336, -349029, 39227, 266278, 115778, -21642, 162000, 309729, -22370, -566791, -674440, -261523, 88663, -68798, -546791, -866662, -785861, -433632]
35431d33632L16800R7181R382J86208L27924R5858l09804l61312J0393K97389
35421B36387J67008j25952k30907j63799o5917R0163K84385K88121K1686k02114
35411B99061r3193J72947K18991Q126j61389j09471K8642L9984j00992k28602
35401G4104j87527l0227K5234j10505k42201j63770K2778P0346k2777m0103R3417
35390e11231K43887L17126L12641J88056n0303j97110r9327L2103q8384l26639
35380a79181l35787j49542p6744q5664J22453M37921L99636K0187j37194R6101
35370A12186J81815j71546m44804j73023K38512J57359k79149m38974j52077K02398
35360g67303L51360L34158K03619j0002j46161j04016n0244j21296j33691O8353
$$ y = [-433632, -116832, -19651, -10269, 175939, 503863, 599721, 289917, -71395, -61002, 236387, 403395, 277443, 46536, -117263, -183180, -93017, 191368, 479489, 501175, 299061, 205868, 378815, 597806, 605932, 444543, 335072, 363714, 403698, 302706, 74104, -113423, -143650, -118416, -228921, -471122, -634892, -612114, -541768, -564545, -604648, -511231, -267344, 49782, 362423, 550479, 500176, 303066, 203739, 235842, 147458, -179181, -514968, -664510, -741254, -826918, -704465, -266544, 133092, 153279, 16085, 112186, 294001, 122455, -322349, -495372, -256860, -99501, -378650, -817624, -969701, -767303, -415943, -81785, 121834, 111832, -34329, -138345, -188589, -309885, -443576, -375223]
35350c75223K40763J22061p1117J646J80945O4330k69033l50118q1980J30144
35340d07582M8473q0713P261K00972K34476M4316k04742k91534j21926J34048
35330d36951J69735n5858k03482k3202K72981L49324K23179J04887J536j59593
35320B42556k34035r3744L2599j14345l26613k19522J18746K58983J16366J443
35310b17566L8451L7411n5502o0245N3075J13604R9950J34529J49138j5933k15828
35299F1084j65348L5129L0108j62503j86648o557M6593p5507n0504J58792J87188
35288a28173l7402j08017J31370K78721P1433j86648k06279j69572k62071k71172
35278h87810k8510K20080K52949K24360K39580Q5227k38902k70212J62370M73486
$$ y = [-375223, -134460, -12399, -83516, -81870, 99075, 163405, -105628, -455746, -537726, -407582, -359109, -439822, -432561, -231589, 2887, 47203, -157539, -449073, -570999, -436951, -267216, -323074, -526556, -549758, -276777, 72547, 295726, 400613, 402149, 242556, 8521, -85223, -52624, -166969, -493582, -713104, -594358, -335375, -219009, -217566, -179115, -141704, -197206, -257451, -204376, -90772, 9178, 143707, 292845, 276912, 61084, -104264, -69135, -39027, -201530, -388178, -394735, -348142, -423649, -474153, -315361, -128173, -165575, -273592, -142222, 136499, 207932, 21284, -184995, -354567, -616638, -887810, -916320, -696240, -443291, -218931, 20649, 105876, -133026, -403238, -240868, 232618]
35268B32618J74896l00467k73668J09587K07971m1486j54165j1911K4422j40100
35258a72303j80943K0478J98599K02232J51456P7167r8943k30883j01291J09729
35248b4702M2650j72888o7931L08297L41918j66390o16875m93987p2725J17333
35238h05300N4688L6343J00758Q3644K936r679P542l9329n6564O4336J76333Q4868
35226b99424q7371n5464J65240K54652O4522j57131j09648J57547L10276J42483
35216C85682j83621l49409k66972j27931n9377N8252K87587L75529R7074k86488
35206f9674l02366M0409K55697J25145j3467J22007L00429K02635o3415k01941
35196C95459j94613j85532j45087n259P3499o0296k13871j28167O1024M4305j07994
$$ y = [232618, 407514, 107047, -166621, -57034, 150937, 109451, -44714, -56625, -32203, -172303, -353246, -332768, -134169, 68063, 219519, 296686, 197743, -33140, -134431, -24702, 17948, -154940, -222871, 85426, 427344, 260954, -355921, -849908, -922633, -805300, -750612, -714269, -613511, -529867, -526931, -536610, -529068, -568397, -624961, -560625, -384292, -299424, -386795, -442259, -277019, -22367, 42155, -114976, -224624, -67077, 243199, 385682, 202061, -147348, -414320, -542251, -601628, -543376, -255789, 119740, 216814, -69674, -372040, -331631, -75934, 49211, 35744, 157751, 458180, 660815, 597400, 395459, 200846, 15314, -129773, -135032, -61533, -121829, -335700, -463867, -402843, -358538, -466532]
35185d66532p0399J29751J30543j13398k06331L6339K84651K41671O4398j0739
35175A9954n8584j69871j38148J63988L98347K06114j79905k63132p7340r4472
35165a93049l66748l73842J04616N25424L41116j88283l83507r5820K00633J69206
35155b60254O680J5927J52717J80773N9895k5180N4649K10263K55340J25172n4430
35144G21552j23393q2924o1916r4952p1678L8652Q2111l1933j41273p9965K1907
35133A76188p1258l08459m20282l17216j35094O8584L32210N11593L64374j1840
35123A88800k05822r1840k1299k20771l92157k15550R3642J23220q5695j52676
35113i80148K6235J94288J93665J23026N6800m4878j37940j12791k0665m954k1162
$$ y = [-466532, -536931, -407180, -276637, -390035, -596366, -560027, -275376, -33705, 30693, 19954, -38630, -208501, -346649, -182661, 215686, 421800, 241895, -21237, -98577, -193049, -559797, -933639, -829023, -303599, 37517, -150766, -534273, -630093, -429460, -260254, -253574, -237647, -84930, 95843, 155738, 130558, 185207, 395470, 650810, 775982, 721552, 598159, 515235, 453319, 358367, 286689, 325341, 407452, 375519, 234246, 154281, 176188, 104930, -203529, -623811, -941027, -1076121, -1007537, -675327, -163734, 200640, 188800, -17022, -108862, -130161, -350932, -743089, -958639, -864997, -741777, -827472, -980148, -953913, -759625, -565960, -442934, -386134, -431012, -568952, -681743, -702408, -707362, -728524]
35102g28524Q5014K40449K08104O30r8201K6899J73129J65971N0946j11553l16507
35091c03643m14981k03572J75862K91381L2784j88853m6542K49867L43632K38864
35081A74799J38342P5117J0049K6355J18635N7034k12498l23703l5788K65879
35071B94221J02192k98954l12202R5719L10147K3322l54686l80110j45696L7233
35061f28814Q1520K7487j10001j89367m367L09557L23850j8359k23168p138K32625
35050b06175R8255j18673M0333L57533K66725j91769m27337k38392k6193l3164
35040d78857k4313J17961J02642j92116l84223j79712J38500J92355J02111J75044
35030d30608L08205J82421j33068k50077o9089J05593O4895n0136m7192N1404
$$ y = [-728524, -643510, -403061, -194957, -194327, -292528, -265629, -92500, 73471, 124417, 12864, -303643, -718624, -922196, -746334, -454953, -422169, -611022, -657564, -407697, -64065, 174799, 313141, 388258, 398307, 424662, 543297, 600331, 387833, 64130, 28342, 294221, 396413, 97459, -214743, -119024, 191123, 214445, -140241, -520351, -666047, -628814, -547294, -519807, -629808, -819175, -823542, -513985, -190135, -208494, -431662, -438800, -206175, -107920, -226593, -186260, 171273, 437998, 246229, -181108, -419500, -445693, -478857, -503170, -385209, -282567, -474683, -858906, -1038618, -900118, -707763, -605652, -430608, -122403, 60018, -73050, -323127, -392216, -286623, -221728, -271864, -319056, -267652]
35020b67652J20453J03738J7341p0098n1589R2011K11075J64459J3291j02435
35010B30594j75254k39070j95777K3030K25033J73824k4339n0958J31415K24335
35000C22833N2950k10572l35373k85632j28992P3639K26807K44854J66318O4143
34990A90975r2376k75850k44629J15450M27857K59250j55739j75168K39397M02654
34980F91821k5164m85813l82336O5554K68547J19351q5209k07814k59454j20692
34970d21209K28029M32333J95848k16057l46390j97169n5876O7593K88949L68312
34960C44363J9573m34180l93457O3369K50943l6812k22581O9293L98577K45800
34950C04888j74765k98156m9718J56778P3442j23413j72958n1618O5617L7380
$$ y = [-267652, -147199, -43461, -26120, -96218, -147807, -55796, 155279, 319738, 333029, 230594, 55340, -183730, -379507, -356477, -131444, 42380, 18041, -32917, 98498, 322833, 375783, 165211, -170162, -455794, -584786, -511147, -284340, -39486, 126832, 190975, 98599, -177251, -421880, -306430, 121427, 380677, 224938, 49770, 289167, 691821, 666657, 180844, -201492, -135938, 132609, 251960, 166751, -41063, -300517, -421209, -193180, 239153, 435001, 218944, -127446, -324615, -380491, -312898, -23949, 344363, 363936, -70244, -463701, -400332, -149389, -186201, -408782, -339489, 59088, 304888, 130123, -168033, -217751, -60973, 12469, -110944, -283902, -335520, -269903, -232523]
34940b32523p8371j03621o427M3734N32R4988M04291N25646J21928m05283l75984
34929a1090J13252K77939j41064m90077k76545R6990J05217m0188J06256L64704
34919A05394K68096o4852j18501J11448J05661k75907n28074k95345J00535J86842
34909d04703J646p9927O6009K16993J98971R7958M7336J587j47907l13214k48057
34898e63308R8878M26140M19384J36977j25812k46766k97521k43978K3180L49826
34888b3000L87718J05926j15637m7516P6779J391j29944n4403J65300K50102Q2949
34877F99665k26897m86744m86875j51666K43638K84830j4944j94307m3701R4106
34867b82895l9655j64681j5159J24323n6887k41736K7305M99525N28921P3442
$$ y = [-232523, -310894, -414515, -420942, -377208, -376676, -281688, 122603, 648249, 770177, 364894, -11090, 102162, 380101, 239037, -251040, -527585, -430595, -325378, -365566, -259310, 105394, 373490, 308638, 190137, 301585, 407246, 131339, -396735, -692080, -591545, -404703, -403057, -482984, -416975, -199982, -1011, 96947, 144283, 145870, -2037, -315251, -563308, -464430, -38290, 381094, 518071, 392259, 145493, -152028, -396006, -372826, -23000, 364718, 470644, 355007, 307491, 384270, 385661, 255717, 201314, 366614, 616716, 699665, 472768, -13976, -500851, -652517, -408879, -124049, -138993, -333300, -377001, -282895, -322550, -487231, -502390, -378067, -434954, -676690, -649385, -149860, 379061, 452503]
34857D52503k90636k87495k12860k58459k07089N2965K56360K02492L6186p8098
34847c34131j70156k14206o1020K21191L10065J08428p7269j1986J34389J17752
34837B3057l601l0501N9543J36079R7256p4500k84032l26636j18062J02079N8101
34826c61217j18100p5293J59900K10734N825r5395M0606P5900j42743k16033J32609
34815c83207M76677K90414j95676l15540K8042K59563K6751l20121k94131O3915
34805c63313L16696K15954o3377k05809j12689N6955J32999J21236R8911L7660
34795B35223j07807k06629r2762J05538P2567j89227k90191m8952J82878O0633
34785b78729j92877j43322J55540K72709J16240M7357K24929L11440M6950k69295
$$ y = [452503, 161867, -125628, -338488, -596947, -804036, -751071, -494711, -292219, -256033, -334131, -504287, -718493, -779513, -558322, -248257, -139829, -217098, -229084, -94695, 23057, 19456, -11045, 48498, 184577, 281833, 207333, -76699, -403335, -521397, -419318, -361217, -479317, -554610, -394710, -183976, -178151, -273546, -232940, -157040, -299783, -515816, -383207, 93470, 383884, 188208, -127332, -99290, 160273, 187024, -133097, -427228, -363313, -46617, 169337, 105960, -99849, -212538, -155583, -22584, 98652, 197563, 235223, 127416, -79213, -171975, -66437, 6130, -183097, -473288, -522240, -339362, -278729, -471606, -614928, -459388, -186679, -70439, -23082, 201847, 513287, 560237, 290942]
34775B90942k11275R9917J61786j41216l51037j26089K36451K36656r3226k59333
34765a56424n4589J65581P2941j32880q3834J58428K28766M9602j00903r1932
34755E4756j09790k30347k00241J32343M52164L48376q9413l53713j80815J34335
34745d2345J69796p1663k24026j00535O0141r430j65831p9940J79869J66160k47298
34734c65102n66171l35900K11769N21066M68142L34839K24506J3966j94935j22744
34724A89436J45022J75055j34901l67185k38674K851M4908m5012q7329j17959
34714d33788j72091r0076J64979L11223J70048j5718O445P4648m7622j98428r9989
34703c30369J14843J11329o5485q1952Q8971J29586m9540j34237P6236L24471
$$ y = [290942, 79667, 179584, 341370, 200154, -150883, -276972, -40521, 196135, 102909, -156424, -211013, -45432, 27509, -105371, -189205, -30777, 197989, 247591, 146688, 54756, -55034, -285381, -485622, -353279, 98885, 447261, 357848, 4135, -176680, -42345, 127451, 55788, -168238, -268773, -208632, -218062, -383893, -463833, -283964, -117804, -365102, -931273, -1267173, -1055404, -534338, -66196, 268643, 493149, 507115, 312180, 189436, 334458, 509513, 374612, 7427, -231247, -228396, -183488, -228500, -315829, -433788, -605879, -695955, -530976, -219753, -49705, -65423, -58978, 15670, -31952, -230380, -330369, -215526, -104197, -169682, -251634, -162663, -33077, -82617, -216854, -140618, 183853]
34693A83853K54317j03927l90742l51437p7251J51954J81346J04613P9781R9472
34683A31979N0879n0213p0770j024L4408K7248R1030J68259M2077k50229l52231
34672a78587j16985J31497R8945m4412k2657O4774j0850j31697k1004K48339L35165
34661C52528J41068j02266k00105j61333o3067M252n4486j75235j27855J15805
34651b70694K26270k933k71032k07279N4696J42451N6709N3163R9363l0567k33461
34640c83314j87476N8219J27575m4640j25965K1414J50050J07471N0550P8573
34630a47543O7289l0833r6386j15558j74067j72736K7359J93054k9101m22633
34620i01155l66504J78693M94305J82474k02315k0888M70448N40212M7003m50503
$$ y = [183853, 438170, 334243, -56499, -407936, -485187, -333233, -151887, -47274, 32507, 131979, 182858, 132645, 61875, 60851, 95259, 122507, 213537, 381796, 423873, 173644, -178587, -295572, -164075, -65130, -109542, -132199, -67425, -78275, -209972, -230976, 17363, 352528, 493596, 391330, 191225, 29892, -33175, -28923, -83409, -258644, -386499, -270694, -44424, -47357, -318389, -525668, -470972, -328521, -271812, -218649, -119286, -149853, -383314, -570790, -512571, -384996, -429636, -555601, -534187, -384137, -276666, -226116, -147543, -80254, -111087, -207473, -323031, -497098, -669834, -642475, -449421, -478522, -901155, -1267659, -1088966, -594661, -412187, -614502, -635390, -164942, 375270, 422273, -28230]
34610b8230m90999j80593Q3610O0962j46379k12957L1607L26216K92777J6921
34600b47065m9234J80351K63308k1044k70648j30179J20075Q5729m1716J45602
34590C5179M83443M22021r8852n11723l97158K5778K70334J39566j69371l20264
34580a21047j59303J10194J38602r8725k22971L758K97611K70321L092j27126
34570I4406l0225N4701Q555l9482j1898J0151k332K2201O3252m214j84634k93531
34558c13050j59850J80019M64847L70086j55096o63293n86420J8107M13031J25700
34548c05919l80337l62681J46417M56170K50328o2541p3664P1719M6823j10455
34538c24140j09292J21624L20693K28723q1277k58779q7299K06694K13126q8734
$$ y = [-28230, -519229, -699822, -616212, -555250, -701629, -914586, -882979, -556763, -263986, -247065, -296299, -115948, 147360, 126316, -144332, -274511, -154436, -68707, -110423, 35179, 518622, 940643, 841791, 330068, -67090, -41312, 229022, 368588, 199217, -121047, -280350, -170156, -31554, -130279, -353250, -349492, -51881, 218440, 221532, 94406, 64181, 118882, 127437, 87955, 76057, 86208, 83876, 106077, 169329, 165115, -19519, -313050, -472900, -292881, 171966, 542052, 386956, -276337, -862757, -844650, -431619, -305919, -686256, -1048937, -902520, -446350, -196022, -258563, -332227, -260508, -213685, -324140, -433432, -311808, 8885, 237608, 156331, -102448, -189747, 16947, 230073, 141339]
34528A41339k76069j02602J39937R7943j11201j54855j8420P8892R7865J31411
34518B4240J12805m7945j88109j26262q957m2960q3082P6155K19546M7194k07328
34507b24703j05235J98932J77811j21716j21358K48459L65031j9332l14167n8266
34497B5456L45990L33644L7128p6399K2249M7719k8686k8179L5715J8834o3499
34486F69972j22878j88952k63757k11422k0499Q1911p437q0715p75N9759k0164
34475a04957p1893K389J9804q0056m8148J79369K68981Q9934L763J72547J63428
34464E95161k53772n24122j80188K71393J36676k76722j88643K92488L73640l6997
34454B08914k25826L7437J67590r8611k32496Q0207L47363J32165k31946k72850
$$ y = [141339, -134730, -237332, -97395, 548, -110653, -265508, -283928, -205036, -107171, 24240, 137045, 89100, -99009, -225271, -234228, -277188, -360270, -284115, -64569, -17375, -224703, -329938, -131006, 46805, -74911, -196269, 52190, 417221, 397889, 83722, 25456, 371446, 705090, 742218, 665819, 688068, 735787, 707101, 678922, 714637, 733471, 669972, 547094, 358142, 94385, -117037, -137536, -55625, -63062, -143777, -144552, -84793, -104957, -176850, -174461, -154657, -234713, -282861, -103492, 165489, 255423, 259186, 431733, 595161, 341389, -182733, -362921, -91528, 45148, -231574, -420217, -127729, 245911, 208914, -16912, 20525, 188115, 89504, -142992, -62785, 284578, 416743, 184797, -88053]
34444h8053j10717p2200r4934P408J19412R9279J00176K32669K74999P4125j38238
34433D03926j67163j88044l04068k14979K30593N70661L46762j45955k86656n5389
34423A89688N3113j16845k11447k6204J95719K02682O4829l5461m2805J7426R5938
34412C86633R4158l5357j74816j87435j16878p8640n6720%J160j33208k48715
34401e49818j38730J16610K37605J32090k1388n0560L3611J10712O4090j23503
34391a89281k86877k11888M2472J44296l3042j64426N3734M01968M33421J24358
34381C14735j27222r3598L2521K584j49262k11075p5398J43182K20591Q0745o7136
34370G0667P699J75146J01060j82196k55499j87J63322p718j30400J09739L11534
$$ y = [-88053, -198770, -270970, -365904, -358496, -239084, -139805, -39629, 193040, 468039, 542164, 403926, 236763, 48719, -255349, -470328, -239735, 330926, 677688, 531733, 245077, 189688, 242801, 125956, -85491, -111695, 84024, 286706, 351535, 316074, 273269, 290695, 386633, 480791, 445434, 270618, 83183, -33695, -112335, -169055, -169055, -167895, -301103, -549818, -688548, -571938, -334333, -202243, -223631, -274191, -240580, -129868, -65778, -189281, -476158, -688046, -645574, -501278, -534320, -698746, -645012, -243044, 190377, 314735, 187513, 93915, 126436, 129020, -20242, -231317, -306715, -163533, 57058, 137803, 70667, 78366, 253512, 354572, 172376, -83123, -83310, 80012, 72294, -58106, 51633, 363167]
34359C63167O909m39624l19230K63963N10937J37983k94485l21787j30894k3273
34349b46334L4336J00386M9381r4014q3876Q3802Q7311j62108l31454k17598l5221
34338h15389L1168J02992K37173K44753R7557N5823J68878J28860j35655k32781
34328a16621K8802K66431J70538J8119J20936K42100N0967k59129l27329k36274
34318d1460k36133j90830J27755M60279L70030m4144k98787k46389j19699K280
34308b17098K21799M07654L05180L4147l3609J10072J04484j51951l42447k56573
34298A81658m4600J15130K05979J77094n0134l12214l10739n9786J19552R8145
34288A20085O7933J18612P6951j20854k58723j87782l9611L6768P3092J05564
$$ y = [363167, 370076, -69548, -388778, -124815, 386122, 524105, 229620, -92167, -223061, -246334, -211998, -111612, -62231, -156245, -240121, -156319, -69008, -231116, -562570, -780168, -815389, -784221, -681229, -444056, -199303, -101746, -45923, 122955, 251815, 116160, -116621, -87819, 178612, 349150, 367269, 488205, 730305, 781272, 522143, 194814, -41460, -277593, -468423, -340668, 119611, 489641, 445497, 146710, -99679, -219378, -217098, 4701, 412355, 717535, 751682, 718073, 828145, 932629, 780678, 438231, 181658, 137058, 252188, 458167, 635261, 585127, 272913, -37826, -97612, 21940, 120085, 188018, 306630, 383581, 262727, 4004, -183778, -223389, -186621, -113529, -7965]
34278g965O8066l3751q8359r2975j51545k14434j08134J25274K32849J59166J12199
34267C91J40645K8478k43540l32549p2098J82018O6082k10064j74099J80647L76037
34256e8052J44397j94703j76901J81893L94737J31464l22058l95569J2967L77615
34246I5790K56162j19192k32124k7608J20237M1170p7709j21545j71662j83788
34236d20269k803K37822J96829r1756j96424K532Q8586j74709m04638k06451K13539
34225g57742M14922L37411J75672j8249k18129k28059j1331Q3980j50354l39229
34215g11108q5471L17023L03947l9162j22154J72027L26123P3256j81961m0175
34205A2345K93580L71722J15310k08100l76324l52872j99593k5013P3905R4925
$$ y = [-7965, 60101, 26350, -62009, -154984, -306529, -520963, -629097, -503823, -270974, -111808, 391, 141036, 169514, -74026, -406575, -478673, -296655, -230573, -440637, -614736, -434089, -58052, 86345, -108358, -285259, -103366, 291371, 422835, 100777, -294792, -281825, 95790, 351952, 232760, 636, -26972, 93265, 134435, 56726, -64819, -236481, -420269, -423072, -185250, 11579, -80177, -276601, -274069, -185483, -360192, -764830, -971281, -757742, -342820, -5409, 170263, 152014, -66115, -294174, -305505, -221525, -371879, -711108, -796579, -479556, -175609, -214771, -336925, -164898, 161225, 234481, 52520, 12345, 305925, 677647, 792957, 584857, 208533, -144339, -343932, -368945, -295040, -200115]
34195b00115P3921j8223j66186j81787N8648L03316J74103k59868m94713k53515
34185i64419J81326M08923L82012K83317J91929O8704r2544k48518l30599k42369
34175c62238Q528J84239O0006k06990k45983k4419J24550P3086O4670J83314J46869
34164E632j23052k25916M6534K35431q0033n01555l69961J66897L62169L4388
34154d49466k20913l5264K38282K33199J15661J09497M8584j94755l10917m2297
34144e08389L00681K85218J7455j15924r6691j47124j77447N1982L45625K74520
34134B29906o3378j26535J54353K12793j88981m92545k24434K27388K38535q8945
34124a21843j94104N849J00233k7195n1034J28552J71657r2182l41065k73893
$$ y = [-200115, -126194, -144417, -310603, -492390, -433742, -130426, 43677, -216191, -710904, -964419, -783093, -374170, 7842, 291159, 483088, 551792, 459248, 210730, -119869, -362238, -353710, -169471, -109465, -316455, -562438, -586857, -462307, -389221, -324551, -141237, 5632, -117420, -343336, -296802, -61371, -141404, -642959, -1012920, -846023, -483854, -449466, -670379, -705643, -467361, -234162, -118501, -9004, 39580, -155175, -466092, -508389, -207708, 77510, 94965, -20959, -117650, -264774, -442221, -390239, -44614, 229906, 166528, 39993, 194346, 407139, 218158, -274387, -498821, -271433, -32898, -121843, -315947, -310098, -209865, -237060, -288094, -159542, 12115, -80067, -421132, -695025]
34114f95025m7247N0543L5532P3786J49493J52384J05103P4272K1952n7610l4376
34103a71193J23616K05824P5159o5359J2976J66086J13173o9897o6486J32352
34093D56251J86252n3406l19121l44680k00717p9305p109O6607J09548R5723Q2486
34082g471O4353o8161k86083l42058j16894J43090J59293K7211K4901J45317J40013
34071a16489j9544o4571J32891L39967K99929O0797j63669k68278k51093j10518
34061a60578P9694J29715l9019k13589j30196J48847K84596R1281k38048l69209
34051d16506j81362J48100L35264K43251m390j58335j15259j2295j7829j18246
34041b97607j92476j97273j52803l5187J54566K83896K33746J00393N9971Q3103
$$ y = [-695025, -742272, -691729, -656197, -582411, -432918, -280534, -175431, -101159, -79207, -136817, -171193, -47577, 158247, 233406, 168047, 181023, 347109, 460282, 390385, 323899, 456251, 642503, 589097, 269976, -74704, -275421, -354726, -361835, -295228, -185680, -89957, -7471, 56882, -11279, -297362, -639420, -756314, -613224, -453931, -426720, -401819, -256502, -116489, -136033, -200604, -67713, 272254, 572183, 632980, 469311, 201033, -50060, -160578, -80884, 48831, 9812, -203777, -333973, -185126, 99470, 190751, -47297, -416506, -597868, -449768, -114504, 128747, 124357, -33978, -149237, -161532, -179361, -297607, -490083, -687356, -840159, -875346, -720780, -436884, -203138, -102745, -42774, 40329]
34031D0329J1445j24077j39988m9335n3742j44758p7800J43389J62073j29284
34021c61748k90359J2227M09853L60295R72r5237J28025J50860j97892m16833
34011b99837j65919J57369O8675k20788j64838K51436N23405L81449N4078j92365
34001C92665l23432k99868j8428L52737L76111n9803m58471l47068M7811J41675
33991a96071j35932k70869K1203L74531L52347O1859j11871j08912j52859k60433
33981d27007k05613M1252K12703J56919M0402L1217N6536J2398l3155r158L53
33970a23153o2476q4868M754P0130K769o3973M205O9376m4488j91958r3698J92047
33958c21333L07033J08102j39774j48793L8334J72380J18470m2056j47795j30132
$$ y = [40329, 51774, -72303, -212291, -261626, -315368, -460126, -537926, -394537, -232464, -361748, -652107, -639880, -230027, 130268, 131240, 36003, 164028, 314888, 116996, -299837, -465756, -308387, -239712, -460500, -625338, -373902, 149503, 530952, 585030, 392665, 69233, -230635, -249063, 103674, 479785, 419982, -38489, -385557, -337746, -196071, -332003, -602872, -581669, -207138, 145209, 207068, 95197, -13715, -166574, -427007, -632620, -591368, -378665, -221746, -181344, -150127, -93591, -81193, -114348, -123506, -123153, -185629, -270497, -265743, -195613, -192844, -256817, -252612, -183236, -227724, -419682, -513380, -321333, -14300, 93802, -45972, -194765, -156431, 15949, 134419, 92363, -55432, -185564]
33948a85564o4268m2973k3002R8129K53263K39422M2810q9000j5331R4249P9860
33937C87595M5590P7160j659k82049m53253k27433J33434J61454r8682j93401
33927d51244N858J72219J16735K4099L4568L3108m3221o9480k128M8174O6945
33916f4367J32137J53955j5019k20141j72910K4100j0155k73882l53386j27951
33906i27619N2736K9471Q8614L43282M43121K02492k7212K6773P6372j75584m47944
33895c15498l18681Q8097L09186J92517l8716j58247p6245J62337K98222P5633
33885B18605k86623k59520J61367L27376m9458l71442j11256L16971K64836j05153
33875A05703k12524o5204o9946j58484M2066L54782K33236k52386m22164l6072
$$ y = [-185564, -249832, -292805, -315807, -217678, 35585, 275007, 317817, 228817, 213486, 307735, 387595, 433185, 510345, 508686, 226637, -226616, -454049, -320615, -159161, -257843, -451244, -445386, -273167, -156432, -132333, -97765, -64657, -107878, -177358, -179486, -131312, -64367, 67770, 221725, 206706, -13435, -186345, -162245, -172400, -446282, -799668, -927619, -874883, -845412, -756798, -413516, 29605, 232097, 204885, 231658, 308030, 132446, -315498, -634179, -546082, -236896, -44379, -83095, -241342, -317587, -155250, 142972, 218605, -68018, -327538, -166171, 161205, 111747, -259695, -370951, -53980, 210856, 105703, -106821, -172025, -241971, -400455, -358389, -3607, 229629, -22757, -444921, -480993]
33865d80993L90364M27716K36071Q7865k7067j53885k14448k23107k54442j77081
33855c89007J45224M32460K80330j60613l48829j73047k1747m1993K1539J95521
33845f0162J61742j04687k33609j38680j38338k47361p0560L64665M29327r3992
33835a31655n33361l12628K26730M75484M24127L41957J58549k11152m00085j12789
33825g4823K52448J55689k18941k98220n6644N8281m8032n7027Q0151O9329r7170
33814b34959n0284L06767N74431M34905M8706k62056l86142l62739k41404j07362
33804b80137k6237P0047K37513L09655J01705k25490l15801j09587J23068K10782
33794I5518K07205J16371j19813l33397k37500R2153K39873P3887o0321O0021
$$ y = [-480993, -90629, 337087, 573158, 661023, 633956, 480071, 265623, 42516, -211926, -389007, -243783, 188677, 469007, 308394, -40435, -213482, -235229, -277222, -255683, -60162, 101580, -3107, -236716, -375396, -513734, -761095, -831655, -466990, -37663, -131655, -665016, -977644, -750914, -275430, 148697, 490654, 649203, 438051, 37966, -74823, 177625, 333314, 114373, -183847, -240491, -182210, -230242, -287269, -207118, -137789, -234959, -285243, 21524, 595955, 1030860, 1079566, 817510, 431368, 68629, -172775, -280137, -306374, -236327, 1186, 310841, 412546, 187056, -128745, -238332, -115264, 95518, 302723, 419094, 299281, -34116, -271616, -179463, 60410, 134297, 73976, 133997]
33784A33997J69695J6975j68850p7820J34385J29577k0996l001J30642L4226k73900
33773B04930l52785l8094K78718K64004J06322R7022J29080k5789k39493k43934
33763A79981j13510r3354j04017R6509L46573K24692k12183l94239r0856K31180
33753G0776J36847j78393l18568k61690j51909N3483L23031L43523L0831j46936
33743i9005J23860L75406P0327m35231m19093k822P6756k27647k12013K66818
33733d82644M71243P1515k56000j2648K66219Q262l47284j30151L54133L33428
33723B76073j22552k66582N3649K21685n6549l29426k08902R4192K48426K46919
33713A56933J65684l5040k57897k39579K5221K03908J38323N9952J18381R5292
$$ y = [133997, 303692, 320667, 151817, 73997, 208382, 337959, 316963, 313962, 444604, 478830, 204930, -147855, -185949, 92769, 356773, 463095, 560117, 689197, 663408, 423915, 179981, 66471, -26883, -130900, -34391, 312182, 536874, 324691, -69548, -160404, 70776, 207623, 29230, -289338, -551028, -702937, -649454, -326423, 17100, 47931, -99005, 24855, 400261, 470588, 35357, -383736, -386558, -309802, -537449, -749462, -482644, -11401, 60114, -195886, -208534, 57685, 65947, -281337, -411488, -57355, 276073, 153521, -113061, -59412, 162273, 105724, -223702, -432604, -338412, -89986, 156933, 322617, 287577, 29680, -209899, -184678, 19230, 157553, 217505, 335886, 431178]
33703D31178j61990l83297k69325K8924J53719O7321J0055O5152Q8573J9644k8296
33692B1658k897r002j15375k26225k07818m4020J69899L09688K80810P8283j75585
33681G9416l09069k52552q6842O1718J27787J03704L068j18498j54489m2386J33158
33670d54985K03206J04098m6884q8832J3581J54020J88753N1203j69699k65202
33660c10741j20343J02664J35553j7669o8741J11833K76610J86004k6235j05723
33650A63212p4269p7757m3915J35368K50291N2601k19536j14932K58083L09955
33640F39101r1374l66498j34903K06155J72392n8875o9585M0878j12059m53113
33630b27881n08598j33728K98020M25004K44833n1055k60137k07229R2569L23122
$$ y = [431178, 269188, -114109, -383434, -354510, -200791, -133470, -123415, -58263, 30310, 49954, 21658, 18761, 9759, -105616, -331841, -539659, -583679, -413780, -104092, 176718, 255001, 79416, -229653, -482205, -569047, -507329, -379542, -275838, -272770, -391268, -545757, -588143, -454985, -251779, -147681, -194565, -283397, -269816, -115796, 72957, 124160, -45539, -310741, -431084, -328420, -192867, -210536, -279277, -167444, 109166, 295170, 268935, 163212, 88943, 11186, -32729, 102639, 352930, 405531, 185995, 71063, 329146, 639101, 547727, 181229, 46326, 252481, 424873, 365998, 296413, 337291, 225232, -227881, -736479, -870207, -572187, -147183, 97650, 46595, -213542, -420771, -328202, -5080]
33620e080J95398j39670k70400p7451J65681K17122J17228J8546R587J00570J76317
33609E07848K7384l35905n12797j85728L15120L35400j97748o33762m82341m398
33599a166927L08171M30566O00528P08351M03257k43537o60208m97789q1728P8379
33589a20937l6370p2047P2635J30714k0532j25045J2855J79539J00119j11617
$$ y = [-5080, 190318, 50648, -219752, -297203, -131522, 85600, 202828, 221374, 230961, 331531, 507848, 535232, 199327, -313470, -499198, -184078, 151322, -46426, -680188, -1162529, -1166927, -858756, -428190, 172338, 880689, 1283946, 1040409, 380201, -117588, -199316, -120937, -157307, -229354, -156719, -26005, -46537, -171582, -158727, 20812, 120931, 9314]
$$ [...]
##END NTUPLES=NMR SPECTRUM
##END=
