##TITLE=31Pdec_ABDE0806-5
 CDCl3, 24 sc
 9.06.2021
##JCAMPDX= 6.0         $$ Bruker NMR JCAMP-DX V2.0
##DATA TYPE= NMR SPECTRUM
##DATA CLASS= NTUPLES
##ORIGIN= UXNMR, Bruker Analytische Messtechnik GmbH
##OWNER= root
$$ XWIN-NMR		Version 3.5
$$ Wed Jun  9 09:35:20 2021 Russian Standard Time (UT+4h)  she@DPX200
##.OBSERVE FREQUENCY= 81.013821
##.OBSERVE NUCLEUS= ^31P
##.ACQUISITION MODE= SIMULTANEOUS
##.ACQUISITION SCHEME= undefined
##.AVERAGES= 24
##.DIGITISER RES= 16
##SPECTROMETER/DATA SYSTEM= spect
##.PULSE SEQUENCE= zgpg30
##.SOLVENT NAME= CDCl3
##.SHIFT REFERENCE= (INTERNAL, CDCl3, 0, 248.564)
##AUDIT TRAIL= $$ (NUMBER, WHEN, WHO, WHERE, WHAT)
$$ ##TITLE= Audit trail, XWIN-NMR		Version 3.5
$$ ##JCAMPDX= 5.01
$$ ##ORIGIN= Bruker BioSpin GmbH
$$ ##OWNER= she
$$ F:/spectra/data/she/nmr/P31/1/pdata/1/auditp.txt
$$ ##AUDIT TRAIL=  $$ (NUMBER, WHEN, WHO, WHERE, WHAT)
(   1,<2021-06-09 09:33:03.95 +0400>,<she>,<DPX200>,
      <created by zg, POWCHK disabled, PULCHK disabled
       configuration hash MD5:
       00 E9 B6 7A A2 85 ED C7 34 08 36 98 17 FE 4E 26
       data hash MD5: 32K
       BB B9 BF A8 0F 63 06 9C EA 5C 99 7E 15 9C 17 61>)
(   2,<2021-06-09 09:33:06.43 +0400>,<she>,<DPX200>,
      <Start of raw data processing
       efp BC_mod = 2 LB = 1 FT_mod = 6 PKNL = 1 PHC0 = -5909.4 PHC1 = 198.0748 SI = 64K 
       data hash MD5: 64K
       12 8A 85 2F BD 9F 51 B7 AE EB BD FA 68 78 48 2A>)
(   3,<2021-06-09 09:33:37.39 +0400>,<she>,<DPX200>,
      <pk PHC0 = -79.03323 PHC1 = 159.8 
       data hash MD5: 64K
       8F F1 93 CD 28 81 2F 42 A2 00 B3 B7 25 46 B9 58>)
$$ ##END=
$$ 
$$ hash MD5
$$ D2 75 DD 04 0F 68 3A 58 8F 95 44 4B 4E B9 7F D9
##$RELAX= 
##$RELAX= 
##$RELAX= 
##$RELAX= 
##$RELAX= 
##$RELAX= 
##$RELAX= 
##$RELAX= 
$$ Bruker specific parameters
$$ --------------------------
##$DU= <F:/spectra>
##$EXPNO= 1
##$NAME= <P31>
##$PROCNO= 1
##$TYPE= <nmr>
##$USER= <she>
##$AMP= (0..31)
100 100 100 100 100 100 100 100 100 100 100 100 100 100 100 100 100 100 
100 100 100 100 100 100 100 100 100 100 100 100 100 100 
##$AQSEQ= 0
##$AQ_mod= 1
##$AUNM= <au_zg>
##$AUTOPOS= <>
##$BF1= 81.014009
##$BF2= 200.13
##$BF3= 200.13
##$BF4= 200.13
##$BF5= 200.13
##$BF6= 200.13
##$BF7= 200.13
##$BF8= 200.13
##$BYTORDA= 1
##$CFDGTYP= 0
##$CFRGTYP= 5
##$CHEMSTR= <none>
##$CNST= (0..31)
1 1 145 1 1 1 1 1 1 1 1 1 1 1 1 1 1 1 1 1 1 1 1 1 1 1 1 1 1 1 1 1 
##$CPDPRG= <waltz16>
##$CPDPRG1= <>
##$CPDPRG2= <waltz16>
##$CPDPRG3= <>
##$CPDPRG4= <mlev>
##$CPDPRG5= <mlev>
##$CPDPRG6= <mlev>
##$CPDPRG7= <mlev>
##$CPDPRG8= <mlev>
##$CPDPRGB= <>
##$CPDPRGT= <>
##$D= (0..31)
0 1 0 0 0 0 0 0 0 0 0 0.03 2e-05 3e-06 0 0 0 0 0 0 0 0 0 0 0 0 0 0 0 0 
0 0 
##$DATE= 1623216783
##$DBL= (0..7)
120 120 120 11 120 120 24 19 
##$DBP= (0..7)
150 150 150 150 150 150 150 150 
##$DBP07= 0
##$DBPNAM0= <>
##$DBPNAM1= <>
##$DBPNAM2= <>
##$DBPNAM3= <>
##$DBPNAM4= <>
##$DBPNAM5= <>
##$DBPNAM6= <>
##$DBPNAM7= <>
##$DBPOAL= (0..7)
0.5 0.5 0.5 0.5 0.5 0.5 0.5 0.5 
##$DBPOFFS= (0..7)
$$ [...]
##$SUBNAM2= <"">
##$SUBNAM3= <"">
##$SUBNAM4= <"">
##$SUBNAM5= <"">
##$SUBNAM6= <"">
##$SUBNAM7= <"">
##$SUBNAM8= <"">
##$SUBNAM9= <"">
##$SW= 501.771253377433
##$SWIBOX= (0..15)
0 1 3 0 0 0 0 0 0 0 0 0 0 0 0 0 
##$SW_h= 40650.406504065
##$TD= 32768
##$TD0= 1
##$TE= 0
##$TE2= 300
##$TE3= 300
##$TEG= 300
##$TL= (0..7)
0 120 53 12 22 120 120 120 
##$TP= (0..7)
150 150 150 150 150 150 150 150 
##$TP07= 0
##$TPNAME0= <>
##$TPNAME1= <>
##$TPNAME2= <>
##$TPNAME3= <>
##$TPNAME4= <>
##$TPNAME5= <>
##$TPNAME6= <>
##$TPNAME7= <>
##$TPOAL= (0..7)
0.5 0.5 0.5 0.5 0.5 0.5 0.5 0.5 
##$TPOFFS= (0..7)
0 0 0 0 0 0 0 0 
##$TUNHIN= 0
##$TUNHOUT= 0
##$TUNXOUT= 0
##$USERA1= <user>
##$USERA2= <user>
##$USERA3= <user>
##$USERA4= <user>
##$USERA5= <user>
##$V9= 5
##$VALIST= <valist>
##$VCLIST= <CCCCCCCCCCCCCCC>
##$VD= 0
##$VDLIST= <DDDDDDDDDDDDDDD>
##$VPLIST= <PPPPPPPPPPPPPPP>
##$VTLIST= <TTTTTTTTTTTTTTT>
##$WBST= 1024
##$WBSW= 4
##$XGAIN= (0..3)
0 0 0 0 
##$XL= 0
##$YL= 0
##$YMAX_a= 9969
##$YMIN_a= -10473
##$ZGOPTNS= <>
##$ZL1= 120
##$ZL2= 120
##$ZL3= 120
##$ZL4= 120
##$ABSF1= 0
##$ABSF2= 0
##$ABSG= 0
##$ABSL= 0
##$ALPHA= 0
##$AQORDER= 0
##$ASSFAC= 0
##$ASSFACI= 0
##$ASSFACX= 0
##$ASSWID= 0
##$AUNMP= <proc_1d>
##$AZFE= 0.1
##$AZFW= 0.5
##$BCFW= 0
##$BC_mod= 2
##$BYTORDP= 0
##$COROFFS= 0
##$CY= -3
##$DATMOD= 1
##$DC= 0
##$DFILT= <>
##$DTYPP= 0
##$F1P= 0
##$F2P= 0
##$FCOR= 1
##$FTSIZE= 65536
##$FT_mod= 6
##$GAMMA= 0
##$GB= 0
##$INTBC= 1
##$INTSCL= 5.30512e-09
##$ISEN= 30
##$LB= 1
##$LEV0= 0
##$LPBIN= 0
##$MAXI= 10000
##$MC2= 0
##$MEAN= 0
##$ME_mod= 0
##$MI= 50
##$NCOEF= 0
##$NC_proc= -6
##$NLEV= 6
##$NOISF1= 182.463
##$NOISF2= 159.3651
##$NSP= 0
##$NTH_PI= 0
##$NZP= 0
##$OFFSET= 248.5645
##$PC= 4
##$PHC0= -5988.433
##$PHC1= 357.8748
##$PH_mod= 1
##$PKNL= yes
##$PPARMOD= 0
##$PSCAL= 0
##$PSIGN= 0
##$REVERSE= no
##$SF= 81.014009
##$SI= 65536
##$SIGF1= 159.3651
##$SIGF2= -187.1042
##$SINO= 113.3802
##$SIOLD= 16384
##$SREGLST= <1H.CDCl3>
##$SSB= 0
##$STSI= 65536
##$STSR= 0
##$SW_p= 40650.406504065
##$SYMM= 0
##$S_DEV= 0
##$TDeff= 32768
##$TDoff= 0
##$TI= <>
##$TILT= no
##$TM1= 0
##$TM2= 0
##$TOPLEV= 0
##$USERP1= <user>
##$USERP2= <user>
##$USERP3= <user>
##$USERP4= <user>
##$USERP5= <user>
##$WDW= 1
##$XDIM= 65536
##$YMAX_p= 446732441
##$YMIN_p= -6089358
$$ End of Bruker specific parameters
$$ ---------------------------------
##NTUPLES= NMR SPECTRUM
##VAR_NAME=  FREQUENCY,     SPECTRUM/REAL,   SPECTRUM/IMAG
##SYMBOL=    X,             R,               I
##VAR_TYPE=  INDEPENDENT,   DEPENDENT,       DEPENDENT
##VAR_FORM=  AFFN,          ASDF,            ASDF
##VAR_DIM=   65536,         65536,           65536
##UNITS=     HZ,            ARBITRARY UNITS, ARBITRARY UNITS
##FACTOR=    0.620285442955139, 1,           1
##FIRST=     20137.2065510759, 0,            0
##LAST=      -20513.1999529892, 0,           0
##MIN=       -20513.1999529892, -6089358,    0
##MAX=       20137.2065510759, 446732441,    0
$$ Real data points
##PAGE= N=1
##DATA TABLE= (X++(R..R)), XYDATA
$$ [...]
39590H15527m27456r0725K28652j69285p14483m91441L45970Q59496O65277K47541
39580A269073M7089r1031m03151o25884l13644L98105P58975L37840l02089l26177
39570G49106J12155P0505n87943p68082J05249R06422M22685o92173r65461m43880
39560a091417k59380l04718N10212J678646J235374q66742j982924o35493J135697
39551e80745J001819j59429k07304N65341L61576o35802n98681N86278J037296
39542A370349J3447j061293r90267j81889O11251J073837P29369n75143j554155
39533e64494q23267O73634P69512m10104o15727N88689J009938k20205r24500
39524e16524L67086J729189R51542r53398j611226q21249J1624M12600N81968
$$ plain form
39590 815527 388071 297346 525998 356713 -357770 -849211 -503241 356255 1021532 1269073
39580 1269073 1316162 1225131 821980 196096 -117548 280557 1039532 1377372 1075283 749106
39570 749106 861261 931766 343823 -424259 -319010 587412 1010097 317924 -647537 -1091417
39560 -1091417 -1350797 -1655515 -1145303 533343 1768717 901975 -1080949 -1716442 -580745
39551 -580745 421074 261645 54341 619682 981258 345456 -253225 333053 1370349
39542 1370349 1383796 322503 -667764 -849653 -238402 835435 1564804 989661 -564494
39533 -564494 -1387761 -714127 55385 -354719 -970446 -381757 628181 407976 -516524
39524 -516524 -149438 1579751 2531293 1577895 -33331 -854580 -842956 -430356 151612
39515A51612J5396j352039j867263l32926J631058J718892M01120j80048J95573
39506C81375O8892n33213j35038J138922J423440K57973p66790q79387j047736
39497i1562j471462q21569J008561J881337N80780j073916r20331M16871Q39933
39488C48642m0787q23498o24985J24438P65947J005853O79745r9923p56755q64764
39478b86087o28242l07330K29840Q56975Q47667o0524r06923o77625K29713N59600
39468a42936r3338r06874r84581k47674P12150J179727Q23980J8284m73436l33301
39458d47999L7411K05829K37466L27486L84517K88757J45775N11k92972o75041
39448B11740p94316n46818k47066p4444J34004L68264L34992Q0562N9226L11462
$$ plain form
39515 151612 167008 -1185031 -3052294 -3385220 -1754162 -35270 365850 185802 381375
39506 381375 450267 -82946 -217984 920938 2344378 2602351 1835561 956174 -91562
39497 -91562 -1563024 -2384593 -1376032 505305 1086085 12169 -908162 -491291 348642
39488 348642 307855 -515643 -1140628 -1016190 -250243 755610 1435355 1335432 578677 -286087
39478 -286087 -914329 -1221659 -991819 -134844 712823 652299 -254624 -932249 -702536 -142936
39468 -142936 -236274 -1143148 -2127729 -2375403 -1663253 -483526 340454 358738 -114698 -447999
39458 -447999 -410588 -204759 32707 360193 744710 1033467 1179242 1179753 886781 211740
39448 211740 -582576 -1129394 -1376460 -1450904 -1316900 -948636 -613644 -533082 -473856 -162394
39438a62394K89640j61981m12734p0848L36204K26570j71944l53447k68378j6193
39428g65505M73772R13133O38788j93580l12357Q39166J827990J000535j075208
39419C346734k264680j629049k21700P06360R47610P13279Q2510n51806n51032
39410E78226n572K08075k43986n81359j39432N88411P35549K85516j42793k95519
39400I87116l93008m88037l57955N686K90690K98024J52308L3142n1105j53167
39390C23694k20110j32598J18610L26430K14737j94239m36731q6402O02465Q54958
39380A370814L31726l94108n77278k17516J41549K61722L11678K70492o2510m08591
39370A027978j75379M15078K59870r07283j599205m72294J462273J951013O08727
$$ plain form
39438 -162394 127246 -34735 -447469 -518317 -182113 44457 -127487 -480934 -749312 -765505
39428 -765505 -291733 621400 1260188 1066608 754251 1593417 3421407 4421942 3346734
39419 3346734 1082054 -546995 -768695 -62335 885275 1598554 1681064 1129258 578226
39410 578226 572654 780729 536743 -44616 -184048 404363 1139912 1425428 1282635 987116
39400 987116 594108 106071 -251884 -246198 44492 342516 494824 527966 476861 323694
39390 323694 103584 -29014 89596 416026 630763 436524 -207 -86609 515856 1370814
39380 1370814 1702540 1308432 731154 513638 655187 916909 1228587 1499079 1436569 1027978
39370 1027978 852599 1267677 1527547 620264 -978941 -1451235 11038 1962051 2570778
39361B570778o90143p17324m39378r31428j422481p49626M84898Q17657K15831
39352h61216j28586J75687M26615K79163N5372j84036n07191l23732P72947J649048
39342A354071Q65051q30137j204712P3641Q93568J11525o99306j6510J121239
39333A668430R43291k50735q49696m18837K05013N01259M57062j40548j189064
39324I26175j649777q03643M08041O05673O008j00717N66986J107015R92210M57053
39314B515024l85782j466417j994808j135308N64127J584055J283513L74245k77694
39305A060955l50144J32215O54280K84087r66480j445312m343J749319J293564
39296B408141r68279j975384m24811J401878J156150l17762p37052J41893O20438
$$ plain form
39361 2570778 1880635 1163311 723933 -207495 -1629976 -2379602 -1894704 -1077047 -861216
39352 -861216 -989802 -814115 -387500 -108337 -52965 -237001 -744192 -1067924 -294977 1354071
39342 1354071 2219122 1388985 184273 257914 1151482 1263007 563701 547191 1668430
39333 1668430 2611721 2360986 1511290 1092453 1297466 1798725 2255787 2115239 926175
39324 926175 -723602 -1527245 -1119204 -513531 -507523 -608240 -41254 1065761 2057971 2515024
39314 2515024 2129242 662825 -1331983 -2467291 -1903164 -319109 964404 1338649 1060955
39305 1060955 710811 843026 1497306 1781393 814913 -630399 -634742 1114577 2408141
39296 2408141 1439862 -535522 -960333 441545 1597695 1279933 542881 684774 1305212
39287A305212j29691j037667q33679L57926J290672R26103n16542j649305j305564
39278a592535J03852J099538R78456L93869L2420k54247o20065n88721N0857N56510
39268A59934K60275l38340l25340K45968N42761K47563r2328L2771L96255L64891
39258A494410k77210r41030q35372p0791K90433k27853n41146M14438J629331
39249I35210J130445q78609j861715n45964J159503J017542l43304p38858J91714
39240F5964Q57156M44526j46981j39259J5471k31191n44799m28590o3943P5814
39230i5832j14075m15734n47593k45250M41918R07539O09494m8132j27820M59388
39220H23903P63283K48151l86625l69583r3387l40610p70456l19760R03749J358490
$$ plain form
39287 1305212 1175521 137854 -695825 -337899 952773 1878876 1362334 -286971 -1592535
39278 -1592535 -1488683 -389145 589311 983180 1015600 761353 141288 -447433 -396576 159934
39268 159934 420209 81869 -243471 2497 545258 792821 700493 733264 1129519 1494410
39258 1494410 1217200 276170 -559202 -629993 -339560 -567413 -1108559 -694121 935210
39249 935210 2065655 1187046 -674669 -1220633 -61130 956412 613108 -125750 65964
39240 65964 923120 1367646 1220665 1081406 1096877 865686 320887 -107703 -171646 -95832
39230 -95832 -209907 -625641 -1173234 -1418484 -976566 -69027 540467 492335 364515 823903
39220 823903 1587186 1835337 1448712 1079129 985742 645132 -125324 -445084 458665 1817155
39210A817155K55989j037241q47731K47764K07871j269067k081728q59246R20670
39201b645564J206400M00860L29479J083267J076729p537o34325j28916K11374
39192H91767m43996q95978m4386J101888J078260K86321j9290K4657m68238j026390
39182D84615m30589Q56530R57103m88928j533138p27724Q01721J073592k2351
39173I70831q52232l82796O50275R23910J67860o88906p40017q7444N00161N88655
39163A050297L29459q7063n69331p28628j78037N71054M50795n14811r34021p7525
39153f87811Q99235P31912P066L9308O40188O10636n5548k08464L49952N13231
39143B839705j71376p58422n54360j47608k08794m04871j67355L33602N71476
$$ plain form
39210 1817155 2073144 1035903 188172 435936 643807 -625260 -2706988 -3566234 -2645564
39201 -2645564 -1439164 -1038304 -708825 374442 1451171 1443634 809309 680393 891767
39192 891767 447771 -448207 -492593 609295 1687555 1973876 1954586 1979243 1511005 484615
39182 484615 54026 910556 1867659 1378731 -154407 -882131 -80410 993182 970831
39173 970831 118599 -264197 386078 1309988 1477848 788942 48925 -38519 461642 1050297
39163 1050297 1379756 1292693 723362 -5266 -183303 387751 838546 323735 -610286 -687811
39153 -687811 211424 943336 950402 989710 1629898 2240534 2184986 1976522 2326474 2839705
39143 2839705 2668329 1909907 1355547 1207939 999145 594274 426919 760521 1331997
39134A331997L65462j61028p07951p55372j32523L91633M8553m88958Q2032J382063
39124A355908J513092K2435j085381l06925J042015R21521l67262j011564o62332
39115A421507n58421j034440r22759L02463J449520J285403J19032q90255j130232
39106D1818p25767p2236L21806J10333l67212l67318J58580L94695k2676k60897
39096g88874M50297J396078J167213k97283j412128r29615M88095J150867M06093
39087A630743p08363q13713K19865J208764J044110n4999q24067m95851K31631
39078A438120J45929p15254r70753J36064J436416J301534p9873j004646p06170
39069I81367j78598k31502j42597Q20385J719266J207621k18229q24368k42167
$$ plain form
39134 1331997 1697459 1536431 828480 73108 -59415 332218 380771 -108187 -26155 1355908
39124 1355908 2869000 2891435 1806054 1499129 2541144 3462665 3095403 2083839 1421507
39115 1421507 863086 -171354 -1094113 -791650 657870 1943273 2062305 1172050 41818
39106 41818 -683949 -756185 -434379 -324046 -691258 -1058576 -899996 -505301 -527977 -788874
39096 -788874 -338577 1057501 2224714 1927431 515303 -414312 73783 1224650 1630743
39087 1630743 922380 108667 328532 1537296 2581406 2526407 1702340 1206489 1438120
39078 1438120 1584049 868795 -101958 34106 1470522 2772056 2692183 1687537 981367
39069 981367 802769 571267 428670 1249055 2968321 4175942 3957713 3133345 2891178
39060B891178J65840l41982q20442m72828k4583k92922o22794l6098Q93338P54263
39050B092970m96975j429626j186799l80059K30634P34700J266217J260862L47296
39041B439220o80225p16536R2925N01458j14505r15252p47880L60306J250936
39032A470447R85950j51348j003881p85433M9145K89435n59536j539657j379133
39023b624011j86242O93365N77879L05109P11403J166015N88629o65000j160846
39014e93699m53400M08942N26504J61790j25897k69317k48846J15297M98306K08699
39004B28379n57056o94900K9393M25458j29357m84174L65957J413382J175962
38995A773044R4770l08136M9604m0022q04123j200414q07870l22281j11053J86264
$$ plain form
39060 2891178 3057018 2715036 1894594 1421766 1397183 1104261 481467 445369 1338707 2092970
39050 2092970 1595995 166369 -1020430 -1400489 -1169855 -435155 831062 2091924 2439220
39041 2439220 1758995 1042459 1135384 1636842 1522337 607085 -140795 219511 1470447
39032 1470447 2456397 2305049 1301168 515735 564880 854315 294779 -1244878 -2624011
39023 -2624011 -2810253 -2116888 -1539009 -1233900 -522497 643518 1232147 567147 -593699
39014 -593699 -1047099 -638157 -111653 50137 -75760 -345077 -593923 -478626 19680 228379
39004 228379 -328677 -1023577 -994184 -568726 -698083 -1182257 -816300 597082 1773044
38995 1773044 1867814 1559678 1609282 1569260 765137 -435277 -1243147 -1565428 -1676481 -1490217
38985a490217N31026M23954M0237J11L8275n36164j124312m32472J096866J499618
38975D6922L58757m67592R3822P16650K09888m45501r4789M28369n1564p78731
38965A6231m27508M43579L56592n06613p10699R288O45225Q29885R83715Q34398
38955B474093k69991j577693j387750L49871J575293Q60918p70924j477386r14261
38946a137830j09450J93080K05077M14665Q22786R08500K96817n54539o95764
38937C43342L6628O22110K57354m37353l91335K74064N78941K91471P8973K07659
38927A861854K09539j13305l49950k72202j30836q7480r0197k56394o13750o52096
38917d94817m7190M26594j31906j041672p32553P48456J501143N44492p06709
$$ plain form
38985 -1490217 -959191 -535237 -495000 -494889 -456614 -992778 -2117090 -2549562 -1452696 46922
38975 46922 405679 -61913 31909 748559 958447 512946 418157 846526 794962 16231
38965 16231 -411277 32302 388894 -117719 -828418 -819130 -173905 655980 1639695 2474093
38955 2474093 2204102 626409 -761341 -411470 1163823 2024741 1253817 -223569 -1137830
38946 -1137830 -1247280 -1054200 -849123 -434458 388328 1296828 1593645 1039106 343342
38937 343342 379970 1002080 1259434 822081 430746 704810 1283751 1575222 1654195 1861854
38927 1861854 2071393 1958088 1608138 1335936 1205100 1117620 1027423 771029 157279 -494817
38917 -494817 -542007 -115413 -247319 -1288991 -2021544 -1273088 228055 772547 65838
38908F5838o40321J97128K11752o68448j008221j38901R17019R73635J87071l72466
38898b75914j26935M61146N86352M4260o12703p61034l42899K51418O66537P01647
38888E91875K26827n73988j021011n26732N88747J287866R19617j33341r12890
38879D46970p72856Q7606P66641N37287k35821m64284J15263M35225k60146j019132
38869c63247m83077R19890J406949L65732q73984j008584l10053K27492L01273
38860A82391K83760M65936P98302R55455M84739o09472j449370j154628j06282
38851a49169M91802K88813K5041O5411q1892n07996m61742K71376P31747K47402
38841I20793n09125o81713m49483k81122O069M94095M78948l18791p80618J7248
$$ plain form
38908 65838 -574483 -377355 -165603 -834051 -1842272 -1981173 -1064154 -90519 96552 -275914
38898 -275914 -402849 58297 644649 688909 76206 -684828 -1027727 -776309 -109772 591875
38888 591875 818702 244714 -776297 -1303029 -714282 573584 1493201 1359860 446970
38879 446970 -325886 -238280 528361 1065648 829827 365543 480806 916031 655885 -363247
38869 -363247 -846324 73566 1480515 1846247 972263 -36321 -346374 -118882 182391
38860 182391 466151 932087 1730389 2685844 3170583 2561111 1111741 -42887 -149169
38851 -149169 342633 631446 656487 721898 640006 132010 -329732 -58356 673391 920793
38841 920793 411668 -270045 -719528 -1000650 -994581 -500486 -21538 -340329 -1120947 -1103699
38831a103699J015690N79633q10918j096883J99710J231252O80607l89333m70762
38822a64703O8834j8539n36248k30519Q13184R54242l98972j514489p00840J131914
38812e96136J697947N76588m19692j40052L77339n9319p88540n52683L58655P10906
38802A165013L65133J66895K26517p9117n59873l10788N49356Q24308K03486k55970
38792B294960l0894J6726o75826j283074j021380m14389k33407k72322o5642J80843
38782a504405K26340L81262O69732M71990j91908k47791N84618Q77000k67202
38773I99636j364892o47283J020254J288430j76382j358281r38830J72155N91630
38764d13563K15769k25082k51162J26972N14759L62229l16477o71341j64088M51710
$$ plain form
38831 -1103699 -88009 491624 -319294 -1416177 -1216467 14785 695392 306059 -164703
38822 -164703 -95869 -114408 -650656 -881175 -67991 886251 487279 -1027210 -1728050 -596136
38812 -596136 1101811 1678399 1258707 1118655 1495994 1436675 648135 95452 454107 1165013
38802 1165013 1530146 1697041 1923558 1844441 1284568 973780 1523136 2347444 2550930 2294960
38792 2294960 2264066 2280792 1604966 321892 -699488 -1113877 -1347284 -1619606 -1685248 -1504405
38782 -1504405 -1278065 -896803 -227071 244919 53011 -194780 389838 1266838 999636
38773 999636 -365256 -1012539 7715 1296145 1119763 -238518 -1177348 -1005193 -413563
38764 -413563 -197794 -422876 -674038 -547066 -32307 329922 13445 -657896 -821984 -370274
38754c70274K28002l92206k63791N63250R53752M98541r8684l56730m63718m36132
38744a37990q3439K25104n595k99317J32804Q02143N55667l13894l73205M02661
38734I04939M06189p60989j330146k64749Q49283L09534r12104p37479P31130
38725h04392J481227O75525l94043m85342O924Q5716k99329l85479J99397R01300
38715I81504R26227K83359j40569K05043O09437R7828q62217p79250N38140J364643
38705C224145M65971j026234j229355j56597N59953J50291m53084k68659M03232
38696A669663O50961J76355n61903r79328q19865k39737L30010N09903K77553
38687A013612m9849j22817J06354K70285o2552p37383r56912k61136O97646R35232
$$ plain form
38754 -370274 -142272 -534478 -798269 -235019 718733 1217274 1118590 761860 298142 -137990
38744 -137990 -221429 3675 -1920 -301237 -168433 633710 1189377 875483 502278 904939
38734 904939 1311128 550139 -780007 -1044756 -195473 114061 -798043 -1535522 -804392
38725 -804392 676835 1352360 958317 472975 479899 565615 266286 -119193 80204 981504
38715 981504 1907731 2191090 2050521 2255564 2865001 2962829 2100612 1321362 1859502 3224145
38705 3224145 3690116 2663882 1434527 1277930 1837883 1988174 1535090 1266431 1669663
38696 1669663 2320624 2496979 1935076 955748 135883 -103854 226156 736059 1013612
38687 1013612 963763 840946 947300 1217585 1155033 417650 -539262 -800398 -102752 832480
38677H32480M53815K5632j20269l65022n17289J31132J267084J440202J53007
38668C300772j170270j180100m32897j72825l38986j03041M25498N00470K12903
38659A041524J97884K24749m12671j252663r72033M98491J585565J190619j403
38650B100062p78334q75264o40830j96997L65988O46837M50846J77072J92068
38641A441448K75712J30898l8099M1305J18937j60351n23823l71633K41499M82226
38631A638119j91039j156197j200721Q631J365196J542108N72894l07877l58879
38622A912235j12262k00125k83040J43206N84770K13857o78148r60298k91570
38613C28625M97328O58346K81322k34819o14004n61976k2930M08074J73584k21270
$$ plain form
38677 832480 1286295 1311927 1191658 826636 309347 440479 1707563 3147765 3300772
38668 3300772 2130502 950402 517505 344680 5694 -97347 328151 828621 1041524
38659 1041524 1239408 1464157 1051486 -201177 -1173210 -674719 910846 2101465 2100062
38650 2100062 1321728 446464 -194366 -391363 -25375 621462 1072308 1249380 1441448
38641 1441448 1717160 1848058 1809959 1851264 1970201 1809850 1286027 914394 1155893 1638119
38631 1638119 1447080 290883 -909838 -901207 463989 2006097 2578991 2271114 1912235
38622 1912235 1799973 1599848 1316808 1460014 2044784 2258641 1580493 620195 328625
38613 328625 825953 1484299 1765621 1530802 916798 354822 331892 739966 913550 692280
38603F92280J26757R15650R29961j8769q39351j027231j175303j238189k04865
38594a839060J618326K026644J25382j706335j059591Q36900J140818j04802m57275
38585E81007N18991O72070o23344j146303K07910J239890J17154j414097r61913
38576h08635M85321M28516p25388m75764J206689J654017P9898j001406P234J178638
38566B029120M24964j034660q78549M46592O80146m51736j045086l27607K98457
38557A41641j76274q31170n50311K87891P09447O00179M49210M29057L92058K24764
38547A676492j84245p72636r34032q6858J188996J494537M47563p14379q09581
38538A305857j26817L42812K44096j61899n84243o68456j06223O64008O61476
$$ plain form
38603 692280 819037 1734687 2664648 2645879 1806528 779297 -396006 -1634195 -1839060
38594 -1839060 -220734 1805910 1931292 224957 -834634 2266 1143084 1038282 581007
38585 581007 1099998 1772068 1148724 2421 210331 1450221 1567375 153278 -808635
38576 -808635 -323314 105202 -620186 -1095950 110739 1764756 1844654 843248 850482 2029120
38566 2029120 2454084 1419424 540875 987467 1667613 1215877 170791 -156816 141641
38557 141641 -34633 -865803 -1416114 -1128223 -418776 181403 630613 1059670 1451728 1676492
38547 1676492 1492247 719611 -214421 -301279 887717 2382254 2829817 2115438 1305857
38538 1305857 1179040 1521852 1765948 1604049 1019806 351350 245127 909135 1570611
38529A570611j66035o13908o2808M33680r0634p46778j88349J034643J192917
38520B363339O7624p69526l80180L70224L64007l16433r19473j033608o65993
38511i20019n5210L26932J79288j73354k89342l37315n62001m40517N24566J525796
38501b21176J357006M18078K14296Q32988P51649m63751j237018o08176J09489
38492A153385l74855j004409j03897J677120K093186N05442j368582j837590r87730
38483b47930M8763M93889L76935K56013N66976R51634O14403l38607p24892q0966
38473A916218L74382l69599j239286n89641J089635J738932P20551n36657r14161
38464B190374q66999r80375r16649m27800m5058o9481l4189K29804J62951k83298
$$ plain form
38529 1570611 1404576 790668 727860 1161540 1070906 324128 135779 1170422 2363339
38520 2363339 2430963 1661437 1281257 1651481 2015488 1699055 779582 -254026 -920019
38511 -920019 -975229 -648297 -469009 -642363 -931705 -1269020 -1831021 -2271538 -1746972 -221176
38501 -221176 1135830 1553908 1768204 2601192 3352841 2889090 1652072 1043896 1153385
38492 1153385 778530 -225879 -329776 1347344 3440530 3945972 2577390 739800 -247930
38483 -247930 -199167 294722 671657 927670 1494646 2446280 3060683 2722076 1997184 1916218
38473 1916218 2290600 1921001 681715 92074 1181709 2920641 3641192 3104535 2190374
38464 2190374 1323375 343000 -573649 -1001449 -1046507 -1115988 -1150177 -920373 -757422 -1040720
38454a040720k36771N09657Q02253j51p24070k06344P28754O60438k36J80518
38444F73328R97730Q35488m91299j220536m57079M18842Q2388o66188m75345K39313
38434f3358J95222l93441j92851Q14686J115090J11849q62372o17428J92180L47880
38424F47457n1043j09541K39357L61744K06091K39617L58301O9314l45028j01121
38414A515148N80304N61423l20171q07543k68973J55494n78866j569028j292832
38405b025044J1718P76408M91392J46955L49870M75385K6152m21772k34506K42011
38395a61431L35335Q6456k9802J6101j38617n11094o30018j71768N37518P67070
38385I9750J46652p98161j051215k39799Q28240J066132L74488l58597l62347
$$ plain form
38454 -1040720 -1277491 -767834 34419 34268 -689802 -896146 -167392 493046 492810 673328
38444 673328 1671058 2506546 2015247 794711 337632 756474 838862 172674 -302671 -63358
38434 -63358 131864 -261577 -454428 360258 1475348 1587197 724825 107397 299577 647457
38424 647457 596414 486873 726230 1087974 1294065 1533682 1891983 1961297 1616269 1515148
38414 1515148 2095452 2656875 2336704 1529161 1260188 1415682 836816 -732212 -2025044
38405 -2025044 -2013326 -1236918 -745526 -598571 -248701 226684 252836 -168936 -403442 -161431
38395 -161431 173904 260360 230558 246659 108042 -403052 -1033070 -1204838 -667320 99750
38385 99750 246402 -551759 -1602974 -1842773 -1014533 51599 426087 67490 -294857
38376b94857L15508J048514J138293K82428r59608j399292n33197O04892O55356
38367H58037k05028n65050R5235P14654L94185k67105k41749L42839N30346k702
38357A653662n95651n84219p6835K88370J06115l26750l46374J81110N62678K30414
38347A092520l50463l48873J47447L48356P9150r7584n654j0132l3663L51380
38337A172484P28066J61931r44705r42548M32800J207120Q2690j359231r55318
38328d16711P56351J428611L66114q21983q07452p3565K68531j23140q19166j097624
38318a340034m23886Q14107J344846N60577n05596o67427k98341l21403l34948
38309a172105N37148J548137J157707k55034p01767K37979P80507q215p35681
$$ plain form
38376 -294857 20651 1069165 2207458 2489886 1530278 130986 -402211 202681 858037
38367 858037 653009 87959 183194 897848 1292033 1024928 783179 1126018 1656364 1653662
38357 1653662 1058011 473792 396957 685327 791442 464692 118318 299428 862106 1092520
38347 1092520 742057 393184 540631 888987 968137 870553 864899 854767 821104 1172484
38337 1172484 1900550 2062481 1117776 175228 608028 1815148 1897838 538607 -416711
38328 -416711 339640 1768251 2134365 1312382 504930 431365 699896 576756 -242410 -1340034
38318 -1340034 -1763920 -949813 395033 955610 450014 -217413 -515754 -837157 -1172105
38309 -1172105 -634957 913180 2070887 1815853 1114086 1352065 2132572 2124357 1388676
38300A388676j90110O93112O25612J1706k10368l12956q42341j151017m72509
38291d60195M61675M50323k41839m58588o0748J91716J68752L38664N77298L98012
38281A365070P5496J92849L59031k01344j009012q39691J71349N85246L4472j59260
38271E74206O81438J266446L74540j068822j278663k02624N57998J45303n03789
38262E46033k15827P19892R60406j09867j506835j715373m59898R57852J252482
38253D28865O47813K48771K86363n1609r81421j432257o08259O27462Q73005J81788
38243B20521j43577M03572Q31635K79598o21669o76615J76900Q78423P27060J20311
38233B196159k26445j76422m4597j5383l4608o7073j75898m27904q30518j200064
$$ plain form
38300 1388676 1198566 1891678 2517290 2528996 2318628 2005672 1163331 12314 -460195
38291 -460195 1480 451803 209964 -248624 -309372 -117656 51096 389760 967058 1365070
38281 1365070 1440566 1633415 1992446 1791102 782090 -57601 113748 698994 733466 574206
38271 574206 1255644 2522090 2896630 1827808 549145 346521 904519 1049822 546033
38262 546033 330206 1050098 2010504 1900637 393802 -1321571 -1781469 -823617 428865
38253 428865 1076678 1325449 1611812 1560203 578782 -853475 -1461734 -834272 38733 220521
38243 220521 76944 480516 1312151 1591749 970080 293465 470365 1348788 2075848 2196159
38233 2196159 1969714 1793292 1748695 1733312 1698704 1631631 1455733 1027829 197311 -1002753
38223a002753j077368j71232R58509J218081M13779k06407L98519J344655Q98557
38214B774340q40537j747811o52559Q36627N80941r62881j380551K34704K027081
38205H69354J954836L57741q54334p72994k23351j74094l99928n7808R31069J591174
38195C221665R75915p16610k227057k377695j105197N36374J295220P40530m27748
38186h4603j055676o56271J59536N05940L18659K43280M95248M75849j69140p16003
38176d83181k59638Q43236J221296K77387r30502r69702J75834J053532M54918
38167A383180j124760j936318q98365J087538K004754R56741q07532j389772m62649
38158a187183N49266M41193l10621m12061M30020J206222J033872K46099k18945
$$ plain form
38223 -1002753 -2080121 -2251353 -1292844 -74763 339016 132609 531128 1875783 2774340
38214 2774340 1933803 185992 -466567 370060 951001 -11880 -1392431 -1157727 869354
38205 869354 2824190 3181931 2327597 1554603 1331252 1157158 757230 699422 1630491 3221665
38195 3221665 4197580 3480970 1253913 -1123782 -2228979 -1692605 -397385 343145 -84603
38186 -84603 -1140279 -1796550 -1637014 -1131074 -812415 -569135 -73887 401962 232822 -483181
38176 -483181 -742819 100417 1321713 1599100 668598 -301104 -125270 928262 1383180
38167 1383180 258420 -1677898 -2576263 -1488725 516029 1472770 665238 -724534 -1187183
38158 -1187183 -637917 -196724 -507345 -919406 -489386 716836 1750708 1996807 1777862
38149A777862q3323R5337j35163n28458o12846l42080K225K70065M56442M31156
38139A331217M7443n10436q13008o45378j58412L85414P54832P14345J94610m68686
38129H31941p44528m08027L08625R36950R62818J28212j033774j320202j96233
38120e34218J213470J309488J12351p94194m97995J76563K14424j23668j16911
38111I59310J02739L6277r4155J64970M03489q4253q63495p08390N01223J331917
38101A749632O64135q12324j530800r42794J17579O77998O00302K55930k20179
38092E59479q92605j417688j115918M4351J053153J035716M61218M03774Q52153
38083I83633P86248o3479p22657n61577j99596k54658l17944M9913L53135J36643
$$ plain form
38149 1777862 1694539 1789876 1654713 1126255 513409 171329 173554 443619 900061 1331217
38139 1331217 1378660 868224 55216 -590162 -748574 -363160 391672 1106017 1300627 831941
38129 831941 87413 -320614 -11989 924961 1887779 2015991 982217 -337985 -534218
38120 -534218 679252 1988740 2101091 1306897 808902 985465 1199889 1076221 959310
38111 959310 1062049 1098326 1004171 1169141 1572630 1488377 624882 -83508 417715 1749632
38101 1749632 2413767 1601443 70643 -872151 -754572 -76574 523728 779658 559479
38092 559479 -333126 -1750814 -2866732 -2822381 -1769228 -733512 -272294 131480 983633
38083 983633 1769881 1706402 983745 422168 222572 -32086 -350030 -300117 53018 189661
38073A89661l4054L54453O07647k1815q22808o76104L8046J32024k79764o9832
38063e82546P42783R22920J89175l14189p5421n3945p97535j233544l26488J151425
38053c77365J577038N89851o04068p40661J84004R27243K80914j350824k014467
38044a528335n92563J369797J499930p0144r41830r1674P79738K39882o01331
38035F3470k04889P00090M36151o63414p14995O29297J500438N31413j198512
38026A079049j624223l01236J142741R76575o13427j708213r42636P93388J548100
38017C50118Q77889J24273J36883J86098l33471o37980l4979O19880K78243n14292
38007A052662o43515l63027n75603q85600k32620R11492R61859j66970q19637
$$ plain form
38073 189661 155607 510060 1117707 1095892 273084 -403020 -364974 -232950 -512714 -582546
38063 -582546 160237 1083157 1272332 958143 882722 828777 31242 -1202302 -1528790 -377365
38053 -377365 1199673 1789524 1185456 444795 628799 1556042 1836956 486132 -1528335
38044 -1528335 -2120898 -751101 748829 678685 -263145 -354819 424919 664801 63470
38035 63470 -141419 558671 994822 331408 -383587 245710 1746148 2277561 1079049
38026 1079049 -545174 -846410 296331 1272906 659479 -1048734 -1991370 -1197982 350118
38017 350118 1228007 1352280 1489163 1675261 1341790 703810 668831 1288711 1566954 1052662
38007 1052662 409147 46120 -529483 -1415083 -1647703 -736211 225648 58678 -760959
37998g60959k71061K75953j4132j74089O49302J425345Q12075n91911j079488
37989B71035k73468O68859R02052O20304J22573n60168j027344o74228K07508
37980B57123M99341j50170o99034k57629N39297N25462k01463n01837n073L90954
37970C96971L7403m28795j47630N56816O37603j15575p81839n81201K06669P60349
37960E40771O71616J61737l08172m01677r1708L21661M63809K24747j96859m91648
37950H94277l69900K75365J048811J135970J79956j025575j251457k95267P38790
37941A330970P46494j77168j000357r33831k02463K54177j20437p08963m13275
37932a224853P13818J236487L04893q93755o64970P45700J512034P87548m63068
$$ plain form
37998 -760959 -1032020 -756067 -770199 -944288 -294986 1130359 1942434 1350523 271035
37989 271035 -2433 666426 1568478 2188782 2311355 1751187 723843 49615 257123
37980 257123 756464 606294 -92740 -350369 188928 714390 512927 11090 6017 396971
37970 396971 434374 5579 -142051 414765 1052368 936793 154954 -426247 -219578 540771
37960 540771 1212387 1374124 1065952 664275 572567 894228 1358037 1582784 1385925 894277
37950 894277 524377 799742 1848553 2984523 3164479 2138904 887447 592180 1330970
37941 1330970 2077464 1900296 899939 -33892 -236355 17822 -102615 -811578 -1224853
37932 -1224853 -511035 725452 1030345 136590 -528380 217320 1729354 2516902 2053834
37923B053834j156308j171612n91344N98751J624274J268031k22646j007403k41681
37914A153896O36420K18513p16150p20090j05765j68602q42817r41996l04996
37905a791587L9219k40524k91233L54827J028832J041681N35513m4994m89270
37896A42464o16517k71284K79365N33988M43436L93769N00759M43032J6260n62530
37886A302742q77690n95747K34258R47599Q07432P4472j38067M86178Q15367k1560
37876C034984j147319j148843p0989Q73579R85490L99171o36098j601465j466895
37867g78385K7261J361563R63417m95142j067170l92441J70435M4711Q9341O02688
37857E26278O56722l9101l93949J80118O80119J75404p53584j111363q64643l87392
$$ plain form
37923 2053834 897526 -274086 -865430 -266679 1357595 2625626 2402980 1395577 1153896
37914 1153896 1790316 2008829 1292679 572589 466824 298222 -544595 -1486591 -1791587
37905 -1791587 -1752368 -1992892 -2284125 -1929298 -900466 141215 676728 631734 142464
37896 142464 -474053 -745337 -465972 68016 511452 905221 1405980 1849012 1865272 1302742
37886 1302742 425052 -170695 63563 1011162 1818594 1893066 1754999 2241177 3056544 3034984
37876 3034984 1887665 738822 667833 1541412 2526902 2926073 2289975 688510 -778385
37867 -778385 -751124 610439 1573856 1078714 11544 -380897 -210462 -165751 -76410 526278
37857 526278 1183000 1143899 749950 930068 1610187 1785591 1032007 -79356 -943999 -1331391
37847a331391L57547J178105J221885K08196p22879m24259O04142R54694K72377
37838B318417m58281m04336J07824J68555n05396j107070o23929P20196J391584
37829A607564M61877r48530j103804q8736M94400M6338l84263j07518K19418J06403
37819C03149J49047O62286Q16326R2444o14297l78324K98059M28519L4178l05036
37809A486351n46513q24522p46587m7435O94504Q80769P78238P68349M92580l14586
37799B621148r05488n10655L49245N96345J43591k70862l22887k27609o9523R8352
37789A501657o4756n71798o99875n1873N78656L54561k19996j50658L67382L28249
37779A371549m05594r86580r02590l64755L58960J001832J022471K96974k78614
$$ plain form
37847 -1331391 -973844 204261 1426146 1634342 911463 487204 1091346 2046040 2318417
37838 2318417 1860136 1455800 1563624 1732179 1226783 119713 -504216 215980 1607564
37829 1607564 2069441 1120911 17107 -71629 422771 469109 84846 -22672 196746 303149
37819 303149 452196 1114482 1930808 2023252 1408955 1030631 1328690 1757209 1791387 1486351
37809 1486351 939838 115316 -631271 -678706 15798 896567 1674805 2443154 2935734 2621148
37799 2621148 1715660 1205005 1554250 2150595 2294186 2023324 1700437 1472828 1403305 1501657
37789 1501657 1436901 865103 165228 113355 692011 1046572 826576 675918 1043300 1371549
37779 1371549 965955 -20625 -923215 -1287970 -929010 72822 1095293 1392267 1113653
37770A113653N8183O17524K99319m93408m32561M99695R38538L29511l51141l27168
37760B252145n6201j28930l77531n25671o43395n95155j00171L83639L3993p52629
37750e09906n21438R27000J797363P86377r33718j381126m42070M18172M44548
37741E85202K16761K89376M81832N51702N85559N76910L36143p9537l99681n81602
37731B562665p02639n60864j0487M61259K70740k01490k818P83131Q35762m80499
37721B954760j900915j814414m14145P08473P61675M19189L51140K99773m4592
37712A320944l32074l10395l59858n46510p0921J318173K183590J068048j153835
37703C117162k133445j146819K26007O28486M46268L37775r499p06934p85321
$$ plain form
37770 1113653 1171836 1789360 2088679 1595271 1162710 1662405 2600943 2930454 2579313 2252145
37760 2252145 2195944 2067014 1689483 1163812 520417 -74738 -174909 208730 242723 -509906
37750 -509906 -1031344 -104344 1693019 2479396 1545678 164552 -277518 140654 585202
37741 585202 801963 1091339 1573171 2124873 2710432 3287342 3623485 3543948 3144267 2562665
37731 2562665 1860026 1299162 1288675 1749934 2020674 1819184 1816366 2599497 3435259 2954760
37721 2954760 1053845 -760569 -1174714 -466241 295434 714623 1065763 1365536 1320944
37712 1320944 988870 678475 318617 -227893 -298814 1019359 3202949 4270997 3117162
37703 3117162 983717 -163102 62905 691391 1137659 1475434 1465935 759001 -26320
37694b6320K14661R90077K83506j007296j118084j03607M84732J76987J9286M85048
37684C98990P35681K89290j52540r1050o7311m28525m88692J99618P43926J43101
37674A282488j033231j285681k32453R21342R62467J0846q77708r72648m48922
37665a673500J09451M60364P51250R33698O18806j89383o76237j55543Q10152
37656I89058R76468Q8110p73737o77513K9572L98672J18826l18752l25494K34579
37646G39789R40519J096080M05058n71500r99842q01411n77567n29071k13005
37637e10950M29951O77998J58670l94705k23639K45108J36933l72386l16358M63662
37627B94284J014958O95262k3707m71888o62584p91396o00753P2940O54510N24007
$$ plain form
37694 -26320 188341 1178418 1461924 454628 -663456 -767063 -282331 -105344 -86058 398990
37684 398990 1134671 1423961 1271421 1180371 1113060 684535 195843 395461 1139387 1282488
37674 1282488 249257 -1036424 -1268877 -347535 614932 625778 -251930 -1224578 -1673500
37665 -1673500 -1564049 -1103685 -352435 581263 1200069 1010686 334449 178906 989058
37656 989058 1965526 2053636 1279899 602386 631958 1030630 1149456 830704 505210 739789
37646 739789 1680308 2776388 3181446 2609946 1610104 808693 231126 -297945 -510950
37637 -510950 -80999 596999 755669 360964 137325 382433 519366 146980 -169378 294284
37627 294284 1309242 2004504 1980797 1508909 846325 54929 -545824 -472884 181626 705633
37617G05633K8964j6699L59841M10095O1506J22542P86978J013739R0514j075202
37607B487911j180511m00290O2806j21974k01756J21161K46226o1007k01707M7526
37597G98385j0615p23663j262078q31462P1095M37042J78380l8131P9863K77366
37587a023818L63877K97742l4077m91097m74749K91033J080761R60333N4497o13218
37577D11284m08943L19958Q13213O20191r5787o58148n20621r166K0350n45111
37567e2780q31747l41155K88629M22493M12039O88066P93983K92760k19683j30498
37557A322107l2286o42189j249626p58635L01405N01328j05133j32783O96239
37548i9573J135942O40175J62268K53476J24288o31638r86440k05124O90289M20235
$$ plain form
37617 705633 734597 717898 1077739 1487834 1549340 1671882 2458860 3472599 3563113 2487911
37607 2487911 1307400 907110 969916 847942 646186 767347 1013573 952566 750859 798385
37597 798385 787770 64107 -1197971 -2029433 -1958338 -1521296 -1342916 -1381047 -1301184 -1023818
37587 -1023818 -659941 -362199 -396276 -887373 -1362122 -1071089 9672 970005 1024502 411284
37577 411284 2341 322299 1135512 1755703 1659916 1001768 481147 471981 492331 -52780
37567 -52780 -884527 -1225682 -937053 -514560 -102521 585545 1379528 1672288 1452605 1322107
37557 1322107 1289821 647632 -601994 -1360629 -1059224 -557896 -663029 -795812 -99573
37548 -99573 1036369 1676544 1838812 2092288 2216576 1584938 598498 393374 1083663 1503898
37538A503898n30744o73392K55866J005923N71418o58285j532759j350542l72222
37529a780839N61524Q41682N38448M0798m47425p57926n20368L14437J019558
37520a90111Q86267K35555j17046j06072k26619m03564j32631M26359O18324M14144
37510A404606K25642j48645j027753j551203n81136J112117J471020K39915n66317
37501E78246J48710R78853N55862l43402n25965l95622o85903p73012J5005P44798
37491B97570L48203l99114k39434K60565j91836j034217o08671R25276J685774
37482A044116J025080K68843K76887K68317l91322j010460r53311p48454r42711
37473a163015r94667k19405R80953J631584J375819N98484j39522m06822j63753
$$ plain form
37538 1503898 973154 299762 555628 1561551 2132969 1474684 -58075 -1408617 -1780839
37529 -1780839 -1219315 -377633 160815 201613 -245812 -1003738 -1524106 -1209669 -190111
37520 -190111 696156 931711 814665 708593 481974 78410 -54221 372138 990462 1404606
37510 1404606 1630248 1481603 453850 -1097353 -1678489 -566372 904648 1144563 578246
37501 578246 726956 1705809 2261671 1918269 1392304 996682 310779 -462233 -447228 297570
37491 297570 645773 246659 7225 267790 75954 -958263 -1566934 -641658 1044116
37482 1044116 2069196 2338039 2614926 2883243 2491921 1481461 528150 -220304 -1163015
37473 -1163015 -2157682 -2377087 -1396134 235450 1611269 2209753 2070231 1663409 1499656
37464A499656J2983m45437j077219p81541M69944J245508N82550n42256n70001
37455C94187M03651Q59623J31493p24691o35379o3077q0246n31264k58220Q75102
37445C71179J404420L34767j163343j226632N3554Q07146J43950p16157m97702
37436d88818L00567M92760O7990j41278K9777L2003l00597n86994n94163l03664
37426a492417L88537J243791J370675L03032r49810j001254k7741N22037Q1527
37417D38377l84060m3173O56177Q98798N81185K3035n47596p63433k11082O93506
37407A341734P34840m70190j559526j056115N43844J351562O20996l79609l14877
37398H12659L64568K87219o45184r98165R1219J467541J351273k61047j542952
$$ plain form
37464 1499656 1512639 1067202 -10017 -791558 -321614 923894 1506444 964188 394187
37455 394187 797838 1657461 1788954 1064263 428884 365807 285561 -245703 -503923 371179
37445 371179 1775599 2110366 947023 -279609 -226055 581091 725041 8884 -488818
37436 -488818 -188251 304509 372499 231221 260998 293001 -7596 -594590 -1188753 -1492417
37426 -1492417 -1103880 139911 1510586 1813618 863808 -137446 -165187 356850 438377
37417 438377 54317 11144 667321 1566119 2147304 2170339 1622743 859310 648228 1341734
37407 1341734 2076574 1606384 46858 -1009257 -465413 886149 1507145 1127536 812659
37398 812659 1177227 1464446 819262 -178903 -87684 1379857 2731130 2470083 927131
37389I27131j221662o7703M51990J95112J52498O64693R00257K30930p57098j079081
37379C97067o23128o6431J63094K47427L64825L07511m9185l19463q1025M13413
37369G54105M88069O434m07840k51070K28158N10406M61289K05890j75029m51641
37359A368771k62465K31844L05070j80389l17279L63582Q03952m945j116299q77531
37349C14311M00876Q79856J52719k55370L91282Q83333L04302m94950n86250l85513
37339A604596l67402o8464N01576K37627r11766j037624P21771K071144P34805
37330C486263j743240k085368j86238J049033M02008k36981M54613J052948P1435
37321B264473j440778j554729k49157R32081J083379N68904N9621o2661K88686
$$ plain form
37389 927131 -294531 -362234 89756 284868 437366 1102059 2002316 2233246 1476148 397067
37379 397067 -226061 -292492 -129398 118029 482854 790365 741180 421717 340692 754105
37369 754105 1242174 1248608 840768 589698 817856 1328262 1789551 1995441 1820412 1368771
37359 1368771 1106306 1338150 1643220 1462831 1145552 1509134 2313086 2308141 1191842 314311
37349 314311 715187 1595043 1747762 1492392 1883674 2767007 3071309 2576359 1990109 1604596
37339 1604596 1237194 1168730 1670306 1907933 996167 -41457 680314 2751458 3486263
37330 3486263 1743023 -342345 -528583 520450 922458 685477 1140090 2193038 2264473
37321 2264473 823695 -731034 -980191 -48110 1035269 1604173 1663794 1601133 1889819
37312A889819P64470P03093j11308j030846j193716m07826P24206J332521R56436
37303C626849j7551o73777n65467j54873j5502p3067m7750n3760j71081m7415
37293A806606L77927M44213j16554m08682K60748J023144O96248l05366p03653
37284C074631m02580k83124m53259l27002o8358k70667n04967M5715P70974L79793
37274A961156o90146p25943L26993O53526l03106q16400J85740J294234R20175
37265B806229l36624r31003n94486n8461L28642N68753M75882Q0407j67598j73726
37255A998015l45808o37595n06024o9453m3788l11196l8742N58057L37474n48593
37245C92347o00167K97805L73660q61473j355237J51004J823324J586508K35456
$$ plain form
37312 1889819 2654289 3357382 3246074 2215228 1021512 613686 1337892 2670413 3626849
37303 3626849 3609298 2935521 2370054 2215181 2199679 2126612 2078862 2025102 1854021 1806606
37293 1806606 2184533 2628746 2512192 2103510 2364258 3387402 4083650 3778284 3074631
37284 3074631 2672051 2388927 1935668 1608666 1540308 1269641 764674 810389 1581363 1961156
37274 1961156 1271010 545067 872060 1525586 1222480 406080 591820 1886054 2806229
37265 2806229 2469605 1538602 944116 885655 1214297 1783050 2258932 2339339 2171741 1998015
37255 1998015 1652207 1014612 508588 439135 395347 84151 45409 603466 940940 392347
37245 392347 -207820 89985 463645 -397828 -1753065 -1602061 221263 1807771 2043227
37236B043227l38260k00006m09216n86903J26684R07241M57340n66894o34613
37227G98600J2953N2449m02736k91408J13882j97170o99166j03246J066100J157434
37217A507692K94759L3604L93645j1905r41162n90998R26750J185713o00496k035983
37207A61619j227770M86867J026607N89044M39382M87185k6695p08156o32095
37198E95988Q3491O81996R20800P63523n6841j124126j154721J01412R77618K36637
37188B025777q98067o11620O94604J274243Q62679O11124O82857O2382j208464
37179C495515j623621n46483O80448O82151j37545n14001j26789L10452K01250
37170B421377l31568p08102m45088K84379O18769l241q81557p77087L52854J169209
$$ plain form
37236 2043227 1704967 1504961 1095745 508842 635526 1542767 2000107 1433213 798600
37227 798600 811553 864002 461266 169858 283740 86570 -612596 -715842 350258 1507692
37217 1507692 1802451 1836055 2229700 2217795 1276633 685635 1612385 2798098 2197602 161619
37207 161619 -1066151 -579284 447323 1036367 1475749 1962934 1936239 1228083 595988
37198 595988 679479 1361475 2282275 3045798 2988957 1864831 710110 811522 1789140 2025777
37188 2025777 1127710 516090 1210694 2484937 3347616 3958740 4641597 4703979 3495515
37179 3495515 1871894 1325411 2005859 2688010 2550465 2036464 1909675 2220127 2421377
37170 2421377 2089809 1381707 936619 1220998 1839767 1836526 954969 177882 530736 1699945
37160A699945P50397k57495p23634m85957j00574K17360O09354R05347P33285
37151C348028J82570k44529k74442m948M06121O99177M04700n82758j484334j408327
37141A041258n70028K7196R6666L11981Q83333R73671Q7235q92328q42714Q9428
37131A205698R00850J055240O09269l36024j349354j433853k30322J001536Q56530
37122B279570j57336m61362K5736n9939r09414j010192K15729J209467P11363
37113A843622l30301n34484k12450k39235k01933N65157J220690O39059m24814
37104B325311m19638L46606K84675n90418o81039K41446N21978m10627q99646
37095G18648R8103J131747O63847l79616k36061P91023J010792J73899l49601
$$ plain form
37160 1699945 2450342 2192847 1469213 983256 882682 1100042 1709396 2614743 3348028
37151 3348028 3530598 3286069 3011627 3006679 3412800 4111977 4516677 3933919 2449585 1041258
37141 1041258 471230 498426 595092 907073 1790406 2764077 2851312 1958984 1116270 1205698
37131 1205698 2106548 3161788 3771057 3435033 2085679 651826 421504 1423040 2279570
37122 2279570 2122234 1660872 1686608 1626669 717255 -292937 -77208 1132259 1843622
37113 1843622 1513321 978837 766387 527152 325219 890376 2111066 2750125 2325311
37104 2325311 1905673 2252279 2536954 1946536 1265497 1506943 2028921 1618294 718648
37095 718648 816751 1948498 2612345 2232729 1996668 2787691 3798483 3972382 3622781
37086C622781J6254K81825k60978r34139r00369l44856J34036M28329O23848N01096
37076C167827k6827m64806l47806J5282j3045m21770n93995k42309K56911N13638
37066A843100N89606O35226N16305J11993l32677m91067l81340k17548n0533J41306
37056B364371K37460J83637J53231J55093j27074o17415n08155N45088J394482
37047C780718P54500p06503j105481j73950L85544k18117n49788M72681J520130
37038D159734R73261l65816o39351N4529J92763l10057j37789P20083O98433n81272
37028D764518j483490r57407K01L15468M18794P89779O58979m38621j253441n79977
37018B234803O55863P64249m3846j64320O51581R32137l8648j076102r70159j82999
$$ plain form
37086 3622781 3639035 3920860 3659882 2725743 1825374 1480518 1614554 2042883 2666731 3167827
37076 3167827 3141000 2676194 2328388 2343670 2330625 1908855 1314860 1072551 1329462 1843100
37066 1843100 2432706 3067932 3584237 3696230 3363553 2872486 2491146 2273598 2223065 2364371
37056 2364371 2601831 2785468 2938699 3093792 2966718 2349303 1841148 2386236 3780718
37047 3780718 4535218 3828715 2723234 2549284 2934828 2716711 2166923 2639604 4159734
37038 4159734 5132995 4767179 4127828 4182357 4375120 4065063 3927274 4647357 5345790 4764518
37028 4764518 3281028 2323621 2323822 2639290 3058084 3847863 4506842 4068221 2814780 2234803
37018 2234803 2890666 3654915 3611069 3446749 4098330 5030467 4991819 3915717 2945558 2762559
37008B762559J33303j03951q9558L98601O82692L43080r9020k9840K38102n7074
36998D178894p72203p83511M05410J681211J634520L98808o77316r21877q87897
36989D256039j035243r77964l83912L15420O08260N65453L83935p067m18440k33119
36979C073362O36489J283803R55725J00315l81144l78417l55349l88319k30488
36970D315977J2562P3719J49335N48434Q69708L49936q87877j626772r00144P87786
36960C692664J850478J224866m40039j367196o62973N42285N94117l07090l98012
36951D729100Q00968J445338J12289j749557j703930J20132J246461M78106o22494
36942D856413l90352N26929N63796j43161j25547Q24675J111495j47401j413546
$$ plain form
37008 2762559 2895862 2791911 2702353 3100954 3783646 4126726 4027706 3997866 4235968 4178894
36998 4178894 3406691 2623180 3028590 4709801 6344321 6743129 6065813 5143936 4256039
36989 4256039 3220796 2242832 1858920 2174340 2782600 3348053 3731988 3724921 3306481 3073362
36979 3073362 3709851 4993654 5949379 6049694 5668550 5290133 4934784 4546465 4315977
36970 4315977 4328539 4402258 4551593 5100027 5969735 6319671 5431794 3805022 2904878 3692664
36960 3692664 5543142 6768008 6327969 4960773 4297800 4840085 5434202 5127112 4729100
36951 4729100 5530068 6975406 7087695 5338138 3634208 3754340 5000801 5478907 4856413
36942 4856413 4466061 4992990 5556786 5413625 5288078 6112753 7224248 7076847 5663301
36933E663301p50398J138269J573062k21053j715264o97443J281599J163251q15873
36924F619451j363922O62808K296860J025189j324997j502481L01632J264880
36916G979420M80946k58479J00533M90771J14422k34522M9175L00821R9706J30376
36906I253169O94278R06590K26351n99471r05912j070901j340979j083502p0349
36897F009274Q19367J043845J196759J491532R71958o25769j730201j072561L28487
36888H432691P93697L71474N4046j51113n91854n47363N79429J578402J027073
36879A1546482k35807m27683J41505j70638j103099q32356N78305J043839J16064
36870A0656612k23733P71631J142783k50921j510719q20989O05483Q16294L11453
$$ plain form
36933 5663301 4912903 6051172 7624234 7403181 5687917 4990474 6272073 7435324 6619451
36924 6619451 5255529 5918337 8215197 9240386 7915389 6412908 6714540 7979420
36916 7979420 8460366 8201887 8302420 8793191 8907613 8673091 8722266 9023087 9122793 9253169
36906 9253169 9947447 10854037 11080388 10480917 9575005 8504104 7163125 6079623 6009274
36897 6009274 6828641 7872486 9069245 10560777 11532735 10906966 9176765 8104204 8432691
36888 8432691 9226388 9597862 9651908 9500795 8908941 8361578 8941007 10519409 11546482
36879 11546482 11310675 10882992 11024497 10853859 9750760 8918404 9496709 10540548 10656612
36870 10656612 10432879 11204510 12347293 12096372 10585653 9764664 10370147 11186441 11497894
36861A1497894N93186J186463O84661l66201k10079J126181J925854J507886P76756
36852A8722601L34558l888m8970N25772R80249L71982n95290m66400M59992N97340
36842B0877946o7961R1512J298127J684080M22123o81388R0898J832656K513194
36833B8061187J666835L89628k78182K8408J046337J779294J312090K85985L80171
36824C4671753J800010K741798K092702J083172J238764K218016K902475L201337
36816E1950027L409469L101550K145421J622723K255317L096015L297370L838404
36808G4716296N638744P258928O794883N168473N029587O837301Q532638Q999063
36800A28975913R361457J0549750J1900493J2862055J4115955J6115040J8042359
$$ plain form
36861 11497894 12091080 13277543 13962204 13596003 13385924 14512105 16437959 17945845 18722601
36852 18722601 19057159 19053271 19004301 19530073 20510322 20882304 20287014 19820614 20280606 20877946
36842 20877946 20809985 20901497 22199624 23883704 24305827 23624439 23715337 25547993 28061187
36833 28061187 29728022 30117650 29839468 29867876 30914213 32693507 34005597 34291582 34671753
36824 34671753 36471763 39213561 41306263 42389435 43628199 45846215 48748690 51950027
36816 51950027 55359496 58461046 60606467 62229190 64484507 67580522 70877892 74716296
36808 74716296 80355040 87613968 94408851 99577324 104606911 111444212 119976850 128975913
36800 128975913 138337370 148887120 160787613 173649668 187765623 203880663 221923022
36793B21923022J9086120J9607630K0417442K1806188K3547350K4893600K4597198
36786C75878550K2101105J8525866J5081436J0880862M264622l886723j0551820
36779D32293898j4581592j7796955k1381336k3871452k4087243k3501408k3703759
36772B83370153k3598329k1482125j8362005j6661315j6568317j6099134j4285897
36765A56313031j2098392j0452255r309296q669439q631236q467259p321481n828372
36757H5535301n379431n768324n362933l841120k854469l347700m004223l387328
36749E1589773k157334j839632k422504k630957k034357j472392j496770j620567
36741C5915260j371685j136889j424590j872474j650118o66919K13401K51866
$$ plain form
36793 221923022 241009142 260616772 281034214 302840402 326387752 351281352 375878550
36786 375878550 397979655 416505521 431586957 442467819 446732441 442845718 432293898
36779 432293898 417712306 399915351 378534015 354662563 330575320 307073912 283370153
36772 283370153 259771824 238289699 219927694 203266379 186698062 170598928 156313031
36765 156313031 144214639 133762384 124453088 115783649 107152413 98685154 91363673 85535301
36757 85535301 80155870 74387546 69024613 65183493 62329024 58981324 54977101 51589773
36749 51589773 49432439 47592807 45170303 42539346 40504989 39032597 37535827 35915260
36741 35915260 34543575 33406686 31982096 30109622 28459504 27792585 28005986 28257852
36733B8257852l41688q95399j156773j253970j110627n59552M0944J6123o49863
36724B2347047j163343r70419m04827o0432p6385k83878m72074k79341M79392
36715A9115740J114047N86216q01202j285335l9504J318682Q40189q92588j568056
36706A8388189m91955N71355J53512q93138r17096J21867Q60129N88713J3075
36697A8394651m848L88634M44311j03292p77131j011663o78073K1033P70493J135809
36687A8579924Q01200J30846L5416P95176J476523J186203M20448K25809M63067
36678B4114612K16480k86464J84120J570696K136799J076212j12661J05324J116746
36669C0121864J510526J317617J383585J527255R94646R8035j66159K91156P74611
$$ plain form
36733 28257852 27916164 27020765 25863992 24610022 23499395 22939843 22980787 22996910 22347047
36724 22347047 21183704 20213285 19808458 19748026 19671641 19387763 18915689 18636348 19115740
36715 19115740 20229787 20816003 20014801 18729466 18689962 20008644 20848833 19956245 18388189
36706 18388189 17896234 18467589 18621101 17727963 16810867 16932734 17792863 18381576 18394651
36697 18394651 18389803 18778437 19222748 19119456 18342325 17330662 16652589 16673622 17444115 18579924
36687 18579924 19381124 19511970 19547386 20342562 21819085 23005288 23425736 23651545 24114612
36678 24114612 24331092 24044628 24228748 25799444 27936243 29012455 28899794 29005118 30121864
36669 30121864 31632390 32950007 34333592 35860847 36855493 36953528 36787369 37078525 37853136
36660C7853136J038159J157698Q02326m0643l40458M86516J146590K65490j154093
36651D1214721j132479L2081K78061p45947j316841q48862p58597j548542j703923
36642C3469672n49382K61047m75098j409046r85095k5107j22313r57644j157988
36633B8049046p12567o49767j092833j334193j254382j208018j059458o04919
36625B0132909l08872m47964l45469L16836M55133o42093j558562o53045J118695
36616A8067568J423401Q4298q62304m70147P8914m0660m0811O04748J013819N32768
36606B0391594r5811j21423N1163m7217j5162L70044M25741j60086n24276j38222
36596B0136345K5041r64901k265784k384218j279018r2819N41188O56142P9602
$$ plain form
36660 37853136 38891295 40048993 40851319 40810676 40470218 40956734 42103324 42368814 41214721
36651 41214721 40082242 40114323 40392384 39646437 38329596 37480734 36722137 35173595 33469672
36642 33469672 32920290 33181337 32706239 31297193 30312098 30286991 30164678 29207034 28049046
36633 28049046 27336479 26686712 25593879 24259686 23005304 21797286 20737828 20132909
36625 20132909 19824037 19376073 19030604 19347440 19802573 19160480 17601918 16948873 18067568
36616 18067568 19490969 19575267 18712963 18242816 18321730 18281070 18240259 18845007 19858826 20391594
36606 20391594 20295783 20174360 20225523 20178306 20163144 20533188 20958929 20798843 20274567 20136345
36596 20136345 20161386 19196485 16930701 14546483 13267465 13174646 13715834 14371976 14451578
36587A4451578j137802j874504j073386M43993P95470l22213j272446r23169L264
36578I090785M11689K81953K3538l88732q63766q20005j92655J03271m10022p80489
36568F455567q6508Q97737P59083l54596r68092n01538J23762J87013J41861M76675
36558G130964P45917M21518j05705j42005J96680K12666k82432p18234n77813
36549F881556n4953J98657j46889o66914o78967k10044n9181n59373q14956O8339
36539C957275J399449J628509N25062n90671q67259p88081o94593l8136J093252
36530E624807J275393j28656j457650r68437M84295Q38252R5586K1657R20063
36521F705310J112264o8694j063002o81029R7404O2230k57787j953J65582o20221
$$ plain form
36587 14451578 13313776 11439272 10365886 10809879 11605349 11283136 10010690 9087521 9090785
36578 9090785 9502474 9784427 9807965 9419233 8555467 7735462 7542807 7646078 7236056 6455567
36568 6455567 6369059 7266796 8025879 7671283 6703191 6201653 6325415 6512428 6654289 7130964
36558 7130964 7876881 8298399 8192694 8050689 8247369 8460035 8177603 7459369 6881556
36549 6881556 6826603 7025260 6878371 6211457 5532490 5322446 5263265 4703892 3888936 3957275
36539 3957275 5356724 6985233 7510295 6919624 6052365 5264284 4569691 4531555 5624807
36530 5624807 6900200 6771544 5313894 4345457 4829752 5668004 5763590 5785247 6705310
36521 6705310 7817574 7748880 6685878 6004849 6102253 6164483 5906696 5904743 6070325 5450104
36511E450104j367139n18947J288739J849599O77485l34780P4804P51356K51183
36502H122404p87352p64903L38897J064137P41072K25488K84496N32505M49310
36493A0206054M03196Q42328J176078N11378p63096j215774l52990N86458K94363
36484A1687995q63928j457419r27199j49131j20822p24736j017576m52138M21086
36475F396132N20737m58285j476020j269240J0452Q92391M77675m95248q60472
36466C738122n24791j29428N5342O0258l17940r90649j074342n5648J016715Q22233
36456B599872j32222k66761M14948L04910r23018j436736j36657J380293J117077
36447B921706m02212j076470k22375R18714J154759M28997p46301j679272j539350
$$ plain form
36511 5450104 4082965 3564018 4852757 6702356 7379841 7045061 7119865 7871221 8122404
36502 8122404 7335052 6570149 6909046 7973183 8714255 8939743 9224239 9756744 10206054
36493 10206054 10609250 11451578 12627656 13139034 12375938 11160164 10807174 11393632 11687995
36484 11687995 10824067 9366648 8439449 8290318 8169496 7444760 6427184 5975046 6396132
36475 6396132 6916869 6458584 4982564 3713324 3723776 4616167 5093842 4598594 3738122
36466 3738122 3213331 3083903 3139245 3199503 2881563 1890914 816572 760924 1777639 2599872
36456 2599872 2467650 2200889 2615837 2920747 1997729 560993 424336 1804629 2921706
36447 2921706 2519494 1443024 1220649 2139363 3294122 3723119 2976818 1297546 -241804
36438b41804j90691J138105J105944P8646l76386K70428R46673P42474N2073l84479
36428C140983n30117o36643o25810m34507l08718k51581J78867R69341J188687
36419B690502J89436j151863j287826j5604J172162R50256k53634r19154k81324
36410A092951R50619J558086J036834j53241j130367j223361m37595M38496M99980
36401B632402j89458n38500Q3562P32434J07358j328883j628041n6312J662895
36392A477457J605741K22614m95119J15192P11445J30430j029131j464402q85379
36383C88848l6121M14722L60813j8424m26288m96014j40701K32560K33242P8132
36373E90769K32630N64831M40520k38805p17480m60041J618j18007n94454n45293
$$ plain form
36438 -241804 -432495 705610 1811554 1890200 1513814 1784242 2730915 3473389 3525462 3140983
36428 3140983 2610866 1974223 1348413 913906 605188 353607 532474 1501815 2690502
36419 2690502 2879938 1728075 440249 424645 1596807 2547063 2293429 1374275 1092951
36410 1092951 2043570 3601656 4638490 4485249 3354882 2131521 1693926 2132422 2632402
36401 2632402 2442944 1904444 1988006 2720440 2827798 1498915 -129126 -185438 1477457
36392 1477457 3083198 3305812 2810693 2925885 3637330 3767760 2738629 1274227 388848
36383 388848 352727 767449 1128262 1109838 683550 187536 46835 279395 512637 590769
36373 590769 823399 1388230 1828750 1589945 872465 412424 414042 296035 -298419 -843712
36363h43712J09066M86246K03510J1480M76847R53747O77546J24122J90986N41734
36353B931572J04076r23428j036371K29860J251263M61265j359438k003156o59944
36344a004301J164750J600891N47119n16182n15306j2679j50928p68152m93226
36335a48014J026067K111323J273723m14341o94393N63636J288535N43041j31705
36326E417872N12429J252544M35323j243749j797361r39467j90156l46725o00843
36317B499867k70978J19401j6001k32558J91763J019508J243516M00130p08056
36308D246592q42413R9248P57892R0128r32997n24697J078060J565827m4230j636983
36298C856427r37294J157096J974355R04454j94991p1190M76659L86121j81281
$$ plain form
36363 -843712 -734646 -248400 -44890 -33410 443437 1397184 2074730 2198852 2389838 2931572
36353 2931572 3035648 2112220 1075849 1305709 2556972 3018237 1658799 -344357 -1004301
36344 -1004301 160449 1761340 2308459 1792277 1276971 1264292 1113364 345212 -148014
36335 -148014 878053 2989376 4263099 3848758 3154365 3718001 5006536 5549577 5417872
36326 5417872 5930301 7182845 7618168 6374419 4577058 3637591 3447435 3100710 2499867
36317 2499867 2228889 2348290 2332289 2099731 2291494 3311002 4554518 4954648 4246592
36308 4246592 3404179 3503427 4261319 4351447 3418450 2893753 3971813 5537640 5493410 3856427
36298 3856427 2919133 4076229 6050584 6955038 6760047 6688857 7165516 7551637 7370356
36289G370356n99524o84155m21287J10732L19572k97730j028128o82821M07650
36280D494665O01725n17909j386578q65959J22564K97016m9624j5084J60369k63791
36270B577394q94093o81779L13170R26626N52396k53172p86559q93243o30005
36261B30735o4881M58812N09506J40551k11484l85046n29270n46853j46368M79227
36251f5071O79290K76463r4333J06554N71051P06683N18465L72120J93941l48103
36241B917060r36860p55367J75515O67984O732q20569m86698O13639R14715P2322
36231B368473o42473m79527j79925k99721j75720N05867O68736k75562r08698
36222E81450R3673J477601J105154o33236j389467m62631N62604P43848Q27598
$$ plain form
36289 7370356 6770832 6086677 5665390 5776122 6095694 5797964 4769836 4087015 4494665
36280 4494665 5096390 4578481 3191903 2325944 2448508 2745524 2695900 2680816 2841185 2577394
36270 2577394 1683301 1001522 1314692 2241318 2793714 2540542 1753983 860740 230735
36261 230735 165854 624666 1134172 1274723 1063239 678193 148923 -397930 -544298 -65071
36251 -65071 614219 890682 796349 902903 1473954 2180637 2699102 3071222 3265163 2917060
36241 2917060 1980200 1224833 1400348 2068332 2075064 1254495 767797 1381436 2296151 2368473
36231 2368473 1726000 1246473 1066548 766827 591107 1096974 1765710 1490148 581450
36222 581450 675123 2152724 3257878 2624642 1235175 772544 1335148 2078996 2906594
36213B906594R90200J21998j697721k397208r41740Q54559J039338K13489j09228
36204I80281o8074m49871o51920J50119R84747N43890k67617L11328J642715J423541
36194D599139n36848j919890j477088m61082N07M17033R63118M97989j083632
36185I99246j756993l76841J114037N34361j044590j037742N37850J354245O85693
36176A009266K39862Q45097R78207m12134j818338j416274J54166R08182M06006
36167H94040j32686j5412K45796K76641L97815O60467N04560k53563r59403j013803
36157F04452n88065j87903o5562k34069n11306m56833J36728O82059M75693p8382
36147b23188O3913P60092O09226p66923j739356r76509M67043P66401J17040J64952
$$ plain form
36213 2906594 3896794 4018792 2321071 -76137 -1017877 -163318 876020 1089509 980281
36204 980281 912207 462336 -189584 -39465 945282 1489172 1221555 1532883 3175598 4599139
36194 4599139 4062291 2142401 665313 204231 204738 621771 1584889 2082878 999246
36185 999246 -757747 -1134588 -20551 513810 -530780 -1568522 -1030672 323573 1009266
36176 1009266 1249128 2094225 3072432 2660298 841960 -574314 -420148 488034 894040
36167 894040 761354 745942 991738 1268379 1666194 2326661 2831221 2577658 1618255 604452
36157 604452 16387 -171516 -237078 -471147 -982453 -1439286 -1302558 -620499 -144806 -223188
36147 -223188 -159275 600817 1210043 443120 -1296236 -2272745 -1805702 -1039301 -922261 -757309
36137g57309J100376J278074m1913j349853j053394L00437R67032L92587l21372
36128E14665n2277R58712J408102M18893j272681j865190n92034J108213J272865
36119A899268m7187j021291p04894p2147n7042o3680O70559J441441J069481k04716
36109B909792j075375j011954n83468j91356L56177R92515J169072P28054J99650
36100C493107m2873k57600o66367r06512n69579R2315M20087J43608l67128n68721
36090G70337k83956J68602K86125r8410n38133l51166N56481J336479R69957m62634
36080B353682j554311j003456P88128K021379J532146K9059r68662q88572k94676
36071B014717J94361M06804K58931k82476q33063q43990l20552K10168M15264
$$ plain form
36137 -757309 343067 1621141 1579228 229375 -824019 -523582 443450 836037 514665
36128 514665 462388 1421100 2829202 3248095 1975414 110224 -481810 626403 1899268
36119 1899268 1852081 830790 125896 53749 -3293 -66973 603586 2045027 3114508 2909792
36109 2909792 1834417 822463 238995 47639 403816 1396331 2565403 3293457 3493107
36100 3493107 3450234 3192634 2526267 1619755 1050176 1142491 1562578 1706186 1339058 770337
36090 770337 486381 654983 941108 842698 304565 -46601 509880 1846359 2816316 2353682
36080 2353682 799371 -204085 584043 2605422 4137568 4166627 3197965 2309393 2014717
36071 2014717 2209078 2615882 2874813 2592337 1759274 915284 594732 804900 1220164
36062A220164L22983n9904o11750p41845l6020Q05989O56968l59246r48774n86568
36052c38003j71563l33822l69734L55049J077760P90813r5881m08725O758L04126
36042H16778J25870m0323P1120P8618k38000m60945j56026M74142P95835M13976
36032A881045m20648r92109q15985k03438J10200p0557k07478Q9543M68788L78177
36022B17538j84463o97189o09972K13978J176683J223481Q7057r35558l99746
36013I1809J158981J714862N27906r28611j232158p43638l52000L9914O72195
36004I49260Q40829L985r61024r36201k45984P8352j6528P7791L12873K76094
35994C79447J98106M08718L95390l25942j032005p94672j2897L87955N23759Q46343
$$ plain form
36062 1220164 1543147 1483243 871493 129648 93628 899617 1556585 1197339 248565 -338003
36052 -338003 -509566 -843388 -1213122 -858073 219687 1010500 914619 505894 512652 816778
36042 816778 942648 902325 973445 1052063 814063 353118 197092 671234 1467069 1881045
36032 1881045 1460397 468288 -347697 -551135 -440935 -511492 -718970 -629427 -160639 217538
36022 217538 33075 -664114 -1274086 -1060108 116575 1340056 1427113 491555 91809
36013 91809 1250790 2965652 3493558 2564947 1332789 589151 237151 277065 949260
36004 949260 1790089 1794074 833050 -103151 -349135 -270783 -287311 -209520 103353 379447
35994 379447 577553 986271 1381661 1055719 23714 -770958 -783855 -395900 127859 974202
35984I74202P56728k84046j084071k73717J102541R12816n35795r11454K42200
35975H99404Q22553j63729j040414n09002L31150K93775R2878M88446N65361l64074
35965A416348r87930r5296J078334P02812o28844q82655K23539J096547Q70706
35956B793561K18912k16322n02435n93752k83402M3317j76439o42274o76061m60838
35946d95733n95537p46021j16073R18747J092266J99957n74948m43074J04561
35937f55855L79781L28207P9594k62928k36973M88333J143862O23303o08879p91649
35927D86796N02511J472098O20840j106691j778078j021171P5672Q10128J270354
35918A332459J329458N89409o42429j338887r29005J07029Q59422P59024j20166
$$ plain form
35984 974202 1730930 1446884 362813 89096 1191637 2104453 1568658 657204 899404
35975 899404 1721957 1558228 517814 8812 339962 633737 726615 1215061 1780422 1416348
35965 1416348 428418 333122 1411456 2114268 1485424 602769 826308 1922855 2793561
35956 2793561 3012473 2796151 2293716 1699964 1416562 1459879 1283440 641166 -34895 -495733
35946 -495733 -1091270 -1837291 -1953364 -1034617 57649 257606 -317342 -760416 -655855
35937 -655855 -276074 52133 131727 -131201 -368174 120159 1264021 1887324 1278445 486796
35927 486796 989307 2461405 3082245 1975554 197476 -823695 -748023 62105 1332459
35918 1332459 2661917 3251326 2608897 1270010 341005 448034 1307456 2066480 1946314
35909A946314j044886j126802l33232L11826N3667n38677n46535j46736m8837
35900a473898j7809O17243J239276M85615j253523j733262k8684J880731J867200
35891A582889N13259k58560j31276j33422l57721m4900M81501J05296q70517q66697
35881A9852L23958J012973K96227o38331o72612l94486n02470l07482P44183J490319
35871A372131O64595r30110j506945q07357K9951M74147Q66122J107368P07955
35862A977857J5462l6129N62126Q12361J77604q21220j399909j120564l6709R88118
35852A118997P20579p13668j371152o8975J492334R57808j076045j877994o47542
35843a465658O70110P40287M78199O90616N03261o66213j570742j031530J33289
$$ plain form
35909 1946314 901428 -225374 -558606 -246780 -193113 -731790 -1278325 -1425061 -1473898
35900 -1473898 -1491707 -874464 364812 850427 -403096 -2136358 -2165042 -284311 1582889
35891 1582889 2096148 1837588 1706312 1572890 1215169 1170269 1651770 1757066 886549 19852
35881 19852 343810 1356783 1653010 1014679 342067 -52419 -554889 -862371 -118188 1372131
35871 1372131 2036726 1106616 -400329 -1207686 -1177735 -703588 162534 1269902 1977857
35862 1977857 1993319 1957190 2519316 3331677 3509281 2688061 1288152 167588 130879 1118997
35852 1118997 1839576 1125908 -245244 -314219 1178115 2135923 1059878 -818116 -1465658
35843 -1465658 -795548 -55261 422938 1113554 1616815 950602 -620140 -1651670 -1518381
35834a518381M90099Q8358j38160k1982N5401J55515L82979K56803m45818r23655
35824a618841m37717M69218P49135K62633l45243n60384j64295P56869J394662
35815E06037P53319p65405j408278m54116O66910N56375j82127l46400j58879
35806h32564l52755m30780L35967J076975M84710p68327q24837L86508R88256
35797F3153N7831j149797j238500l55979O16429J227011J325051Q80791L57033
35788A783023L33825N27533J28796p63470j132750o49542j26603p2762K1547M87020
35778E36617P04880K01686m35214m88188k01527j86491l40570j44470L64479O50574
35768F61776N05100K12044j5871k68696n75992o73492l07483L27526O33542K45883
$$ plain form
35834 -1518381 -1028282 -939924 -1078084 -1100066 -1044665 -889150 -506171 -249368 -695186 -1618841
35824 -1618841 -2056558 -1587340 -838205 -575572 -920815 -1481199 -1645494 -888625 506037
35815 506037 1259356 493951 -914327 -1368443 -701533 -145158 -327285 -673685 -832564
35806 -832564 -1185319 -1616099 -1280132 -203157 281553 -486774 -1311611 -925103 63153
35797 63153 120984 -1028813 -2267313 -2623292 -2006863 -779852 545199 1425990 1783023
35788 1783023 2116848 2644381 2773177 2009707 876957 227415 100812 28050 49597 536617
35778 536617 1241497 1443183 1007969 519781 318254 131763 -208807 -353277 11202 661776
35768 661776 1166876 1378920 1363049 1094353 518361 -155131 -462614 -135088 498454 744337
35758G44337m29852o13829j45954L14359K43253j10531l55568o03497r36220q42190
35748b735692J2129R03255Q72128J48062j90914J95498O33957O69923N73996N55401
35738A637743M27553K08992J64536Q7836n30502j389004j415483l44170O62968
35729d89531N71737j08684j92937M52739Q73143M80431k07058l77331Q077K35088
35719A245674j93208q62181r33758k64835L66842L34960K548Q7591O06357R95130
35709A385120R51861N62405q4387p42541q28981k12802J48677o28085j764316
35700a213049j588533N4833J416589J200083J36620l64696j08979J30059j6418
35691c53491k59907l47494k72958l9156K64378L76078K42256J92079L93986N01747
$$ plain form
35758 744337 314485 -299344 -445298 -130939 112314 1783 -353785 -957282 -1893502 -2735692
35748 -2735692 -2723563 -1820308 -948180 -800118 -991032 -795534 -161577 508346 1082342 1637743
35738 1637743 2065296 2274288 2438824 2526660 1996158 607154 -808329 -1152499 -489531
35729 -489531 82206 -26478 -219415 233324 1106467 1586898 1379840 1002509 1010586 1245674
35719 1245674 1052466 190285 -743473 -1008308 -641466 -306506 -303958 -216367 389990 1385120
35709 1385120 2336981 2899386 2814999 2072458 1243477 1030675 1179352 551267 -1213049
35700 -1213049 -2801582 -2746749 -1330160 -130077 6543 -358153 -467132 -337073 -353491
35691 -353491 -613398 -960892 -1233850 -1273006 -1008628 -632550 -390294 -198215 195771 697518
35681F97518K23608j41549j97143j29790l46315o71139n37835N6673M12589J48648
35671d84735j31426L60531J350122J633015O11819q07251j310860q14658l09875
35662I6682k53909q0021M87000O75093j22488j189322j381346o26609K67754P90065
35652a337101Q71473L88342m97890r15585k49630P55061Q89066K08022k12055
35643a00297J727K30098J60333J37144K15713N9228j62956O4803M97665L62629
35633A466087k64471n49684l84707m14539n51070m8894P34727M43987q92869j413285
35623a874718k13587J129092R61869o2643l50755K15181P04681Q91915J020625
35614B421660O68005n62845j790407j789100p82953K6227L21814O92408J094366
$$ plain form
35681 697518 921126 779577 582434 452644 106329 -564810 -1102645 -1045972 -633383 -484735
35671 -484735 -616161 -255630 1094492 2727507 3339326 2532075 1221215 406557 96682
35662 96682 -157227 -237248 249752 924845 802357 -386965 -1768311 -2394920 -2127166 -1337101
35652 -1337101 -465628 -77286 -575176 -1490761 -1740391 -985330 -96264 111758 -100297
35643 -100297 -98570 131528 291861 429005 644718 703946 540990 605793 1103458 1466087
35633 1466087 1201616 651932 267225 -147314 -698384 -747278 -12551 431436 -461433 -1874718
35623 -1874718 -2088305 -959213 2656 -59987 -410742 -195561 509120 1401035 2421660
35614 2421660 3089665 2526820 736413 -1052687 -1835640 -1809413 -1487599 -795191 299175
35605B99175P72565k41874q52736m06678M56649P37474K01261n67262p46937L2447
35595c15916J149928J376376K94289r98010j169845k54527O78043R84600P78020
35586B522958K03138o45304j270857j166241o01295k45531j33520J77219N64063
35577e95370M33303r5903j23455N81443R69483J85064r58841q48834O79402J814950
35567B041242R91193q99418j490360j74883R26860N2979j406185r15899J135043
35558B60572J752421j18740j905610j298063M84649J019743L60591J80387N89636
35549A325586L06711o73566j009031m21509j2312j51070o4134L33938J81610m46025
35539f29802l45152O01168R04854o9633r22766n24954J23677l20086j190314q25760
$$ plain form
35605 299175 1071740 829866 -22870 -429548 27101 764575 965836 398574 -348363 -315916
35595 -315916 834012 2210388 2504677 1506667 336822 82295 760338 1744938 2522958
35586 2522958 2726096 2080792 809935 -356306 -957601 -1203132 -1336652 -1159433 -595370
35577 -595370 -162067 -257970 -381425 200018 1169501 1354565 395724 -453110 226292 2041242
35567 2041242 3032435 2133017 642657 467774 1394634 1447613 41428 -874471 260572
35558 260572 2012993 1894253 -11357 -1309420 -824771 194972 555563 735950 1325586
35549 1325586 1632297 958731 -50300 -471809 -484121 -635191 -699325 -365387 -183777 -629802
35539 -629802 -974954 -373786 531068 461435 -461331 -986285 -862608 -1182694 -2373008 -3198768
35529c198768Q23836K107328J872517N61226p25702j254841q37508J22504P03549
35520A74141L00406n30976o66239O1826N70310N0056p87782o05456O43648J472916
35510F82850P97260n77024j050628l49846M04990N46089N49304O76638K83417
35501A963050q02737j409125o08526O98875R86425K23215m20538m44920l08500
35492a22781k30455r946J68891m9978l49485k03196Q1300j02708m49447k91727
35482a559532O3127o3692k47162K92346Q97559L55971o91958m43930R18084J199455
35472G20268k20867j263942n29209O02545N68851R8129L72803O70983r9464j026821
35462a06724n95166N73328O21074m85951r47338k2786R59299P03009m04764j105324
$$ plain form
35529 -3198768 -2374932 -267604 1604913 2166139 1440437 185596 -651912 -529408 174141
35520 174141 474547 -56429 -722668 -660842 -90532 -40476 -828258 -1433714 -790066 682850
35510 682850 1480110 903086 -147542 -497388 -92398 453691 1002995 1679633 1963050
35501 1963050 1160313 -248812 -857338 -158463 827962 1051177 630639 185719 -122781
35492 -122781 -353236 -363182 -194291 -244269 -593754 -796950 -715650 -818358 -1267805 -1559532
35482 -1559532 -1496405 -1560097 -1807259 -1514913 -617354 -261383 -953341 -1397271 -479187 720268
35472 720268 499401 -764541 -1293750 -691205 -122354 -24225 348578 1019561 920097 -106724
35462 -106724 -701890 -128562 492512 6561 -940777 -963563 -4264 698745 293981 -811343
35452h11343p50798K84611J068354R50349K76444m3599J24880Q033n34745n06646
35442F5540M51759J067169L46364p09741p03124o3550l0387l38349J61884J162975
35432A410540J204208J18462p13086n90189k65504l34525m20953k25321l0710
35423A52922O8398K77382L85959O3673k68704o8872J41240l58138q34942p5039
35413e16121J284520J407058J71664p23086o63080p55199j214749p21644Q02452
35404i28185J383538K03933q36265k82288N25437P9745o12898j77398M16159j51368
35394c79590o91352M26626J855817J184033p69429j073992L97452Q47532n27406
35385A269691j216455J37628J421329P29690o23253p07356j13965l12344q47156
$$ plain form
35452 -811343 -1562141 -1277530 -209176 741173 1017617 974018 1098898 1106931 572186 65540
35442 65540 517299 1584468 1930832 1221091 517967 454417 424030 85681 247565 1410540
35432 1410540 2614748 2733210 2020124 1429935 1164431 829906 408953 183632 152922
35423 152922 221320 498702 884661 948334 679630 610758 751998 393860 -441082 -516121
35413 -516121 768399 2175457 2347121 1624035 960955 205756 -1008993 -1730637 -928185
35404 -928185 455353 659286 -176979 -459267 66170 145915 -466983 -644381 -228222 -379590
35394 -379590 -1070942 -644316 1211501 2395534 1626105 552113 949565 1797097 1269691
35385 1269691 53236 190864 1612193 2341883 1718630 1011274 897309 584965 -262191
35376b62191m88431K91984K65218k20050o067O14067N12071k5704K27084J057278
35366A965259R74856k61924j186265r33413l40111l12334n27985l41107J30124
35357h32900M04871L55893J19186j28807j37942J26309K05789k28505o77301m79658
35347a273065Q5692K47916K4734N5357L89989N28987M63235N40016N26520M2740
35337A632121l63585k623M17936k31757j225337p84289P90279J217565l1197p20197
35327F98916L69616J297838L24359j005757m76445R99377R22060o93007j576840
35318H60117r49006l02081n49006q03567l10636L65855N31748K81330m4131j69961
35308a089338K68782J088126J149506j18795j363230j019540K27948N23916k10391
$$ plain form
35376 -262191 -750622 -458638 -193420 -413470 -419537 194530 706601 680897 907981 1965259
35366 1965259 2940115 2678191 1491926 558513 218402 -93932 -621917 -963024 -832900
35357 -832900 -428029 -72136 47050 -81757 -219699 -93390 112399 -116106 -793407 -1273065
35347 -1273065 -1187373 -939457 -914723 -859366 -469377 59610 522845 1062861 1589381 1632121
35337 1632121 1268536 1265913 1683849 1452092 226755 -557534 232745 1450310 1419113 698916
35327 698916 1068532 2366370 2690729 1684972 1208527 2207904 3129964 2436957 860117
35318 860117 -88889 -390970 -939976 -1743543 -2054179 -1688324 -1156576 -875246 -919377 -1089338
35308 -1089338 -820556 267570 1417076 1298281 -64949 -1084489 -856541 -332625 -543016
35299e43016n45697l09198n96734j138347l68172J505640K193343Q60436n39690
35290E18565m60247J28375M2884l6830O44672J106727L64793p01295r09668p21431
35280b3455r87516j156597m08985O51587J026082Q90740P17575J26851r05253
35271f8971j125390L1963R78180L14662p52624l89271Q06488J012413L07549J14231
35261A229230M27111J74933l51166q1871L47404n25614j922730j546279N64089
35252a684893J793620R76602j37130r9686K71993J08778R0462N79689M71173o51294
35242A719314j256950l17707P98050N12375m75458n95419N7701L58354K35375
35233A035635L57967N22504L4403p85192r44590l45477J87003K01980j0464j24972
$$ plain form
35299 -543016 -1088713 -1397911 -1994645 -3132992 -3501164 -1995524 197819 1058255 518565
35290 518565 58318 186693 229577 192747 837419 1944146 2308939 1607644 697976 -23455
35280 -23455 -1010971 -2167568 -2576553 -1924966 -898884 -8144 709431 836282 -68971
35271 -68971 -1194361 -1162398 -184218 130444 -622180 -1011451 -204963 807450 1114999 1229230
35261 1229230 1656341 1831274 1480108 1398237 1745641 1220027 -702703 -2248982 -1684893
35252 -1684893 108727 1085329 948199 848513 1120506 1229284 1319746 1899435 2370608 1719314
35242 1719314 462364 144657 942707 1455082 979624 384205 441906 800260 1035635
35233 1035635 1393602 1916106 1950509 1165317 220727 -124750 62253 264233 253769 128797
35223A28797j10872q8883k84758o87922n98494N85371J920028J602264l44132
35214B121399j615206q00609N86291N76727l14657l97677K50509L04879j96359
35205E15297o1507O17757N02708n08610r46974k24568M93542L65390P7507L08602
35195A139144N33742J70461l65613n54077o09480o95038l85173L11950M73344
35186A9260k82476q44931j86354R34779J050146J71562l78918j5724N19390N86592
35176A573326M53527M14744J55972n05031j026387q78532l29225O1329K60488
35167A80211M61596L84151k98465j025392q12623K13523P28892J06056n50386
35158f12437o5229R24485R35188j8569n24587j40101n552o45893q20858L72520
$$ plain form
35223 128797 17925 -70958 -355716 -1043638 -1642132 -1056761 863267 2465531 2121399
35214 2121399 506193 -294416 291875 868602 553945 156268 406777 711656 515297
35205 515297 453790 1071547 1574255 1065645 118671 -105897 387645 753035 830542 1139144
35195 1139144 1672886 1843347 1477734 923657 314177 -380861 -766034 -454084 19260
35186 19260 -263216 -1108147 -1294501 -359722 690424 861986 483068 467344 986734 1573326
35176 1573326 2026853 2441597 2597569 2092538 1066151 187619 -141606 -80277 180211
35167 180211 641807 1025958 727493 -297899 -1110522 -896999 -168107 -62051 -612437
35158 -612437 -677666 246819 1182007 1163438 638851 498750 493198 -152695 -973553 -601033
35148f01033J619305J137088n58464j364040o82690k0081l90068q65009l55852
35139b080844N81876P39862J28709k43119L5576M26385M98094M40706M48662L00706
35129A276613j55815n37669l33839L35357P04269K57812n40200p50493k11529
35120D4506J83838k22948p92168m94742M20193O46364k05466r10938m23720N60300
35110a194781P08697Q3339p8779N93498J006720L34187o87187q48768j64102L59860
35100A12684K79848J28099K76692K88629k07702o67838l26134N52411Q34965R11
35090A272565j106225j278810l54223O93463R02515K66919m45981n93401k54159
35081h97337L4463j590j16553m1981Q9730J14204L21287J000884J613079J171730
$$ plain form
35148 -601033 1018272 2155360 1596896 232856 -449834 -469915 -859983 -1724992 -2080844
35139 -2080844 -1498968 -759106 -630397 -873516 -837940 -411555 86539 527245 975907 1276613
35129 1276613 1120798 583129 249290 584647 1288916 1546728 1006528 256035 44506
35120 44506 228344 5396 -786772 -1281514 -861321 -214957 -420423 -1331361 -1755081 -1194781
35110 -1194781 -486084 -402745 -481524 111974 1118694 1452881 765694 -83074 -247176 112684
35100 112684 392532 520631 797323 1085952 878250 210412 -115722 436689 1271654 1272565
35090 1272565 166340 -1112470 -1466693 -773230 129285 396204 -49777 -643178 -897337
35081 -897337 -862874 -864464 -981017 -1022998 -933268 -819064 -497777 503107 2116186 3287916
35071C287916l05864j434523j052684L15301J170401Q49258k1568o33154q08193
35062A366890p11352m38474j17795L5194j5392r9559j76988l71929n84883m39108
35052a553396J93441Q82322J059465O01914j11677n84776n83952k75094j9532
35043c91285L5369O7516J81832J52666j54971l74932j06684L85669M78828R1615
35033C65623l06139n11737p16443q03331l50575M62087Q13147M75218K26816N19816
35023A74482O63676J11691l55289J35971Q46369M09541q18358j038565K11989
35014C41507J189493M91633r18619j255489m46452J14951k31234p21484n38634
35005a974328J69863P61270Q67082N59098K11836K02355M21087L16454j99530
$$ plain form
35071 3287916 2982052 1547529 494845 810146 1980547 2829805 2808237 2175083 1366890
35062 1366890 655538 217064 99269 134463 119071 19512 -157476 -529405 -1114288 -1553396
35052 -1553396 -1359955 -477633 581832 1183746 1072069 487293 -96659 -371753 -391285
35043 -391285 -355916 -288400 -106568 46098 -108873 -483805 -590489 -204820 274008 365623
35033 365623 59484 -452253 -1168696 -1972027 -2322602 -1860515 -1047368 -572150 -345334 174482
35023 174482 838158 949849 594560 730531 1576900 1986441 1168083 129518 341507
35014 341507 1531000 2022633 1104014 -151475 -597927 -482976 -714210 -1435694 -1974328
35005 -1974328 -1804465 -1043195 -176113 382985 594821 797176 1218263 1534717 1335187
34996A335187l72081K26127P11427R9965r19716p93642M04294Q72801j42876j090678
34986C30808n12132P19400Q82812O8705k68178J77640K57772m73118r70021n16915
34976c03227M1782l04132j046090q46917N01336J685624J467372J38171q50091
34967D83828n56251M05147O99746J4492o03281l49023J46868q5202o97749n52526
34957a093951L82215R14219M87004r1103j46563j64452o30217q89531j44342J090082
34947b86639J557291R42549P7028l48491m40665n07973n36933m05003j42113J43596
34937E2647L28174K85331O7909n7923M234o698k22268k85021P9428M16504P9007
34926G41324p00611r35445j97118P61431R70326M26325m9616P8345M91246N67335
$$ plain form
34996 1335187 963106 1189233 1900660 2000625 1080909 287267 691561 1564362 1421486 330808
34986 330808 -181324 538076 1420888 1489593 1221415 1399055 1656827 1183709 213688 -303227
34976 -303227 -261445 -565577 -1611667 -2458584 -1957248 -271624 1195748 1333919 483828
34967 483828 -72423 332724 1032470 1046962 443681 94658 241526 156324 -541425 -1093951
34957 -1093951 -711736 202483 689487 598384 451821 287369 -342848 -1232379 -1376721 -286639
34947 -286639 1270652 2213201 2290229 1941738 1501073 993100 456167 51164 -90949 52647
34937 52647 380821 666152 734061 676138 680372 673674 451406 166385 245813 662317 741324
34926 741324 40713 -894732 -1091850 -330419 639907 1066232 1016616 1094961 1586207 2153542
34916B153542J72245l28329o73543r37458j081186p28033K16745J020476P94771
34907F09230l12868j151125q91741J37256J029609J212554O57083k65556q83723
34898A40719o72745R2787N30100K30914k65499k94062J31848O00539Q55155P19966
34888B069722N896j040078j599789j091651J15696J103683J267434O40232k15013
34879A256132m88534J58295R68053P97523l47223j222480j044638l98645p6174
34870c97691k792J05396L8489k06129k0198O52464P79317j00859p44820l4599
34860F8578J043055Q31329l57469q29266k40295J67339j12008k10449K67778N44099
34850A172691K07400q7013Q0293K53121J65719J38924O7829n99159j475450j312234
$$ plain form
34916 2153542 2325787 1997458 1323915 386457 -694729 -1422762 -1206017 -185541 609230
34907 609230 296362 -854763 -1746504 -1609248 -579639 632915 1289998 1024442 140719
34898 140719 -532026 -439239 90861 321775 56276 -237786 -105938 494601 1349756 2069722
34888 2069722 2075618 1035540 -564249 -1655900 -1540204 -436521 830913 1471145 1256132
34879 1256132 767598 925893 1893946 2691469 2344246 1121766 77128 -321517 -397691
34870 -397691 -400483 -295087 -256598 -462727 -482925 169539 948856 847997 103177 68578
34860 68578 1111633 1942962 1585493 756227 515932 683271 571263 360814 628592 1172691
34850 1172691 1380091 1293078 1373371 1626492 1792211 1931135 1998964 1399805 -75645 -1387879
34840a387879k1137Q61015M66307q0205M37883J401149J431395L72677q58769
34831B622436j550197j410338m02001P49640Q07486k92083r76341k55343O77136
34822b9605L16829p26289p85566J35541N17720j16625o15719k55502K47465J75265
34812a136486p8502J02332N52852P65840O20202K72545q2778j10913L73788Q34097
34802B112977M36076o97072j371787q25243K97097Q78198O67077J94864j44515
34793A547672l23309k94444n786K81497K15310o7684l0535M54816P74250L44243
34783B896030n18767r01157m28626K96892N05970J29868l61729o17494n45202
34774D55785j37562L59294L83481k46359p87715m20112N07359Q75179L90230j36040
$$ plain form
34840 -1387879 -1409016 -548001 -81694 -161899 275984 1677133 3108528 3481205 2622436
34831 2622436 1072239 -338099 -740100 9540 817026 524943 -451398 -706741 -29605
34822 -29605 287224 -439065 -1224631 -1089090 -571370 -687995 -1303714 -1559216 -1311751 -1136486
34812 -1136486 -1214988 -1112656 -559804 206036 826238 1098783 1016005 905092 1278880 2112977
34802 2112977 2549053 1851981 480194 -345049 -47952 830246 1497323 1692187 1547672
34793 1547672 1224363 929919 924133 1205630 1420940 1353256 1322721 1777537 2551787 2896030
34783 2896030 2377263 1476106 1047480 1344372 1850342 1980210 1618481 1000987 455785
34774 455785 318223 677517 1060998 814639 26924 -393188 114171 989350 1379580 1243540
34764A243540j90814k00238m59736n01202q6351J65728j28227l10515J57739N81781
34754B71705J43421n79579m48889L52133O09594L3748m38986l28813k47546n34702
34744a167914n11709K72897J039618Q33443o0840n79703l70746k3343L7820J09560
34734d20917M85953P72158L81010n09462j004460o00621J70219M99562L45191
34725A18633K18163K11018m087k75311j3760O28849O37562k49466p81452M0867
34715E31016J239608J092579l81780j482067j218198l40454J55114K76130L40522
34706B12470J49443m00531o65037q2703P65857P61366k10132j014345o98586L23262
34696h58936Q22923K85961n04754n42679Q2432M19382J22221n4673M26843Q16928
$$ plain form
34764 1243540 1052726 852488 392752 -108450 -194801 -29073 -157300 -467815 -310076 271705
34754 271705 415126 -164453 -613342 -261209 348385 382133 -56853 -385666 -633212 -1167914
34744 -1167914 -1679623 -1406726 -367108 466335 405495 -174208 -544954 -568297 -530477 -420917
34734 -420917 65036 837194 1218204 708742 -295718 -896339 -726120 -226558 118633
34725 118633 336796 547814 543727 268416 254656 883505 1521067 1271601 490149 531016
34715 531016 1770624 2863203 2481423 999356 -218842 -559296 -404182 -128052 212470
34706 212470 361913 -38618 -703655 -786358 -20501 740865 530733 -483612 -1182198 -858936
34696 -858936 -36013 249948 -254806 -797485 -715053 -295671 -173450 -228123 198720 1015648
34686A015648J33077j134362j413718j69833J322112J618884P48210k29413o48988
34677A241617o31180m56441k17545K06R8021J58200L30787N13858M45346J47921
34667A630790l5142J6279o7748n63422j020198p09505K75842R41737O83001R2192
34657A243826k5499R3547k73030q78972p28531K13998P05196L1506q80013q01928
34647a299900J53478R50096J021758N20198k49288q69281p56588J70013J105156
34638G45642J244586O68547j35901r90799j641913j438680k94424P20125P33903
34629c88914L50410M65690N77555k51615j312998r40269P98906J882281J130220
34620B311266l27266q98148m90579L8692K80688L45571K89508J05562j66206n67164
$$ plain form
34686 1015648 1148725 14363 -1399355 -1569188 -247076 1371808 2120018 1890605 1241617
34677 1241617 610437 153996 -63549 -63343 34678 192878 523665 1037523 1482869 1630790
34667 1630790 1595648 1611927 1544179 980757 -39441 -748946 -473104 468633 1151634 1243826
34657 1243826 1218327 1311874 1038844 159872 -568659 -354661 350535 382041 -497972 -1299900
34647 -1299900 -1146422 -196326 825432 1345630 1096342 227061 -529527 -359514 745642
34638 745642 1990228 2658775 2522874 1532075 -109838 -1548518 -1842942 -1122817 -388914
34629 -388914 -38504 427186 1004741 753126 -559872 -1500141 -701235 1181046 2311266
34620 2311266 1984000 1085852 595273 633965 914653 1260224 1549732 1655294 1489088 921924
34610I21924r83591q84581m9764O69412L81525k60472J09281J202741J231200
34601B337675k52826j456969j031555K6389K01015k97653m09161j32532j41113
34592a156730l63727k91626l6050Q5414L45345Q86535R61974R8141p32811m43198
34582f46733L54816L53844k13641n7806P57629P47436n07800j538004j155931
34573a906190k5891O00622N53321L98845L30975J88634o18j20862k07578j97598
34563c86340J20696O10224P31597K84966k68261m74962l77082j19130L11366O50478
34553A083552L50543n17770r82501m02028N34014P24923J56570l07020l14229
34544C26054k77556l25858k1302O39254Q66694K34201n28221n26506O2635M48533
$$ plain form
34610 921924 -61667 -946248 -996012 -326600 54925 -205547 -96266 1106475 2337675
34601 2337675 2084849 627880 -403675 -377286 -176271 -473924 -883085 -1015617 -1156730
34592 -1156730 -1520457 -1812083 -1848133 -1762719 -1417374 -530839 431135 529276 -203535 -646733
34582 -646733 -291917 61927 -151714 -209520 548109 1295545 787745 -750259 -1906190
34573 -1906190 -1932081 -1331459 -778138 -379293 -48318 140316 139698 18836 -188742 -386340
34563 -386340 -265644 344580 1076177 1361143 1092882 617920 240838 121708 433074 1083552
34553 1083552 1434095 916325 -66176 -468204 65810 790733 947303 640283 326054
34544 326054 48498 -277360 -298662 340592 1207286 1441487 913266 386760 449395 897928
34534H97928M54211M57378M34035L0966n18938n62582j70327j03893m80649n53871
34524a15742j07945J34120m5525J26226P24665M88736r38718j691926l55858J398626
34514c83341J122918m75712o62688P49059J126504l80966j277599K1543J411039
34505A250757N79991j185358j200488L52391J069073K18695o22425m18290J41685
34496A86031K67090K2435l68393o83904l40324P30328J225007P5559j510058j439312
34486a835541J14220R81841L69497k54372N3399L39978l3075q675J031787J614874
34476B373933L65692j476547j620115m9449J050936M74242n76081n08032N01551
34467E36130J040150M45303m90302o79685o5893M99550M83113K45211K21377J28887
$$ plain form
34534 897928 1352139 1809517 2243552 2274518 1755580 1192998 1022671 918778 438129 -115742
34524 -115742 -223687 -89567 -135092 -8866 715799 1204535 265817 -1426109 -1781967 -383341
34514 -383341 739577 263865 -398823 350236 1476740 1095774 -181825 -160282 1250757
34505 1250757 1830748 645390 -555098 -202707 866366 1085061 462636 44346 186031
34496 186031 453121 475556 107163 -576741 -917065 -186737 1038270 1113829 -396229 -1835541
34486 -1835541 -1721321 -739480 -369983 -624355 -570956 -230978 -264053 -272728 759059 2373933
34476 2373933 2739625 1263078 -357037 -406486 644450 1118692 542611 34579 536130
34467 536130 1576280 2021583 1531281 851596 785703 1285253 1768366 2013577 2234954 2363841
34457B363841m26962r89091p32158K28370Q43452M87124m01770j056965j090183
34448g74342n00080L06204N83043J03386k46072L31737J020323L82184j201918
34439D465j694936l43454J173159J221654L15480k10716k18113k42630j33442
34430a28533M04351P76192L67834k34132j72159J83338k2194n10259m33386l8557
34420A92495k00709o41680k96611O49260Q29360k8004o05298k13641J50387l05572
34410d70013p50749k51043N41604M93704j00291o9657O90681J150784Q18494K80578
34400B334092K6000k12365o74496r92357q23209m68281l94237n17191m04755L1164
34390b095635M58440O62120P77914R09213Q15089K37962n67657r59841o70447
$$ plain form
34457 2363841 1936879 947788 215630 444000 1287452 1774576 1372806 315841 -774342
34448 -774342 -1274422 -968218 -385175 -281789 -527861 -196124 824199 1206383 4465
34439 4465 -1690471 -2033925 -860766 360888 676368 465652 247539 4909 -128533
34430 -128533 275818 1052010 1419844 1185712 1013553 1196891 1174697 664438 231052 192495
34420 192495 -8214 -649894 -946505 -297245 532115 504111 -101187 -314828 -164441 -470013
34410 -470013 -1220762 -1471805 -930201 -436497 -536788 -606445 84236 1235020 2053514 2334092
34400 2334092 2360092 2147727 1473231 480874 -342335 -810616 -1204853 -1722044 -2126799 -2095635
34390 -2095635 -1637195 -975075 -197161 712052 1527141 1765103 1197446 237605 -432842
34381d32842j68125j4305q8234J28035O06632P04531J80682l18477j82152K61432
34371F77177L35574J13678J61457L82888O9705p60164j043920k03687Q09945P87999
34361A330652J5780k13048M35444R32828N42355j65378l78268k60571m32923q40673
34351I66198r31682o21823k95512j7202M47478Q29939M50766n92902j124739l86834
34341a276313O99281O02598o64476j388498m18023J220065J638060N24055o65079
34332B71670q26757m54167m09498n02099j35068L85864L44856K6308L46673J150057
34322A97839J236994L44218k89311Q5763N03812l7209q58670p81790r3101Q9099
34312C97644k39001j88033K43561K25062j70011O6803R51479J147216Q5712r68244
$$ plain form
34381 -432842 -600967 -615272 -703506 -575471 31161 735692 916374 597897 415745 677177
34371 677177 1012751 1126429 1287886 1670774 1740479 980315 -63605 -267292 542653 1330652
34361 1330652 1346432 1133384 1568828 2501656 3044011 2878633 2500365 2239794 1806871 966198
34351 966198 34516 -587307 -882819 -900021 -452543 377396 828162 235260 -889479 -1276313
34341 -1276313 -577032 25566 -638910 -2027408 -2445431 -1225366 412694 936749 271670
34332 271670 -555087 -1009254 -1418752 -1920851 -2055919 -1670055 -1325199 -1298891 -952218 197839
34322 197839 1434833 1779051 1489740 1575503 2079315 2042106 1183436 401646 308545 397644
34312 397644 158643 -29390 214171 439233 269222 336025 1287504 2434720 2520432 1552188
34302A552188p84830N8361K45663l04191n95732j76159L75729L91402j38951o66490
34292d3010n48211L73960J394150J483974M64922p41746j210051q49072k3333
34283C01583R08552J359161O86483p86973j661978j092476P1545M91753Q6172
34274C63822k72417k47959k08360k31067j1776L04232J66610m00771o63186j99892
34264a400764N43438Q77272N69785j19492o60630n36131K23760Q28945N34980
34255H61163l75356q83563m64007M25110J003631Q83061K30388l48904k60990
34246A070533L25486M99219j08255n61158L3388R25841O78894n35977j054467
34237A273504k50035N80848L57629k44078k45890k7805l46182p42689l58163L52375
$$ plain form
34302 1552188 767358 825719 1071382 767191 171459 -4700 371029 762431 623480 -43010
34292 -43010 -591221 -217261 1176889 2660863 3125785 2384039 1173988 324916 301583
34283 301583 1210135 2569296 3255779 2468806 806828 -285648 -214103 277650 363822
34274 363822 91405 -156554 -364914 -595981 -607757 -303525 -136915 -537686 -1200872 -1400764
34264 -1400764 -857326 19946 589731 470239 -190391 -726522 -502762 326183 861163
34255 861163 485807 -397756 -861763 -436653 566978 1450039 1680427 1331523 1070533
34246 1070533 1396019 1895238 1786983 1225825 1259213 2185054 2863948 2327971 1273504
34237 1273504 1023469 1604317 1961946 1717868 1471978 1444173 1097991 355302 -2861 349514
34227C49514K26958o16353q75370j15478O34600N36473q911l09377l39618l22204
34217h39766k25440j12450k38248m41487j95025M34516P32963N57445N76174Q38241
34207A086923L56640j050622j789844o64526J023097J164778p8945p20028p0941
34198g43468N56850L19119k053K24875L85160N5704r5162K49883K18633o13928
34188E55613j162754n79999K51665K63929k6976K49766N40472J5495n76275j09663
34178e78727P31502N24971l31962l46983L05830J65620o42963n32802M84444O33800
34168D12730k61365j58733J461501K134116L36794j724339j443348J96578N01075
34159A455009o48690j141448l23644L96070K96235K12285N52764N77058L4405
$$ plain form
34227 349514 576472 -39881 -915251 -1030729 -396129 140344 131433 -177944 -517562 -839766
34217 -839766 -1065206 -1177656 -1415904 -1857391 -2052416 -1617900 -884937 -327492 248682 1086923
34207 1086923 1443563 392941 -1396903 -2061429 -1038332 126446 47501 -672527 -743468
34198 -743468 -186618 132501 130448 355323 740483 796187 701025 950908 1169541 555613
34188 555613 -607141 -1187140 -935475 -671546 -698522 -448756 91716 107211 -469064 -578727
34178 -578727 152775 677746 345784 -1199 304631 470251 -172712 -705514 -221070 412730
34168 412730 151365 -7368 1454133 3588249 3925043 2200704 757356 953934 1455009
34159 1455009 806319 -335129 -658773 -262703 33532 245817 798581 1375639 1410044
34150A410044k20325K41777O38262K36914n87696r41893l97795O67423J202002
34141B248713L15177j367515j873107l69908J351510J230865q0532l96878M85987
34132A544312P17444k76229q45498o0084O86282J08752q26122o23681K92236M45996
34122A163408k85273o94417k45580L00919K24452k07191l24875m101K40921m2825
34112A25438n81631n97109J58446R31710R39506M06851J6099k17981o26527q53010
34102b98208l12187N23468N72290j52980n73095k96657J2201R8248M49204R38907
34092I61191P15011j65406n74825k50915k09188o67128m47471P07797J231631
34083A300697L43222m18816J76490Q22581L7811r93154l62637J110409J092207
$$ plain form
34150 1410044 1189719 1431496 2069758 2306672 1718976 777083 379288 1046711 2248713
34141 2248713 2563890 1196375 -676732 -1046640 304870 1535735 1455203 1058325 1544312
34132 1544312 2261756 1985527 1140029 1079945 1766227 1874979 1048857 425176 717412 1163408
34122 1163408 878135 183718 -61862 239057 463509 256318 -68557 -72658 168263 125438
34112 125438 -456193 -1053302 -894856 36854 976360 1383211 1399310 1181329 554802 -298208
34102 -298208 -610395 -86927 485363 332383 -240712 -537369 -525168 -426920 22284 961191
34092 961191 1676202 1510796 935971 685056 475868 -191260 -638731 69066 1300697
34083 1300697 1643919 1225103 1401593 2224174 2261985 1268831 906194 2016603 3108810
34074C108810m11460j207424n87098o8071l55692k69678O88328J135893J86149
34065B219757r72669j014524l70343o1714n0931Q7593N5049m24270p23227l21650
34055a576929J33469j10626n20751j22685P92118J012291K27184n79853n69304
34046a315086j5830L12438J37763j70131r7731M47377R30277O56734l71404j255071
34036g40664j126641j69061N74848M18753j63190j23768P75250J458367Q00628
34027A704522p35934j447450n96510N65288N86644j98481m56634L5990L65934
34018a76631K16782K02667M93400M99953J14403m4805J25935M2241k22203J29136
34008A380878Q97423P15686o51147j471268o34553M54354N8423j112036j123632
$$ plain form
34074 3108810 2697350 1489926 902828 834757 479065 209387 897715 2033608 2219757
34065 2219757 1247088 232564 -137779 -199493 -250424 -162831 -107782 -532052 -1255279 -1576929
34055 -1576929 -1443460 -1554086 -2074837 -2197522 -1405404 -393113 -165929 -745782 -1315086
34046 -1315086 -1330916 -1018478 -880715 -1050846 -1148577 -701200 229077 885811 514407 -740664
34036 -740664 -1867305 -2036366 -1461518 -1042765 -1205955 -1329723 -554473 903894 1704522
34027 1704522 968588 -478862 -1075372 -510084 76560 -121921 -578555 -542565 -176631
34018 -176631 40151 242818 736218 1236171 1350574 1305769 1431704 1473945 1251742 1380878
34008 1380878 2278301 2993987 2342840 871572 237019 691373 749796 -362240 -1485872
33999a485872O4431P15175J72263l46803P7689P72671P59006O4719o95390j088106
33989i90217q59973P337R34862J120652M98578k17107m72115l00404O3556L34003
33979A19172J03377o21889j002003l29384P63498J007482K76520l57017k69024
33970c09268J09387L30150M26249K94723k39758o24922r9575Q09004O96573m76256
33960I16307j061893k32825P19150M72316l61805n04964l2975J59319l1887j25322
33950h4579j10896j30890J38044O60670M94543o36798j184198J64551K050445
$$ plain form
33999 -1485872 -1421441 -706266 -534003 -880806 -803117 -30446 728560 793279 97889 -990217
33989 -990217 -1850190 -1842853 -907991 212661 711239 494132 22017 -278387 -214831 119172
33979 119172 222549 -399340 -1401343 -1730727 -967229 40253 316773 -40244 -309268
33970 -309268 -199881 130269 556518 851241 611483 -13439 -113014 695990 1392563 916307
33960 916307 -145586 -378411 340739 813055 451250 -53714 -86689 72630 40743 -84579
33950 -84579 -195475 -326365 -188321 472349 966892 330094 -854104 -689553 1360892
$$ [...]
##END NTUPLES=NMR SPECTRUM
##END=
