##TITLE=31Pdec_ABDE0406-4
 CDCl3, 24 sc
 7.06.2021
##JCAMPDX= 6.0         $$ Bruker NMR JCAMP-DX V2.0
##DATA TYPE= NMR SPECTRUM
##DATA CLASS= NTUPLES
##ORIGIN= UXNMR, Bruker Analytische Messtechnik GmbH
##OWNER= root
$$ XWIN-NMR		Version 3.5
$$ Mon Jun  7 11:04:57 2021 Russian Standard Time (UT+4h)  she@DPX200
##.OBSERVE FREQUENCY= 81.013821
##.OBSERVE NUCLEUS= ^31P
##.ACQUISITION MODE= SIMULTANEOUS
##.ACQUISITION SCHEME= undefined
##.AVERAGES= 24
##.DIGITISER RES= 16
##SPECTROMETER/DATA SYSTEM= spect
##.PULSE SEQUENCE= zgpg30
##.SOLVENT NAME= CDCl3
##.SHIFT REFERENCE= (INTERNAL, CDCl3, 0, 248.564)
##AUDIT TRAIL= $$ (NUMBER, WHEN, WHO, WHERE, WHAT)
$$ ##TITLE= Audit trail, XWIN-NMR		Version 3.5
$$ ##JCAMPDX= 5.01
$$ ##ORIGIN= Bruker BioSpin GmbH
$$ ##OWNER= she
$$ F:/spectra/data/she/nmr/P31/1/pdata/1/auditp.txt
$$ ##AUDIT TRAIL=  $$ (NUMBER, WHEN, WHO, WHERE, WHAT)
(   1,<2021-06-07 11:03:53.45 +0400>,<she>,<DPX200>,
      <created by zg, POWCHK disabled, PULCHK disabled
       configuration hash MD5:
       00 E9 B6 7A A2 85 ED C7 34 08 36 98 17 FE 4E 26
       data hash MD5: 32K
       BA C6 76 1E 50 40 AD E0 6B 2C 67 95 36 9F 85 97>)
(   2,<2021-06-07 11:03:56.26 +0400>,<she>,<DPX200>,
      <Start of raw data processing
       efp BC_mod = 2 LB = 1 FT_mod = 6 PKNL = 1 PHC0 = -5821.659 PHC1 = -25.12524 SI = 64K 
       data hash MD5: 64K
       AF 3F 75 3E 36 3D 59 32 69 0B AC 3C B4 03 81 59>)
(   3,<2021-06-07 11:04:14.39 +0400>,<she>,<DPX200>,
      <pk PHC0 = 3.258001 PHC1 = 0 
       data hash MD5: 64K
       31 47 32 ED 25 E1 39 E7 C9 A9 05 27 F3 04 8E 40>)
(   4,<2021-06-07 11:04:21.75 +0400>,<she>,<DPX200>,
      <abs ABSG = 5 
       data hash MD5: 64K
       BC 27 47 34 9E 5D DE 9F CE 16 E6 22 14 5B E0 79>)
$$ ##END=
$$ 
$$ hash MD5
$$ CD FF 1C 52 CC EE 85 C6 C5 9E 8A F6 C5 6C 8F F7
##$RELAX= 
##$RELAX= 
##$RELAX= 
##$RELAX= 
##$RELAX= 
##$RELAX= 
##$RELAX= 
##$RELAX= 
$$ Bruker specific parameters
$$ --------------------------
##$DU= <F:/spectra>
##$EXPNO= 1
##$NAME= <P31>
##$PROCNO= 1
##$TYPE= <nmr>
##$USER= <she>
##$AMP= (0..31)
100 100 100 100 100 100 100 100 100 100 100 100 100 100 100 100 100 100 
100 100 100 100 100 100 100 100 100 100 100 100 100 100 
##$AQSEQ= 0
##$AQ_mod= 1
##$AUNM= <au_zg>
##$AUTOPOS= <>
##$BF1= 81.014009
##$BF2= 200.13
##$BF3= 200.13
##$BF4= 200.13
##$BF5= 200.13
##$BF6= 200.13
##$BF7= 200.13
##$BF8= 200.13
##$BYTORDA= 1
##$CFDGTYP= 0
##$CFRGTYP= 5
##$CHEMSTR= <none>
##$CNST= (0..31)
1 1 145 1 1 1 1 1 1 1 1 1 1 1 1 1 1 1 1 1 1 1 1 1 1 1 1 1 1 1 1 1 
##$CPDPRG= <waltz16>
##$CPDPRG1= <>
##$CPDPRG2= <waltz16>
##$CPDPRG3= <>
##$CPDPRG4= <mlev>
##$CPDPRG5= <mlev>
##$CPDPRG6= <mlev>
##$CPDPRG7= <mlev>
##$CPDPRG8= <mlev>
##$CPDPRGB= <>
##$CPDPRGT= <>
##$D= (0..31)
0 1 0 0 0 0 0 0 0 0 0 0.03 2e-05 3e-06 0 0 0 0 0 0 0 0 0 0 0 0 0 0 0 0 
0 0 
##$DATE= 1623049432
##$DBL= (0..7)
120 120 120 11 120 120 24 19 
##$DBP= (0..7)
150 150 150 150 150 150 150 150 
##$DBP07= 0
##$DBPNAM0= <>
##$DBPNAM1= <>
##$DBPNAM2= <>
$$ [...]
##$SUBNAM3= <"">
##$SUBNAM4= <"">
##$SUBNAM5= <"">
##$SUBNAM6= <"">
##$SUBNAM7= <"">
##$SUBNAM8= <"">
##$SUBNAM9= <"">
##$SW= 501.771253377433
##$SWIBOX= (0..15)
0 1 3 0 0 0 0 0 0 0 0 0 0 0 0 0 
##$SW_h= 40650.406504065
##$TD= 32768
##$TD0= 1
##$TE= 0
##$TE2= 300
##$TE3= 300
##$TEG= 300
##$TL= (0..7)
0 120 53 12 22 120 120 120 
##$TP= (0..7)
150 150 150 150 150 150 150 150 
##$TP07= 0
##$TPNAME0= <>
##$TPNAME1= <>
##$TPNAME2= <>
##$TPNAME3= <>
##$TPNAME4= <>
##$TPNAME5= <>
##$TPNAME6= <>
##$TPNAME7= <>
##$TPOAL= (0..7)
0.5 0.5 0.5 0.5 0.5 0.5 0.5 0.5 
##$TPOFFS= (0..7)
0 0 0 0 0 0 0 0 
##$TUNHIN= 0
##$TUNHOUT= 0
##$TUNXOUT= 0
##$USERA1= <user>
##$USERA2= <user>
##$USERA3= <user>
##$USERA4= <user>
##$USERA5= <user>
##$V9= 5
##$VALIST= <valist>
##$VCLIST= <CCCCCCCCCCCCCCC>
##$VD= 0
##$VDLIST= <DDDDDDDDDDDDDDD>
##$VPLIST= <PPPPPPPPPPPPPPP>
##$VTLIST= <TTTTTTTTTTTTTTT>
##$WBST= 1024
##$WBSW= 4
##$XGAIN= (0..3)
0 0 0 0 
##$XL= 0
##$YL= 0
##$YMAX_a= 5166
##$YMIN_a= -4917
##$ZGOPTNS= <>
##$ZL1= 120
##$ZL2= 120
##$ZL3= 120
##$ZL4= 120
##$ABSF1= 248.5645
##$ABSF2= -253.2056
##$ABSG= 5
##$ABSL= 3
##$ALPHA= 0
##$AQORDER= 0
##$ASSFAC= 0
##$ASSFACI= 0
##$ASSFACX= 0
##$ASSWID= 0
##$AUNMP= <proc_1d>
##$AZFE= 0.1
##$AZFW= 0.5
##$BCFW= 0
##$BC_mod= 2
##$BYTORDP= 0
##$COROFFS= 0
##$CY= -3
##$DATMOD= 1
##$DC= 0
##$DFILT= <>
##$DTYPP= 0
##$F1P= 0
##$F2P= 0
##$FCOR= 1
##$FTSIZE= 65536
##$FT_mod= 6
##$GAMMA= 0
##$GB= 0
##$INTBC= 1
##$INTSCL= 5.30512e-09
##$ISEN= 30
##$LB= 1
##$LEV0= 0
##$LPBIN= 0
##$MAXI= 10000
##$MC2= 0
##$MEAN= 0
##$ME_mod= 0
##$MI= 50
##$NCOEF= 0
##$NC_proc= -6
##$NLEV= 6
##$NOISF1= 182.463
##$NOISF2= 159.3651
##$NSP= 0
##$NTH_PI= 0
##$NZP= 0
##$OFFSET= 248.5645
##$PC= 4
##$PHC0= -5818.401
##$PHC1= -25.12524
##$PH_mod= 1
##$PKNL= yes
##$PPARMOD= 0
##$PSCAL= 0
##$PSIGN= 0
##$REVERSE= no
##$SF= 81.014009
##$SI= 65536
##$SIGF1= 159.3651
##$SIGF2= -187.1042
##$SINO= 113.3802
##$SIOLD= 16384
##$SREGLST= <1H.CDCl3>
##$SSB= 0
##$STSI= 65536
##$STSR= 0
##$SW_p= 40650.406504065
##$SYMM= 0
##$S_DEV= 0
##$TDeff= 32768
##$TDoff= 0
##$TI= <>
##$TILT= no
##$TM1= 0
##$TM2= 0
##$TOPLEV= 0
##$USERP1= <user>
##$USERP2= <user>
##$USERP3= <user>
##$USERP4= <user>
##$USERP5= <user>
##$WDW= 1
##$XDIM= 65536
##$YMAX_p= 458726643
##$YMIN_p= -21488917
$$ End of Bruker specific parameters
$$ ---------------------------------
##NTUPLES= NMR SPECTRUM
##VAR_NAME=  FREQUENCY,     SPECTRUM/REAL,   SPECTRUM/IMAG
##SYMBOL=    X,             R,               I
##VAR_TYPE=  INDEPENDENT,   DEPENDENT,       DEPENDENT
##VAR_FORM=  AFFN,          ASDF,            ASDF
##VAR_DIM=   65536,         65536,           65536
##UNITS=     HZ,            ARBITRARY UNITS, ARBITRARY UNITS
##FACTOR=    0.620285442955139, 1,           1
##FIRST=     20137.2065510759, 0,            0
##LAST=      -20513.1999529892, 0,           0
##MIN=       -20513.1999529892, -21488917,   0
##MAX=       20137.2065510759, 458726643,    0
$$ Real data points
##PAGE= N=1
##DATA TABLE= (X++(R..R)), XYDATA
$$ [...]
39448A34632O41824o60998j564062q28147O47177J120107M61735R91K97009N22819
$$ 134632 776456 115458 -1448604 -2276751 -1629574 -509467 -47732 -46741 250268 773087
39438G73087J08910l62864k90419L0401J55620K73131N95449O67455L8278p94329
$$ 773087 881997 519133 228714 259115 414735 687866 1283315 1950770 1989048 1194719
39428A194719q99127k40091K46964L5518k15328K63463R93800Q15456k61094q17373
$$ 1194719 295592 55501 302465 337983 122655 386118 1379918 2195374 1934280 1116907
39418A116907j13613O25365L3086j116370r84519L58445R14231q8914r96052m77278
$$ 1116907 1003294 1628659 1661745 545375 -439144 -80699 833532 744618 -251434 -728712
39408g28712L73415K0138r68362j046340k40670K75410L72247P80406J189545
$$ -728712 -355297 -335159 -1303521 -2349861 -2590531 -2315121 -1942874 -1162468 27077
39399B7077N62286p37641j098772j80016N36985J47753m33231k70988J49420J58441
$$ 27077 589363 -148278 -1247050 -1427066 -890081 -742328 -1175559 -1446547 -1297127 -1138686
39389a138686J70013O35838Q80761J95532p39016p43559Q3786O14974L79887k8169
$$ -1138686 -968673 -332835 547926 743458 4442 -739117 -655331 -40357 339530 311361
39379C11361p7485Q8737J79774J79063J40126N7987P207O5226J21581L2106j36623
$$ 311361 233876 322613 502387 681450 821576 879563 886770 951996 1073577 1105683 969060
39368I69060k40811k52580j10601L12248P83500O34086l71802j349674j151349
$$ 969060 728249 475669 365068 677316 1460816 2094902 1723100 373426 -777923
39359g77923R1913R43508M35089o71281q89869K5380Q31234O05871M2243K94655
$$ -777923 -686010 257498 692587 21306 -868563 -843183 -11949 593922 636165 930820
39349I30820J051773Q71750n18812j523031r10949L57820O34891J3017k22267
$$ 930820 1982593 2854343 2335531 812500 -98449 259371 894262 907279 685012
39340F85012J1630l92120j373509j398356p3482Q64724K40148o24072j46515Q37096
$$ 685012 696642 304522 -1068987 -2467343 -2540825 -1676101 -1435953 -2060025 -2206540 -1369444
39330a369444N93283m02696k22976J120203J531550K73915q50014n07705J77187
$$ -1369444 -776161 -1178857 -1401833 -281630 1249920 1523835 673821 166116 343303
39321C43303j14706o06402j18010N14368j22597j179519o15880J218908J647631
$$ 343303 228597 -377805 -495815 18553 -104044 -1283563 -1899443 -680535 967096
39312I67096k66498k103125j620452J07193O88502K8563o4213R57218J719804
$$ 967096 700598 -1402527 -3022979 -2915786 -2227284 -2198721 -2262934 -1305716 414088
39303D14088J284309K85811n17269j196822j663230j186411K89955J476238J275658
$$ 414088 1698397 1984208 1466939 270117 -1393113 -2579524 -2289569 -813331 462327
39294D62327J96453n55043o53100n21192l08628P8482L97969L94848L59459O18642
$$ 462327 658780 103737 -549363 -1070555 -1379183 -1300701 -902732 -507884 -148425 470217
39284D70217Q51159O38549K58235J33527k1701n74796r65357m60132M12591M58987
$$ 470217 1321376 1959925 2218160 2351687 2329986 1755190 789833 329701 742292 1201279
39274A201279k75450n35583J24364P03255M43811j21143k97160k29859j90353
$$ 1201279 925829 390246 514610 1217865 1661676 1540533 1243373 1013514 823161
39265H23161M9555M52617L57541l48774o85139q4748M91136J5768q39374o78554
$$ 823161 872716 1325333 1682874 1334100 648961 564213 1055349 1071117 231743 -446811
39255d46811M04977R37275K16769q42447j085277l86055N63338R96469N66104
$$ -446811 -41834 895441 1112210 269763 -815514 -1201569 -638231 358238 924342
39246I24342k94718o07852k4206N34934J31671p07903p65441m4623L33666K6552
$$ 924342 629624 21772 -2434 532500 664171 -43732 -809173 -853796 -520130 -493578
39236d93578j35261K12420L83064J08244J48136P46808Q52298j55453j176955
$$ -493578 -628839 -416419 -33355 74889 223025 969833 1822131 1666678 489723
39227D89723j004928j67679J79712K57130R08387J531695P24469j139384j948656
$$ 489723 -515205 -682884 -503172 -246042 662345 2194040 2918509 1779125 -169531
39218a69531q41338N99136P89016J98127K5879K18562M3439l86517m88387l98958
$$ -169531 -1010869 -411733 377283 575410 601289 819851 863290 476773 -11614 -410572
39208d10572n24461m87973J78245P86414L68788n22970m58546N08900P99475j24575
$$ -410572 -935033 -1423006 -1244761 -458347 -89559 -612529 -1071075 -562175 237300 112725
39198A12725q63200l92754L50034K25406j78612K55679J093305J024438Q561p76282
$$ 112725 -750475 -1143229 -793195 -567789 -746401 -490722 602583 1627021 1635582 859300
39188H59300p87071m91181j06686N62319J045266M56593q99427j535554q21183
$$ 859300 72229 -418952 -525638 36681 1081947 1538540 639113 -896441 -1717624
39179a717624K15598N91806O00512O86043L89145n74732j245015o52757N80416
$$ -1717624 -1502026 -910220 -309708 376335 765480 190748 -1054267 -1707024 -1126608
39170a126608J078678O27917R5223j26384l46330n12184k06006L27792L57420
$$ -1126608 -47930 579987 675210 548826 202496 -309688 -515694 -187902 169518
39161A69518n4644j10624K45549J62437m81909n94607L29796J136446O96941l07849
$$ 169518 114874 4250 249799 412236 -69673 -664280 -334484 801962 1498903 1191054
39151A191054m56854K45662N61156J1709o21474p45746o69872o53085l55768L03294
$$ 1191054 734200 979862 1541018 1552727 931253 185507 -484365 -1137450 -1493218 -1189924
39141a189924O58655K79817k47919j78317K90557M46539J82261n7112j65467m08907
$$ -1189924 -531269 -251452 -499371 -677688 -387131 59408 241669 184557 19090 -389817
39131c89817o60089m28787K06261M53636o5945o50098m17247N34726J308090J235692
$$ -389817 -1049906 -1478693 -1272432 -818796 -884741 -1534839 -1952086 -1417360 -109270 1126422
39121A126422L59382p71562j344201p16856P54986J607532P82934q20382j203392
$$ 1126422 1485804 714242 -629959 -1346815 -591829 1015703 1798637 978255 -225137
39112b25137J56221J513317J137254m41681j293007o61027L45480N23629L0087
$$ -225137 -68916 1444401 2581655 2139974 846967 185940 531420 1055049 1085136
39103A085136k44678k8102J57971j26099o48888q02176l00471M63109Q05508N34942
$$ 1085136 840458 812356 970327 844228 195340 -606836 -907307 -444198 361310 896252
39093H96252J53656J09324J43728k01042o91995o72787j43892J95488J06664J63294
$$ 896252 1049908 1159232 1302960 1101918 409923 -262864 -406756 -211268 -104604 58690
39083E8690N84781O10851k49499j093070p64647L18259O64307n9638n37278J41180
$$ 58690 643471 1254322 1004823 -88247 -852894 -534635 129672 70034 -467244 -326064
39073c26064J076085R42979l5521m84256J16762P99409N43185m23061j076675
$$ -326064 750021 1693000 1657479 1173223 1289985 2089394 2632579 2209518 1132843
39064A132843q94571k88534P1827P072j62084j36244M0300J72989K12307J96535
$$ 1132843 238272 -50262 21565 28637 -133447 -269691 -229391 -56402 155905 352440
39054C52440P0058j68070k42250R7283N60766N58311P2449j95968J64775N85894
$$ 352440 422498 254428 12178 109461 670227 1228538 1300987 1105019 1269794 1855688
39044A855688K96694n23494r32703m56316L76683P48974M15315k08789n31382
$$ 1855688 2152382 1628888 696185 239869 616552 1365526 1780841 1572052 1040670
39035A040670l18671P5984J00288k36964k96980J77570M22049k93209j260600
$$ 1040670 721999 797983 898271 661307 364327 541897 963946 670737 -589863
39026e89863r90173O30107J868961J342544k00436j031116p05896k13127k41075
$$ -589863 -1580036 -949929 919032 2261576 2061140 1030024 324128 111001 -130074
39017a30074m22979l49452k80615m36143l83984K32862Q80796P64093K2620m04088
$$ -130074 -553053 -902505 -1183120 -1619263 -2003247 -1770385 -889589 -125496 -102876 -506964
39007e06964q2692L98781L73055m0843l42087m28692m76244l52262K30293J026348
$$ -506964 -589656 -190875 182180 141337 -200750 -629442 -1105686 -1457948 -1227655 -201307
38997b01307J289454O36055m81979j270307j268296n50076L48218P00627K71160
$$ -201307 1088147 1724202 1242223 -28084 -1296380 -1846456 -1498238 -797611 -526451
38988e26451k44120l650P31689Q82628K09604k85759j9023K13459l02209q41775
$$ -526451 -770571 -774221 -42532 840096 1049700 763941 744918 958377 656168 -185607
38978a85607m85495K00932J61607j99399K09511R14978M51360q41629q62421Q25679
$$ -185607 -671102 -470170 -308563 -507962 -298451 616527 1067887 226258 -636163 189516
38968A89516J836679M40722j704725j973238m78433N73778L09012j06914J58600
$$ 189516 2026195 2466917 762192 -1211046 -1689479 -1115701 -806689 -913603 -755003
38959g55003M64961J43950m06113n04219o9286N90330J131726J187128O55396
$$ -755003 -290042 -146092 -552205 -1056424 -1125710 -535380 596346 1783474 2438870
38950B438870m527l09246l81509m80714l35668K50547N98569N444r34853j012637
$$ 2438870 2434343 2125097 1743588 1262874 927206 1177753 1776322 1781766 846913 -165724
38940a65724j86888M93104N67557M82513L46945j79147p00256l40756N45856N26534
$$ -165724 -352612 140492 708049 1190562 1537507 1358360 658104 317348 863204 1389738
38930A389738n61622j071839j65331O69799n1199j347307j230191K94260J390868
$$ 1389738 828116 -243723 -409054 260745 209546 -1137761 -2367952 -2073692 -682824
38921f82824J127383M08163J84010J68475k52768q40290q29300N741J018569J309258
$$ -682824 444559 852722 1036732 1205207 952439 112149 -717151 -711410 307159 1616417
38911A616417O00001m42911q82900n56970j64919k60547o14399p50455n75566
$$ 1616417 2216418 1773507 890607 333637 168718 -91829 -706228 -1456683 -2032249
38902b032249j93181L49639P74274O04680p9176m76632j30626L74508K69242l70860
$$ -2032249 -2225430 -1875791 -1101517 -496837 -576013 -1052645 -1183271 -808763 -539521 -910381
38892i10381r29509j025985n26659N36012J504715J351852J36200n96860J93845
$$ -910381 -1839890 -2865875 -3392534 -2856522 -1351807 45 136245 -460615 -266770
38883b66770J410074J308444o51q81951o19169j12545k03963o14212p21089l71616
$$ -266770 1143304 2451748 2451097 1569146 949977 837432 633469 19257 -701832 -1073448
38873a073448K27613O26794K43657p79582j133567J11822J795473J883493K94998
$$ -1073448 -845835 -219041 24616 -754966 -1888533 -1776711 18762 1902255 2197253
38864B197253j017419q81792j35513K55720N04131P60256L40519p71198j221818
$$ 2197253 1179834 298042 162529 418249 922380 1682636 2023155 1251957 30139
38855C0139l33501N54640J89495m84143j7466Q80681M61389r69197j357839k07066
$$ 30139 -303362 251278 440773 -43370 -60836 819845 1281234 312037 -1045802 -1252868
38845a252868O58327N6784q22599n33895M23657P10819K84812J00310L53359L11943
$$ -1252868 -594541 -537757 -1360356 -1894251 -1470594 -759775 -474963 -374653 -21294 290649
38835B90649l18970r15101q96499m47938q3638N7754K48223O63293J002667P28608
$$ 290649 -28321 -943422 -1839921 -2287859 -2371497 -2313743 -2065520 -1402227 -399560 329048
38825C29048k16853j092203j072871k16066O74930J069544J063502P56722L8742
$$ 329048 112195 -980008 -2052879 -2268945 -1594015 -524471 539031 1295753 1334495
38816A334495p76037q94487j44204N09182J93150o10159p60426p3874N43734M24747
$$ 1334495 558458 -336029 -480233 28949 222099 -388060 -1148486 -1222360 -678626 -253879
38806b53879j45857n39673m70426j3073N29521P26034M31160P2880P8703J64591
$$ -253879 -399736 -939409 -1409835 -1422908 -893387 -167353 263807 336687 415390 579981
38796E79981j93835p22581o04190J79574O67230L59614m1927J70832N77252L81846
$$ 579981 386146 -336435 -940625 -761051 -93821 265793 223866 394698 971950 1353796
38786A353796k81690n86982k27960L04226M73034J66993m14050q81411q61408
$$ 1353796 1072106 485124 257164 561390 1034424 1201417 787367 -94044 -955452
38777i55452m56103k12153l00044k18862K28508L51107k69631p17802K6633J255237
$$ -955452 -1411555 -1623708 -1923752 -2142614 -1914106 -1562999 -1832630 -2550432 -2523799 -1268562
38767a268562J308063O5509p92921k46242P50993R14428L25878k28418n16270
$$ -1268562 39501 105010 -687911 -934153 -183160 731268 1057146 828728 312458
38758C12458o12460l21578K53240L75732j68194l77529M56984J326095Q66246
$$ 312458 -300002 -621580 -368340 7392 -160802 -538331 -81347 1244748 2110994
38749B110994m55301j019164n65079l28486o58397l63915R58941J694249N21219
$$ 2110994 1655693 636529 71450 -257036 -915433 -1279348 -320407 1373842 1895061
38740A895061j303674j543018j52875Q22479L48236l37632P444O66420L50437
$$ 1895061 591387 -951631 -1104506 -282027 66209 -271423 -263979 402441 752878
38731G52878n16903m13641P51181J311969L47224q91870q61587L2184K41986n13666
$$ 752878 235975 -177666 573515 1885484 2232708 1340838 479251 511435 753421 239755
38721B39755j016077n49259K05086M78345M19380L55153J19788k67860k06608
$$ 239755 -776322 -1325581 -1120495 -642150 -222770 132383 252171 -15689 -222297
38712b22297M43491P39120j9657r99900q99429J46731Q00441M41044j98679l10645
$$ -222297 221194 960314 940657 -59243 -958672 -811941 -11500 429544 230865 -79780
38702g9780J7297K68351J88071j79232n64740m79373L13577J256266J445935O93965
$$ -79780 -62483 205868 393939 214707 -350033 -829406 -515829 740437 2186372 2880337
38692B880337l13433q77502q28137l27033K54642L42331k67850q55207n14452
$$ 2880337 2566904 1689402 861265 534232 788874 1131205 863355 8148 -506304
38683e06304N28983J120509P65145J48214j11528k57610n38492n31372j8683K70550
$$ -506304 22679 1143188 1908333 2056547 1945019 1687409 1148917 617545 598862 869412
38673H69412l01053j062033q59402K00168Q82035O49703K91296M45889N26129
$$ 869412 568359 -493674 -1353076 -1152908 -270873 378830 670126 1116015 1642144
38664A642144j82181j082768r83240Q374M69499k18775q77426l73887N23921L60502
$$ 1642144 1459963 377195 -606045 -597671 -128172 -346947 -1224373 -1598260 -1074339 -713837
38654g13837n63138n86579N32909J046129j5835j197820q46376M41660J027515
$$ -713837 -1276975 -1863554 -1330645 -284516 -300351 -1498171 -2344547 -1902887 -875372
38645h75372P46319N28515L73160l52705j057818m46789J112969J721562P40946
$$ -875372 -129053 399462 772622 419917 -637901 -1084690 28279 1749841 2490787
38636B490787l70064m72201k06814l56441m56373o616L92422J83380r9727N2423
$$ 2490787 2120723 1648522 1441708 1085267 628894 622278 1014700 1198080 1098353 1150776
38626A150776J32263k22338k58071N11286J054007L15951r31886j175207l93881
$$ 1150776 1283039 1060701 802630 1313916 2367923 2683874 1751988 576781 182900
38617A82900K11502J96840J37998K40533O6966m16349o46056l37661K25592O17367
$$ 182900 394402 591242 729240 969773 1036739 620390 -25666 -363327 -137735 479632
38607D79632M04775o21507j697093j382976M36927J783900J087151m44261n68880
$$ 479632 884407 262900 -1434193 -2817169 -2380242 -596342 490809 46548 -522332
38598e22332O27635J101663J89689o12202l27855J48266p9029n25122n66880m93080
$$ -522332 105303 1206966 1396655 784453 456598 604864 525835 713 -566167 -1059247
38588a059247n02366o5212Q33405J103185J90932p77475n33565N28016J069146
$$ -1059247 -1561613 -1626825 -793420 309765 500697 -276778 -810343 -282327 786819
38579G86819O24517k04199p66486p67958k01427M20898L13995m68165p88018L9049
$$ 786819 1411336 1207137 440651 -327307 -528734 -107836 206159 -262006 -1050024 -1010975
38569a010975J120688J182684L02099m21152m66737k50224j46273m6557J33308
$$ -1010975 109713 1292397 1594496 1173344 706607 456383 310110 263553 396861
38560C96861J96350K1111k24032k84882p3115K05413J55546l15059o66287l37278
$$ 396861 593211 614322 390290 105408 32293 237706 393252 78193 -588094 -925372
38550i25372L77623O80258M43552K43515K21838q3402o14548o27354k099M06080
$$ -925372 -547749 132509 576061 819576 1041414 958012 343464 -283890 -285989 120091
38540A20091J75317q6743l6507j61699m43503J7679J138502J276084j97448j409262
$$ 120091 295408 208665 172158 10459 -433044 -415365 723137 1999221 1801773 392511
38530C92511p65778L79841j548j077935n90387J085678J398781o9467r08662N3795
$$ 392511 -373267 6574 5026 -1072909 -1663296 -577618 821163 751696 -156966 -103171
38520a03171J009153N10380k12587J90721P09473j9001j094365q95125J08285
$$ -103171 905982 1416362 1203775 1394496 2103969 2084968 990603 95478 203763
38511B03763K63224m23747m91592L58416Q19849J46643q39818j099695n38260
$$ 203763 466987 43240 -448352 -89936 729913 876556 36738 -1062957 -1601217
38502a601217L20394Q87718P20418l2834n21148k38931J70447k9047l59398j3496
$$ -1601217 -1280823 -393105 327313 294479 -226669 -465600 -295153 -324200 -683598 -697094
38492f97094M75966l5219j116682j039906M95138J608607R31866m15892n89225
$$ -697094 -221128 -256347 -1373029 -2412935 -1917797 -309190 622676 206784 -382441
38483c82441L86653J051792P89528K86089L8952k40666o41869o45593j23083J59809
$$ -382441 4212 1056004 1845532 2131621 2170573 1929907 1288038 642445 519362 679171
38473F79171l46797j004600q76224j81074L8675l85842l99941N82406J557976
$$ 679171 332374 -672226 -1548450 -1729524 -1690849 -2076691 -2476632 -1894226 -336250
38464c36250J270583M4019o99909m23878J07163K94192L96598N55309L32381k69986
$$ -336250 934333 978352 278443 -145435 -38272 255920 652518 1207827 1540208 1270222
38454A270222m32651J44338N29466J2227o71569n45066N2904K52712J89428M19939
$$ 1270222 837571 981909 1511375 1523602 852033 306967 359871 612583 802011 1221950
38444A221950M95273l14277j308236j084691J54278P50158J52004l75932M2123
$$ 1221950 1717223 1402946 94710 -989981 -835703 -85545 66459 -309473 -267350
38435b67350O40131N56593J31856q8604l20275p06991p27261k48477l6369l96629
$$ -267350 372781 929374 1061230 972626 652351 -54640 -781901 -1030378 -1066747 -1463376
38425a463376m62105K77876R15633O24677Q1286J96715M80625L4246o93475o19991
$$ -1463376 -1925481 -1647605 -731972 -107295 -26009 170706 651331 685577 -7898 -627889
38415f27889J10285M05976m2922n82089p67019n98044l5938O49078O43007j82623
$$ -627889 -517604 -111628 -154550 -736639 -1503658 -2101702 -2137640 -1488562 -845555 -1028178
38405a028178n92414J53383P25204k52746j528555q49949J251408J933817L96610
$$ -1028178 -1620592 -1467209 -742005 -994751 -2523306 -3373255 -2121847 -188030 208580
38396B08580r26753k28956J113877J073750l3360o39767m31051j31188Q2439M13991
$$ 208580 -718173 -947129 166748 1240498 1207138 567371 136320 5132 87571 501562
38386E01562M94047n7677o76803n74322M8345L85575J65147l01316o84487o87283
$$ 501562 995609 937932 261129 -313193 -264848 120727 285874 -15442 -699929 -1387212
38376a387212j35233N25849N41260O149j93902J13691J37441k64768k09451L93395
$$ -1387212 -1522445 -996596 -455336 -449187 -643089 -529398 -391957 -656725 -866176 -472781
38366d72781L62269n14607o26475P57695J806454Q99979o31236o76241K18809
$$ -472781 -110512 -625119 -1251594 -493899 1312555 2212534 1581298 905057 1123866
38357A123866N4869j072917j317910l50634L74339L59293N41733J066491R67604
$$ 1123866 1178735 105818 -1212092 -1562726 -1188387 -829094 -287361 779130 1746734
38348A746734J81211l37842n50427j153975j539067m51346J206821J033526r46220
$$ 1746734 1927945 1590103 1039676 -114299 -1653366 -2104712 -897891 135635 -810585
38339h10585j886155m73280J197338J248089O41022O36686M39113o14187j051696
$$ -810585 -2696740 -3170020 -1972682 -724593 -83571 553115 992228 378041 -673655
38330f73655J63420J223757K20654j507523j480226l5937O38941K70871L40865
$$ -673655 -510235 713522 934176 -573347 -2053573 -2089510 -1450569 -1179698 -838833
38321h38833R25176O59068m20832p40556O8638P07071N82927M23018M14513q5248
$$ -838833 86343 745411 324579 -415977 -347339 359732 942659 1365677 1780190 1694942
38311A694942q19327p29222k583L5998o85023p87115O5189N97163K67845N4007
$$ 1694942 875615 146393 143810 179808 -505215 -1292330 -1227141 -629978 -362133 -308126
38301c08126L66656L25032k47415k62209M45725N80791q0309K8493J281358J624859
$$ -308126 58530 383562 136147 -126062 319663 900454 820145 848638 2129996 3754855
38291C754855m3056j618762j031212L38236N954j475251j581021j7180J042460
$$ 3754855 3711799 2093037 1061825 1400061 1406015 -69236 -1650257 -1667437 -624977
38282f24977N44399k85137m07761k27174q6423L75912Q92812M55073q58711j541181
$$ -624977 -80578 -365715 -773476 -1000650 -1087073 -711161 181651 636724 -221987 -1763168
38272a763168q20928K00144K67668l39300n63131q2560N88923Q57230M68565k65591
$$ -1763168 -2584096 -2383952 -2116284 -2455584 -3018715 -3101275 -2512352 -1655122 -1186557 -1452148
38262a452148n07036K01773J086035J009177J15681m05665j54275R4357o3758
$$ -1452148 -1959184 -1757411 -671376 337801 453482 47817 -106458 -12101 -75859
38253g5859p0444K88663L21879k60081o88704m45878r3049j01155p965M33778
$$ -75859 -146303 142360 464239 204158 -484546 -930424 -1023473 -1124628 -1132593 -698815
38243f98815M28842m91873j303604r01887J58974O36513N83685Q92344J348498
$$ -698815 -269973 -761846 -2065450 -2967337 -2808363 -2171850 -1588165 -695821 652677
38234F52677Q05815p11713j625396r29366M60398J019886M49112l29340m24412
$$ 652677 1458492 746779 -878617 -1807983 -1347585 -327699 121413 -207927 -632339
38225f32339K19105R16523Q82252L0731q12238q06145j20712L49007J58012l28086
$$ -632339 -413234 503289 1385541 1416272 604034 -202111 -322823 26184 184196 -143890
38215a43890o29818n84947j42434N84776J040795P11287l6542l20693l0974Q5826
$$ -143890 -773708 -1358655 -1501089 -916313 124482 835769 799227 478534 447560 533386
38205E33386k14860k47026K35549L06776o50555j585978j062876N49564J410098
$$ 533386 318526 71500 307049 613825 -36730 -1622708 -2685584 -2136020 -725922
38196g25922O96086l92057m25216M17043R08491N47161J262j8157L43548M58767
$$ -725922 -29836 -421893 -847109 -430066 478425 1025586 1026848 1008691 1352239 1811006
38186A811006P8975m62087p44592o66611l37556J47615O39189Q40191N84429J19488
$$ 1811006 1889981 1427894 683302 16691 -320865 -173250 465939 1306130 1890559 2010047
38176B010047j95983l93684p09472r79003p73483j83338J93812K31469M67837
$$ 2010047 1814064 1420380 710908 -268095 -1041578 -1224916 -1031104 -799635 -331798
38167c31798R43027P48666m90829j496502q46139Q64102J661856Q43736l26779
$$ -331798 611229 1359895 869066 -627436 -1473575 -609473 1052383 1896119 1569340
38158A569340o23401k23918K14472N12578M71261l07021j350045j264521K86288
$$ 1569340 945939 722021 936493 1449071 1920332 1613311 263266 -1001255 -714967
38149g14967J624075J209567j88160p73379l37538m4014j97291p124N85358O18167
$$ -714967 909108 2118675 1930515 1157136 819598 775584 578293 571169 1156527 1774694
38139A774694j26391o25751l02018J52831J02614j34733k12338l66593n59300
$$ 1774694 1648303 1022552 720534 873365 975979 841246 628908 262315 -296985
38130b96985k15252N55433O84286j60459p99434l37263M34809M56933R7963K12257
$$ -296985 -512237 43196 727482 567023 -232411 -569674 -134865 322068 420031 632288
38120F32288M94864J79840l92350l65216O3925J18949j060M36290J051313P51176
$$ 632288 1127152 1306992 914642 549426 613351 732300 731240 1167530 2218843 2970019
38110B970019l32454q54161k99662L78114L37192k07713p68001j092185p97997
$$ 2970019 2637565 1783404 1483742 1861856 2199048 1991335 1223334 131149 -666848
38101f66848K34540J016551L98240r58684j092439L85641J515979P65187q93159
$$ -666848 -432308 584243 982483 23799 -1068640 -682999 832980 1598167 705008
38092G05008j562052q31945L50765J149337J203965M63449m34754m55056L67359
$$ 705008 -857044 -1688989 -1338224 -188887 1015078 1478527 1043773 588717 956076
38083I56076O66588k43397j160105q11461J54938K73781m65491q49199m26646
$$ 956076 1622664 1379267 219162 -592299 -437361 -163580 -629071 -1478270 -1904916
38074a904916Q9376J69850O5987J41640M45834Q09437Q22274J48692o67514n12981
$$ -1904916 -1815540 -1645690 -1579703 -1438063 -992229 -182792 639482 788174 120660 -392321
38064c92321N54493R53669j02358j183501q68543q9511l98624j041964k03020
$$ -392321 162172 1115841 1013483 -170018 -1038561 -1128072 -1526696 -2568660 -2771680
38055b771680J484577J512597l26395j245265K07550J796049J097691q31171j317009
$$ -2771680 -1287103 225494 -100901 -1346166 -1138616 657433 1755124 923953 -393056
38046c93056r9474P46895J87878o24029n31077P6569L02143P6938j40426k12250
$$ -393056 -492530 254365 442243 -181786 -712863 -636294 -334151 -257213 -397639 -609889
38036f09889k77992k79606l0756L73780N67354L73922N6326m7203j2260j56641
$$ -609889 -887881 -1167487 -1198243 -824463 -257109 116813 173139 125936 113676 -42965
38026d2965l81203j57523N59915R07126J44783j195873j827407j211428J1860
$$ -42965 -424168 -581691 -21776 885350 1030133 -165740 -1993147 -3204575 -3192715
38017c192715R48996J239238J034791P38241O77605O65925J73218o99693j016741
$$ -3192715 -2243719 -1004481 30310 768551 1446156 2112081 2285299 1585606 568865
38008E68865l80796K47320K0154l28515K27345J015808O68241l97906n18459L31810
$$ 568865 188069 435389 455543 127028 354373 1370181 2038422 1640516 1122057 1453867
37998A453867M16111o82386j137402J13696J513375J270334r4802r36989q08560
$$ 1453867 1869978 1187592 50190 163886 1677261 2947595 2852793 1915804 1107244
37989A107244k68319L55610O92394L5044j318853j631577j11036J425349R48424
$$ 1107244 838925 1194535 1886929 1921973 603120 -1028457 -1139493 285856 1234280
37980A234280p39661j238664o7693J047146R72952K81585l12975p76738r10863
$$ 1234280 494619 -744045 -811738 235408 1208360 1489945 1176970 400232 -510631
37971e10631l48409L79027K56907m85860m88565N88084J405184R19361k21245
$$ -510631 -859040 -480013 -223106 -708966 -1197531 -609447 795737 1715098 1493853
37962A493853q38293p27597l56753Q0099N94930R37684P85742J54216o19776j070901
$$ 1493853 655560 -72037 -428790 -348691 246239 1183923 1969665 2123881 1504105 433204
37952D33204q42009j18386L40853J03438k67104o7244L82261K86719k13566k48792
$$ 433204 -408805 -527191 -186338 -82900 -350004 -417248 -34987 251732 38166 -210626
37942b10626K88494N87475L01916l2183j25007l57796p73807p25008J263O32201
$$ -210626 77868 665343 967259 935076 810069 452273 -321534 -1046542 -1045279 -413078
37932d13078N27686Q7638K0656L42595N77881M39546m2605n94673p15121j88540
$$ -413078 114608 202246 222902 565497 1143378 1582924 1540319 945646 230525 41985
37922D1985L40871P2322n82904l49549Q67052J438905K72871j365963j390661
$$ 41985 382856 455178 -127726 -477275 389777 1828682 2101553 735590 -655071
37913f55071K92047J677159J280741j64871r30970m94196P2643k67459j082336
$$ -655071 -363024 1314135 2594876 2430005 1499035 1004839 1077482 810023 -272313
37904b72313j073318O6533J064294P00834m99850r20850K8255J215457J271228
$$ -272313 -1345631 -1279098 -214804 486030 -13820 -934670 -906415 309042 1580270
37895A580270J40389j025237j113965j05421Q60145N97133o73800j393019o37915
$$ 1580270 1720659 695422 -418543 -523964 336181 933314 259514 -1133505 -1771420
37886a771420N71341P42705N1301k08914J35277K8475o97206q01514K85989J382375
$$ -1771420 -1200079 -457374 -406073 -614987 -479710 -451235 -1148441 -1949955 -1663966 -281591
37876b81591J322164N57897J08874Q784j85418k56024J45473M59634j02393j135693
$$ -281591 1040573 1598470 1707344 1716128 1530710 1274686 1420159 1879793 1777400 641707
37866F41707j356341l31211Q95851J049000L9964r73865q02462M55094J362249
$$ 641707 -714634 -1045845 -149994 899006 938970 -34895 -837357 -382263 979986
37857I79986P40437p91752j469266n88567O84637R22435Q9410p73661q63291j98828
$$ 979986 1720423 928671 -540595 -1129162 -444525 477910 567320 -206341 -1069632 -1268460
37847a268460N86212P21347K7867o93486n54455J65738M52119J93807K80757Q99987
$$ -1268460 -682248 39099 66966 -626520 -1180975 -1015237 -563118 -369311 -88554 811433
37837H11433J036230J71713p62827q53804n02453m37905m62031j08273L19713
$$ 811433 1847663 2019376 1256549 402745 -99708 -537613 -999644 -1107917 -788204
37828g88204L13013N6222m4058m0152O90K90502N66448R0682q99738j005483J47431
$$ -788204 -475191 -418969 -463027 -503179 -502489 -211987 354461 445143 -454595 -1460078 -1312647
37817a312647R41737K56366n23046L05871J801721J722337L7739j152359q85399
$$ -1312647 -370910 -114544 -637590 -331719 1470002 3192339 3230078 2077719 1192320
37808A192320l27261m40284o76747l85287J40163M82374O55640N49023K6390l12758
$$ 1192320 865059 424775 -251972 -637259 -497096 -14722 640918 1189941 1216331 903573
37798I03573K21634R50977M76843j053147j882343j174006m0069M31523N85950
$$ 903573 1125207 2076184 2553027 1499880 -382463 -1556469 -1596538 -1165015 -579065
37789e79065R23414R36544K42472l54219n9911N64559N28506n4095l73015k72942
$$ -579065 344349 1280893 1523365 1169146 1109235 1673794 2202300 2148205 1775190 1502248
37779A502248k00331k17095q407L43193L88317L4268l69609o21940q44462j043767
$$ 1502248 1301917 1084822 1076415 1419608 1807925 1842193 1472584 850644 6182 -1037585
37769a037585q95212j54756Q18582J167097M17329p48756j053658j73020Q13219
$$ -1037585 -1932797 -2087553 -1268971 -101874 315455 -433301 -1486959 -1659979 -846760
37760h46760R05958M62715L49899N31424M45171J74152J02307q0554p38377j129913
$$ -846760 59198 521913 871812 1403236 1848407 2022559 2124866 2044312 1305935 176022
37750A76022m09240N85240L26671p76477p91518N31700J187268J78636q65624
$$ 176022 -233218 352022 678693 -97784 -889302 -357602 829666 1008302 142678
37741A42678m42667N02724M80888r1771p9674K11466k6382k00142N77229J360058
$$ 142678 -299989 202735 683623 591852 512178 723644 697262 497120 1074349 2434407
37731B434407N65041j183272j639112l21632Q11150M09893m81561l89166M55699
$$ 2434407 2999448 1816176 177064 -144568 666582 1076475 594914 205748 661447
37722F61447R00057O05821J338o70580j294382j427906q07009p185J71035j48646
$$ 661447 1561504 2167325 2168663 1498083 203701 -1224205 -2031214 -2038399 -1867364 -2016010
37712b016010p1139P04643J283041P01871o52072j311710n24919P07682Q53816
$$ -2016010 -2087149 -1382506 -99465 602406 -49666 -1361376 -1886295 -1178613 -324797
37703c24797j68664r36793m94240M11516N06083k00608n03834K74997J328857
$$ -324797 -493461 -1430254 -1924494 -1512978 -1006895 -1207503 -1711337 -1436340 -107483
37694a07483J345573J52588r55998p03694N17080J011795K3249j123059q49156
$$ -107483 1238090 1390678 434680 -269014 248066 1259861 1283110 160051 -689105
37685f89105L66158P57134J0346l69458M05302J187412Q55316m3904n45685p73604
$$ -689105 -322947 434187 444533 75075 480377 1667789 2523105 2479201 1933516 1159912
37675A159912j035287o83378O69414J782180J241275l45931j148139o44948J07280
$$ 1159912 124625 -558753 110661 1892841 3134116 2788185 1640046 995098 1102378
37666A102378L58997K97826L0636n39292q83052l44389N24032N38399j68968k83131
$$ 1102378 1461375 1759201 1789837 1250545 367493 23104 547136 1085535 916567 633436
37656F33436M49568P28264q9543q62427n50755J49622J26854k68685N1123R25216
$$ 633436 1083004 1811268 1721725 859298 308543 458165 585019 316334 367457 1292673
37646A292673J002055k60184j661243j668910k71355R85119P76270m66763j127805
$$ 1292673 2294728 2034544 373301 -1295609 -1566964 -581845 194425 -272338 -1400143
37637a400143m53451N66720O75067K1173l34551n9896K45596K07663P1434L3211
$$ -1400143 -1853594 -1286874 -611807 -590634 -925185 -985081 -739485 -531822 -460388 -427177
37627d27177L7870J58681L94335K89894l83811q73622l89985N06296O57655J38719
$$ -427177 -389307 -230626 163709 453603 69792 -803830 -1193815 -687519 -29864 108855
37617A08855p9790k0282n10610j160442n69677J064424J690053N64339m35115
$$ 108855 29065 8783 -501827 -1662269 -2231946 -1167522 522531 1086870 651755
37608F51755J10727Q01964j12179j604290j414432L45092J426455Q14373k50123
$$ 651755 762482 1564446 1452267 -152023 -1566455 -1221363 205092 1019465 769342
37599G69342n29024k06642J40236M21344N37197K41326j91825j74847J42986J5435
$$ 769342 240318 33676 173912 595256 1132453 1373779 1181954 1007107 1150093 1165528
37589A165528n80413p67173j22884P03396R79092O94085J84988k91116m43759
$$ 1165528 585115 -182058 -304942 398454 1377546 2071631 2256619 1965503 1521744
37580A521744j34493J94067k7061n53644n98746o7986L33320K88063J87890J02110
$$ 1521744 1387251 1581318 1554257 1000613 401867 333881 667201 955264 1143154 1245264
37570A245264m65030j362226j441997j76536J243653J344995L21873l94786j60020
$$ 1245264 780234 -581992 -2023989 -2200525 -956872 388123 709996 315210 155190
37561A55190K77188J22709m19942p05331n73879k98272O326M26273Q16908P84946
$$ 155190 432378 555087 135145 -570186 -1144065 -1442337 -1436011 -1009738 -192830 592116
37551E92116K34670l84286n96106m19751j06262L26952Q15799Q07449r2763j101550
$$ 592116 826786 442500 -153606 -573357 -679619 -352667 463132 1270581 1177818 76268
37541G6268r03080M30025J234913N13510o97303j004163n91203l42815j04328
$$ 76268 -826812 -396787 838126 1351636 654333 -349830 -941033 -1283848 -1388176
37532a388176O17711J046753J59200j113774q42781P53370J364043K00943p61872
$$ -1388176 -770465 276288 435488 -678286 -1521067 -767697 596346 797289 35417
37523C5417q5662Q54212L87742o17943m34964N00919N11630l40788n68611o5234
$$ 35417 -50245 803967 1191709 573766 138802 639721 1151351 810563 241952 176718
37513A76718j91842j076048j169012L8161R95118O28561K6835M47872J214566
$$ 176718 -15124 -1091172 -2260184 -2222023 -1226905 -598344 -571509 -123637 1090929
37504A090929J007391Q3903l30708j02002j00407m83463n39270j31734M1804k39702
$$ 1090929 2098320 2182223 1851515 1749513 1649106 1165643 626373 494639 536443 296741
37494B96741l38337K7207K29823j57404n89655m63238q7461o3994k11057J20002
$$ 296741 -41596 -14389 215434 58030 -531625 -994863 -1082324 -1146318 -1357375 -1237373
37484a237373Q85495J244715O82789k64879o06912n119Q23638Q06192k85717j367346
$$ -1237373 -351878 892837 1575626 1310747 703835 698716 1522354 2328546 2042829 675483
37474F75483j129967K83308J206272M54396j087907j550379m33597R45403J280680
$$ 675483 -454484 -171176 1035096 1489492 401585 -1148794 -1582391 -636988 643692
37465F43692O50041j21494o04765q12044p41636m42199j63644k4659J53655M02551
$$ 643692 1293733 1172239 567474 -244570 -986206 -1428405 -1592049 -1616708 -1463053 -1060502
37455a060502M30330J94856J23629L66583M05098p2189m80676j85691M75918P53109
$$ -1060502 -630172 -435316 -311687 54896 459994 387805 -92871 -278562 197356 950465
37445I50465N74741K73251k67390j143281j517312m76377J267897J861801P24560
$$ 950465 1525206 1798457 1531067 387786 -1129526 -1605903 -338006 1523795 2248355
37436B248355p25119j134960q35374p73847q92147m93924M10178J051226R43633
$$ 2248355 1523236 388276 -447098 -1220945 -2113092 -2607016 -2196838 -1145612 -201979
37427b01979L30326k62081m67571k13395K70565O29555O49609K63443m78643j114569
$$ -201979 128347 -133734 -601305 -814700 -544135 85420 735029 998472 519829 -594740
37417e94740q60463L12668J097037L75532r48398r85731L36006J124145M60778
$$ -594740 -1455203 -1142535 -45498 330034 -618364 -1604095 -1268089 -143944 316834
37408C16834l22093p5064K89474l33764j072457n32814O89058Q97297N4619k91973
$$ 316834 -5259 -80323 209151 -124613 -1197070 -1729884 -1040826 -143529 -88910 -380883
37398c80883M00230R97220P09540J40575o6597k48243p89288j192476p72870K69528
$$ -380883 19347 1016567 1726107 1866682 1800085 1551842 762554 -429922 -1202792 -933264
37388i33264J008833Q44529J75098j5993O06968J100067M82812n47554l87678
$$ -933264 75569 920098 1095196 1079203 1686171 2786238 3269050 2721496 2333818
37379B333818Q03952R60434n67833j551252l34081J188615M24897j601777j778667
$$ 2333818 3137770 4098204 3530371 1979119 1645038 2833653 3258550 1656773 -121894
37370a21894J16395J248454L85487o02230l85359j17166o75510q51330K24243
$$ -121894 -5499 1242955 1628442 1026212 640853 523687 -151823 -1003153 -778910
37361g78910J257778R89690J64783j78794m18183q56671n42369P42705J253989
$$ -778910 478868 1468558 1633341 1454547 1036364 179693 -362676 380029 1634018
37352A634018p6041j561530j318958j80136J17488q765P61597J714074J157163
$$ 1634018 1557977 -3553 -1322511 -1502647 -1385159 -1393924 -632327 1081747 2238910
37343B238910m86779j300028r14994m27247M8895J063888J650061L94893j535854
$$ 2238910 1752131 452103 -462891 -890138 -841243 222645 1872706 2267599 731745
37334G31745j496923M04599J293245J91446n54272M78275J348115K92966j129869
$$ 731745 -765178 -360579 932666 1124112 569840 1048115 2396230 2689196 1559327
37325A559327p48014N86147O53299l83559n80092L32516P05290q8780q14696o78441
$$ 1559327 811313 1397460 2050759 1667200 1087108 1419624 2124914 2036134 1221438 542997
37315E42997m83592r12562j218309m96741P42255J192037M76971m58150n79028
$$ 542997 59405 -853157 -2071466 -2568207 -1825952 -633915 -156944 -615094 -1194122
37306a194122R8931P23154P06086L07347O9781N8639K2238l550J60214K64901
$$ -1194122 -1095191 -372037 334049 641396 711177 769816 792054 788504 948718 1213619
37296A213619p3872n53355m36029K90437P95529N93667M5764m68714r47794j104904
$$ 1213619 1139747 586392 150363 440800 1236329 1829996 1875760 1407046 459252 -645652
37286f45652m02270P81719J126311K18105o07331j59292Q43425J005698M00426
$$ -645652 -1047922 -266203 860108 1078213 470882 311590 1155015 2160713 2561139
37277B561139J03340J63254l58821j431933j732358o63763O06709P94132J92089
$$ 2561139 2664479 2827733 2468912 1036979 -695379 -1359142 -752433 41699 233788
37268B33788p4010K24536L68499Q599m05780n16931n66331p40059o48285L9593
$$ 233788 159778 384314 752813 761412 355632 -161299 -727630 -1467689 -2115974 -2076381
37258b076381Q35601R36343L51650r9241M8917L89175M51124L38417K23223p3817
$$ -2076381 -1240780 -304437 47213 -52028 -3111 386064 837188 1175605 1398828 1325011
37248A325011m58474k46734P23869J305673M37339j084279j469692m31998M95614
$$ 1325011 866537 619803 1343672 2649345 3086684 2002405 532713 100715 596329
37239E96329K70559l55199l03406K34720M14516J01138j94380k32362k17209l27195
$$ 596329 866888 511689 208283 443003 857519 958657 764277 531915 314706 -12489
37229a2489m95015m65490K9244Q13248J095356L71001o29671p36300m255M49743
$$ -12489 -507504 -972994 -943750 -130502 964854 1335855 706184 -30116 -34371 415372
37219D15372K65786K04597N00723L48398m31483p40844p8206M04768j43828o53322
$$ 415372 681158 885755 1386478 1734876 1303393 562549 484343 889111 745283 91961
37209I1961O5520J064525O21897q63248j292100M14J331136J134780j21841r88117
$$ 91961 157481 1222006 1843903 980655 -311445 -311031 1020105 2154885 2033044 1044927
37199A044927r11509m50316k20360j79991J37810Q18000J148556M65753o18409
$$ 1044927 133418 -316898 -537258 -717249 -579439 238561 1387117 1852870 1234461
37190A234461p34408K08455O63614j97974j066680n67555M82777M95761j93225
$$ 1234461 500053 708508 1372122 1174148 107468 -460087 22690 518451 325226
37181C25226k2501R49448J046805j95005j243383r83457j43492K51118L00673
$$ 325226 302725 1252173 2298978 2103973 860590 -122867 -266359 -15241 285432
37172B85432M35069M99571L26906J66224J6783m55287r64094p10634J69182N20663
$$ 285432 720501 1220072 1546978 1713202 1729985 1274698 310604 -400030 -230848 289815
37162B89815K8083j89060M84003J000703L96448n52244n98890K5692K17942j63895
$$ 289815 317898 128838 612841 1613544 2009992 1457748 858858 884550 1102492 938597
37152I38597l53746j07545J06466Q2464K3543r5526m23680o67910m55392j08849
$$ 938597 584851 477306 583772 666236 689779 594253 170573 -497337 -952729 -1061578
37142a061578k66236q07601r01247j43377R33255J516336J248412L78913m18534
$$ -1061578 -1327814 -2135415 -3036662 -3180039 -2246784 -730448 517964 896877 478343
37133D78343m95903J39992P86083Q87176O18836L44286j7260n64695q33235l73440
$$ 478343 -17560 122432 908515 1795691 2414527 2758813 2741553 2176858 1343623 970183
37123I70183L60978M76053j08040n81877m32897l6273N7653j60112l70320m08255
$$ 970183 1331161 1807214 1699174 1117297 684400 648127 705780 545668 175348 -232907
37113b32907k82046j2115L11388M83491L75300J02483q2105m7530P4810L5379
$$ -232907 -514953 -527068 -215680 267811 643111 745594 663489 615959 690769 726148
37103G26148j99426l56430k58598j51654k74612k53367M76028J583040J898806
$$ 726148 526722 170292 -88306 -239960 -514572 -767939 -291911 1291129 3189935
37094C189935Q97019m93981j026129n67247J05791M54474M83223K67034j34165
$$ 3189935 4086954 3592973 2566844 1999597 2105388 2559862 3043085 3310119 3175954
37085C175954m82701o43559q29039j061994q03196J65769Q97911L41113r13790
$$ 3175954 2693253 2049694 1220655 158661 -644535 -478766 419145 760258 -153532
37076a53532j119985J97266J454094J183158o970m85622R5344N89464J59941p16427
$$ -153532 -1273517 -1076251 377843 1561001 1554031 1068409 1163753 1753217 1913158 1196731
37066A196731j140904q92562l43797J59673M45840L81526j1656m28356n43093
$$ 1196731 55827 -836735 -1180532 -1020859 -575019 -193493 -205149 -633505 -1176598
37057a176598l56559j20792j2137l5613j37183k07880p4587K72433N22956M15441
$$ -1176598 -1533157 -1653949 -1666086 -1701699 -1838882 -2046762 -2121349 -1848916 -1325960 -910519
37047i10519K14215M25847R80261J156579N67100k04092l35211J68840O02163
$$ -910519 -696304 -270457 709804 1866383 2433483 2229391 1894180 2063020 2665183
37038B665183N28045J10866l93448q99613j210595j021721l92082J92805M04710
$$ 2665183 3193228 3304094 2910646 2011033 800438 -221283 -613365 -420560 -15850
37029a5850L68807K40601q5521n69886p05777n2827J023801J548607R71156k00399
$$ -15850 352957 593558 508037 -61849 -767626 -820453 203348 1751955 2723111 2522712
37019B522712r52958q76739m97136m06944l84406J52692R46152R40158j55241
$$ 2522712 1569754 693015 195879 -211065 -595471 -442779 503373 1443531 1288290
37010A288290j110944o85559O53987J370835Q71960l7424n09936m81317j78765
$$ 1288290 177346 -508213 145774 1516609 2388569 2351145 1841209 1359892 1181127
37001A181127K17173L32712o8695m44368j05199M87322K13293p76436j011021
$$ 1181127 1398300 1731012 1662317 1217949 1112750 1600072 1813365 1036929 25908
36992B5908l3005O90118K6235j026160r85617j72236J09836j70953L1068Q16937
$$ 25908 -7097 683021 709256 -316904 -1302521 -1474757 -1364921 -1535874 -1504806 -687869
36982f87869J141874O11600O9515J71477N09237M61921M0998l95882n98213m25343
$$ -687869 454005 1065605 1135120 1306597 1815834 2277755 2318753 1922871 1324658 899315
36972H99315L5637L30551J50595j42782p7675J31471P4897N1941M99008Q44851
$$ 899315 934952 1265503 1416098 1273316 1195641 1327112 1402009 1453950 1952958 2797809
36962B797809J91995r72081j164860j91672M23489k18334j023154o89970L47476
$$ 2797809 2989804 2017723 852863 661191 1084680 866346 -156808 -846778 -499302
36953d99302Q10780M80526P0001j27883k88277j92298M89850J235157J100397
$$ -499302 311478 792004 862005 734122 445845 253547 743397 1978554 3078951
36944C078951J48577n36214m02444p9304j77775l28426P073M44960K36378l89240
$$ 3078951 3227528 2691314 2288870 2209566 2031791 1703365 1710438 2155398 2391776 2002536
36934B002536l77977N11476J093040L55996r28788j131684p9201O71535J20548
$$ 2002536 1624559 2136035 3229075 3585071 2656283 1524599 1445398 2116933 2237481
36925B237481p62688o44894J58010M41614J92100M02273J042267Q60718m70990
$$ 2237481 1474793 829899 987909 1429523 1621623 2023896 3066163 3926881 3455891
36916C455891j505168j028503K14396O54174q7734j108630j456294p55617P07053
$$ 3455891 1950723 922220 1136616 1790790 1703056 594426 -861868 -1617485 -910432
36907i10432J862271J562564J04993p67957j57408O72850K85977o76864o98591
$$ -910432 951839 2514403 2619396 1851439 1694031 2366881 2652858 1975994 1277403
36898A277403K3648M4853p09075q18085R1050O64923J28467n44101m62748j68841
$$ 1277403 1301051 1345904 636829 -181256 -90206 574717 703184 159083 -303665 -472506
36888d72506k48609j25618O37705J159360O42888j36990r2184M04541M20806K40211
$$ -472506 -721115 -846733 -209028 950332 1593220 1456230 1364046 1768587 2189393 2429604
36878B429604O11753R42637R7892j366923j714964p51916j11885n24076p10303
$$ 2429604 3041357 3983994 4081886 2714963 999999 248083 136198 -387878 -1098181
36869a098181K79942J372165J199577J90189l14594n9205K15450J49024p3168
$$ -1098181 -818239 553926 1753503 1943692 1629098 1569893 1785343 1934367 1861199
36860A861199l81959o37510k99759P08613J313803N66971p79782j144250l24624
$$ 1861199 1479240 841730 541971 1250584 2564387 3131358 2351576 1207326 882702
36851H82702L76331J81061k57432j89017J48411K37854J61273K02335K44922J29660
$$ 882702 1259033 1440094 1182662 993645 1142056 1379910 1541183 1743518 1988440 2118100
36841B118100J12071M21072O92118L46736n87426j378792j313489m10323N49138
$$ 2118100 2230171 2651243 3343361 3690097 3102671 1723879 410390 67 549205
36832E49205P51167K05928k79214j14436L97207O61402O31643N66986L90539m3942
$$ 549205 1300372 1506300 1227086 1112650 1509857 2171259 2802902 3369888 3760427 3716485
36822C716485m12307m00750l57563n97720n00820N25454J535006J014961o63935
$$ 3716485 3304178 2903428 2545865 1948145 1447325 1972779 3507785 4522746 3858811
36813C858811j449955n63165N14166O12583N73815J277623J748641Q59842m61428
$$ 3858811 2408856 1845691 2359857 2972440 3546255 4823878 6572519 7432361 6970933
36804F970933o19401O5065J50050l08144j27080M48247k851j187692r82118J070941
$$ 6970933 6351532 6416597 6566647 6258503 6131423 6579670 6576819 5389127 4407009 5477950
36794E477950K488439J399450n77031p77058O41766J392426P81522M49516J494868
$$ 5477950 7966389 9365839 8788808 8011750 8653516 10045942 10827464 11276980 12771848
36785A2771848L046137M229728N553790P089050O832249K885848l189640p156021
$$ 12771848 15817985 20047713 25601503 32690553 39522802 42408650 39219010 32062989
36777C2062989o641509l482515r59233j31381L3426K95499P85798K223573N063299
$$ 32062989 25421480 21938965 20979732 20848351 20881777 21177276 21963074 24186647 29249946
36768B9249946P257052N382314p95870o858496q503061o323327m006184l143316
$$ 29249946 36506998 41889312 41093442 34234946 25731885 19408558 15402374 12259058
36760A2259058k353077q63974J1340n25147j183561p42597M6189k1536n63870
$$ 12259058 9905981 9042007 9053347 8528200 7344639 6602042 6648231 6626695 6062825
36751F062825m32098L83870R16085O98930J34048j68288K22672J257124K039631
$$ 6062825 5630727 6014597 6930682 7629612 7763660 7595372 7818044 9075168 11114799
36742A1114799J565705K47789l55569J47862L12662o84327j528966j068635n02795
$$ 11114799 12680504 12928293 12572724 12720586 13033248 12348921 10819955 9751320 9248525
36733I248525j289749k194678j002750J526504K292286M79736j272627r84488
$$ 9248525 7958776 5764098 4761348 6287852 8580138 9059874 7787247 6802759
36725F802759M9998k7294o81005m83044K58530L78724J02551M05262R70893P20238
$$ 6802759 6852757 6825463 6144458 5661414 5919944 6298668 6401219 6806481 7777374 8497612
36715H497612j57024n09123k14013j38784l44854p5911N41451N59448P5954K30238
$$ 8497612 8340588 7831465 7617452 7478668 7133814 7057903 7599354 8158802 8234756 8464994
36705H464994J019071J003381j51187p22938L79055J645017J172983m31374j081349
$$ 8464994 9484065 10487446 10336259 9613321 9992376 11637393 12810376 12379002 11297653
36696A1297653l03755M62877K43802m86808j086155j443507j277681j83387J262735
$$ 11297653 10993898 11456775 11700577 11213769 10127614 8684107 7406426 7223039 8485774
36687H485774J699692P84187k54093l56530Q0766K64878L21315O58499Q34317
$$ 8485774 10185466 10969653 10715560 10359030 10439796 10704674 11025989 11684488 12518805
36678A2518805K07869o90355o36176M53021J250845R04262K44815M72022J319713
$$ 12518805 12726674 12036319 11400143 11853164 13104009 14008271 14253086 14725108 16044821
36669A6044821J529973R11636P21361J629410K467073J995225J074324J562096
$$ 16044821 17574794 18486430 19207791 20837201 23304274 25299499 26373823 27935919
36661B7935919L380074M515694M242066M373259O329567Q788463R876599J0244506
$$ 27935919 31315993 35831687 40073753 44447012 50776579 59565042 69441641 79686147
36653G9686147J1943655J5276087J8963980K2747781K7565969L3779754M1487125
$$ 79686147 91629802 106905889 125869869 148617650 176183619 209963373 251450498
36646B51450498N1200431O0191204N8848255L7036255k546588m1633771o1738097
$$ 251450498 302650929 362842133 421690388 458726643 456180055 414546284 352808187
36639C52808187o0572079n0036041m0788587l4068124k7296441k0738201j6037748
$$ 352808187 292236108 242200067 201411480 167343356 140046915 119308714 103270966
36632A03270966j2665407r332239o717377o072639o626847o670385o105493n898572
$$ 103270966 90605559 81273320 74555943 68483304 61856457 55186072 49080579 43182007
36624D3182007n871470m970972l237666j824947j287616j167252j044814q63284
$$ 43182007 37310537 32339565 29101899 27276952 25989336 24822084 23777270 22913986
36616B2913986m48036K49475O63634L15289k77712l01817R5157K58783L84858
$$ 22913986 22465950 22715425 23379059 23694348 23416636 23114819 23209976 23468759 23853617
36607B3853617J201486K434878K931699K516710K425908L285304L726319K010077
$$ 23853617 25055103 27489981 30421680 32938390 35364298 38649602 42375921 44385998
36599D4385998j465769m281372m651596l280197k274745k627691l291711k784585
$$ 44385998 42920229 38638857 33987261 30707064 28432319 25804628 22512917 19728332
36591A9728332j197632p4856l95131j353428j517619p10984p8031l90294j011693
$$ 19728332 18530700 18455844 18060713 16707285 15189666 14478682 14400651 14010357 12998664
36582A2998664q77714l1175M26486j17977r03805q52366j24215Q4075o90582j404521
$$ 12998664 12120950 12089775 12516261 12398284 11494479 10642113 10517898 10601973 9911391 8506870
36572H506870r45945K73907Q83738L72911m22486n47784O4150Q21720J085716
$$ 8506870 7560925 7834832 8718570 9091481 8668995 8121211 8185361 9007081 10092797
36563A0092797N24813n66621j308076j143914o09889n38118p16968l10881M70635
$$ 10092797 10617610 10050989 8742913 7598999 6989110 6450992 5734024 5423143 5893778
36554E893778L99117p59546j565344r64356J05105J85742n07084o27046Q4957
$$ 5893778 6292895 5533349 3968005 3003649 3108754 3294496 2787412 2160366 2245323
36545B245323M90798p6575q43289q27714j69409K81665J84145k2203J15972M51104
$$ 2245323 2736121 2659546 1816257 988543 819134 1100799 1284944 1262741 1378713 1829817
36535A829817M89340P9529l61956l69172K0307M13346N77784N10640J71798l91638
$$ 1829817 2319157 2398686 2036730 1667558 1687865 2101211 2678995 3189635 3361433 2969795
36525B969795p38178m03904L47969O72191J92247n35678p64440l76671J59722
$$ 2969795 2231617 1827713 2175682 2847873 3040120 2504442 1740002 1363331 1523053
36516A523053L28158N755l64025j61071N72022J046414R08331Q71677J391010
$$ 1523053 1851211 1856966 1492941 1331870 1903892 2950306 3858637 4730314 6121324
36507F121324J476499J30781j652362k028971j092216n34261o50838p9054J137074
$$ 6121324 7597823 7728604 6076242 4047271 2955055 2420794 1769956 1690902 2827976
36498B827976R61643j043778k220876p17201J437121J434930p9133n65106J25514
$$ 2827976 3789619 2745841 524965 -192236 1244885 2679815 2600682 2035576 2161090
36489B161090M6814j093332j556152p56749k3901n611J54742O94629O40386j34705
$$ 2161090 2207904 1114572 -441580 -1198329 -1222230 -1227841 -1073099 -378470 261916 127211
36479A27211m28827Q8212K32751m26152o31113L44984J337252J147519K24475
$$ 127211 -301616 -213404 19347 -406805 -1037918 -692934 644318 1791837 2016312
36470B016312m49259p25439p02592k07431L05852j78991j403486j622651k28031
$$ 2016312 1567053 841614 139022 -68409 237443 58452 -1345034 -2967685 -3195716
36461c195716J043679P45240p0034J88899R66027P24009l19299o77517j61858
$$ -3195716 -2152037 -1406797 -1476831 -1287932 -321905 402104 82805 -594712 -756570
36452g56570N3061l42322l73032L33467Q54181N04105j71494l53759l2158K21244
$$ -756570 -703509 -1045831 -1418863 -1085396 -231215 272890 101396 -252363 -284521 -63277
36442f3277J1725n11801p46947k35638N92544P37084K6146m93392r7301N06631
$$ -63277 -51552 -563353 -1310300 -1545938 -953394 -216310 -190164 -683556 -780857 -274226
36432b74226L79214j72540l05302q8590j28283l56975l40809k32167k84502m5497
$$ -274226 104988 -67552 -372854 -461444 -589727 -946702 -1287511 -1519678 -1804180 -1849677
36422a849677P29694J058681R2521j135909r92988K36573R32221P95686Q31472
$$ -1849677 -1119983 -61302 31219 -1104690 -2097678 -1861105 -928884 -133198 698274
36413F98274R35995k9537j550725j480942M42581J620236M21495j296089j199732
$$ 698274 1634269 1604732 54007 -1426935 -984354 635882 1057377 -238712 -1438444
36404a438444R404K35023m27595k14239J056628J684284Q28691m73628j100724
$$ -1438444 -1429040 -1194017 -1621612 -1835851 -779223 905061 1733752 1260124 159400
36395A59400j012736n40470P5612L61132O2808j22405N17650J258342Q30291m20123
$$ 159400 -853336 -1393806 -1318194 -957062 -894254 -1016659 -499009 759333 1589624 1169501
36385A169501r04090l31597n8443n88065o69251L54686J144917N16347n43258
$$ 1169501 265411 -66186 -124629 -712694 -1381945 -1027259 117658 634005 90747
36376I0747m70007M25739O96956J22955l08404k91746m59040r08537r62386m63350
$$ 90747 -379260 46479 743435 866390 557986 266240 -192800 -1101337 -2063723 -2527073
36366b527073k2244J74701N83892J098433Q70248j84626q46992k95105N70712
$$ -2527073 -2549317 -2374616 -1790724 -692291 177957 -6669 -853661 -1148766 -578054
36357e78054M12069n76659j002758k86772O75257R16724N72032K68739L6693m80058
$$ -578054 -165985 -742644 -1745402 -2032174 -1356917 -440193 131839 400578 437271 -42787
36347d2787j009274p09214N10121J444729J036552q1450m01324K47959M80788
$$ -42787 -1052061 -1761275 -1251154 193575 1230127 1148677 747353 995312 1476100
36338A476100l74451j108347n93368K83917N4912q12075o26304O49105J263896
$$ 1476100 1101649 -6698 -600066 -316149 -261237 -1073312 -1699616 -1050511 213385
36329B13385O05272J40118O88640Q72147k72239r84684P16576L379239L569643
$$ 213385 818657 958775 1647415 2519562 2247323 1262639 1979215 5358454 8928097
36320H928097P33436j968380k178686j303663j713782k967711k807851q42723
$$ 8928097 9661533 7693153 5514467 4210804 2497022 -470689 -3278540 -4121263
36312d121263R48541J207380P46873O94950P22249O7512p91741p32826K41190
$$ -4121263 -3172722 -1965342 -1218469 -523519 198730 266242 -525499 -1258325 -1017135
36303a017135R66411P48454P5838l54064m47720l40691k2636K91100J34509l87898
$$ -1017135 -50724 697730 773568 419504 -28216 -368907 -391543 -100443 34066 -353832
36293c53832m31385L41653R96566N95617l19319m90806J77760O25829L77965R8987
$$ -353832 -785217 -443564 553002 1148619 829300 338494 516254 1142083 1520048 1619035
36283A619035K69532M24487P8145n10802q87446r26251n44860K23839O36733j75940
$$ 1619035 1888567 2313054 2391199 1880397 992951 66700 -478160 -254321 382412 206472
36273B06472j599983j744566k282J783229J705985K82888o50189n68418l16566
$$ 206472 -1393511 -3138077 -3140359 -1357130 348855 631743 -18446 -586864 -903430
36264i03430k33131J15814N88166M36385l06530p35426m95525j30216P8700M33363
$$ -903430 -1136561 -1020747 -432581 3804 -302726 -1038152 -1533677 -1663893 -1585193 -1151830
36254a151830Q28722O37740j05834m99975j24434L71813L90325J56617O171j86274
$$ -1151830 -323108 314632 208798 -291177 -415611 -43798 346527 503144 509315 323041
36244C23041m47262m26228r6515N8783p3894q58L84898M83358R8984p2229L71120
$$ 323041 -124221 -550449 -646964 -588181 -662075 -662933 -278035 205323 304307 232078 603198
36233F03198P68003M71108j34882l86080l40207l19349k15292O418j12176o19972
$$ 603198 1371201 1842309 1707427 1321347 981140 661791 446499 452917 340741 -279231
36223b79231o49268K20318Q95690K79902q15672p21866M95221J087223K97270
$$ -279231 -928499 -708181 187509 467411 -348261 -1070127 -574906 512317 809587
36214H09587n97583l70018M09057N18564l2790l00841j3502J65394j39048m11018
$$ 809587 212004 -158014 251043 769607 736817 435976 422474 587868 448820 37802
36204C7802j09296M44989M89718q4836n31974k44932M06273N73161P4061m24496
$$ 37802 -71494 373495 863213 778377 246403 1471 407744 980905 1054966 630470
36194F30470l64522O8354M02458M63020K46263k72754q18923p83901l4335O32282
$$ 630470 265948 334302 736760 1199780 1446043 1173289 354366 -429535 -463870 168412
36184A68412M37053k71190n16491r6416K69592J52997r250K45006O47192O42567
$$ 168412 605465 334275 -182216 -278632 -9040 143957 134707 379713 1026905 1669472
36174A669472J53087m43957p87572p08803k33723K99607L95059o400l11598k4323
$$ 1669472 1822559 1378602 591030 -117773 -351496 -51889 343170 336770 25172 849
36164H49M81514M17069k68501p81013o53571l57298l17373J031J145590K229756
$$ 849 482363 899432 630931 -150082 -803653 -1160951 -1478324 -1477293 -331703 1898053
36154A898053J716214j97269j336978m29590R73382O53073j072642j890993q52526
$$ 1898053 3614267 3416998 2080020 1650430 2623812 3276885 2204243 313250 -539276
36145e39276N57813Q39657K85376j90380n29973r37278r91004m21786Q8581q2592
$$ -539276 18537 858194 1143570 953190 423217 -514061 -1505065 -1926851 -1838270 -1920862
36135a920862m01364q8597N44589P41991O62932Q84999J033471K90419r34829
$$ -1920862 -2322226 -2410823 -1866234 -1124243 -461311 423688 1457159 1747578 812749
36126H12749j272564m31003L65890K96916M7379M19248R25536O27478l37559r64216
$$ 812749 -459815 -890818 -524928 -228012 -180633 238615 1164151 1791629 1454070 489854
36116D89854p48263q8635M62684O62664L82506l61857j053020r30632M0680Q39372
$$ 489854 -258409 -347044 115640 778304 1160810 798953 -254067 -1184699 -1144019 -304647
36106c04647N09775n32939q93949p794J044843R55236q0131p56759n06880k9004
$$ -304647 205128 -327811 -1221760 -1229554 -184711 770525 690394 -66365 -573245 -602249
36096f02249M6292K4047L08847N76595L84668m3493k76913l76514n03725l61730
$$ -602249 -555957 -531910 -223063 353532 738200 694707 417794 41280 -462445 -824175
36086h24175K43423P37037M84995j54246l19714K7661J26915l09036o72923m33360
$$ -824175 -580752 156285 641280 487034 167320 194981 321896 12860 -660063 -1093423
36076a093423J31305L65174j0680o59628q76060j88008R92577J571484R98850
$$ -1093423 -962118 -596944 -607624 -1267252 -2143312 -2331320 -1338743 232741 1231591
36067A231591j2732m33683k13307p9109l82305p73225p96826k89456N23585R03721
$$ 1231591 1218859 785176 571869 492760 110455 -662770 -1459596 -1749052 -1225467 -321746
36057c21746J29545j277713j611228j36151J578506J649208M85235p3775L32809
$$ -321746 -192201 -1469914 -3081142 -3217293 -1638787 10421 495656 421881 754690
36048G54690L98114k69053m27988M63570J085965L52460q18020r49131j39113
$$ 754690 1152804 883751 455763 919333 2005298 2357758 1539738 590607 451494
36039D51494M09390K40132q0584j25962j21055l89903q22680r05131k49069O94820
$$ 451494 860884 1101016 1020432 894470 773415 383512 -439168 -1344299 -1593368 -898548
36029h98548P85948k95151j122214k43239J469920J730746J31023j253736r82233
$$ -898548 -112600 -407751 -1529965 -1773204 -303284 1427462 1558485 304749 -677484
36020f77484q8048O5982p9747L41276O74954r4495j289592j388606l11462O53068
$$ -677484 -765532 -699550 -779297 -438021 236933 142438 -1147154 -2535760 -2847222 -2194154
36010b194154P56221L42486o6133j16867M31038J110957Q14633n08292j182496
$$ -2194154 -1437933 -1095447 -1161580 -1278447 -847409 263548 1078181 569889 -612607
36001f12607j41612J144562P57412o48053r64186m2873L62193k59188n52452N6546
$$ -612607 -754219 390343 1147755 499702 -464484 -507357 -145164 -404352 -956804 -900258
35991i00258M77225J72569N2224M96019N60128m7816j88720N75437R84817L05646
$$ -900258 -423033 -250464 -198240 297779 857907 810091 621371 1196808 2181625 2487271
35981B487271l03820Q3817M67200j64852q81711n17597J23983k79781j092192
$$ 2487271 2183451 2267268 2734468 2569616 1687905 1170308 1294291 1014510 -77682
35972g7682p80400L88776Q39950L24935j7532R9641j04695n65417l11438N22323
$$ -77682 -858082 -469306 370644 695579 678047 777688 672993 107576 -203862 318461
35962C18461O19814j92699m68959L83509R86774K83166o93490n62017K04719K50142
$$ 318461 938275 745576 276617 660126 1646900 1930066 1236576 674559 879278 1129420
35952A129420l99005n40444J59148O99736L08435n73337j019951o31776L27053
$$ 1129420 730415 189971 349119 1048855 1357290 783953 -235998 -867774 -540721
35943e40721J264509J570385R74199j77616j110436j203851m76193M08199P05189
$$ -540721 723788 2294173 3268372 3090756 1980320 776469 300276 708475 1413664
35934A413664L44576k2875L9344R8043l63601q58244m69791N75432R59174J32465
$$ 1413664 1758240 1735365 1774709 1872752 1509151 650907 181116 756548 1715722 1848187
35924A848187q69073r18901k09484L92879N56604L57936k77717j161602j472936
$$ 1848187 979114 60213 -149271 243608 800212 1158148 880431 -281171 -1754107
35915a754107p04961M34676Q81090N87571K64840J59672k3415k87465l31984j95397
$$ -1754107 -2459068 -2024392 -1143302 -555731 -290891 -131219 -154634 -442099 -774083 -969480
35905i69480j19427L698K86981K96129k63586o89920k12700N34842K98768o74865
$$ -969480 -1088907 -1085209 -798228 -502099 -765685 -1455605 -1668305 -1133463 -834695 -1509560
35895a509560q29882K10991R76277N36709l1965M09075J042196M56678q97814
$$ -1509560 -2339442 -2128451 -1152174 -615465 -647430 -238355 803841 1260519 362705
35886C62705j286042l51797M19780M5972n80199k50018O96440R79977L04229l28390
$$ 362705 -923337 -1275134 -855354 -809382 -1389581 -1639599 -943159 36818 341047 12657
35876A2657j73663K82514K92205P9429L13103O95100J84404j175493j816534p62922
$$ 12657 -161006 121508 413713 493142 806245 1501345 1685749 510256 -1306278 -2069200
35866b069200P86945J087473K91916j30963J02915n5746p16445o13494N22061
$$ -2069200 -1282255 -194782 97134 -33829 69086 13340 -703105 -1316599 -794538
35857g94538J048742o4648j392722j123132K60847R41376M93521m8625k51116
$$ -794538 254204 189556 -1203166 -2326298 -2065451 -1124075 -630554 -679179 -930295
35848i30295n90641r01453l22104R33754J340635K34536r87543o69350Q94504
$$ -930295 -1520936 -2422389 -2744493 -1810739 -470104 -235568 -1223111 -1892461 -997957
35839i97957J902042J306937j04507q68348n59802o2891k24108o83675n14300
$$ -997957 904085 2211022 2106515 1238167 678365 615474 391366 -292309 -806609
35830h06609K34297N35584Q3045j16481N45620J081545M62034n70283o26591N6148
$$ -806609 -572312 -36728 46317 -70164 475456 1557001 2019035 1448752 822161 878309
35820H78309Q7558o66717r00356j42353N17973L84482K17967O45189R16820K07057
$$ 878309 965867 299150 -601206 -743559 -225586 158896 376863 1022052 1938872 2145929
35810B145929r22344j355943r39551k79436K90597P00583P10095L17555R5402
$$ 2145929 1223585 -132358 -1071909 -1351345 -1060748 -360165 349930 667485 762887
35801G62887L39676L97466l28159j187490j074091j10158M91805K01402k02176
$$ 762887 1102563 1500029 1171870 -15620 -1089711 -1199869 -708064 -506662 -708838
35792g08838Q250M06751J85211n59848r74338o70004j64845l120J3416L18919
$$ -708838 -700588 -293837 -108626 -668474 -1642812 -2312816 -2477661 -2480781 -2467365 -2148446
35782b148446O85085M89447k01701n97998m14702k84782n08823l49332O07862
$$ -2148446 -1463361 -973914 -1175615 -1773613 -2188315 -2473097 -2981920 -3331252 -2723390
35773b723390J308176O92844l76430k34213R01545J170471N5217q03693l15372
$$ -2723390 -1415214 -722370 -1098800 -1333013 -431468 739003 794220 -9473 -324845
35764c24845M04884P0444p23097p85165l31326k04132j62517M16502R35378M43219
$$ -324845 80039 150483 -572614 -1357779 -1689105 -1893237 -2055754 -1639252 -703874 -260655
35754b60655l97060p2720J179430J415987o8617j570132j440880k79773L26914
$$ -260655 -657715 -730435 448995 1864982 1796365 226233 -1214647 -1494420 -1167506
35745a167506J38471R8515M86905N71634M6802l19982J26241Q37394P75657j15416
$$ -1167506 -1029035 -930520 -443615 128019 174821 -145161 -18920 818474 1594131 1478715
35735A478715q19650o54611j48717j52165n34704m26289L73895R74900O18792
$$ 1478715 659065 4454 -144263 -296428 -831132 -1257421 -883526 91374 710166
35726G10166k55614o24181k34370J35474k54945j101578j296409k10188J374652
$$ 710166 454552 -169629 -403999 -268525 -523470 -1625048 -2921457 -3131645 -1756993
35717a756993J949260J029450k54420o88740m84900n09141o11612K6841J113384
$$ -1756993 192267 1221717 967297 278557 -206343 -715484 -1327096 -1300255 -186871
35708a86871J305620L06777n29324k55902K98425J0918q07718j113579o72370
$$ -186871 1118749 1425526 896202 640300 938725 949643 141925 -971654 -1644024
35699a644024K6783O51064R64878O24841j43847m17340Q4289L73822k29367q81687
$$ -1644024 -1617241 -966177 -1299 623542 479695 62355 146644 520466 291099 -590588
35689e90588o21028J8142O9123j42168J72116N44693O6201p24034n95093J50721
$$ -590588 -1211616 -1193474 -1124351 -1266519 -1094403 -549710 -483509 -1207543 -1802636 -1651915
35679a651915J35472o12998o44089L56634R75142M28573l15342l56459j16822
$$ -1651915 -1516443 -2129441 -2773530 -2416896 -1441754 -1013181 -1328523 -1684982 -1801804
35670a801804o7043K38931R77147J255680M87918m97084o20910L0376O75148Q67055
$$ -1801804 -1868847 -1629916 -652769 602911 1090829 593745 -27165 3211 678359 1545414
35660A545414M56090n52944j492351j333638j31527P74766N95776Q1870L7736
$$ 1545414 2001504 1448560 -43791 -1377429 -1508956 -734190 -138414 -56544 -18808
35651a8808N3881l73065o32861r9891N21863K61393m41193m51543K11451N80642
$$ -18808 35073 -337992 -970853 -1070744 -548881 -287488 -728681 -1180224 -968773 -388131
35641c88131M06972K75908K59350j95952r62184j056588j37866P69490N59808
$$ -388131 18841 294749 554099 358147 -604037 -1660625 -1798491 -1029001 -469193
35632d69193n12873j151317n50398O66435J088033J37861j085478j022792L11270
$$ -469193 -982066 -2133383 -2683781 -2017346 -929313 -791452 -1876930 -2899722 -2588452
35623b588452J257258P51556k56229k89649N56549J001217N58602J7440O9508
$$ -2588452 -1331194 -579638 -835867 -1125516 -568967 432250 990852 1008292 1077800
35614A077800M39188M91761J5865p14532j196326j044219m42222m8367j10705
$$ 1077800 1516988 2008749 2024614 1310082 113756 -930463 -1372685 -1421052 -1531757
35605a531757r6732L32744N79029R1573m73717j23758Q08968J055948L41776k93213
$$ -1531757 -1628489 -1295745 -716716 -625143 -1098860 -1222618 -413650 642298 984074 690861
35595F90861j98039O0150j04466l78544l54093k95073m36154l05935M44906J086816
$$ 690861 492822 552972 448506 69962 -284131 -579204 -1015358 -1321293 -876387 210429
35585B10429N78380q85834j848304j222476M79384J705131J461644K59832n15749
$$ 210429 788809 -97025 -1945329 -3167805 -2688421 -983290 478354 738186 222437
35576B22437j60518N79748M84170n69847j440920j163001p6602P36638Q07403
$$ 222437 61919 641667 1125837 555990 -884930 -2047931 -2124533 -1387895 -580492
35567e80492O45566Q05318R92473M48992q07660j620778j053466J62364L81665
$$ -580492 65074 870392 1862865 2311857 1504197 -116581 -1170047 -1007683 -626018
35558f26018o43659j256627k89066J091241J073065m1587l77741M90025R05066
$$ -626018 -1269677 -2526304 -2815370 -1724129 -651064 -692651 -1070392 -580367 324699
35549C24699r8201j167788p91353L33730N26563j94038l33028M94915R07001J955
$$ 324699 226498 -941290 -1732643 -1398913 -872350 -1066388 -1399416 -904501 2500 4455
35539D455j139021r96358K43224J056706O86414q1287k39879J50976L59057J19350
$$ 4455 -1134566 -2130924 -1887700 -830994 -144580 -225867 -465746 -314770 44287 163637
35529A63637j86390k89711l77184n79914o24019k66653K75449O47060P98218P70597
$$ 163637 -22753 -312464 -689648 -1269562 -1893581 -2160234 -1884785 -1237725 -439507 331090
35519C31090L95878l01360p16064l40235L47954M11652j95117o18939m72634k60543
$$ 331090 726968 425608 -290456 -630691 -282737 128915 -66202 -685141 -1157775 -1418318
35509a418318k36233Q1216P46544Q57842M5179n26672J45582J025469M37627j102328
$$ -1418318 -1654551 -1573335 -826791 31051 76230 -450442 -304860 720609 1158236 55908
35499E5908j349787K44323J530391Q47216n74258p30212Q0771J58424n15381l25267
$$ 55908 -1293879 -1049556 480835 1328051 753793 23581 104352 262776 -252605 -577872
35489e77872R48974J407910L4881j490592j258260R485K09955q60325j327045
$$ -577872 371102 1779012 1813893 323301 -934959 -925474 -715519 -1575844 -2902889
35480b902889j94785J233556J341477L08640m99240m21597l433l460m99841q84243
$$ -2902889 -3097674 -1864118 -522641 -214001 -713241 -1134838 -1138271 -1141731 -1641572 -2525815
35470b525815n38067L62317Q51741L92837j93762J87394J089890R82960l37787
$$ -2525815 -3063882 -2701565 -1849824 -1456987 -1650749 -1463355 -373465 609495 271708
35461B71708j218649o18297L35857K95441j57605J96349Q56410M49862o65684
$$ 271708 -946941 -1565238 -1229381 -933940 -1091545 -895196 -38786 411076 -254608
35452b54608p66485L39120Q87461M4972p64869k64636O60431N23768n03318j177379
$$ -254608 -1021093 -681973 205488 250460 -514409 -779045 -118614 405154 -98164 -1275543
35442a275543j052908n29667J78894R05163J010991K35998m62431j19221O62303
$$ -1275543 -2328451 -2858118 -2679224 -1774061 -763070 -527072 -989503 -1108724 -446421
35433d46421O10068j54993l99931P1410J35830n96466r86949k17413Q37023R19525
$$ -446421 163647 8654 -391277 -319867 -184037 -780503 -1767452 -1984865 -1147842 -228317
35423b28317J58215l73859k44459P2394J73561J87761L42447N95439O98196L85695
$$ -228317 -70102 -443961 -688420 -616026 -442465 -254704 87743 683182 1381378 1767073
35413A767073l45943r95553r04730q3651O54350O66489K24020o0944j47295l84364
$$ 1767073 1421130 425577 -479153 -562804 91546 758035 982055 921111 773816 389452
35403C89452p07088o62668k02073J54317Q3190r0684M8227L75844M92101L54256
$$ 389452 -317636 -980304 -1182377 -1028060 -944870 -1035554 -987327 -611483 -119382 234874
35393B34874K12597K3151n21395j205883j118735J67469J575163J516261k6491
$$ 234874 447471 470622 -50773 -1256656 -2375391 -2207922 -632759 883502 857011
35384H57011j268865q73976L47835O73919k16324j092320r94394j94053N75859
$$ 857011 -411854 -1285830 -937995 -264076 -480400 -1572720 -2567114 -2761167 -2185308
35375b185308Q71906M67144n04274j148089n16951R70664J748306J140436K32871
$$ -2185308 -1313402 -846258 -1350532 -2498621 -3015572 -2044908 -296602 843834 1076705
35366A076705J65553N45875L78594k77628o25755n24285m76685n55384l61237
$$ 1076705 1242258 1788133 2166727 1889099 1263344 739059 262374 -293010 -654247
35357f54247R6709L82040M02100M09500L50704j5599m71196n70545l75631j99430
$$ -654247 -557538 -175498 226602 636102 986806 971207 500011 -70534 -446165 -645595
35347f45595J29424Q10667J138874K36955j289726j750640o89836M71259N60670
$$ -645595 -516171 294496 1433370 1670325 380599 -1370041 -2059877 -1588618 -1027948
35338a027948J37256J42344L10178k4986m92657k97370L24729M72544P1152j24633
$$ -1027948 -890692 -748348 -438170 -463156 -955813 -1253183 -928454 -455910 -384758 -509391
35328e09391J42310L24856O9496l63521o88909q17858n22343L00825J026832Q35730
$$ -509391 -367081 -42225 27271 -336250 -1025159 -1843017 -2365360 -2064535 -1037703 -201973
35318b01973n2938n59765l19517j01261l28524k68111N82119J240586M92262j113044
$$ -201973 -254911 -814676 -1134193 -1235454 -1563978 -1832089 -1249970 -9384 482878 -630166
35308f30166j736065o73297P85274J166461N40245n3868j58828j45729k95158
$$ -630166 -2366231 -3039528 -2254254 -1087793 -547548 -601416 -760244 -905973 -1201131
35299a201131l95654k28896R5286L63744M49574K61521j37366l59622m8064N37238
$$ -1201131 -1596785 -1825681 -1730395 -1366651 -917077 -655556 -792922 -1152544 -1200608 -663370
35289f63370P00495K03678m16892n79559k97702R4164M11296N39401L04894k31015
$$ -663370 37125 240803 -176089 -755648 -1053350 -959186 -547890 -8489 296405 65390
35279F5390o93142q92514j002113r76740l93881O82246J335559R66026K36345
$$ 65390 -627752 -1520266 -2522379 -3499119 -3893000 -3210754 -1875195 -909169 -672824
35270f72824O1211K23743k5272m94088l73690K60597N49157L38775K89463N04583
$$ -672824 -611613 -387870 -413142 -907230 -1280920 -1020323 -471166 -132391 157072 661655
35260F61655L86335n3404j24984J23178j02072o59270m23145O07643R21748j0628
$$ 661655 1047990 994586 869602 992780 890708 231438 -191707 415936 1337684 1327056
35250A327056o74503o0116N16835l25077j535857j281262R6855P68981K60546
$$ 1327056 652553 592437 1109272 784195 -751662 -2032924 -1936069 -1167088 -906542
35241i06542l28027l73955j90651J07606N08478L60939n99137j094470j5676J372794
$$ -906542 -1234569 -1608524 -1799175 -1691569 -1183091 -822152 -1421289 -2515759 -2531435 -1158641
35231a158641J072027l53258n81764O14874J056912j02065j091105o48378J83831
$$ -1158641 -86614 -439872 -1021636 -406762 650150 548085 -543020 -1191398 -1007567
35222a007567L54478M42471Q33580N93150m78130q77129M392M89365m68006j165982
$$ -1007567 -653089 -210618 622962 1216112 737982 -139147 -134755 354610 -113396 -1279378
35212a279378n3375J304045P00378r41932j141041J4255L55255m35694n25669
$$ -1279378 -1332753 -28708 671670 -270262 -1411303 -1397048 -1041793 -1477487 -2003156
35203b003156N21767R13985j56789j096371n65007O00784J067806Q15722L62615
$$ -2003156 -1481389 -567404 -724193 -1820564 -2385571 -1784787 -716981 98741 461356
35194D61356k27349o74717k70883P80558J131754K56897o34050n26932j27220
$$ 461356 234007 -440710 -711593 68965 1200719 1457616 823566 296634 169414
35185A69414l76577o88126l1240J116910J361320M40242n94941r45449o81874
$$ 169414 -207163 -895289 -926529 190381 1551701 1991943 1397002 451553 -230321
35176b30321m3778P48782J071756L86777p13047r20789K2398Q23159L63597p44338
$$ -230321 -274099 474683 1546439 1933216 1220169 299380 321778 1144937 1508534 764196
35166G64196j022695j84709N01191R046j014909j176590k92215M19796J77914
$$ 764196 -258499 -443208 57983 67029 -947880 -2124470 -2416685 -1996889 -1818975
35157a818975k43737J74365R82318Q67232k92758j120000o82827K58696M84985
$$ -1818975 -2062712 -1888347 -906029 -38797 -331555 -1451555 -2134382 -1875686 -1390701
35148a390701L2796p7463N65497J228216J095407L26314j79806R3262N88537K95416
$$ -1390701 -1357905 -1435368 -869871 358345 1453752 1780066 1600260 1693522 2282059 2577475
35138B577475q56312j576905p15373J006298J604688L89684j024335r21474J10807
$$ 2577475 1721163 144258 -571115 435183 2039871 2429555 1405220 483746 594553
35129E94553J22510j224998k078310j111524N32916R98315M34362M80208J382963
$$ 594553 717063 -507935 -2586245 -3697769 -3164853 -2166538 -1732176 -1251968 130995
35120A30995J423164k62669j909000j463930L56937J063007j4129j006293n65959
$$ 130995 1554159 1291490 -617510 -2081440 -1724503 -661496 -675625 -1681918 -2247877
35111b247877K70753J34551l96967m151R62586R85934j17946q35806k11070Q65304
$$ -2247877 -1977124 -1842573 -2239540 -2243691 -1281105 -295171 -413117 -1248923 -1459993 -594689
35101e94689J043672K50448n05452m99405K0994L05808J4503l58821j17222N66257
$$ -594689 448983 699431 193979 -305426 -284432 21376 35879 -322942 -440164 126093
35091A26093P10949n9324q24533o58424M9119L61237K65038L34974M32346P073
$$ 126093 837042 777718 -46815 -705239 -656120 -294883 -29845 305129 737475 744548
35081G44548n79148m18198K82728L25858m76394q37673k1066R65748R15686R0947
$$ 744548 165400 -252798 29930 355788 -120606 -958279 -979345 -13597 902089 993036
35071I93036m83299n39085m91169m59621k42162Q9218K68407K98308L42632L69485
$$ 993036 509737 -29348 -520517 -980138 -1222300 -1133082 -864675 -566367 -223735 145750
35061A45750K60421M5446k08764m64669n22508j37501N19035Q81737N86425k47647
$$ 145750 406171 451617 242853 -221816 -744324 -881825 -362790 518947 1105372 857725
35051H57725j208919j653292r20059P53650J858612J198013l48345q80578j88384
$$ 857725 -351194 -2004486 -2924545 -2170895 -312283 885730 537385 -343193 -531577
35042e31577J45918m87100p14525L20970J260061O39564o95852q92750J27828
$$ -531577 -385659 -872759 -1587284 -1266314 -6253 633311 -62541 -955291 -827463
35033h27463Q13367L82425m18026p32209m96941N926M71635M98442J3849l60596
$$ -827463 -14096 368329 -49697 -781906 -1278847 -1272921 -801286 -302844 -288995 -649591
35023f49591q7116M05057L54672j23991k88008K1069K45936Q2295j51351q7050
$$ -649591 -736707 -331650 23022 -100969 -388977 -367908 -121972 -39677 -191028 -278078
35013b78078K70361O19249N47764r1202p83916q25803l63584k23199m90070l22834
$$ -278078 -7717 611532 1159296 1068094 284178 -541625 -905209 -1128408 -1618478 -1941312
35003a941312M25444P41264L04999K76567J127371J327398j68280j641443r79169
$$ -1941312 -1515868 -774604 -469605 -193038 934333 2261731 2093451 452008 -527161
34994e27161Q36352J121790l26260j171114m57105K18551j82799n40897L4301
$$ -527161 309191 1430981 1104721 -66393 -523498 -304947 -487746 -1028643 -994342
34985i94342N56520J13092m52300j15496O06562P60253M87025L09812O6525l78172
$$ -994342 -437822 -324730 -777030 -892526 -285964 474289 961314 1271126 1337651 959479
34975I59479m75920o4948J6735o04988r24464k11249N82685L51877k96236j63336
$$ 959479 483559 418611 435346 -169642 -1094106 -1305355 -722670 -370793 -667029 -830365
34965h30365M38358L20736m38032o43140k1773M28829J48448k67305k39009J9806
$$ -830365 -392007 -71271 -509303 -1152443 -1174216 -745387 -596939 -864244 -1103253 -1083447
34955a083447J72228L05783M96796N07682K07394j87264m66542o32447o56089
$$ -1083447 -911219 -605436 -108640 399042 606436 419172 -47370 -679817 -1335906
34946a335906l96411J21021N84302O58010L10524r7741j19499K17770L27859j06233
$$ -1335906 -1732317 -1611296 -1026994 -368984 -58460 -156201 -275700 -57930 269929 163696
34936A63696m93304j57893M57773L71692k63011k98037M13585N78315m03624j267444
$$ 163696 -329608 -487501 -29728 341964 78953 -219084 194501 772816 369192 -898252
34926h98252p93204L30999P22742L66499J46153J31247k21179o74101m62750K90202
$$ -898252 -1691456 -1360457 -637715 -271216 -125063 6184 -214995 -889096 -1351846 -1061644
34916a061644O71526L88222K1694k2603J07406K34159K42987p1419m91535k09089
$$ -1061644 -390118 -1896 19798 -2805 104601 338760 581747 510328 18793 -190296
34906a90296R13735J538203N07884j204937j605975m10123P79597Q48908K48508
$$ -190296 723439 2261642 2769526 1564589 -41386 -451509 328088 1176996 1425504
34897A425504k86522o17256o40797j98611K40341J4528n06978l75642K60884L55681
$$ 1425504 1138982 521726 -119071 -317682 -77341 -62813 -569791 -945433 -684549 -328868
34887c28868j40195k24889J36404j84596j179886j215904K60662J479962J084324
$$ -328868 -469063 -693952 -557548 -742144 -1922030 -3137934 -2877272 -1397310 -312986
34878c12986K76683N75561J072279J10214j441873j166723R67280K151969O86574
$$ -312986 -36303 539258 1611537 1721751 279878 -886845 80435 2232404 2918978
34869B918978j664484k193722o46570J029882J350641N18504n03923j019869p55664
$$ 2918978 1254494 -939228 -1585798 -555916 794725 1313229 809306 -210563 -966227
34860i66227J20286R13800R24821L23356M7867N06027Q62185K06721r45835j243091
$$ -966227 -845941 67859 992680 1316036 1363903 1869930 2732115 2938836 1993001 749910
34850G49910n07876m3257o03329j253164r77712k68877j2377J40575Q26003J306973
$$ 749910 242034 198777 -404552 -1657716 -2635428 -2904305 -2916682 -2776107 -1950104 -643131
34840f43131O10330l15129K30754J630206J518900l46413j433372m58086N84890
$$ -643131 -32801 -347930 -117176 1513030 3031930 2685517 1252145 794059 1378949
34831A378949j41370j300710q57727M36857N24356m02002m85405M56368Q34924
$$ 1378949 1237579 -63131 -920858 -484001 40355 -361647 -847052 -390684 444240
34822D44240K46355J5264O23722Q45420l0338r75311r17630k01632L11523M25649
$$ 444240 690595 705859 1329581 2175001 2144663 1169352 251722 50090 361613 787262
34812G87262L16645L3412k50290k91083l10512o49250q51998j42021J086187J433970
$$ 787262 1103907 1137319 887029 595946 285434 -363816 -1215814 -1357835 -271648 1162322
34802A162322M86178m91700l50621M08048N27818k65704j063433r70306r6977
$$ 1162322 1648500 1156800 806179 1214227 1742045 1476341 412908 -557398 -654375
34793f54375N53855J90924p06953q60992K5291P36814M13304m9871M37696J173213
$$ -654375 -100520 90404 -616549 -1477541 -1452250 -715436 -302132 -352003 85693 1258906
34783A258906P89465l58634p72315l25507k27295o87998p05595j79553p8467l18121
$$ 1258906 2048371 1689737 917422 591915 364620 -323378 -1028973 -1208526 -1286993 -1605114
34773a605114K66782J446998J468697N4113q88363m60457j82877r79704j322754
$$ -1605114 -1338332 108666 1577363 1631476 743113 282656 99779 -879925 -2202679
34764b202679j06823J038902M71713n50264j36260Q71206N53287m99647k70561
$$ -2202679 -2309502 -1270600 -798887 -1349151 -1485411 -614205 -60918 -560565 -831126
34755h31126R35935R34618m94307j187008j94396Q89008P27903P3979M1525M19647
$$ -831126 104809 1039427 545120 -641888 -836284 52724 780627 854606 896131 1315778
34745A315778M94698J50563m09103q88196o64847M61644J353647P77437n82772
$$ 1315778 1810476 1961039 1551936 663740 -1107 460537 1814184 2591621 2008849
34736B008849r92978m01999l42702j035288q43384P93651K058459J419439j91699
$$ 2008849 1015871 613872 271170 -764118 -1607502 -813851 1244608 2664047 2472348
34727B472348j000889o88038L7094P75853J207579P11507o32228j624174j459796
$$ 2472348 1471459 783421 820515 1596368 2803947 3515454 2883226 1259052 -200744
34718b00744p16856j20224M67395J016442P10229n24534j219907m45974N45612
$$ -200744 -917600 -1037824 -570429 446013 1156242 631708 -588199 -1034173 -488561
34709d88561K78264m91579r0995J148307J351110J40351q16415m50151L14886
$$ -488561 -210297 -701876 -792871 355436 1706546 1846897 1030482 580331 895217
34700H95217L21885j20193q8710L85616M83011j13128p72471p38897q6130L12490
$$ 895217 1217102 1096909 1008199 1393815 1876826 1763698 991227 252330 166200 478690
34690D78690j25235p90093n61181N71548J287906O91874m48270q00688j89148
$$ 478690 353455 -436638 -997819 -426271 861635 1553509 1105239 304551 115403
34681A15403M87740N70126J54700l45278n40221k71489Q8290j3314l50262p7462
$$ 115403 603143 1173269 1327969 982691 442470 170981 259271 245957 -104305 -181767
34671a81767P29900P81051l82203j214257l08971J270102J404497J1816j037535
$$ -181767 548133 1329184 946981 -267276 -576247 693855 2098352 2110168 1072633
34662A072633p80364j31942K8997K21J17864K778m82396p32682m23324m8895k302
$$ 1072633 292269 160327 189324 189545 307409 310187 -172209 -904891 -1328215 -1377110 -1379412
34651a379412l8836N85j08674k36656J10439P08739O27928k06018n96848J19995
$$ -1379412 -1418248 -1417663 -1526337 -1762993 -1652554 -943815 -315887 -521905 -1118753 -998758
34641i98758R43604P18069j57802n23481k49240j59721n66602q76752n58647K26930
$$ -998758 -55154 662915 505113 -18368 -267608 -427329 -993931 -1870683 -2429330 -2202400
34631b202400R36744J118989O75736j3235l78196k67334j3048J73559L85206M91897
$$ -2202400 -1265656 -146667 529069 515834 137638 -129696 -142744 30815 416021 907918
34621I07918J31339m85639n35098J60918N88692m8056j006865r57596J40259J003218
$$ 907918 1039257 553618 18520 179438 768130 720074 -286791 -1244387 -1104128 -100910
34611a00910P30830k21768q19618o27089p5581J56414m8155o5214O12535J428524
$$ -100910 629920 408152 -411466 -1038555 -1114136 -957722 -1005877 -1071091 -458556 969968
34601I69968J288181J58554o62895k98283N02703N56036j03462o06480o47149
$$ 969968 2258149 2416703 1753808 1455525 1958228 2514264 2410802 1804322 1157173
34592A157173m87736n7221P96850J419220R34860k69326q13682k72997K33374
$$ 1157173 669437 612216 1409066 2828286 3763146 3493820 2680138 2407141 2640515
34583B640515k27715j076804j211928n50691J11372K65756L0768l54147p22237
$$ 2640515 2412800 1335996 124068 -426623 -315251 -49495 -18727 -372874 -1095111
34574a095111p81477k81959N29125R69349O12312k00074o64057l58062K91029
$$ -1095111 -1876588 -2158547 -1629422 -660073 -47761 -247835 -911892 -1269954 -978925
34565i78925N18191J65530j71478m7718J93822M7468k59422r5239M97602P17051
$$ -978925 -460734 -295204 -466682 -514400 -320578 -273110 -532532 -627771 -130169 586882
34555E86882R2735q72212j327306r31369M7348J048746J443966Q77588k68008
$$ 586882 679617 -192595 -1519901 -2451270 -2403922 -1355176 88790 966378 698370
34546F98370j004178o70477L45124J024429P94004K6037n09977n43203m98281
$$ 698370 -305808 -976285 -631161 393268 1187272 1213309 703332 160129 -338152
34537c38152p56428r70183n07569M94449J131435R83225O79959P67236P31901
$$ -338152 -1094580 -2064763 -2572332 -2077883 -946448 36777 716736 1483972 2215873
34528B215873m8158r79416r73069j92327J38141l26800n39471K00156J107765
$$ 2215873 2167715 1188299 215230 22903 161044 -165756 -705227 -505071 602694
34519F02694J078304J43408q03253j090224o39750J12208L33479m31486j298526
$$ 602694 1680998 1824406 1021153 -69071 -708821 -596613 -263134 -694620 -1993146
34510a993146p83856J034316K164243J258375n09704j129754m09389K82291K20827
$$ -1993146 -2777002 -1742686 421557 1679932 1170228 40474 -368915 -86624 134203
34501A34203j32395m10642p37299r08847m55842L65155P02871L69612N2563J90505
$$ 134203 1808 -408834 -1146133 -2054980 -2510822 -2145667 -1442796 -1073184 -1020621 -830116
34491h30116N00908O48525N45412N8043o88488q99947r1682P31254K31844j006963
$$ -830116 -329208 319317 864729 922772 234284 -665663 -757345 -26091 205753 -801210
34481h01210j040961L99444J284341L87758q30762o42160K79649K35427o43311
$$ -801210 -1842171 -1442727 -158386 229372 -601390 -1243550 -963901 -728474 -1371785
34472a371785q05183R3660Q27221O87623K98686K35112K19657j3052j70181o7287
$$ -1371785 -2176968 -2083308 -1256087 -568464 -269778 -34666 184991 171939 1758 -65529
34462f5529K0398l9935Q380K53877M27507L88785K44195k7376m84634q09780o12068
$$ -65529 -45131 -85066 -76686 177191 604698 993483 1237678 1210302 725668 -84112 -696180
34451f96180r3799J97531J65333Q1648o1464l59109m37498k9810J78333n39454
$$ -696180 -789979 -592448 -427115 -345467 -406931 -766040 -1203538 -1233348 -1055015 -1594469
34441a594469j378090q12734Q94947J646166N21179p64253m14568Q40222J082470
$$ -1594469 -2972559 -3785293 -2890346 -1244180 -723001 -1487254 -1901822 -1061600 20870
34432B0870J34353m80277j0709O82086P32111L37561l3911l82876o77908m98245
$$ 20870 155223 -325054 -335763 346323 1078434 1415995 1382084 999208 321300 -176945
34422a76945K40731Q04357N16746k14456l96341J12671L27501m31312j371019
$$ -176945 63786 868143 1384889 1170433 774092 886763 1214264 782952 -588067
34413e88067j161176J39390R79249M24503n38371n36629J56022K85508k05169
$$ -588067 -1749243 -1609853 -630604 -206101 -744472 -1281101 -1125079 -839571 -1044740
34404a044740j84973N36364P47031n2983o47775p9151P18997M23763n64469q33403
$$ -1044740 -1229713 -693349 53682 699 -647076 -726227 -7230 416533 -147936 -981339
34394i81339j19093N37041M25896j42187n46002l61557N13493J441999J245734
$$ -981339 -1100432 -563391 -137495 -279682 -825684 -1187241 -673748 768251 2013985
34385B013985k71346j570654j233413Q532M02131j71550k91153M45884P72011
$$ 2013985 1742639 171985 -1061428 -1052896 -650765 -822315 -1113468 -667584 104427
34376A04427j6703q43904o01387K00224M29406K4690k33969j9595K88728K99493
$$ 104427 87724 -756180 -1357567 -1157343 -727937 -703247 -937216 -956811 -668083 -368590
34366c68590o989l58843l83951n665L02798J10619j99821N1700O13260N20777
$$ -368590 -375579 -734422 -1118373 -1124038 -821240 -710621 -910442 -858742 -245482 275295
34356B75295l31568q95458n78910p6369n0782n0325M65507R49532O47724O497
$$ 275295 -56273 -951731 -1530641 -1607010 -1657792 -1708117 -1242610 -293078 354646 361143
34346C61143O8242P82359J012697K26196p45004q64832j73447M42172M06965J6405
$$ 361143 429385 1211744 2224441 2450637 1705633 840801 667354 1109526 1516491 1532896
34336A532896j20385Q8331J92708n2121l37043l89860m18437n46590l71679K29847
$$ 1532896 1412511 1500842 1693550 1641429 1304386 914526 496089 -50501 -422180 -192333
34326a92333M43138l18931j078882m78966R51711J330098K81839n23097j33354
$$ -192333 250805 -68126 -1147008 -1625974 -674263 655835 937674 414577 281223
34317B81223K89817k43416p17256j502R25688M39567j042431j670696q81894J97029
$$ 281223 571040 327624 -389632 -391134 534554 974121 -68310 -1739006 -2620900 -2423871
34307b423871P12434Q56974Q42148N50531J96958J25838M6061m21048p13527j20503
$$ -2423871 -1711437 -854463 -12315 538216 735174 861012 907073 486025 -227502 -348005
34297c48005P00394M97522m24144m98189N21263J023625J07455r55794p09901
$$ -348005 352389 849911 425767 -72422 448841 1472466 1579921 624127 -85774
34288h5774L61454P92836K79176k74648k87198n4616O580j00999j57897m5733
$$ -85774 275680 1068516 1347692 1073044 785846 731230 737810 636811 478914 433181
34278D33181J31900J31620q6438j84267M8895K13428j08979m91281k23878L38597
$$ 433181 565081 696701 610263 425996 474891 688319 579340 88059 -135819 202778
34268B02778N6797j138216j763506p38167J047921J859937J222278J48534l68783
$$ 202778 259575 -878641 -2642147 -3380314 -2332393 -472456 749822 898356 529573
34259E29573l58182l86550n90193m63195L56345J266467J175481J9651q84217
$$ 529573 171391 -215159 -805352 -1268547 -912202 354265 1529746 1549397 665180
34250F65180o14582j0084k43386p89444l50577O85795O84544l63774o05305N22508
$$ 665180 50598 40514 -202872 -992316 -1342893 -657098 27446 -336328 -941633 -419125
34240d19125J148891O8739j122622o01617P43340R09921l5686n44418l86549n51133
$$ -419125 729766 798505 -324117 -925734 -182394 727527 691841 147423 -239126 -790259
34230g90259q82598k09985J188402J506411K06724j048120q85965L8850N47764
$$ -790259 -1672857 -1882842 -694440 811971 1018695 -29425 -915390 -876540 -328776
34221c28776O53163Q10451P05362o9048r28949r51764j74454N28404N41470l5002
$$ -328776 324387 1134838 1840200 1771152 842203 -109561 -284015 244389 785859 750857
34211G50857o69662p60091j18420O17452N58945k08545o18691j42782M51626L43038
$$ 750857 81195 -678896 -797316 -179864 379081 170536 -448155 -590937 -139311 203727
34201B03727j20414j41039K27560L42101R2227j10293j98793m50945p37410n94038
$$ 203727 83313 -57726 169834 511935 604162 493869 295076 -155869 -893279 -1487317
34191a487317p3448K21908Q2720j7219K13039L74857R3535l05458l02552L2905
$$ -1487317 -1560765 -1338857 -1256137 -1273356 -1060317 -685460 -591925 -897383 -1199935 -1167030
34181a167030K85851M19620O38779O92564P0756r80474j388190o30599L96571
$$ -1167030 -881179 -461559 177220 869784 940540 -39934 -1428124 -2058723 -1662152
34172a662152N13679j37472l81751K66900J007393R82175L47962j85988k90230
$$ -1662152 -1148473 -1285945 -1667696 -1400796 -393403 588772 936734 750746 460516
34163D60516j12258J10452J84484L7932j17086l6111R0663n1579j25865M91567
$$ 460516 348258 458710 643194 681126 564040 527929 618592 567013 441148 932715
34153I32715J389954J227148l07637j682064j506474m11704Q1961k24176l42220
$$ 932715 2322669 3549817 3242180 1560116 53642 -358062 -276101 -500277 -842497
34144h42497J29004O47064Q12719O62572J75063m55823m78446L43481Q60148R4576
$$ -842497 -713493 -66429 746290 1408862 1583925 1128102 649656 993137 1853285 1947861
34134A947861r23935n74011O11330O78596m75869r35558q8073M09595k70865n99968
$$ 1947861 1023926 449915 1061245 1739841 1263972 328414 240341 649936 379071 -220897
34124b20897M48521J339031N41900q07799q75454j40291j67935o28453n6920J148810
$$ -220897 227624 1566655 2108555 1300756 425302 285011 117076 -511377 -568297 580513
34114E80513J085165m34010j383700n92256O82583Q26139n6447q08245p92774
$$ 580513 1665678 1231668 -152032 -744288 -61705 764434 707987 -100258 -893032
34105h93032j91267M45058N55655J03770j94426J84810O23401K24423o72644r41671
$$ -893032 -1084299 -639241 -83586 20184 -174242 10568 633969 858392 185748 -755923
34095g55923m27331j3695j9705J32224N41897M95510j59446n50558j75426L03274
$$ -755923 -1183254 -1196949 -1216654 -1084430 -542533 -47023 -206469 -757027 -932453 -629179
34085f29179J80428k71555m09482j05932L76399P52389O93080P7038n84052o32231
$$ -629179 -448751 -720306 -1129788 -1235720 -859321 -106932 586148 663186 79134 -553097
34075e53097k10253J0278m6786O6213K29024j20894p25351o14504K92874R22157
$$ -553097 -763350 -753072 -799858 -733645 -504621 -625515 -1350866 -1965370 -1672496 -750339
34065g50339P05268L14935L46697M64477L46477L25429N21191M09595j67655n71834
$$ -750339 -45071 269864 616561 1081038 1427515 1752944 2274135 2683730 2516075 1944241
34055A944241m76343l96622o12093o13706j50947K31719K24616K47847M48520
$$ 1944241 1467898 1071276 459183 -154523 -305470 -73751 150865 398712 847232
34046H47232L53297m2833j20120J9192m49581j230961q52552P64871J613460O07998
$$ 847232 1200529 1157696 1037576 1056768 607187 -623774 -1476326 -711455 902005 1510003
34036A510003o53082n70384l3826m07806q75819p8818J071086P62883n29921p96637
$$ 1510003 856921 286537 252711 -155095 -1030914 -1109732 -38646 724237 194316 -602321
34026f02321K01783Q11373L09780m03137o91086o91642k49219O57172Q80571l50503
$$ -602321 -400538 410835 720615 317478 -373608 -1065250 -1314469 -657297 223274 -127229
34016a27229j426405l87832J526872J304623r82094k009521l97822J273150Q17050
$$ -127229 -1553634 -1941466 -414594 890029 -92065 -2101586 -2499408 -1226258 -409208
34007d09208l46853j31450P90937P44495R7723J18189L55514l50829j305077q29083
$$ -409208 -756061 -887511 -96574 647921 745644 863833 1219347 868518 -436559 -1265642
33997a265642Q17446J592167O72040n26304n35177L65528R02296M14402o36845
$$ -1265642 -448196 1143971 1816011 1289707 754530 1120058 2022354 2436756 1799911
33988A799911j254240q63090R0951O33329M12894o3134l65689n83156o74048k86834
$$ 1799911 545671 -317419 -226468 406861 819755 756621 390932 -192224 -866272 -1153106
33978a153106M21000O73054K22704k09767m5620M29422P51723P67988K26373r76705
$$ -1153106 -732106 -59052 163652 -46115 -91735 337687 1089410 1857398 2083771 1107066
33968A107066j893640j251415M98124J359711N99560k62121o600N37079L66234
$$ 1107066 -786574 -2037989 -1539865 -180154 419406 157285 150685 687764 1053998
33959A053998Q1423L55554L47949o29662j389434p21955L63165K96415l47405
$$ 1053998 1135421 1490975 1838924 1209262 -180172 -902127 -538962 -242547 -589952
33950e89952k8496Q77462P95303j44826m03404J52181J84108n06064p18855k76737
$$ -589952 -618448 259014 1054317 909491 506087 658268 842376 336312 -382543 -659280
33940f59280l28649r55465q05230L42927Q77646J8188q29669l61606P17077J119753
$$ -659280 -987929 -1943394 -2748624 -2405697 -1528051 -1509863 -2339532 -2701138 -1984061 -864308
33930h64308Q32736N01453K19856r9170j93379n6154q6204j42206L56012R81618
$$ -864308 -31572 469881 689737 590567 397188 341034 254830 112624 468636 1450254
33920A450254M98530q79304j197621K51627J444557N93821j013233j045585K48838
$$ 1450254 1948784 1069480 -128141 123486 1568043 2161864 1148631 103046 351884
33911C51884O95075k23699q20595k12035M01598N1353l39501K84037J099400O14603
$$ 351884 1046959 823260 2665 -209370 192228 243581 -95920 188117 1287517 1902120
33901A902120q44781j389791k77388R59922O28891q12464j473986o17370N82464
$$ 1902120 1057339 -332452 -609840 350082 978973 166509 -1307477 -1924847 -1342383
33892a342383R10508O14175M88850M40239o7057p39055p76116k13887J53844J05020
$$ -1342383 -431875 182300 671150 1111389 1044332 305277 -470839 -684726 -530882 -425862
33882d25862J59942L96596K33674l68639n90345p1766L97940N3699p56848j187950
$$ -425862 -265920 130676 364350 -4289 -594634 -666400 -268460 -214761 -971609 -2159559
33872b159559r46199k65881N34021J028753Q39810K39099J4066L56099N36130
$$ -2159559 -3105758 -3371639 -2837618 -1808865 -969055 -729956 -715890 -359791 176339
33863A76339Q1714m58876m47975j32842m2179m2321K50140N81692L70228l52195
$$ 176339 258053 -200823 -648798 -781640 -823819 -866140 -616000 -34308 335920 -16275
33853a6275r48800r67373m43082L68037J101576J331865R40880L21208q5036k89727
$$ -16275 -965075 -1932448 -2375530 -2007493 -905917 425948 1366828 1688036 1603000 1313273
33843A313273n68879r58705j152048p88347J65659J141505J265067L57516n69879
$$ 1313273 744394 -214311 -1366359 -2154706 -1989047 -847542 417525 775041 205162
33834B05162m50209L97465P77144M14983J62423L40033J63936p34358j439413
$$ 205162 -245047 152418 929562 1344545 1506968 1847001 2010937 1276579 -162834
33825a62834j129786l10540J41938K72860N02937N93380J68210l26437k10871
$$ -162834 -1292620 -1603160 -1461222 -1188362 -685425 -92045 76165 -250272 -461143
33816d61143K71040L15642j83699n66073m17063K3520L32418K79027p6990l09702
$$ -461143 -190103 125539 -58160 -624233 -1041296 -1017776 -685358 -406331 -483321 -793023
33806g93023J5412O13909O24155j77220r26040q69159l29996L7300K28183M81506
$$ -793023 -777611 -163702 460453 283233 -642807 -1511966 -1841962 -1804662 -1576479 -1094973
$$ [...]
##END NTUPLES=NMR SPECTRUM
##END=
