##TITLE=31Pdec_ABDE0406-3
 CDCl3, 24 sc
 7.06.2021
##JCAMPDX= 6.0         $$ Bruker NMR JCAMP-DX V2.0
##DATA TYPE= NMR SPECTRUM
##DATA CLASS= NTUPLES
##ORIGIN= UXNMR, Bruker Analytische Messtechnik GmbH
##OWNER= root
$$ XWIN-NMR		Version 3.5
$$ Mon Jun  7 10:44:49 2021 Russian Standard Time (UT+4h)  she@DPX200
##.OBSERVE FREQUENCY= 81.013821
##.OBSERVE NUCLEUS= ^31P
##.ACQUISITION MODE= SIMULTANEOUS
##.ACQUISITION SCHEME= undefined
##.AVERAGES= 24
##.DIGITISER RES= 16
##SPECTROMETER/DATA SYSTEM= spect
##.PULSE SEQUENCE= zgpg30
##.SOLVENT NAME= CDCl3
##.SHIFT REFERENCE= (INTERNAL, CDCl3, 0, 248.564)
##AUDIT TRAIL= $$ (NUMBER, WHEN, WHO, WHERE, WHAT)
$$ ##TITLE= Audit trail, XWIN-NMR		Version 3.5
$$ ##JCAMPDX= 5.01
$$ ##ORIGIN= Bruker BioSpin GmbH
$$ ##OWNER= she
$$ F:/spectra/data/she/nmr/P31/1/pdata/1/auditp.txt
$$ ##AUDIT TRAIL=  $$ (NUMBER, WHEN, WHO, WHERE, WHAT)
(   1,<2021-06-07 10:43:03.18 +0400>,<she>,<DPX200>,
      <created by zg, POWCHK disabled, PULCHK disabled
       configuration hash MD5:
       00 E9 B6 7A A2 85 ED C7 34 08 36 98 17 FE 4E 26
       data hash MD5: 32K
       11 48 1D F5 A4 D1 1C 58 76 12 D0 6D 19 D9 8B 1C>)
(   2,<2021-06-07 10:43:25.23 +0400>,<she>,<DPX200>,
      <Start of raw data processing
       efp BC_mod = 2 LB = 1 FT_mod = 6 PKNL = 1 PHC0 = -5880.951 PHC1 = 76.27472 SI = 64K 
       data hash MD5: 64K
       4B 89 FC 94 E0 78 C2 E1 0A 5C F8 57 F3 DB F9 1B>)
(   3,<2021-06-07 10:43:57.95 +0400>,<she>,<DPX200>,
      <pk PHC0 = 60.38664 PHC1 = -101.4 
       data hash MD5: 64K
       DC 27 8E 74 B2 E1 01 B1 43 18 24 83 21 1B 41 0A>)
(   4,<2021-06-07 10:44:00.84 +0400>,<she>,<DPX200>,
      <abs ABSG = 5 
       data hash MD5: 64K
       B5 53 2E 67 22 D9 54 75 7F 21 91 02 EE 7C 0D 2F>)
$$ ##END=
$$ 
$$ hash MD5
$$ C8 61 7B FA D2 2B F3 52 E8 8F BB 45 A4 34 EA 10
##$RELAX= 
##$RELAX= 
##$RELAX= 
##$RELAX= 
##$RELAX= 
##$RELAX= 
##$RELAX= 
##$RELAX= 
$$ Bruker specific parameters
$$ --------------------------
##$DU= <F:/spectra>
##$EXPNO= 1
##$NAME= <P31>
##$PROCNO= 1
##$TYPE= <nmr>
##$USER= <she>
##$AMP= (0..31)
100 100 100 100 100 100 100 100 100 100 100 100 100 100 100 100 100 100 
100 100 100 100 100 100 100 100 100 100 100 100 100 100 
##$AQSEQ= 0
##$AQ_mod= 1
##$AUNM= <au_zg>
##$AUTOPOS= <>
##$BF1= 81.014009
##$BF2= 200.13
##$BF3= 200.13
##$BF4= 200.13
##$BF5= 200.13
##$BF6= 200.13
##$BF7= 200.13
##$BF8= 200.13
##$BYTORDA= 1
##$CFDGTYP= 0
##$CFRGTYP= 5
##$CHEMSTR= <none>
##$CNST= (0..31)
1 1 145 1 1 1 1 1 1 1 1 1 1 1 1 1 1 1 1 1 1 1 1 1 1 1 1 1 1 1 1 1 
##$CPDPRG= <waltz16>
##$CPDPRG1= <>
##$CPDPRG2= <waltz16>
##$CPDPRG3= <>
##$CPDPRG4= <mlev>
##$CPDPRG5= <mlev>
##$CPDPRG6= <mlev>
##$CPDPRG7= <mlev>
##$CPDPRG8= <mlev>
##$CPDPRGB= <>
##$CPDPRGT= <>
##$D= (0..31)
0 1 0 0 0 0 0 0 0 0 0 0.03 2e-05 3e-06 0 0 0 0 0 0 0 0 0 0 0 0 0 0 0 0 
0 0 
##$DATE= 1623048182
##$DBL= (0..7)
120 120 120 11 120 120 24 19 
##$DBP= (0..7)
150 150 150 150 150 150 150 150 
##$DBP07= 0
##$DBPNAM0= <>
##$DBPNAM1= <>
##$DBPNAM2= <>
$$ [...]
##$SUBNAM3= <"">
##$SUBNAM4= <"">
##$SUBNAM5= <"">
##$SUBNAM6= <"">
##$SUBNAM7= <"">
##$SUBNAM8= <"">
##$SUBNAM9= <"">
##$SW= 501.771253377433
##$SWIBOX= (0..15)
0 1 3 0 0 0 0 0 0 0 0 0 0 0 0 0 
##$SW_h= 40650.406504065
##$TD= 32768
##$TD0= 1
##$TE= 0
##$TE2= 300
##$TE3= 300
##$TEG= 300
##$TL= (0..7)
0 120 53 12 22 120 120 120 
##$TP= (0..7)
150 150 150 150 150 150 150 150 
##$TP07= 0
##$TPNAME0= <>
##$TPNAME1= <>
##$TPNAME2= <>
##$TPNAME3= <>
##$TPNAME4= <>
##$TPNAME5= <>
##$TPNAME6= <>
##$TPNAME7= <>
##$TPOAL= (0..7)
0.5 0.5 0.5 0.5 0.5 0.5 0.5 0.5 
##$TPOFFS= (0..7)
0 0 0 0 0 0 0 0 
##$TUNHIN= 0
##$TUNHOUT= 0
##$TUNXOUT= 0
##$USERA1= <user>
##$USERA2= <user>
##$USERA3= <user>
##$USERA4= <user>
##$USERA5= <user>
##$V9= 5
##$VALIST= <valist>
##$VCLIST= <CCCCCCCCCCCCCCC>
##$VD= 0
##$VDLIST= <DDDDDDDDDDDDDDD>
##$VPLIST= <PPPPPPPPPPPPPPP>
##$VTLIST= <TTTTTTTTTTTTTTT>
##$WBST= 1024
##$WBSW= 4
##$XGAIN= (0..3)
0 0 0 0 
##$XL= 0
##$YL= 0
##$YMAX_a= 16430
##$YMIN_a= -16311
##$ZGOPTNS= <>
##$ZL1= 120
##$ZL2= 120
##$ZL3= 120
##$ZL4= 120
##$ABSF1= 248.5645
##$ABSF2= -253.2056
##$ABSG= 5
##$ABSL= 3
##$ALPHA= 0
##$AQORDER= 0
##$ASSFAC= 0
##$ASSFACI= 0
##$ASSFACX= 0
##$ASSWID= 0
##$AUNMP= <proc_1d>
##$AZFE= 0.1
##$AZFW= 0.5
##$BCFW= 0
##$BC_mod= 2
##$BYTORDP= 0
##$COROFFS= 0
##$CY= -3
##$DATMOD= 1
##$DC= 0
##$DFILT= <>
##$DTYPP= 0
##$F1P= 0
##$F2P= 0
##$FCOR= 1
##$FTSIZE= 65536
##$FT_mod= 6
##$GAMMA= 0
##$GB= 0
##$INTBC= 1
##$INTSCL= 5.30512e-09
##$ISEN= 30
##$LB= 1
##$LEV0= 0
##$LPBIN= 0
##$MAXI= 10000
##$MC2= 0
##$MEAN= 0
##$ME_mod= 0
##$MI= 50
##$NCOEF= 0
##$NC_proc= -5
##$NLEV= 6
##$NOISF1= 182.463
##$NOISF2= 159.3651
##$NSP= 0
##$NTH_PI= 0
##$NZP= 0
##$OFFSET= 248.5645
##$PC= 4
##$PHC0= -5820.564
##$PHC1= -25.12528
##$PH_mod= 1
##$PKNL= yes
##$PPARMOD= 0
##$PSCAL= 0
##$PSIGN= 0
##$REVERSE= no
##$SF= 81.014009
##$SI= 65536
##$SIGF1= 159.3651
##$SIGF2= -187.1042
##$SINO= 113.3802
##$SIOLD= 16384
##$SREGLST= <1H.CDCl3>
##$SSB= 0
##$STSI= 65536
##$STSR= 0
##$SW_p= 40650.406504065
##$SYMM= 0
##$S_DEV= 0
##$TDeff= 32768
##$TDoff= 0
##$TI= <>
##$TILT= no
##$TM1= 0
##$TM2= 0
##$TOPLEV= 0
##$USERP1= <user>
##$USERP2= <user>
##$USERP3= <user>
##$USERP4= <user>
##$USERP5= <user>
##$WDW= 1
##$XDIM= 65536
##$YMAX_p= 379638344
##$YMIN_p= -3449660
$$ End of Bruker specific parameters
$$ ---------------------------------
##NTUPLES= NMR SPECTRUM
##VAR_NAME=  FREQUENCY,     SPECTRUM/REAL,   SPECTRUM/IMAG
##SYMBOL=    X,             R,               I
##VAR_TYPE=  INDEPENDENT,   DEPENDENT,       DEPENDENT
##VAR_FORM=  AFFN,          ASDF,            ASDF
##VAR_DIM=   65536,         65536,           65536
##UNITS=     HZ,            ARBITRARY UNITS, ARBITRARY UNITS
##FACTOR=    0.620285442955139, 1,           1
##FIRST=     20137.2065510759, 0,            0
##LAST=      -20513.1999529892, 0,           0
##MIN=       -20513.1999529892, -3449660,    0
##MAX=       20137.2065510759, 379638344,    0
$$ Real data points
##PAGE= N=1
##DATA TABLE= (X++(R..R)), XYDATA
$$ [...]
$$ plain form
39589 660007 89186 -223994 -192468 -8700 90364 -25440 -340863 -638349 -565618 -17282
39579 -17282 547068 488691 -160260 -558958 -72044 847749 1234095 888990 498457 469759
39569 469759 370149 -171381 -662971 -428974 351996 966467 1248553 1582329 1916255 1624252
39559 1624252 581999 -323596 -211124 693773 1406226 1365834 881653 542111 527292 522804
39549 522804 167758 -435258 -720419 -321479 371517 636998 347777 35138 833 -79636
39539 -79636 -454742 -754233 -554288 -75312 138297 -51266 -375689 -624657 -697672 -453516
39529 -453516 38957 314818 42811 -433244 -529240 -204989 159964 442386 729231 778535
39519 778535 266847 -435311 -512277 102539 509704 119624 -523638 -604260 -117859 429208
$$ packed form
39589F60007n70821l13180L1526J83768R9064j15804l15423k97486P2731N48336
39579a7282N64350n8377o48951l98698M86914R19793L86346l45105l90533k8698
39569D69759r9610n41530m91590K33997P80970O14471K82086L33776L33926k92003
39559A624252j042253r05595J12472R04897P12453m0392m84181l39542j4819m488
39549E22804l55046o03016k85161L98940O92996K65481k89221l12639l4305q0469
39539g9636l75106k99491J99945M78976K13609j89563l24423k48968p3015K44156
39529d53516M92473K75861k72007m76055r5996L24251L64953K82422K86845M9304
39519G78535n11688p02158p6966O14816M07165l90080o43262q0622M86401N47067
$$ plain form
39509 429208 881281 1328755 1497172 1007974 158640 -258029 -8461 271165 -17809 -692316
39499 -692316 -1162789 -1144462 -731344 -114653 428018 512419 18149 -610097 -777973 -449813
39489 -449813 -155037 -267256 -556060 -552565 -142965 345202 534765 379276 213009 425952
39479 425952 990937 1373794 1111288 424434 -39833 -63381 -33187 -157035 -31599 644149
39469 644149 1376453 1458750 989787 708801 931255 1254540 1308544 1178660 970228 543055
39459 543055 -80771 -527145 -567512 -432890 -404994 -463508 -549484 -767281 -1048149 -1004919
39449 -1004919 -462168 181438 446653 358025 246708 259157 367013 583218 842438 915459
39439 915459 748390 641402 807231 1024570 1013552 848216 691216 464194 143120 33111
$$ packed form
39509D29208M52073M47474J68417m89198q49334m16669K49568K79626k88974o74507
39499f92316m70473J8327M13118O16691N42671Q4401m94270o28246j67876L28160
39489d49813K94776j12219k88804L495M09600M88167J89563j55489j66267K12943
39479D25952N64985L82857k62506o86854m64267k3548L0194j23848J25436O75748
39469F44149P32304Q2297m68963k80986K22454L23285N4004j29884k08432m27173
39459E43055o23826m46374m0367J34622K7896n8514q5976k17797k80868M3230
39449a004919N42751O43606K65215q8628j11317J2449J07856K16205K59220P3021
39439I15459j67069j06988J65829K17339j1018j65336j57000k27022l21074j10009
$$ plain form
39429 33111 332903 739043 898084 922842 1024917 1008614 652358 240894 138284 154033
39419 154033 -55142 -284524 -167532 56111 -67197 -324925 -224758 -38463 -448884 -1225330
39409 -1225330 -1350949 -614249 16015 -65333 -225781 206421 795792 773720 277429 36707
39399 36707 246688 455448 337705 22554 -210633 -180492 102546 341153 171465 -333457
39389 -333457 -671494 -577551 -312610 -134303 58513 326721 426135 243053 45521 -1078
39379 -1078 -118668 -420809 -618733 -547120 -473845 -535185 -418425 -20551 171865 -121929
39369 -121929 -385264 -121320 284496 225443 -83957 -9882 438238 754770 835791 904608
39359 904608 804943 249088 -394089 -446387 25517 356711 406186 614548 957561 854351
$$ packed form
39429C3111K99792M06140J59041K4758J02075j6303l56256m11464j02610J5749
39419A54033k09175k29382J16992K23643j23308k57728J00167J86295m10421p76446
39409a225330j25619P36700O30264q1348j60448M32202N89371k2072m96291k40722
39399C6707K09981K08760j17743l15151k33187L0141K83038K38607j69688n04922
39389c33457l38037R3943K64941J78307J92816K68208R9414j83082j97532m6599
39379a078j17590l02141j97924P1613P3275o1340J16760L97874J92416k93794
39369a21929k63335K63944M05816n9053l09400P4075M48120L16532Q1021O8817
39359I04608r9665n55855o43177n2298M71904L31194M9475K08362L43013j03210
$$ plain form
39349 854351 272838 -76030 64985 86343 -298858 -431082 124730 668208 416970 -228384
39339 -228384 -367817 -27280 81588 -90833 118421 806990 1172711 721209 14413 -203432
39329 -203432 -32117 -59717 -375196 -497951 -143033 427463 817934 884090 641045 126289
39319 126289 -475427 -808018 -667459 -238506 144843 342135 349168 104902 -324849 -505643
39309 -505643 -24795 841637 1303261 1041216 571031 390691 270861 -164543 -583565 -332828
39299 -332828 503511 1113216 1043620 668342 448072 319236 93522 -38637 169428 486803
39289 486803 420757 -135416 -775541 -1054129 -869392 -420683 12113 223370 140057 -197740
39279 -197740 -667177 -1040808 -1047635 -638028 -142885 54331 -4453 40219 263306 296787
$$ packed form
39349H54351n81513l48868J41015K1358l85201j32224N55812N43478k51238o45354
39339b28384j39433L40537J08868j72421K09254O88569L65721m51502p06796k17845
39329b03432J71315k7600l15479j22755L54918N70496L90471O6156k43045n14756
39319A26289o01716l32591J40559M28953L83349J97292P033k44266m29751j80794
39309e05643M80848Q66432M61624k62045m70185j80340j19830m35404m19022K50737
39299c32828Q36339O09705o9596l75278k20270j28836k25714j32159K08065L17375
39289D86803o6046n56173o40125k78588J84737M48709M32796K11257q3313l37797
39279a97740m69437l73631o827M09607M95143J97216n8784M4672K23087L3481
$$ plain form
39269 296787 -91078 -578134 -687484 -363015 109937 533588 824678 799152 366095 -93861
39259 -93861 -178 636495 1080485 785290 134842 -98309 162691 249182 -209991 -720236
39249 -720236 -652388 -129259 234198 215147 109527 96011 27215 -101094 -14751 326165
39239 326165 563160 535678 584345 939364 1244745 1101138 691499 393748 138753 -274995
39229 -274995 -548261 -269328 241675 247008 -261698 -500028 -107716 316648 187686 -223765
39219 -223765 -346472 -189622 -164910 -357737 -455840 -250582 134209 418900 376980 5951
39209 5951 -396989 -526898 -477013 -537833 -582843 -176473 544976 740259 37981 -711713
39199 -711713 -480993 510435 1103489 739132 -6113 -389835 -335382 -139852 94858 425141
$$ packed form
39269B96787l87865m87056j09350L24469M72952M23651K91090k5526m33057m59956
39259i3861R3683O36673M43990k95195o50448k33151K61000Q6491m59173n10245
39249g20236O7848N23129L63457j9051j05620j3516o8796j28309Q6343L40916
39239C26165K36995k7482M8667L55019L05381j43607m09639k97751k54995m13748
39229b74995k73266K78933N11003N333n08706k38330L92312M24364j28962m11451
39219b23765j22707J56850K4712j92827r8103K05258L84791K84691m1920l71029
39209E951m02940j29909M9885o0820m5010M06370P21449J95283p02278p49694
39199g11713K30720R91428N93054l64357p45245l83722N4453J95530K34710L30283
$$ plain form
39189 425141 763274 903595 763265 472087 254303 210732 182860 -51534 -395315 -491678
39179 -491678 -320005 -387434 -979967 -1537911 -1310284 -476774 -13004 -400531 -1023564 -1016435
39169 -1016435 -265545 641807 1103175 912874 290662 -257935 -305872 87257 458123 479227
39159 479227 218027 -130225 -434768 -495456 -121973 462439 666281 256042 -259416 -279630
39149 -279630 97415 283834 28126 -346027 -474776 -389948 -361132 -517970 -720304 -733272
39139 -733272 -509604 -282004 -286245 -431437 -450361 -361760 -452639 -719346 -744402 -366335 -44797
39128 -44797 -167379 -377811 -138939 321496 311319 -195561 -489814 -282741 -163745 -574337
39118 -574337 -1008616 -789025 -158219 72743 -278232 -595427 -449181 -112219 44221 115891
$$ packed form
39189D25141L38133J40321j40330k91178k17784m3571k7872k34394l43781r6363
39179d91678J71673o7429n92533n57944K27627Q33510M63770l87527o23033P129
39169a016435P50890R07352M61368j90301o22212n48597m7937L93129L70866K1104
39159D79227k61200l48252l04543o0688L73483N84412K03842m10239n15458k0214
39149b79630L77045J86419k55708l74153j28749Q4828K8816j56838k02334j2968
39139g33272K23668K27600m241j45192j8924Q8601r0879k66707k5056L78067L21538
39128d4797j22582k10432K38872M60435j0177n06880k94253K07073J18996m10592
39118e74337m34279K19591O30806K30962l50975l17195J46246L36962J56440P1670
$$ plain form
39108 115891 317640 470037 264450 -135716 -194302 265865 768633 776289 350092 -8089
39098 -8089 -58947 -81681 -381298 -804715 -947096 -701429 -361615 -208862 -217292 -199889 -45753
39087 -45753 263659 701427 1139162 1354959 1214897 806205 351407 48613 -19909 51545
39077 51545 22776 -249136 -600600 -778009 -835179 -1033980 -1329762 -1333524 -932889 -558112
39067 -558112 -564059 -710739 -620981 -429927 -505387 -750851 -736144 -429927 -252591 -379261
39057 -379261 -500000 -369939 -139081 4394 101150 160699 16325 -350546 -649815 -642865
39047 -642865 -418278 -188764 -79262 -182175 -481215 -650235 -348994 163189 196689 -386781
39037 -386781 -888797 -767206 -363446 -215364 -191524 92560 437587 366042 -3524 -136921
$$ packed form
39108A15891K01749J52397k05587m00166n8586M60167N02768P656m26197l58181
39098h089n0858k2734k99617m23417j42381K45667L39814J52753q430J7403J54136
39087d5753L09412M37768M37735K15797j40062m08692m54798l02794o8522P1454
39077E1545k8769k71912l51464j77409n7170j98801k95782l762M00635L74777
39067e58112n947j46680Q9758J91054p5460k45464J4707L06217J77336j26670
39057c79261j20739J30061K30858J43475R6756N9549j44374l66871k99269O950
39047f42865K24587K29514J09502j02913k99040j69020L01241N12183L3500n83470
39037c86781n02016J21591M03760J48082K3840K84084L45027p1545l69566j33397
$$ plain form
39027 -136921 -6921 -86460 -430197 -507556 -96179 320550 295324 7714 -166167 -204111
39017 -204111 -244664 -225494 -39062 227833 472600 744642 1016633 1054887 750831 338463
39007 338463 58848 -148293 -392117 -532797 -421804 -228297 -222658 -391082 -545566 -659481
38997 -659481 -783402 -758074 -372210 227772 617792 610654 408489 218695 32904 -112411
38987 -112411 21139 526209 1047213 1128299 801267 538655 590543 657606 382326 -82653
38977 -82653 -304976 -260123 -387124 -859014 -1173193 -772794 132189 733487 573956 1792
38967 1792 -368893 -347002 -164506 -22151 110427 296610 452452 447696 300744 167846
38957 167846 128938 79326 -82419 -233514 -157648 105443 230051 -5436 -453038 -789553
$$ packed form
39027a36921J30000p9539l43737p7359M11377M16729k5226k87610j73881l7944
39017b04111m0553J9170J86432K66895K44767K72042K71991L8254l04056m12368
39007C38463k79615k07141k43824j40680J10993J93507N639j68424j54484j13915
38997f59481j23921K5328L85864N99982L90020p138k02165j89794j85791j45315
38987a12411J33550N05070N21004Q1086l27032k62612N1888O7063k75280m64979
38977h2653k22323M4853j27001m71890l14179M00399R04983O01298j59531n72164
38967A792l70685K1891J82496J42355J32578J86183J55842m756j46952j32898
38957A67846l8908m9612j61745j51095P5866K63091J24608k35487m47602l36515
$$ plain form
38947 -789553 -819663 -534250 -82757 222545 127711 -195140 -264832 54492 326157 209538
38937 209538 12709 213434 721280 1055599 1030617 793938 385862 -200450 -653497 -624496
38927 -624496 -336383 -340893 -662802 -774710 -485571 -235181 -333711 -492577 -372875 -94837
38917 -94837 98649 255105 473190 593986 418926 -17708 -557395 -1010800 -1076650 -592550
38907 -592550 25918 105206 -339038 -517118 4844 656114 722129 319436 25916 -9103
38897 -9103 -30050 -91431 -79412 -91142 -264226 -378686 -104048 449461 820300 760359 412538
38886 412538 53578 -73339 157482 569650 755841 547592 197277 -56260 -249824 -349563
38876 -349563 -142508 215883 104826 -642770 -1259188 -1067040 -494236 -373024 -661088 -670241
$$ packed form
38947g89553l0110K85413M51493L05302r4834l22851o9692L19324K71665j16619
38937B09538j96829K00725N07846L34319k4982k36679m08076n86312m53047K9001
38927f24496K88113m510l21909j11908K89139K50390r8530j58866J19702K78038
38917i4837J93486J56456K18085J20796j75060m36634n39687m53405o5850M84100
38907e92550O18468P9288m44244j78080N21962O51270O6015m02693k93520l5019
38897i103k0947o1381J2019j1730j73084j14460K74638N53509L70839n9941l47821
38886D12538l58960j26917K30821M12168J86191k08249l50315k53537j93564r9739
38876c49563K07055L58391j11057p47596o16418J92148N72804J21212k88064r153
$$ plain form
38866 -670241 -244805 178248 498723 1012642 1563544 1535218 833671 102009 -231989 -429106
38856 -429106 -752791 -968834 -821394 -482151 -237007 -118400 -40005 50452 247679 575033
38846 575033 803157 769055 758804 1049934 1228387 681080 -280687 -635360 -111333 429622
38836 429622 332014 9747 55161 301931 364313 432658 828052 1238138 1106735 513523
38826 513523 70943 121320 500566 923544 1194801 1176033 857223 334570 -412105 -1401833
38816 -1401833 -2187883 -2039174 -921971 194511 445162 43884 -285794 -356119 -402306
38807 -402306 -362985 -13894 413175 460023 191431 89130 263024 356565 202522 6684
38797 6684 -118653 -259769 -316035 -39443 472869 809748 834764 770647 650309 239732
$$ packed form
38866f70241M25436M23053L20475N13919N50902k8326p01547p31662l33998j97117
38856d29106l23685k16043J47440L39243K45144J18607P8395R0457J97227L27354
38846E75033K28124l4102j0251K91130J78453n47307r61767l54673N24027N40955
38836D29622r7608l22267M5414K46770O2382O8345L95394M10086j31403n93212
38826E13523m42580N0377L79246M22978K71257j8768l18810n22653p46675r89728
38816a401833p86050J48709J117203J116482K50651m01278l29678p0325m6187
38807d02306L9321L49091M27069M6848k68592j02301J73894R3541j54043j95838
38797F684j25337j41116n6266K76592N12312L36879K5016o4117j20338m10577
$$ plain form
38787 239732 -337961 -480660 53152 628336 489134 -230619 -678151 -355762 341015 674570
38777 674570 379807 -181087 -517467 -479182 -219540 116849 451946 580349 262240 -325219
38767 -325219 -526420 85241 1094829 1666852 1497345 1036658 821779 925970 1086653
38758 1086653 1058417 757946 311876 38598 158746 455749 450741 8038 -444615 -429362
38748 -429362 9649 392926 369883 62182 -135341 -10478 248398 289026 -6878 -450141
38738 -450141 -820695 -1030940 -1003235 -654061 -128061 212100 223426 171909 276148 348702
38728 348702 185227 -691 42562 53015 -370993 -999452 -1185862 -818938 -416313 -199088
38718 -199088 222089 970567 1389813 915220 8696 -350112 130906 866896 1266611 1301280
$$ packed form
38787B39732n77693j42699N33812N75184j39202p19753m47532L22389O96777L33555
38777F74570k94763n60894l36380L8285K59642L36389L35097J28403l18109n87459
38767c25219k01201O11661J009588N72023j69507m60687k14879J04191J60683
38758A086653k8236l00471m46070k73278J20148K97003n008m42703m52653J5253
38748d29362M39011L83277k3043l07701j97523J24863K58876M0628k95904m43263
38738d50141l70554k10245K7705L49174N26000L40161J1326n1517J04239P2554
38728C48702j63475j85918M3253J0453m24008o28459j86410L66924M02625K17225
38718a99088M21177P48478M19246m74593r06524l58808M81018P35990L99715L4669
$$ plain form
38708 1301280 1225657 1161572 1065462 849640 452326 -54770 -424333 -453622 -223869 28827
38698 28827 218600 393501 475538 280473 -163162 -549264 -658021 -619001 -678168 -813909
38688 -813909 -753215 -367116 79823 163491 -236641 -795341 -1113503 -1159511 -1217281 -1422756
38678 -1422756 -1545003 -1318806 -834619 -429363 -268935 -210258 -46371 270044 633170 848881
38668 848881 691380 99050 -607804 -901698 -608477 -162802 -91000 -310406 -215275 500304
38658 500304 1392014 1814139 1689489 1439780 1278228 970257 364786 -217096 -374431 -170060
38648 -170060 13558 22322 16514 72105 47133 -98817 -176774 -113500 -154416 -483520 -821818
38637 -821818 -703493 -105769 473360 619925 462104 398326 533914 603759 433827 263420
$$ packed form
38708A301280p5623o4085r6110k15822l97314n07096l69563k9289K29753K52696
38698B8827J89773J74901Q2037j95065m43635l86102j08757L9020n9167j35741
38688h13909O0694L86099M46939Q3668m00132n58700l18162m6008n7770k05475
38678a422756j22247K26197M84187M05256J60428N8677J63887L16415L63126K15711
38668H48881j57501n92330p06854k93894K93221M45675P1802k19406R5131P15579
38658E00304Q91710M22125j24650k49709j61552l07971o05471n81882j57335K04371
38648a70060J83618Q764n808N5591k4972j45950p7957O3274m0916l29104l38298
38637h21818J18325N97724N79129J46565j57821o3778J35588O9845j69932j70407
$$ plain form
38627 263420 462497 1003052 1398071 1240604 684521 245876 173921 210795 28566 -298111
38617 -298111 -448845 -380135 -416627 -766227 -1181299 -1267076 -974619 -580989 -269727 25186
38607 25186 372974 701036 955774 1162807 1211696 832778 6335 -789106 -1008969 -632599
38597 -632599 -81862 347379 664702 838110 649803 45083 -628530 -920575 -707854 -247838
38587 -247838 70490 -4003 -380187 -624779 -353567 298645 779998 759315 449021 214213
38577 214213 128260 75394 34288 23619 -37520 -161801 -138675 197739 665127 947842 1012148
38566 1012148 1045133 1059976 857028 382640 -122391 -383679 -336528 -91499 194952 403406
38556 403406 519236 606684 646172 501535 173551 -59644 27919 245065 210472 -105793
$$ packed form
38627B63420J99077N40555L95019j57467n56083m38645p1955L6874j82229l26677
38617b98111j50734O8710l6492l49600m15072q5777K92457L93630L11262K94913
38607B5186L47788L28062K54738K07033M8889l78918q26443p95441k19863L76370
38597f32599N50737M29241L17323J73408j88307o04720o73613k92045K12721M60016
38587b47838L18328p4493l76184k44592K71212O52212M81353k0683l10294k34808
38577B14213q5953n2866m1106j0669o1139j24281K3126L36414M67388K82715O4306
38566A012148L2985J4843k02948m74388n05031k61288M7151K45029K86451K08454
38556D03406J15830Q7448L9488j44637l27984k33195Q7563K17146l4593l16265
$$ plain form
38546 -105793 -348559 -290338 -90515 32560 119201 298570 496589 530553 418862 385326
38536 385326 516132 572012 285758 -206695 -436008 -182971 202277 254290 -5805 -209618
38526 -209618 -233471 -232442 -156975 206176 620697 455213 -358911 -1013571 -892118 -402466
38516 -402466 -209559 -187038 126816 467902 173576 -624181 -1094717 -995693 -922658 -1133865
38506 -1133865 -1077530 -439806 193123 233524 -32286 -23483 246479 441569 590702 892001
38496 892001 1181738 1180313 998021 877452 706825 310818 -57963 -100264 -99228 -515991
38486 -515991 -1103052 -1115124 -401566 359888 605598 465600 261464 11407 -296821 -422955
38476 -422955 -217156 58888 51452 -245909 -559095 -630107 -329148 251919 688633 541166
$$ packed form
38546a05793k42766N8221J99823J23075Q6641J79369J98019L3964j11691l3536
38536C85326J30806N5880k86254m92453k29313K53037L85248N2013k60095k03813
38526b09618k3853J029P5467L63151M14521j65484q14124o54660J21453M89652
38516d02466J92907K2521L13854L41086k94326p97757m70536R9024P3035k11207
38506a133865N6335O37724O32929M0401k65810Q803K69962J95090J49133L01299
38496H92001K89737j425j82292j20569j70627l96007l68781m2301J036m16763
38486e15991n87061j2072P13558P61454K45710j39998k04136k50057l08228j26134
38476d22955K05799K76044p436k97361l13186p1012L00959N81067M36714j47467
$$ plain form
38466 541166 -24231 -278105 152753 761918 888890 599959 373852 232653 -139800 -530147
38456 -530147 -238259 797515 1594315 1286101 235272 -508438 -527369 -253807 -70998
38447 -70998 146258 530340 825403 738065 322100 -209389 -756655 -1193459 -1238282 -775223
38437 -775223 -156212 89261 -206414 -747802 -1103556 -1005450 -493861 42598 121922 -319118
38427 -319118 -779253 -759717 -359564 -92870 -232951 -593414 -888890 -1040638 -1100937 -1066089
38417 -1066089 -835100 -329027 295567 593588 237851 -456978 -734254 -290212 348263
38408 348263 550542 319431 11982 -263112 -536043 -621057 -380341 -59940 127039 416443
38398 416443 937501 1161491 668928 101392 383224 1207100 1400064 775555 407267 819639
$$ packed form
38466E41166n65397k53874M30858O09165J26972k88931k26107j41199l72453l90347
38456e30147K91888J035774P96800l08214j050829p43710j8931K73562J82809
38447g0998K17256L84082K95063q7338m15965n31489n47266m36804m4823M63059
38437g75223O19011K45473k95675n41388l55754R8106N11589N36459P9324m41040
38427c19118m60135J9536M00153K66694j40081l60463k95476j51748o0299L4848
38417a066089K30989N06073O24594K98021l55737o94829k77276M44042O38475
38408C48263K02279k31111l07449k75094k72931q5014K40716L20401J86979K89404
38398D16443N21058K23990m92563n67536K81832Q23876J92964o24509l68288M12372
$$ plain form
38388 819639 1138588 593096 -221908 -345528 130562 461385 417178 253794 35465 -246233
38378 -246233 -299646 6672 183335 -206408 -758246 -766664 -242304 231457 362627 283651
38368 283651 121427 -5295 126716 446325 467521 74279 -96481 341755 768338 585459
38358 585459 344084 825541 1575756 1575810 967707 763967 1061810 994113 455140 373707 996057
38347 996057 1324434 758723 24746 -128407 -653 -62740 -106567 -10267 -309440 -1145707
38337 -1145707 -1580712 -916601 97419 374701 100130 164951 592842 697236 413586
38328 413586 292240 341711 -19460 -870529 -1597229 -1826402 -1730525 -1415431 -838622 -349864
38318 -349864 -455356 -942757 -1053283 -649965 -389000 -547861 -560726 -65418 416912 354509
$$ packed form
38388H19639L18949n45492q15004j23620M76090L30823m4207j63384k18329k81698
38378b46233n3413L06318J76663l89743n51838q418N24360M73761J31170p8976
38368B83651j62224j26722J32011L19609K1196l93242j70760M38236M26583j82879
38358E85459k41375M81457P50215N4o08103k03740K97843o7697n38973q1433O22350
38347I96057L28377n65711p33977j53153J27754o2087m3827R6300k99173q36267
38337a145707m35005O64111J014020K77282k74571O4821M27891J04394k83650
38328D13586j21346M9471l61171q51069p26700k29173R5877L15094N76809M88758
38318c49864j05492m87401j10526M03318K60965j58861j2865M95308M82330o2403
$$ plain form
38308 354509 66638 120219 405523 443721 220227 81245 66529 -54657 -248041 -276343
38298 -276343 -211521 -359665 -681314 -772189 -493221 -187609 -131093 -145375 19510 211410
38288 211410 86612 -345612 -685154 -644739 -361807 -139338 -65267 -42222 -62557 -197201
38278 -197201 -316166 -127595 350103 642300 441358 140822 297362 685883 500647 -404661
38268 -404661 -1148871 -1053757 -613840 -614304 -779471 -207113 1024348 1702859 1152076 160193
38258 160193 -203943 52394 274559 302091 388946 416943 89497 -277889 -56031 609845
38248 609845 856166 371142 -197415 -328122 -315490 -508252 -628350 -381587 -92526 -102116
38238 -102116 -84602 326180 685902 327062 -493784 -883654 -630265 -407235 -628480 -867607
$$ packed form
38308C54509k87871N3581K85304L8198k23494j38982j4716j21186j93384k8302
38298b76343O4822j48144l21649r0875K78968L05612N6516j4282J64885J91900
38288B11410j24798m32224l39542M0415K82932K22469P4071K3045k0335j34644
38278a97201j18965J88571M77698K92197k00942l00536J56540L88521j85236r05308
38268d04661p44210R5114M39917m64j65167N72358J231461O78511n50783r91883
38258A60193l64136K56337K22165K7532Q6855K7997l27446l67386K21858O65876
38248F09845K46321m85024n68557j30707J2632j92762j20098K46763K89061r590
38238a02116J7514M10782L59722l58840q20846l89870K53389K23030k21245k39127
$$ plain form
38228 -867607 -615721 -1743 495950 609828 370298 8318 -126994 71266 155311 -387132
38218 -387132 -1294629 -1704655 -1282236 -649547 -497955 -777826 -1031037 -1062988 -949951 -740434
38208 -740434 -489142 -334883 -282407 -132124 177310 402414 350755 165213 96985 213077
38198 213077 421916 550649 373439 -125333 -524901 -407516 -18700 11142 -362022 -507583
38188 -507583 -145970 184850 -34344 -594053 -1005824 -1104810 -875737 -266852 425387 562458
38178 562458 10892 -541948 -553839 -341395 -359711 -408943 -169101 75722 -39622 -231547
38168 -231547 -98975 97412 -45210 -249978 -97210 66729 -317440 -947859 -1126293 -956007
38158 -956007 -1010084 -1095954 -560409 304676 452397 -242176 -746611 -530939 -243844 -390907
$$ packed form
38228h67607K51886O13978M97693J13878k39530l61980j35312J98260Q4045n42443
38218c87132r07497m10026M22419O32689J51592k79871k53211l1951J13037K09517
38208g40434K51292J54259N2476J50283L09434K25104n1659j85542o8228J16092
38198B13077K08839J28733j77210m98772l99568J17385L88816K9842l73164j45561
38188e07583L61613L30820k19194n59709m11771r8986K29073O08885O92239J37071
38178E62458n51566n52840j1891K12444j8316m9232K39842K44823j15344j91925
38168b31547J32572J96387j42622k04768J52768J63939l84169o30419j78434J70286
38158i56007n4077q5870N35545Q65085J47721o94573n04435K15672K87095j47063
$$ plain form
38148 -390907 -540657 -354938 -291572 -635596 -816218 -398837 112102 186291 166004 477706
38138 477706 718141 402713 -33401 77927 473231 433098 14795 -145599 36199 105801
38128 105801 15880 127855 357534 210287 -317266 -682022 -692223 -695187 -797777 -682919
38118 -682919 -362561 -338224 -724528 -912707 -496268 59448 128194 -168361 -263462 -22966
38108 -22966 195570 185487 123298 195891 363219 533211 705692 855301 844017 573559
38098 573559 171113 -86992 -89200 -63572 -303638 -718231 -864712 -533870 -56730 183027
38088 183027 274206 446523 440959 -207081 -1247566 -1706630 -1066936 33801 649395 652504
38078 652504 543157 485981 218187 -175561 -138648 476264 991108 782623 182502 10036
$$ packed form
38148c90907j49750J85719O3366l44024j80622M17381N10939P4189k0287L11702
38138D77706K40435l15428m36114J11328L95304m0133m18303j60394J81798O9602
38128A05801q9921J11975K29679j47247n27553l64756j0201k964j02590J14858
38118f82919L20358K4337l86304j88179M16439N55716O8746k96555r5101K40496
38108b2966K18536j0083o2189P2593J67328J69992J72481J49609j1284k70458
38098E73559m02446k58105k208K5628k40066m14593j46481L30842M77140K39757
38088A83027R1179J72317n564o48040j040485m59064O39694J100737O15594L109
38078F52504j09347n7176k67794l93748L6913O14912N14844k08485o00121j72466
$$ plain form
38068 10036 446649 908714 948539 723765 500960 236446 -99200 -218341 92859 555337
38058 555337 732019 605490 499303 569778 685602 689418 489786 31080 -526953 -755593
38048 -755593 -426215 104340 319544 178118 -55909 -358673 -776742 -944584 -500064 103397
38038 103397 19550 -685926 -1014521 -533180 1616 -94767 -441802 -447193 -334498 -547506
38028 -547506 -796774 -581904 -162245 -92205 -184729 98454 519389 371458 -218720 -372555
38018 -372555 107969 439875 201353 -42852 142006 239575 -323032 -1158344 -1472838 -1179678
38008 -1179678 -823748 -684296 -526852 -139203 307492 441443 74141 -524775 -757084
37999 -757084 -363084 106077 -66778 -678541 -806730 -205665 284340 62363 -329971 -241725
$$ packed form
38068A0036M36613M62065L9825k24774k22805k64514l35646j19141L11200M62478
38058E55337J76682j26529j06187P0475J15824L816j99632m58706n58033k28640
38048g55593L29378N30555K15204j41426k34027l02764m18069j67842M44520O03461
38038A03397q3847p05476l28595M81341N34796r6383l47035n391J12695k13008
38028e47506k49268K14870M19659P0040r2524K83183M20935j47931n90178j53835
38018c72555M80524L31906k38522k44205J84858R7569n62607q35312l14494K93160
38008a179678L55930J39452J57444L87649M46695J33951l67302n98916k32309
37999g57084L94000M69161j72855o11763j28189O01065M90005k21977l92334Q8246
$$ plain form
37989 -241725 -89501 -611804 -1473674 -1662467 -1049599 -511399 -484550 -408561 154620 749079
37979 749079 820359 586482 572478 765784 798269 662680 711212 1064396 1426541 1442551
37969 1442551 988284 219567 -442075 -535801 -52024 426217 350896 -125330 -396286 -213574
37959 -213574 102766 245101 311424 477928 604700 440150 71204 -97755 176898 673879
37949 673879 924344 680098 163223 -129373 86273 553791 708587 313635 -209708 -224754
37939 -224754 366343 984523 1052920 644094 287660 252482 295406 160359 29745 235614
37929 235614 672665 831473 457090 -109229 -393145 -365314 -325996 -373881 -316417 -87256
37919 -87256 90662 77896 67498 253364 464129 393985 67866 -202803 -248840 -132258
$$ packed form
37989b41725J52224n22303q61870j88793O12868N38200K6849P5989N63181N94459
37979G49079P1280k33877j4004J93306L2485j35589M8532L53184L62145J6010
37969A442551m54267p68717o61642r3726M83777M78241p5321m76226k70956J82712
37959b13574L16340J42335O6323J66504J26772j64550l68946j68959K74653M96981
37949F73879K50465k44246n16875k92596K15646M67518J54796l94952n23343j5046
37939b24754N91097O18180O8397m08826l56434l5178M2924j35047j30614K05869
37929B35614M37051J58808l74383n66319k83916K7831L9318m7885N7464K29161
37919h7256J77918j2766j0398J85866K10765p0144l26119k70669m6037J16582
$$ plain form
37909 -132258 142850 641992 1158582 1237502 750929 179787 76625 446023 888210 1142829
37899 1142829 1179835 920109 281494 -492536 -913676 -771718 -342578 -5234 111958 26806
37889 26806 -277332 -733268 -1064660 -998926 -557727 -7619 430997 721754 895177 899448
37879 899448 626503 121301 -264463 -112025 517414 948845 615393 -161975 -513465 -173554
37869 -173554 177863 -64457 -554457 -577021 -159785 4093 -350289 -660495 -379493 270199
37859 270199 664296 569901 254785 12429 -79903 4315 327594 811617 1147871 1038593
37849 1038593 526211 5759 -162895 -56208 -96552 -484390 -843777 -628368 163509 917044
37839 917044 1086837 733726 294463 47146 -29443 -42840 -50184 -64766 -54484 9038 38482
$$ packed form
37909a32258K75108M99142N16590P8920m86573n71142j03162L69398M42187K54619
37899A142829L7006k59726o38615p74030m21140J41958M29140L37344J17192q5152
37889B6806l04138m55936l31392O5734M41199N50108M38616K90757J73423M271
37879H99448k72945n05202l85764J52438O29439M31431l33452p77368l51490L39911
37869a73554L51417k42320m90000k2564M17236J63878l54382l10206K81002O49692
37859B70199L94097r4395l15116k42356r2332Q4218L23279M84023L36254j09278
37849A038593n12382n20452j68654J06687m0344l87838l59387K15409P91877P53535
37839I17044J69793l53111m39263k47317p6589j3397p344j4582J0282O3522K9444
$$ plain form
37828 38482 -77535 -189169 55222 666690 1102223 915226 391633 117870 101508 -114126
37818 -114126 -520472 -530306 8852 368859 -46101 -771619 -954908 -588250 -398273 -695688
37808 -695688 -1051366 -1113079 -1039925 -953075 -611207 12128 360406 605 -638399 -765744
37798 -765744 -300524 74342 -95760 -484218 -554568 -280804 -30902 19273 28263 119549
37788 119549 173307 61336 -122635 -209859 -194405 -139921 56200 535892 1091301 1192912
37778 1192912 578343 -381361 -1086217 -1300674 -1148586 -747233 -184098 284374 416856
37769 416856 352278 431837 663733 745175 628694 619350 801221 825136 481468 81720 2889
37758 2889 190887 380328 478492 458267 220623 -107256 -84261 434897 912998 811671
$$ packed form
37828C8482j16017j11634K44391O11468M35533j86997n23593k73763j6362k15634
37818a14126m06346r834N39158L60007m14960p25518j83289L66658J89977k97415
37808f95688l55678o1713P3154Q6850L41868O23335L48278l59801o39004j27345
37798g65744M65220L74866j70102l88458p0350K73764K49902N0175Q990R1286
37788A19549N3758j11971j83971q7224J5454N4484J96121M79692N55409J01611
37778A192912o14569r59704p04856k14457J52088M01353N63135M68472J32482
37769D16856o4578P9559K31896Q1442j16481r344J81871K3915l43668l99748p8831
37758B889J87998J89441R8164k0225k37644l27879K2995N19158M78101j01327
$$ plain form
37748 811671 399344 362432 792147 1115354 963143 567040 263960 88435 -50246 -170255
37738 -170255 -285460 -374507 -277624 70186 362092 251393 -93869 -200181 -22111 28630
37728 28630 -178377 -267718 -20807 250740 232525 69901 36770 119059 192837 274124 337026
37717 337026 227097 23134 125744 655949 1094430 909102 284372 -180039 -290415 -344371
37707 -344371 -523485 -652630 -567590 -353155 -152089 -6277 64425 53185 70301 235498
37697 235498 417099 304524 -141336 -490227 -291445 338331 787684 683504 372020 459570
37687 459570 964238 1255834 919562 321732 71992 231058 403467 365174 171955 -149232
37677 -149232 -515826 -558455 -53221 517920 494157 76866 76647 560917 661282 23646
$$ packed form
37748H11671m12327l6912M29715L23207j52211l96103l03080j75525j38681j20009
37738a70255j15205q9047R6883L47810K91906j10699l45262j06312J78070N0741
37728B8630k07007q9341K46911K71547j8215j62624l3131Q2289P3778Q1287O2902
37717C37026j09929k03963J02610N30205M38481j85328o24730m64411j10376n3956
37707c44371j79114j29145Q5040K14435K01066J45812P0702j1240J7116J65197
37697B35498J81601j12575m45860l48891J98782O29776M49353j04180l11484Q7550
37687D59570N04668K91596l36272n97830k49740J59066J72409l8293j93219l21187
37677a49232l66594m2629N05234N71141k3763m17291k19M84270J00365o37636
$$ plain form
37667 23646 -493840 -153515 450556 314037 -434398 -794460 -347469 384905 826261 834113
37657 834113 444935 -164075 -544482 -438508 -266466 -545875 -998212 -954680 -518215 -463350
37647 -463350 -931909 -1112489 -484492 385867 686636 396089 55008 -31789 47685 113331
37637 113331 -5226 -414739 -944127 -1204024 -1020127 -564609 -1993 620775 1062735 971816
37627 971816 486013 253417 548276 827676 547056 2734 -103586 361006 900701 1102462
37617 1102462 950761 560813 35786 -440738 -718508 -887427 -1116970 -1332266 -1292678 -947300
37607 -947300 -480507 -35830 393723 805647 1079684 1049952 658333 131910 -20002 521282
37597 521282 1317792 1469424 746813 39027 209128 823214 704458 -327470 -1079256
$$ packed form
37667B3646n17486L40325O04071j36519p48435l60062M46991P32374M41356P852
37657H34113l89178o09010l80407J05974J72042k79409m52337M3532M36465N4865
37647d63350m68559j80580O27997Q70359L00769k90547l41081q6797P9474O5646
37637A13331j18557m09513n29388k59897J83897M55518N62616O22768M41960r0919
37627I71816m85803k32596K94859K79400k80620n44322j06320M64592N39695K01761
37617A102462j51701l89948n25027m76524k77770j68919k29543k15296L9588L45378
37607i47300M66793M44677M29553M11924K74037k9732l91619n26423j51912N41284
37597E21282P96510J51632p22611p07786J70101O14086j18756j031928p51786
$$ plain form
37588 -1079256 -639452 284875 316337 -684277 -1437945 -984336 135970 773280 664918
37579 664918 429767 385347 179655 -316296 -532091 -47315 654844 876002 744250 864006
37569 864006 1173438 991547 217299 -365250 -239685 125664 126622 -42904 142361 603437
37559 603437 803084 554598 132632 -236039 -496654 -544636 -362258 -240578 -391429 -479914
37549 -479914 -75076 533472 586167 -42371 -612977 -576981 -284785 -321957 -626508 -726974
37539 -726974 -548279 -456223 -592794 -650976 -407604 -104636 -52597 -67507 338988 1174367
37529 1174367 1710491 1299251 275384 -362030 -188781 178722 59245 -326216 -323364 55304
37519 55304 164418 -188617 -371921 126083 907687 1204758 880435 481002 447663 662897
$$ packed form
37588a079256M39804R24327L1462j000614p53668M53609J120306O37310j08362
37579F64918k35151m4420k05692m95951k15795M84776P02159K21158j31752J19756
37569H64006L09432j81891p74248n82549J25565L65349R58j69526J85265M61076
37559F03437J99647k48486m21966l68671k60615m7982J82378J21680j50851q8485
37549d79914M04838O08548N2695o28538n70606L5996K92196l7172l04551j00466
37539g26974J78695R2056j36571n8182K43372L02968N2039j4910M06495Q35379
37529A174367N36124m11240j023867o37414J73249L67503j19477l85461K852L78668
37519E5304J09114l53035j83304M98004P81604K97071l24323l99433l3339K15234
$$ plain form
37509 662897 770909 652387 488741 501975 713826 925001 918892 689224 424110 264141
37499 264141 162540 11735 -188491 -340633 -350003 -177004 130404 424800 568818 583261
37489 583261 584618 558614 347277 -68965 -431944 -484437 -290466 -122095 -60803 137588
37479 137588 721295 1538410 2032594 1728270 764393 -141199 -379498 -47794 285575 327701
37469 327701 289897 356743 313533 -43287 -402141 -243195 411106 918662 779270 218635
37459 218635 -122654 85382 598343 967608 1016115 919154 885781 861476 648143 303261
37449 303261 211596 586759 1043321 954978 243312 -466558 -569270 -122173 368438 577444
37439 577444 556788 451948 303908 139240 61246 172505 449665 689361 591678 35300
$$ packed form
37509F62897J08012j18522j63646J3234K11851K11175o109k29668k65114j59969
37499B64141j01601j50805k00226j52142r370J72999L07408K94396J44018J4443
37489E83261J357k6004k11337m16242l62979n2493J93971J68371O1292J98391
37479A37588N83707Q17115M94184l04324r63877r05592k38299L31704L33369M2126
37469C27701l7804O6846m3210l56820l58854J58946O54301N07556j39392n60635
37459B18635l41289K08036N12961L69265M8507r6961l3373k4305k13333l44882
37449C03261r1665L75163M56562q8343p11666p09870j02712M47097M90611K09006
37439E77444k0656j04840j48040j64668p7994J11259K77160K39696r7683n56378
$$ plain form
37429 35300 -667834 -969502 -676169 -184345 29008 -46712 -136093 -168869 -237231 -235715 8931
37418 8931 318413 345717 168434 190144 405235 354527 -13921 -81771 483647 1098609 1092242
37407 1092242 670192 438251 365522 -37843 -720370 -1033677 -675235 -46601 381019 499790
37397 499790 326325 -97787 -473628 -457669 -231478 -341015 -836423 -1109018 -770644 -172931
37387 -172931 178279 226802 128036 -101996 -386940 -472761 -330100 -291623 -514977 -721765
37377 -721765 -738514 -819453 -1100877 -1248884 -1078584 -1016271 -1406249 -1808094 -1617936 -1040022
37367 -1040022 -754224 -853956 -818069 -418788 24513 280150 461908 579983 383496 -194590
37357 -194590 -825253 -1136504 -1024512 -632596 -270277 -231784 -411633 -311239 221245 568280
$$ packed form
37429C5300p03134l01668K93333M91824K13353p5720q9381l2776o8362J516K44646
37418H931L09482K7304j77283K1710K15091n0708l68448o7850N65418O14962o367
37407A092242m22050k31941p2729m03365o82527l13307L58442O28634M27620J18771
37397D99790j73465m24112l75841J5959K26191j09537m95408k72595L38374N97713
37387a72931L51210M8523r8766k30032k84944q5821J42661L8477k23354k06788
37377g21765j6749q0939k81424j48007J70300O2313l89978m01845J90158N77914
37367a040022K85798r9732L5887L99281M43301K55637J81758J18075j96487n78086
37357a94590o30663l11251J11992L91916L62319L8493j79849J00394N32484L47035
$$ plain form
37347 568280 183674 -441257 -362984 419394 957473 753666 346948 318854 491441 455381
37337 455381 245698 76068 -82462 -235167 -98552 476477 1127523 1387488 1226963 937552
37327 937552 752012 797001 1094956 1372703 1209428 637419 249191 420694 785945 816797
37317 816797 556648 344426 124275 -409328 -1103214 -1346845 -884584 -231810 -80178 -487391
37307 -487391 -851593 -647595 -39327 343354 187677 -163027 -260663 -174286 -264165 -535842
37297 -535842 -631334 -372051 103908 661414 1159831 1212817 542105 -411250 -839714 -611527
37287 -611527 -337134 -319906 -193621 194472 369078 82857 -190402 -101579 -16761 -202587
37277 -202587 -187113 352262 777346 440366 -131486 29763 827893 1304430 1046736 446585
$$ packed form
37347E68280l84606o24931P8273P82378N38079k03807m06718k8094J72587l6060
37337D55381k09683j69630j58530j52705J36615N75029O51046K59965j60525k89411
37327I37552j85540M4989K97955K77747j63275n72009l88228J71503L65251L0852
37317H16797k60149k12222k20151n33603o93886k43631M62261O52774J51632m07213
37307d87391l64202K03998O08268L82681j55677l50704r7636Q6377q9879k71677
37297e35842r5492K59283M75959N57506M98417N2986o70712r53355m28464K28187
37287f11527K74393J7228J26285L88093J74606k86221k73259Q8823Q4818j85826
37277b02587J5474N39375M25084l36980n71852J61249P98130M76537k57694o00151
$$ plain form
37267 446585 -192463 -816379 -1062322 -568274 194979 370941 -1701 -110821 221003 294227
37257 294227 -171251 -559132 -447698 -176136 10472 386050 899330 904071 274018 -161021
37247 -161021 76716 294091 -137364 -635222 -439210 -769 -205235 -772328 -680276 103434
37237 103434 561793 258943 -142315 -156652 -182247 -548194 -772869 -341526 400811 703960
37227 703960 376260 -151246 -431841 -321099 51290 325103 166732 -259336 -348513 133731
37217 133731 598544 380891 -279701 -490926 99835 830589 872897 200102 -515370 -730493
37207 -730493 -467234 -29124 386075 705754 852800 794622 642581 545650 520200 511792
37197 511792 569609 777448 1018312 1017751 701325 353325 316305 621535 971634 1006074 591411
$$ packed form
37267D46585o39048o23916k45943M94048P63253J75962l72642j09120L31824P3224
37257B94227m65478l87881J11434K71562J86608L75578N13280M741o30053m35039
37247a61021K37737K17375m31455m97858J96012M38441k04466n67093R2052P83710
37237A03434M58359l02850m01258j4337k5595l65947k24675M31343P42337L03149
37227G03960l27700n27506k80595J10742L72389K73813j58371m26068q9177M82244
37217A33731M64813k17653o60592k11225N90761P30754M2308o72795p15472k15123
37207g30493K63259M38110M15199L19679J47046n8178j52041r6931k5450q408
37197E11792N7817K07839K40864n61l16426l48000l7020L05230L50099L4440m14663
$$ plain form
37186 591411 -4100 -240465 162983 795898 933938 442260 -10378 178376 783083 1150718
37176 1150718 1080759 903194 850254 814472 716063 685577 783043 861880 833005 798323 799302
37165 799302 679145 359714 71135 118295 500071 878370 877212 383651 -334195 -767275
37155 -767275 -568851 88658 659909 800252 682418 666915 807016 850234 651525 367634
37145 367634 200920 131916 40783 -12495 166908 572576 910701 958017 828684 717339
37135 717339 570979 315461 254676 764970 1546571 1709955 887170 -165066 -453267 92475
37125 92475 778239 1164854 1356587 1435014 1261524 904886 692816 676277 531709 182025
37115 182025 28803 302390 638389 653357 541177 664288 880244 796213 490757 416407
$$ packed form
37186E91411n95511k36365M03448O32915J38040m91678m52638J88754O04707L67635
37176A150718o9959j77565n2940l5782r8409l0486R7466P8837k8875l4682R79
37165G99302j20157l19431k88579M7160L81776L78299j158m93561p17846m33080
37155g67275J98424O57509N71251J40343j17834j5503J40101M3218j98709k83891
37145C67634j66714o9004r1133n3278J79403M05668L38125M7316j29333j11345
37135G17339j46360k55518o0785N10294P81601J63384q22785j052236k88201N45742
37125I2475O85764L86615J91733P8427j73490l56638k12070j6539j44568l49684
37115A82025j53222K73587L35999J4968j12180J23111K15956q4031l05456p4350
$$ plain form
37105 416407 639077 732280 511600 356703 581810 916040 941303 736048 672392 740645
37095 740645 544224 5534 -341571 5830 824959 1380753 1224604 546577 -186660 -653419
37085 -653419 -717474 -364356 211645 628531 627367 311967 -6221 -99716 91036 466633
37075 466633 737096 608684 199684 35730 359638 685588 425608 -222384 -491994 -75565
37065 -75565 582068 1025630 1269068 1408805 1324477 1040391 904016 1058564 1137488 849107
37055 849107 495542 495339 717808 762713 631945 594358 569956 237055 -285170 -426478 48124
37044 48124 674287 865705 547509 99248 -75730 161285 602188 843811 707856 484721
37034 484721 541056 777197 802370 578107 446437 470813 233200 -488443 -1227738 -1345011
$$ packed form
37105D16407K22670R3203k20680j54897K25107L34230K5263k05255o3656O8253
37095G40645j96421n38690l47105L47401Q19129N55794j56149o78027p33237m66759
37085f53419o4055L53118N76001M16886j164l15400l18188r3495J90752L75597
37075D66633K70463j28412m09000j63954L23908L25950k59980o47992k69610M16429
37065g5565O57633M43562K43438J39737q4328k84086j36375J54548P8924k88381
37055H49107l53565k03K22469M4905j30768l7587k4402l32901n22225j41308M74602
37044D8124O26163J91418l18196m48261j74978K37015M40903K41623j35955k23135
37034D84721N6335K36141K5173k24263j31670K4376k37613p21643p39295j17273
$$ plain form
37024 -1345011 -824918 -267626 -186414 -530440 -850758 -780689 -352373 104016 363810 536881
37014 536881 823641 1193445 1495359 1728697 1914934 1858246 1442140 1055765 1194284 1630529
37004 1630529 1596072 941083 468960 782178 1395371 1493854 1080017 746922 662570 478334
36994 478334 94087 -152108 -54860 250583 664559 1180926 1532590 1336125 739371 424441
36984 424441 748805 1314274 1622279 1727983 1922971 2142665 2108445 1825855 1528602 1270290
36974 1270290 966910 755627 893232 1281254 1478998 1293820 1035347 1045005 1277184 1538276
36964 1538276 1836705 2187975 2312102 1956464 1435315 1377670 1860019 2229948 1994653 1489469
36954 1489469 1341198 1584508 1744792 1622461 1520260 1699644 2011319 2148145 1992412
$$ packed form
37024a345011N20093N57292Q1212l44026l20318P0069M28316M56389K59794J73071
37014E36881K86760L69804L01914K33338J86237n6688m16106l86375J38519M36245
37004A630529l4457o54989m72123L13218O13193R8483m13837l33095q4352j84236
36994D78334l84247k46195R7248L05443M13976N16367L51664j96465n96754l14930
36984D24441L24364N65469L08005J05704J94988K19694l4220k82590k97253k58312
36974A270290l03380k11283J37605L88022J97744j85178k58473R658K32179K61092
36964A538276K98429L51270J24127l55638n21149n7645M82349L69929k35295n05184
36954A489469j48271K43310J60284j22331j02201J79384L11675J36826j55733
$$ plain form
36945 1992412 1665029 1439202 1568480 1975442 2218356 2046537 1812972 1946736 2237011
36936 2237011 2209876 2032636 2264412 2727766 2554351 1580133 750984 703914 868215 603333
36926 603333 327657 636808 1063892 806039 153899 29097 435921 589677 423011 695234
36916 695234 1540940 2152144 2169222 2227656 2705126 3002695 2635607 2085944 1910322 1831859
36906 1831859 1447845 1111921 1299529 1669362 1589968 1169862 963235 1011063 993887 1067005
36896 1067005 1670549 2584511 2982087 2529791 1815042 1544049 1794704 2178773 2343587
36887 2343587 2192077 1884039 1683451 1652091 1610041 1567540 1894376 2698855 3340300 3097122
36877 3097122 2165795 1441313 1368892 1566336 1593628 1528950 1629660 1879383 2084325 2114943
$$ packed form
36945A992412l27383k25827J29278M06962K42914j71819k33565J33764K90275
36936B237011k7135j77240K31776M63354j73415r74218q29149m7070J64301k64882
36926F03333k75676L09151M27084k57853o52140j24802M06824J53756j66666K72223
36916F95234Q45706O11204J7078N8434M77470K97569l67088n49663j75622p8463
36906A831859l84014l35924J87608L69833p9394m20106k06627M7828j7176P3118
36896A067005O03544R13962L97576m52296p14749k70993K50655L84069J64814
36887B343587j51510l08038k00588l1360m2050m2501L26836Q04479O41445k43178
36877C097122r31327p24482p2421J97444K7292o4678J00710K49723K04942L0618
$$ plain form
36867 2114943 1907849 1481384 1043702 859654 956911 1156401 1363014 1593747 1788961 1883827
36857 1883827 1999284 2248216 2432886 2301348 2038715 2076992 2417196 2580083 2298837 1854706
36847 1854706 1627444 1685848 1926431 2256651 2520479 2568674 2505843 2559228 2648077 2445219
36837 2445219 1934094 1504342 1390914 1437279 1546713 1901420 2500597 2915042 2815440 2413594
36827 2413594 2101647 1979064 2006596 2257123 2651439 2775654 2397491 1923209 1886302 2157679
36817 2157679 2156556 1776091 1589823 2041145 2835843 3340162 3325005 3103950 3072315 3302685
36807 3302685 3563711 3601432 3365030 3021927 2814287 2883939 3163002 3424937 3526287 3596243
36797 3596243 3838272 4140512 4157561 3879991 3746036 3922998 3908012 3331080 2767287 3027305
$$ packed form
36867B114943k07094m26465m37682j84048R7257J99490K06613K30733J95214R4866
36857A883827J15457K48932J84670j31538k62633L8277L40204J62887k81246m44131
36847A854706k27262N8404K40583L30220K63828M8195o2831N3385Q8849k02858
36837B445219n11125m29752j13428M6365J09434L54707N99177M14445r9602m01846
36827B413594l11947j22583K7532K50527L94316J24215l78163m74282l6907K71377
36817B157679j123l80465j86268M51322P94698N04319j5157k21055l1635K30370
36807C302685K61026L7721k36402l43103k07640O9652K79063K61935J01350O9956
36797C596243K42029L02240J7049k77570j33955J76962j4986n76932n63793K60018
$$ plain form
36787 3027305 3862084 4244159 3911490 3670167 3979713 4266539 4098524 4042703 4617136 5238869
36777 5238869 5159118 4792620 5032421 5688165 5805289 5347712 5311395 6052209 6685829 6532800
36767 6532800 6137185 6271398 6741280 6874975 6629938 6510503 6741540 7141218 7564881
36758 7564881 7928638 7985500 7592099 7074107 6874850 6949951 6941263 6841047 6995309 7452784
36748 7452784 7780156 7630066 7128505 6590600 6180064 5969541 6017455 6213513 6321281 6357451
36738 6357451 6659753 7344501 7961753 8038364 7794006 7884386 8447652 8858170 8597701 8000018
36728 8000018 7821705 8296613 8964179 9328960 9328317 9148316 8945431 8889177 9187419 9833993
36718 9833993 10485535 10803663 10839766 10914060 11189650 11541706 11802014 11946027 12021261 12048800
$$ packed form
36787C027305Q34779L82075l32669k41323L09546K86826j68015n5821N74433O21733
36777E238869p9751l66498K39801O55744J17124m57577l6317P40814O33620j53029
36767F532800l95615J34213M69882J33695k45037j19435K31037L99678M23663
36758G564881L63757N6862l93401n17992j99257P5101q688j00216J54262M57475
36748G452784L27372j50090n01561n37905m10536k10523M7914J96058J07768L6170
36738F357451L02302O84748O17252P6611k44358R0380N63266M10518k60469n97683
36728H000018j78313M74908O67566L64781o43j80001k02885n6254K98242O46574
36718I833993O51542L18128L6103P4294K75590L52056K60308J44013P5234K7539
$$ plain form
36708 12048800 12073069 12226642 12644909 13289500 13898984 14209243 14273820 14459869 14993313 15610290
36698 15610290 15892199 15892814 16105944 16757218 17493359 17942390 18218617 18597566 19036265 19417029
36688 19417029 19992073 21065227 22358840 23251613 23661487 24161827 25103702 26137504 26850515
36679 26850515 27436436 28377981 29771242 31334270 32873093 34367315 35730267 36868583
36671 36868583 37960356 39360539 41201617 43329134 45641116 48236302 51174486 54330188
36663 54330188 57583341 60960441 64485051 68093296 71860229 76130769 81180756 86829780
36655 86829780 92658855 98636406 105292268 113174973 122319127 132371364 143077771 154474337
36647 154474337 166721209 179973478 194380559 210015527 226791701 244567077 263246383
$$ packed form
36708A2048800K4269J53573M18267O44591O09484L10259O4577J86049N33444O16977
36698A5610290K81909O15K13130O51274P36141M49031K76227L78949M38699L80764
36688A9417029N75044J073154J293613Q92773M09874N00340R41875J033802P13011
36679B6850515N85921R41545J393261J563028J538823J494222J362952J138316
36671C6868583J091773J400183J841078K127517K311982K595186K938184L155702
36663E4330188L253153L377100L524610L608245L766933M270540N049987N649024
36655H6829780N829075N977551O655862P882705R144154J0052237J0706407J1396566
36647A54474337J2246872J3252269J4407081J5634968J6776174J7775376J8679306
$$ plain form
36640 263246383 282562625 301814409 320110642 336896167 351923855 364635859 373959550
36633 373959550 378988226 379638344 376394833 369643169 359585373 346673670 331735068 315598744
36625 315598744 298798935 281664107 264537845 247871167 232125737 217493258 203690780
36618 203690780 190272210 177284197 165362255 154971728 145827047 137342417 129361735
36611 129361735 122047313 115315795 108915497 102922829 97608789 92873502 88372916 84175653
36603 84175653 80660042 77699164 74650624 71368413 68510306 66451871 64561452 62128086
36595 62128086 59478994 57457604 56110747 54660120 52689701 50656785 49128733 48085383
36587 48085383 47175621 46234736 45301319 44394990 43493347 42586650 41652098 40689186 39780175
$$ packed form
36640B63246383J9316242J9251784J8296233J6785525J5027688J2712004R323691
36633C73959550N028676O50118l243511o751664j0057796j2911703j4938602j6136324
36625C15598744j6799809j7134828j7126262j6666678j5745430j4632479j3802478
36618B03690780j3418570j2988013j1921942j0390527r144681q484630p980682
36611A29361735p314422o731518o400298n992668n314040m735287m500586m197263
36603H4175653l515611k960878l048540l282211k858107k058435j890419k433366
36595F2128086k649092k021390j346857j450627j970419k032916j528052j043350
36587D8085383r09762r40885r33417r06329r01643r06697r34552r62912r09011
$$ plain form
36578 39780175 38946427 37987286 36715166 35343856 34336120 33792323 33286881 32435246 31338454
36569 31338454 30298372 29388552 28575037 28006065 27785699 27568296 26814364 25509071 24244004
36560 24244004 23430020 22780649 21845384 20754165 20016149 19727699 19455349 18911455 18270363
36551 18270363 17686332 16973211 16031340 15167328 14608557 14056046 13185158 12291479 11868263
36542 11868263 11742782 11289693 10432055 9727388 9403233 9051248 8495193 8214273 8491680
36533 8491680 8796276 8557749 8024362 7728527 7552145 7071885 6537244 6642027 7335507
36524 7335507 7664156 7035375 6039679 5667981 6097104 6617704 6582400 6115068 5877457 6283971
36514 6283971 7043310 7522327 7480200 7229237 7075487 6950611 6739430 6575845 6531023 6383744
$$ packed form
36578C9780175q33748r59141j272120j371310j007736n43797n05442q51635j096792
36569C1338454j040082r09820q13515n68972k20366k17403p53932j305293j265067
36560B4244004q13984o49371r35265j091219p38016k88450k72350n43894o41092
36551A8270363n84031p13121r41871q64012n58771n52511q70888q93679m23216
36542A1868263j25481m53089q57638p04667l24155l51985n56055k80920K77407
36533H491680L04596k38527n33387k95835j76382m80260n34641J04783O93480
36524G335507L28649o28781r95696l71698M29123N20600l5304m67332k37611M06514
36514F283971P59339M79017m2127k50963j53750j24876k11181j63585m4822j47279
$$ plain form
36504 6383744 6062945 5933828 6179593 6284032 5736734 4942313 4718633 5104683 5432557
36495 5432557 5430950 5397408 5328423 4842749 4096495 3799682 4048204 4103789 3724439 3701408
36485 3701408 4462163 5106943 4700553 3747584 3376550 3621892 3596631 3022170 2490030 2329865
36475 2329865 2234019 2033944 1952647 1993715 1880484 1696707 1816350 2106639 2012013 1571331
36465 1571331 1482281 1896450 2052712 1539329 1051025 1270227 1751808 1697574 1244964 1090502
36455 1090502 1229529 1049216 534247 408781 940336 1427485 1206236 550684 175812
36446 175812 288284 553993 713144 792921 835098 788324 685244 676529 822315 976743
36436 976743 923932 575762 49801 -390345 -500940 -246537 163150 464821 573108 592602
$$ packed form
36504F383744l20799j29117K45765J04439n47298p94421k23680L86050L27874
36495E432557j607l3542o8985m85674p46254k96813K48522N5585l79350k3031
36485C701408P60755O44780m06390r52969l71034K45342k5261n74461n32140j60165
36475B329865r5846k00075q1297M1068j13231j83777J19643K90289r4626m40682
36465A571331q9050M14169J56262n13383m88304K19202M81581n4234m52610j54462
36455A090502J39027j80313n14969j25466N31555M87149k21249o55552l74872
36446A75812J12472K65709J59151P9777M2177m6774j03080q715J45786J54428
36436I76743n2811l48170n25961m40146j10595K54403M09687L01671J08287J9494
$$ plain form
36426 592602 617066 593561 445491 291705 417992 945791 1594638 1909613 1738088 1362211
36416 1362211 1122236 1042439 922231 678858 443037 356635 420542 541018 606456 520839
36406 520839 300175 166240 396013 990442 1605993 1914257 1910920 1731425 1320577 594929
36396 594929 -99721 -126740 605936 1286615 1093368 275323 -152531 233465 778881 786952
36386 786952 459897 388856 556602 456313 -7938 -377789 -389539 -295113 -321881 -311024
36376 -311024 -92618 193731 393477 609308 915357 1077183 841051 325349 -98859 -182782
36366 -182782 67715 431692 536388 154138 -412540 -547452 -112036 328892 335527 250920
36356 250920 605013 1191633 1322332 866439 436059 479233 712306 645913 282894 26658
$$ packed form
36426E92602K4464k3505j48070j53786J26287N27799O48847L14975j71525l75877
36416A362211k39975p9797j20208k43373k35821q6402O3907J20476O5438q5617
36406E20839k20664j33935K29773N94429O15551L08264l337j79495m10848p25648
36396E94929o94650k7019P32676O80679j93247q18045m27854L85996N45416Q071
36386G86952l27055p1041J67746j00289m64251l69851j1750R4426k6768J0857
36376c11024K18406K86349J99746K15831L06049J61826k36132n15702m24208q3923
36366a82782K50497L63977J04696l82250n66678j34912M35416M40928O635q4607
36356B50920L54093N86620J30699m55893m30380M3174K33073o6393l63019k56236
$$ plain form
36346 26658 117949 404057 575177 460826 105811 -343056 -741280 -904678 -594032 215375
36336 215375 1062769 1340594 1024194 710867 746069 732124 233198 -463254 -780486 -694889
36326 -694889 -558833 -367808 102266 599699 610149 245404 156536 479742 629205 308299
36316 308299 -46427 -110149 -189173 -482339 -548040 -68831 462136 471525 240803 400242
36306 400242 831728 828294 198045 -472491 -641889 -348900 90358 441733 551377 362779
36296 362779 6042 -362962 -754733 -1151047 -1284899 -939868 -326577 176827 501870 739787
36286 739787 713174 199285 -506063 -782966 -487026 -86098 75786 186695 474505 715212
36276 715212 520220 -81678 -574688 -437286 332984 1126178 1248084 649062 -41812 -342834
$$ packed form
36346B6658R1291K86108J71120j14351l55015m48867l98224j63398L10646Q09407
36336B15375Q47394K77825l16400l13327L5202j3945m98926o96452l17232Q5597
36326f94889J36056J91025M70074M97433J0450l64745q8868L23206J49463l20906
36316C08299l54726o3722p9024k93166o5701M79209N30967R389k30722J59439
36306D00242M31486l434o30249o70536j69398K92989M39258L51375J09644j88598
36296C62779l56737l69004l91771l96314j33852L45031O13291N03404L25043K37917
36286G39787k6613n13889p05348k76903K95940M00928J61884J10909K87810K40707
36276G15212j94992o01898m93010J37402P70270P93194J21906n99022o90874l01022
$$ plain form
36266 -342834 -461458 -708568 -763834 -127646 885074 1316428 794066 -21454 -360525 -171031
36256 -171031 157841 373336 401815 247187 104716 209473 379294 125186 -573725 -1073636
36246 -1073636 -929183 -476867 -185388 97072 714684 1377913 1405959 682780 -162095 -505338
36236 -505338 -241427 397504 1064476 1305371 804407 -187842 -958210 -1032267 -587672 -87721
36226 -87721 252520 474368 559819 386573 -7592 -327124 -315357 -85463 -6391 -213225
36216 -213225 -371773 -86004 534341 936991 792103 386201 241979 498961 819193 826778
36206 826778 499803 129225 -34024 -49006 -169044 -464172 -688512 -622809 -406358 -334801
36196 -334801 -432511 -470193 -348262 -202990 -162087 -248055 -476376 -765717 -818864 -453483
$$ packed form
36266c42834j18624k47110n5266O36188J012720M31354n22362q15520l39071J89494
36256a71031L28872K15495K8479j54628j42471J04757J69821k54108o98911m99911
36246a073636J44453M52316K91479K82460O17612O63229K8046p23179q44875l43243
36236e05338K63911O38931O66972K40895n00964r92249p70368p4057M44595M99951
36226h7721L40241K21848Q5451j73246l94165l19532J1767K29894P9072k06834
36216b13225j58548K85769O20345M02650j44888m05902j44222K56982L20232P585
36206H26778l26975l70578j63249j4982j20038k95128k24340O5703K16451P1557
36196c34801r7710l7682J21931J45272M0903q5968k28321k89341n3147L65381
$$ plain form
36186 -453483 -13789 -28201 -435524 -611961 -245165 308345 668877 907511 1152265 1245390
36176 1245390 1102070 931829 776731 333633 -374007 -690261 -223574 439071 550125
36167 550125 310892 421840 857551 964793 641574 495168 743898 840191 466940 138435
36157 138435 362266 801350 820655 475811 371269 698028 946813 640830 -5383 -340022
36147 -340022 -44256 529859 815125 684869 481261 438309 377447 102206 -216006 -316191
36137 -316191 -263457 -249564 -180851 131346 495705 490506 62182 -396240 -549193 -379033
36127 -379033 -12100 359357 457750 207381 -31976 86153 323741 202062 -196119 -329327
36117 -329327 -48663 266209 416207 556062 606761 248788 -321839 -413112 76929 348585
$$ packed form
36186d53483M39694j4412m07323j76437L66796N53510L60532K38634K44754R3125
36176A245390j43320j70241j55098m43098p07640l16254M66687O62645J11054
36167E50125k39233J10948M35711J07242l23219j46406K48730R6293l73251l28505
36157A38435K23831M39084J9305l44844j04542L26759K48785l05983o46213l34639
36147c40022K95766N74115K85266j30256k03608m2952o0862k75241l18212j00185
36137c16191N2734J3893O8713L12197L64359n199m28324m58422j52953J70160
36127c79033L66933L71457R8393k50369k39357J18129K37588j21679l98181j33208
36117c29327K80664L14872J49998J39855N0699l57973n70627r1273M90041K71656
$$ plain form
36107 348585 -115166 -772349 -912320 -613309 -243291 267384 918744 1078971 359157 -440045
36097 -440045 -267667 614327 1045207 725319 426233 479059 290561 -344773 -622720 -28920
36087 -28920 667540 506702 -214992 -419598 208725 938699 1080626 680542 156079 -196877
36077 -196877 -258734 -65465 151997 168181 55907 87943 362627 718499 982631 1105609
36067 1105609 1083107 936242 756851 622199 497402 341603 226737 210575 196075 78940
36057 78940 -77695 -192164 -352123 -630093 -832472 -691360 -228199 303779 724470 924459
36047 924459 740620 212418 -173990 35142 592722 860034 754415 780668 1048098 989092
36037 989092 356688 -216893 -169044 100928 -63307 -480846 -501967 -87710 322451 749526
$$ packed form
36107C48585m63751o57183j39971K99011L70018N10675O51360J60227p19814p99202
36097d40045J72378Q81994M30880l19888k99086N2826j88498o35334k77947N93800
36087b8920O96460j60838p21694k04606O28323P29974J41927m00084n24463l52956
36077a96877o1857J93269K17462J6184j12274L2036K74684L55872K64132J22978
36067A105609k2502j46865j79391j34652j24797j55799j14866j6162j4500j17135
36057G8940j56635j14469j59959k77970k02379J41112M63161N31978M20691J99989
36047I24459j83839n28202l86408K09132N57580K67312j05619K6253K67430n9006
36037I89092o32404n73581M7849K69972j64235m17539k1121M14257M10161M27075
$$ plain form
36027 749526 1526639 2315058 2306655 1544223 1033560 1226971 1367067 830005 188294 204740
36017 204740 535962 358813 -212304 -313049 283591 859212 824339 396539 136375 322667
36007 322667 813517 1143235 866912 167976 -156531 215651 467042 -222091 -1248341
35998 -1248341 -1283731 -250691 518179 228232 -383957 -406221 -84859 -153177 -593051 -809011
35988 -809011 -553042 -46961 441822 637417 259385 -523398 -1025535 -889767 -586397 -612994
35978 -612994 -696892 -387416 40248 20326 -308900 -348150 -71188 -8429 -268337 -349672
35968 -349672 14515 501620 784218 867543 747136 326867 -164084 -222045 250792 768172
35958 768172 940896 902295 874627 754126 391125 -52574 -284308 -198994 122970 503245
$$ packed form
36027G49526P77113P88419q403p62432n10663J93411J40096n37062o41711J6446
36017B04740L31222j77149n71117j00745N96640N75621l4873m27800k60164J86292
36007C22667M90850L29718k76323o98936l24507L72182K51391o89133j026250
35998a248341l5390J033040P68870k89947o12189k2264L21362o8318m39874k15960
35988h09011K55969N06081M88783J95595l78032p82783n02137J35768L03370k6597
35978f12994q3898L09476M27664j9922l29226l9250K76962O2759k59908q1335
35968c49672L64187M87105K82598Q3325j20407m20269m90951n7961M72837N17380
35958G68172J72724l8601k7668j20501l63001m43699k31734Q5314L21964L80275
$$ plain form
35948 503245 675767 493780 201448 198381 472028 601169 392619 131125 75578 95512
35938 95512 -19258 -244201 -494311 -763834 -910495 -675848 -157959 104051 -174374 -549523
35928 -549523 -414020 195696 701500 734854 458621 221388 177334 260192 364040 490783
35918 490783 696734 860965 680758 137012 -225357 74140 641139 607687 -131931 -770563
35908 -770563 -834842 -796192 -1056590 -1142926 -581764 104631 146768 -195927 -57650 611652
35898 611652 1023648 844594 541887 400720 150458 -238095 -295509 64314 212948 -211682
35888 -211682 -701176 -728285 -551778 -625595 -785729 -652926 -378018 -325358 -377858 -223285
35878 -223285 -39760 -204311 -521679 -447185 24409 371015 401790 429985 566749 534795
$$ packed form
35948E03245J72522j81987k92332l067K73647J29141k08550k61494n5547J9934
35938I5512j14770k24943k50110k69523j46661K34647N17889K62010k78425l75149
35928e49523J35503O09716N05804L3354k76233k37233m4054Q2858J03848J26743
35918D90783K05951J64231j80207n43746l62369K99497N66999l3452p39618o38632
35908g70563o4279L8650k60398q6336N61162O86395M2137l42695J38277O69302
35898F11652M11996j79054l02707j41167k50262l88553n7414L59823J48634m24630
35888b11682m89494k7109J76507p3817j60134J32803K74908N2660n2500J54573
35878b23285J83525j64551l17368P4494M71594L46606L0775K8195J36764l1954
$$ plain form
35868 534795 317876 322155 639168 759447 375123 -46993 77627 607829 932330 797226
35858 797226 461525 211411 97035 46417 -52981 -298486 -592757 -666287 -462904 -294264
35848 -294264 -401407 -616616 -712942 -779740 -893913 -741616 -86660 597322 576572 -105604
35838 -105604 -630632 -493627 -20318 324278 549529 792812 891127 707081 510593 604630
35828 604630 818170 776387 494430 297099 245746 44076 -456635 -958986 -1030560 -578418
35818 -578418 40702 355309 271294 213591 610042 1239452 1398375 826469 103944 -119704
35808 -119704 54567 94796 -111460 -207587 -21078 224776 319466 253075 6274 -420487
35798 -420487 -753514 -670006 -346253 -324034 -693245 -880016 -499993 12431 12210 -419900
$$ packed form
35868E34795k16919M279L17013J20279l84324m22116J24620N30202L24501j35104
35858G97226l35701k50114j14376n0618r9398k45505k94271p3530K03383J68640
35848b94264j07143k15209r6326o6798j14173J52297O54956O83982k0750o82176
35838a05604n25028J37005M73309L44596K25251K43283R8315j84046j96488R4037
35828F04630K13540m1783k81957j97331n1353k01670n00711n02351p1574M52142
35818e78418O19120L14607q4015n7703L96451O29410J58923n71906p22525k23648
35808a19704J74271M0229k06256r6127J86509K45854R4690o6391k46801m26761
35798d20487l33027Q3508L23753K2219l69211j86771L80023N12424k21m32110
$$ plain form
35788 -419900 -602490 -201781 356832 469659 61504 -408466 -511861 -303741 -203556 -459359
35778 -459359 -822036 -847727 -447500 44044 314576 355728 278620 117172 -72302 -141062
35768 -141062 -23776 179247 386387 591472 643230 266436 -474304 -1001906 -858446 -358799
35758 -358799 -240658 -697970 -1135921 -985125 -440430 -148950 -327407 -505389 -211090 336176
35748 336176 480051 17647 -499027 -515477 -237672 -295335 -794809 -1153803 -916631 -320118
35738 -320118 111568 199637 118237 15642 -133875 -421595 -874921 -1323047 -1392355 -879137
35728 -879137 -141149 201663 3780 -326314 -504059 -625528 -649462 -275100 353739 491409
35718 491409 -149574 -770018 -556163 137418 436013 321968 430566 757186 642810 40481
$$ packed form
35788d19900j82590M00709N58613J12827m08155m69970j03395K08120J00185k55803
35778d59359l62677k5691M00227M91544K70532M1152p7108j61448j89474o8760
35768a41062J17286K03023K07140K05085N1758l76794p40740n27602J43460M99647
35758c58799J18141m57312m37951J50796N44695K91480j78457j77982K94299N47266
35748C36176J43875m62404n16674j6450K77805n7663m99474l58994K37172N96513
35738c20118M31686Q8069q1400j02595j49517k87720m53326m48126o9308N13218
35728h79137P37988L42812j97883l30094j77745j21469k3934L74362O28839J37670
35718D91409o40983o20444K13855O93581K98595j14045J08598L26620j14376o02329
$$ plain form
35708 40481 -267133 46089 297872 -53775 -512801 -343479 324657 767049 663683 338601
35698 338601 233280 485392 858807 924937 538130 144999 233857 521791 303756 -345505
35688 -345505 -520474 113426 732325 636604 272631 301463 432329 76251 -450702 -414219
35678 -414219 33148 100875 -276133 -378802 3609 224359 -127331 -664345 -954139 -1047567
35668 -1047567 -1005969 -646185 -80142 157424 -110975 -362170 -155854 262047 476977 511122
35658 511122 539967 484120 289888 198597 329172 360528 16083 -479927 -783107 -889108
35648 -889108 -847630 -453299 288321 769843 451199 -314891 -686131 -383647 191404 716249
35638 716249 1203220 1547850 1446960 901286 338235 90633 100281 205718 353685 438975
$$ packed form
35708D0481l07614L13222K51783l51647m59026J69322O68136M42392j03366l25082
35698C38601j05321K52112L73415O6130l86807l93131Q8858K87934k18035o49261
35688c45505j74969O33900O18899r5721l63973K8832J30866l56078n26953L6483
35678d14219M47367O7727l77008j02669L82411K20750l51690n37014k89794r3428
35668a047567M1598L59784N66043K37566k68399k51195K06316M17901K14930L4145
35658E11122K8845n5847j94232r1291J30575L1356l44445m96010l03180j06001
35648h89108M1478L94331P41620M81522l18644p66090l71240L02484N75051N24845
35638G16249M86971L44630j00890n45674n63051k47602R648J05437J47967Q5290
$$ plain form
35628 438975 303000 24612 -103245 -17745 -14595 -293202 -644409 -752616 -584155 -321552
35618 -321552 -106648 8028 25222 47229 192683 368489 318193 24009 -153295 64026
35608 64026 435483 477573 91036 -338472 -453651 -293651 -89108 68267 170610 80160
35598 80160 -327775 -812962 -886168 -441884 -7907 -83128 -433641 -445763 -63709 143541
35588 143541 -97378 -346746 -204389 47047 -36927 -336112 -493176 -639559 -1154366 -1855959
35578 -1855959 -2094281 -1657349 -1000756 -515296 -140384 172173 202902 -68482 -249941 -120120
35568 -120120 -11315 -268601 -694207 -904521 -914264 -934106 -840363 -346469 389859 789436
35558 789436 523658 -156588 -799737 -1182917 -1302032 -1177162 -811796 -268872 275429 560919
$$ packed form
35628D38975j35975k78388j27857Q5500L150k78607l51207j08207J68461K62603
35618c21552K14904J14676J7194K2007J45454J75806n0296k94184j77304K17321
35608F4026L71457M2090l86537m29508j15179J60000K04543J57375J02343r0450
35598H0160m07935m85187p3206M44284M33977p5221l50513j2122L82054K07250
35588A43541k40919k49368J42357K51436q3974k99185j57064j46383n14807p01593
35578a855959k38322M36932O56593M85460L74912L12557L0729k71384j81459J29821
35568a20120J08805k57286m25606k10314r743j9842R3743M93894P36328L99577
35558G89436k65778o80246o43149l83180j19115J24870L65366N42924N44301K85490
$$ plain form
35548 560919 412213 -49984 -460456 -571771 -484051 -436665 -499883 -589559 -650817 -665994 -582457
35537 -582457 -393985 -213517 -126492 -67685 20625 36077 -103929 -259418 -265183 -228380 -371009
35526 -371009 -629685 -695619 -474138 -236570 -224573 -328711 -313120 -207407 -271615 -593297
35516 -593297 -894684 -845415 -505994 -308532 -537247 -969589 -1189313 -1141557 -1119673 -1244129
35506 -1244129 -1292454 -1119675 -891326 -722534 -434588 56985 435899 435006 320519 471772
35496 471772 688070 486170 20488 53994 842966 1627563 1582298 860344 272783 198718
35486 198718 276572 83520 -308371 -529232 -381213 7084 338245 370012 86239 -278218
35476 -278218 -430769 -281579 667 175729 137080 -36508 -163259 -98137 139848 363080
$$ packed form
35548E60919j48706m62197m10472j11315Q7720M7386o3218q9676o1258j5177Q3537
35537e82457J88472J80468Q7025N8807Q8310J5452j40006j55489n765L6803j42629
35526c71009k58676o5934K21481K37568J1997j04138J5591J05713o4208l21682
35516e93297l01387M9269L39421J97462k28715m32342k19724M7756K1884j24456
35506a244129m8325J72779K28349J68792K87946M91573L78914q93j14487J51253
35496D71772K16298k01900m65682L3506P88972P84597m5265p21954n87561p4065
35486A98718P7854j93052l91891k20861J48019L88297L31161L1767k83773l64457
35476b78218j52551J49190K82246J75062l8649j73588j26751O5122K37985K23232
$$ plain form
35466 363080 385706 208041 -18761 -209114 -419084 -640827 -645154 -230527 382181 660660
35456 660660 407472 79590 214442 691073 908303 640733 289648 190145 124342 -194814
35446 -194814 -538492 -503611 -224435 -238405 -666768 -992081 -772063 -215350 145476 104484
35436 104484 -107517 -214656 -188781 -176480 -250609 -274694 -55311 329300 464369 44844
35426 44844 -648692 -945001 -513288 269928 751203 646844 194556 -174319 -190587 112256
35416 112256 468691 617034 541210 456777 519390 596196 394462 -179747 -832826 -1110757
35406 -1110757 -864550 -453410 -376937 -708713 -1047605 -1058958 -843125 -649914 -478588 -211084
35396 -211084 40458 45123 -159269 -295995 -249874 -160982 -117501 -30122 145624 298361 321090
$$ packed form
35466C63080K2626j77665k26802j90353k09970k21743m327M14627O12708K78479
35456F60660k53188l27882J34852M76631K17230k67570l51085r9503o5803l19156
35446a94814l43678L4881K79176j3970m28363l25313K20018N56713L60826m0992
35436A04484k12001j07139K5875J2301p4129k4085K19383L84611J35069m19525
35426D4844o93536k96309M31713P83216M81275j04359m52288l68875j6268L02843
35416A12256L56435J48343p5824q4433O2613P6806k01734n74209o53079k77931
35406a110757K46207M11140P6473l31776l38892j1353K15833J93211J71326K67504
35396b11084K51542M665k04392j36726M6121Q8892M3481Q7379J75746J52737K2729
$$ plain form
35385 321090 195649 -74082 -400040 -519068 -241867 204137 369768 151427 -120295 -181552
35375 -181552 -105069 -25206 43222 5133 -316960 -793010 -931740 -476938 183359 441840
35365 441840 121151 -474633 -936365 -991336 -601215 -54010 205451 35338 -243457 -262558
35355 -262558 10582 396321 731351 827505 517879 -32992 -349940 -217686 40386 75339
35345 75339 -28450 -86399 -225151 -550539 -723738 -363903 323792 779750 781662 489374
35335 489374 32800 -441747 -537154 -32699 568562 548453 -18942 -397464 -285394 -65387
35325 -65387 75864 446393 1031690 1209634 732587 281333 464445 857490 700465 74175
35315 74175 -363736 -480223 -699807 -1090083 -1208800 -892892 -503287 -267320 -6879 298917
$$ packed form
35385C21090j25441k69731l25958j19028K77201M46004J65631k18341k71722o1257
35375a81552P6483P9863O8428l8089l22093m76050j38730M54802O60297K58481
35365D41840l20689n95784m61732n4971L90121N47205K59461j70113k78795j9101
35355b62558K73140L85739L35030R6154l09626n50871l16948J32254K58072L4953
35345G5339j03789n7949j38752l25388j73199L59835O87695M55958J912k92288
35335D89374m56574m74547r5407N04455O01261k0109n67395l78522J12070K20007
35325f5387J41251L70529N85297J77944m77047m51254J83112L93045j57025o26290
35315G4175m37911j16487k19584l90276j18717L15908L89605K35967K60441L05796
$$ plain form
35305 298917 281544 -189930 -648029 -656442 -418195 -377538 -523633 -513721 -301849 -218740 -461294
35294 -461294 -821436 -950292 -707964 -273452 -32365 -254542 -741493 -940707 -584917 -29073
35284 -29073 281824 437452 767161 1110496 941760 248057 -277798 -125218 418352 799172
35274 799172 896377 829465 492164 -189956 -802015 -838206 -459159 -276030 -401032 -337273
35264 -337273 73401 264817 -142418 -616251 -444937 179116 441319 102291 -248205 -176162
35254 -176162 -12180 -209896 -583721 -607883 -201137 236946 470401 677019 1009610 1278366
35244 1278366 1239886 948536 621058 336690 82313 -67245 -80033 -166087 -527578 -947941
35234 -947941 -982518 -598510 -245288 -165985 -62111 295233 541097 247608 -325598 -566597
$$ packed form
35305B98917j7373m71474m58099q413K38247M0657j46095R912K11872Q3109k42554
35294d61294l60142j28856K42328M34512K41087k22177m86951j99214L55790N55844
35284b9073L10897J55628L29709L43335j68736o93703n25855J52580N43570L80820
35274G99172R7205o6912l37301o82120o12059l6191L79047J83129j25002O3759
35264c37273M10674J91416m07235m73833J71314O24053K62203l39028l50496P2043
35254a76162J63982j97716l73825k4162M06746M38083K33455K06618L32591K68756
35244A278366l8480k91350l27478k84368k54377j49558j2788q6054l61491m20363
35234i47941l4577L84008L53222P9303J03874L57344K45864k93489n73206k40999
$$ plain form
35224 -566597 -427492 -381098 -498284 -283940 363472 723087 251357 -497665 -568770 61299
35214 61299 519821 347459 91806 376788 925369 960660 317706 -350841 -483715 -279395
35204 -279395 -236084 -354668 -223117 200419 394364 51103 -365802 -225090 348458 613252
35194 613252 220523 -344977 -415780 92113 681924 814298 351833 -361432 -820321 -873052
35184 -873052 -839416 -983309 -1107420 -975059 -844166 -1072563 -1411714 -1337929 -949761 -778770
35174 -778770 -771116 -378853 238778 180081 -658091 -1095773 -384736 591516 708064 298504
35164 298504 363731 786842 647949 -63486 -402222 -57763 252886 102266 -56843 127516
35154 127516 312740 187973 -18142 -81935 -133771 -190666 -1250 410742 686441 780261
$$ packed form
35224e66597J39105M6394j17186K14344O47412L59615m71730p49022p1105O30069
35214F1299M58522j72362k55653K84982N48581L5291o42954o68547j32874K04320
35204b79395M3311j18584J31551M23536J93945l43261m16905J40712N73548K64794
35194F13252l92729n65500p0803N07893N89811J32374m62465p13265m58889n2731
35184h73052L3636j43893j24111J32361J30893k28397l39151P3785L88168J70991
35174g78770P654L92263O17631n8697q38172m37682P11037R76252J16548m09560
35164B98504O5227M23111j38893p11435l38736L44459L10649j50620j59109J84359
35154A27516J85224j24767k06115o3793n1836n6895J89416M11992K75699R3820
$$ plain form
35144 780261 980931 1153481 769536 -76957 -534490 -224847 189993 66554 -368077 -646360
35134 -646360 -768359 -809225 -588404 -252728 -429387 -1221834 -1791208 -1539977 -970305 -751177
35124 -751177 -756311 -740424 -1058069 -1783946 -2003631 -1115365 -66334 -20352 -485992 -225071
35114 -225071 552829 609224 -16969 -2867 869857 1203764 331418 -584438 -559839 -298840
35104 -298840 -655303 -973612 -283541 862563 1162642 538888 3206 -50097 -139007 -454208
35094 -454208 -517223 -159919 113492 -69792 -498507 -855670 -1042584 -950839 -491133 58983
35084 58983 248817 71020 -69202 -12079 11417 -102095 -186020 -233076 -440905 -720748
35074 -720748 -677925 -267115 -6321 -294440 -873503 -1199797 -1066312 -671673 -321177 -209333
$$ packed form
35144G80261K00670J72550l83945q46493m57533L09643M14840j23439m34631k78283
35134f46360j21999m0866K20821L35676j76659p92447n69374K51231N69672K19128
35124g51177n134J5887l17645p25877k19685Q88266J049031M5982m65640K60921
35114b25071P77900N6395o26193J4102Q72724L33907q72346r15856K4599K60999
35104b98840l56463l18309O90071J146104L00079o23754n35682n3303q8910l15201
35094d54208o3015L57304K73411j83284m28715l57163j86914R1745M59706N50116
35084E8983J89834j77797j40222N7123K3496j13512q3925m7056k07829k79843
35074g20748M2823M10810K60794k88119n79063l26294J33485L94639L50496J11844
$$ plain form
35064 -209333 -287226 -272034 -10674 190539 -61465 -571477 -724732 -401813 -181836 -418821
35054 -418821 -664008 -386138 187931 430590 189954 -185986 -474296 -715819 -851970 -726009
35044 -726009 -453025 -377316 -592311 -796229 -672584 -202942 368838 678882 451936 -167503
35034 -167503 -599600 -442383 19994 263041 311303 592428 1092930 1287250 1011385 768593
35024 768593 885972 950832 511127 -152630 -487097 -520494 -650512 -844375 -741426 -447270
35014 -447270 -490355 -902098 -1054398 -678697 -389274 -734806 -1259064 -1132289 -397426 120873
35004 120873 53757 -89498 132480 409291 321755 134241 365020 857334 944666 510358
34994 510358 231868 563985 1036096 965745 477338 272898 570486 846931 667596 247102
$$ packed form
35064b09333p7893J5192K61360K01213k52004n10012j53255L22919K19977k36985
35054d18821k45187K77870N74069K42659k40636l75940k88310k41523j36151J25961
35044g26009K72984P5709k14995k03918J23645M69642N71780L10044k26946o19439
35034a67503m32097J57217M62377K43047M8262K81125N00502J94320k75865k42792
35024G68593J17379O4860m39705o63757l34467l3397j30018j93863J02949K94156
35014d47270m3085m11743j52300L75701K89423l45532n24258J26775P34863N18299
35004A20873o7116j43255K21978K76811q7536j87514K30779M92314Q7332m34308
34994E10358k78490L32117M72111p0351m88407k04440K97588K76445j79335m20494
$$ plain form
34984 247102 -10337 -100288 -235635 -371631 -288387 -10774 196223 215439 181539 192659
34974 192659 159086 -11225 -249665 -393075 -297329 87195 592981 824811 498961 -172984
34964 -172984 -656428 -712027 -611107 -627528 -589354 -197741 390097 668800 480075 251071
34954 251071 391324 737720 865343 753347 755737 944760 931791 524045 160402 315080
34944 315080 718200 656610 -16277 -657063 -677648 -169603 424935 807565 817167 427582
34934 427582 28677 189262 738965 637936 -630057 -2027665 -2160795 -1186812 -528384
34925 -528384 -778390 -1031088 -541145 109602 142598 -68520 302129 1091532 1398170 968187
34915 968187 401654 93961 -158976 -466377 -554187 -352635 -218700 -347621 -498687 -497363
$$ packed form
34984B47102k57439q9951j35347j35996Q3244K77613K06997J9216l3900J1120
34974A92659l3573j70311k38440j43410R5746L84524N05786K31830l25850o71945
34964a72984m83444n5599J00920j6421L8174L91613N87838K78703j88725k29004
34954B51071J40253L46396J27623j11996K390J89023j2969m07746l63643J54678
34944C15080M03120o1590o72887o40786k0585N08045N94538L82630R602l89585
34934D27582l98905J60585N49703j01029j267993j397608j33130R73983O58428
34925e28384k50006k52698M89943O50747L2996k11118L70649P89403L06638m29983
34915I68187n66533l07693k52937l07401q7810K01552J33935j28921j51066J324
$$ plain form
34905 -497363 -486274 -477578 -203821 308178 541516 227849 -180783 -187052 16711 -51234 -383487
34894 -383487 -624257 -709269 -796311 -741809 -260783 432376 725118 418878 -62089 -367957
34884 -367957 -622207 -940487 -1039620 -660701 -53382 315229 341222 276811 288263 306114
34874 306114 247976 148577 59117 -43413 -223530 -486698 -675257 -534342 -54640 315463
34864 315463 106881 -497047 -804323 -563124 -341059 -669443 -1200088 -1161437 -419255 391925
34854 391925 696716 527522 297413 374065 823079 1267946 1121168 291724 -502288 -542773
34844 -542773 -53457 187118 1788 -109702 -12250 -220009 -911481 -1445355 -1300810 -868448
34834 -868448 -773067 -913821 -769532 -296024 75123 103913 -111354 -473020 -903224 -1178926
$$ packed form
34905d97363J1089Q696K73757N11999K33338l13667m08632o269K03763o7945l32253
34894c83487k40770q5012q7042N4502M81026O93159K92742l06240m80967l05868
34884c67957k54250l18280r9133L78919O07319L68611K5993o4411J1452J7851
34874C06114n8138r9399q9460j02530j80117k63168j88559J40915M79702L70103
34864C15463k08582o03928l07276K41199K22065l28384n30645L8651P42182Q11180
34854C91925L04791j69194k30109P6652M49014M44867j46778q29444p94012m0485
34844e42773M89316K40575j85330j11490R7452k07759o91472n33874J44545M32362
34834h68448R5381j40754J44289M73508L71147K8790k15267l61666m30204k75702
$$ plain form
34824 -1178926 -1156738 -998500 -829704 -456125 149278 418051 -135564 -1010278 -1169982 -364963
34814 -364963 601112 935808 626353 113018 -235154 -214101 124890 336694 -10623 -669867
34804 -669867 -903565 -454344 141671 358593 306302 318298 370217 247950 -17088 -213649
34794 -213649 -270933 -269597 -249224 -149410 137896 659850 1204418 1308808 737058 -135415
34784 -135415 -736471 -989593 -1193443 -1341703 -1122464 -588875 -225365 -227701 -273184 -144207
34774 -144207 -11408 69463 327891 696485 679442 154314 -261776 -57297 467160 761299
34764 761299 798846 794269 589357 -77702 -935849 -1340766 -975493 -89803 775050 1082614
34754 1082614 627650 -173883 -621099 -549606 -434758 -527412 -462836 -17623 393396 424389
$$ packed form
34824a178926K2188J58238J68796L73579O05403K68773n53615q74714j59704Q05019
34814c64963R66075L34696l09455n13335l48172K1053L38991K11804l47317o59244
34804f69867k33698M49221N96015K16922n2291J1996N1919j22267k65038j96561
34794b13649n7284J336K0373R9814K87306N21954N44568J04390n71750q72473
34784a35415o01056k53122k03850j48260K19239N33589L63510k336m5483J28977
34774a44207J32799Q0871K58428L68594j7043n25128m16090K04479N24457K94139
34764G61299L7547m577k04912o67059q58147m04917L65273Q85690Q64853L07564
34754A082614m54964q01533m47216P1493J14848r2654O4576M45213M11019L0993
$$ plain form
34744 424389 382879 570443 643204 265942 -152294 -87913 221516 264527 142967 190189
34734 190189 183799 -163767 -347596 290686 1345529 1778551 1374115 785905 340104 -140241
34724 -140241 -477478 -290961 13464 -376494 -1218562 -1388050 -706069 -266982 -576129 -761954
34714 -761954 -278801 -11737 -711207 -1501743 -1169929 -88027 431315 122263 -170126
34705 -170126 -62129 -16359 -262615 -464750 -520586 -709647 -922077 -656638 1849 261928
34695 261928 -185958 -621648 -384887 120953 76683 -550064 -1070462 -1101736 -912640 -785921
34685 -785921 -614756 -308213 -138530 -327498 -553110 -319443 251065 488007 166427 -62000
34675 -62000 410834 1186058 1347034 701770 -55554 -350092 -264509 -26637 363460 758710
$$ packed form
34744D24389m1510J87564P2761l77262m18236O4381L09429M3011j21560M7222
34734A90189o390l47566j83829O38282J054843M33022m04436n88210m45801m80345
34724a40241l37237J86517L04425l89958q42068j69488O81981M39087l09147j85825
34714g61954M83153K67064o99470p90536L31814J081902N19342l09052k92389
34705a70126J07997M5770k46256k02135n5836j89061k12430K65439O58487K60079
34695B61928m47886m35690K36761N05840m4270o26747n20398l1274J89096J26719
34685g85921J71165L06543J69683j88968k25612K33667N70508K36942l21580k28427
34675f2000M72834P75224J60976o45264p57324k94538Q5583K37872L90097L95250
$$ plain form
34665 758710 733526 212770 -235377 -135087 253783 406135 262192 68677 -144292 -432950
34655 -432950 -573749 -357677 -59065 -96671 -357505 -354383 25268 404055 502412 385985
34645 385985 139815 -259478 -705388 -977496 -1028920 -928600 -580580 61957 549897 290549
34635 290549 -515793 -881560 -300939 481524 438564 -358890 -904013 -637045 -42998 209235
34625 209235 144343 174551 337511 353265 281776 541669 1141096 1399716 815070 -118890
34615 -118890 -463786 -79403 246555 -17138 -404884 -220289 402941 719888 452131 90416
34605 90416 82322 208564 12779 -477020 -820419 -834003 -800885 -933362 -970752 -590650 -18712
34594 -18712 173518 -136732 -456242 -429165 -319687 -465795 -674592 -606416 -417499 -444985
$$ packed form
34665G58710k5184n20756m48147J00290L88870J52352j43943j93515k12969k88658
34655d32950j40799K16072K98612l7606k60834L122L79651L78787R8357j16427
34645C85985k46170l99293m45910k72108n1424J00320L48020O42537M87940k59348
34635B90549q06342l65767N80621P82463m2960p97454n45123K66968N94047K52233
34625B09235o4892L0208J62960J5754p1489K59893N99427K58620n84646r33960
34615a18890l44896L84383L25958k63693l87746J84595O23230L16947k67757l61715
34605I0416q094J26242j95785m89799l43399j3584L3118j32477l7390L80102N71938
34594a8712J92230l10250l19510K7077J09478j46108k08797O8176J88917k7486
$$ plain form
34584 -444985 -497373 -149845 376385 430981 81030 166794 930621 1454909 996878 132753
34574 132753 -152550 69679 -8000 -513520 -771651 -516365 -293698 -471161 -630922 -311103
34564 -311103 235136 455016 262028 -61391 -446492 -1022677 -1590963 -1583751 -733773 453280
34554 453280 1123664 928841 303141 -95860 -32460 305042 720347 1140382 1403739 1272738
34544 1272738 776509 296902 160018 308151 485314 566442 581929 587673 633175 708528
34534 708528 646553 274716 -253897 -520198 -350112 -29559 116483 98096 62246 8830
34524 8830 -75404 -47360 177726 418783 436809 192557 -221391 -667682 -866926 -538450
34514 -538450 157793 621347 474229 -54122 -571208 -976433 -1249909 -1223344 -906125 -662211
$$ packed form
34584d44985n2388L47528N26230N4596l49951Q5764P63827N24288m58031q64125
34574A32753k85303K22229p7679n05520k58131K55286K22667j77463j59761L19819
34564c11103N46239K19880j92988l23419l85101n76185n68286P212Q49978J187053
34554D53280O70384j94823o25700l99001O3400L37502M15305M20035K63357j31001
34544A272738m96229m79607j36884J48133J77163Q1128J5487N744M5502P5353
34534G08528o1975l71837n28613k66301J70086L20553J46042j8387l5850n3416
34524H830q4234K8044K25086K41057J8026k44252m13948m46291j99244L28476
34514e38450O96243M63554j47118n28351n17086m05225k73476K6565L17219K43914
$$ plain form
34504 -662211 -695729 -712263 -448332 -148230 -114087 -190423 -148310 -157343 -354750 -378110 52012
34493 52012 469651 272066 -328813 -668726 -636585 -558804 -387137 106592 530764 254058
34483 254058 -456722 -657085 -157487 222107 -6727 -363577 -388860 -343110 -479839 -427687
34473 -427687 165055 985767 1537876 1739531 1651185 1166079 401290 -121110 -127446 13863
34463 13863 -80713 -259599 -267778 -219631 -244722 -157826 108789 233715 64496 -84607 -104632
34452 -104632 -428045 -1140220 -1417373 -626823 527232 848886 316337 -2114 470547
34443 470547 1211088 1555015 1442063 1082333 580443 94680 -170101 -294961 -525096 -745250
34433 -745250 -570070 -40204 304887 207957 35654 119209 245568 126928 -38778 98773
$$ packed form
34504f62211l3518j6534K63931L00102L4143p6336M2113r033j97407k3360M30122
34493E2012M17639j97585o00879l39913L2141P7781J71667M93729M24172k76706
34483B54058p10780k00363M99598L79594k28834l56850k5283M5750j36729N2152
34473d27687N92742Q20712N52109K01655q8346m85106p64789n22400o336J41309
34463A3863r4576j78886q179M8147k5091Q6896K66615J24926j69219j49103k0025
34452a04632l23413p12175k77153P90550J154055L21654n32549l18451M72661
34443D70547P40541L43927j12952l59730n01890m85763k64781j24860k30135k20154
34433g45250J75180N29866L45091r6930j72303Q3555J26359j18640j65706J37551
$$ plain form
34423 98773 402535 388136 -66548 -529328 -600606 -422513 -423261 -677714 -778840 -435685 18579
34412 18579 -2648 -537170 -1014614 -1064959 -969208 -1084822 -1235938 -1061064 -652981 -382578
34402 -382578 -293177 -160390 -7856 -39732 -141421 -2713 268969 235442 -104881 -243216
34392 -243216 -26511 30901 -367056 -688891 -371626 205626 190770 -489795 -987588 -672540
34382 -672540 99244 518804 259453 -328777 -726621 -730321 -516332 -363830 -325951 -200842
34372 -200842 120893 395548 314279 -110 -71998 277566 645885 600274 275229 127480
34362 127480 241944 256788 -12370 -253459 -133408 195084 326605 177906 46220 155572
34352 155572 402822 561294 526948 334462 102842 -11959 28917 35011 -192159 -525325
$$ packed form
34423I8773L03762j4399m54684m62780p1278J78093p48k54453j01126L43155M54264
34412A8579k1227n34522m77444n0345R5751j15614j51116J74874M08083K70403
34402c82578Q9401J32787J52534l1876j01689J38708K71682l3527l40323j38335
34392b43216K16705N7412l97957l21835L17265N77252j4856o80565m97793L15048
34382f72540P71784M19560k59351n88230l97844l700K13989J52502L7879J25109
34372b00842L21735K74655q1269l14389p1888L49564L68319m5611l25045j47749
34362A27480J14464J4844k69158k41089J20051L28492J31521j48699j31686J09352
34352A55572K47250J58472l4346j92486k31620j14801M0876O094k27170l33166
$$ plain form
34342 -525325 -625458 -427260 -248272 -306259 -400311 -277342 -92116 -208610 -641832 -984722
34332 -984722 -898498 -457873 38330 431100 778247 1132624 1331179 1080127 329160 -485408
34322 -485408 -776394 -468885 -120884 -214384 -537643 -563977 -291299 -265003 -711246 -1089311
34312 -1089311 -781463 57645 695252 719299 367732 1393 -326057 -630895 -709246 -398317
34302 -398317 74047 322425 276727 125911 -93240 -468750 -822256 -805676 -474985 -307163
34292 -307163 -462780 -499260 -109867 315566 295598 16551 -57830 -15530 -282634 -772191
34282 -772191 -963876 -791255 -720787 -856956 -693008 10652 755477 1040653 993798 896018
34272 896018 633251 103409 -291664 -129343 356433 605241 510483 375913 292166 86349
$$ packed form
34342e25325j00133J98198J78988n7987r4052J22969J85226j16494m33222l42890
34332i84722Q6224M40625M96203L92770L47147L54377J98555k51052p50967q14568
34322d85408k90986L07509L48001r3500l23259k6334K72678K6296m46243l78065
34312a089311L07848Q39108O37607K4047l51567l66339l27450l04838p8351L10929
34302c98317M72364K48378m5698j50816k19151l75510l53506J6580L30691J67822
34292c07163j55617l6480L89393M25433j9968k79047p4381M2300k67104m89557
34282g72191j91685J72621P0468j36169J63948P03660P44825K85176m6855r7780
34272H96018k62767n29842l95073J62321M85776K48808r4758j34570q3747k05817
$$ plain form
34262 86349 -201605 -297186 -158501 -62989 -183524 -381459 -444545 -300588 -33071 113416
34252 113416 -131835 -662449 -868926 -261113 839107 1548133 1360652 597668 -45890
34243 -45890 -175210 36770 74957 -346100 -845329 -765918 -145121 156368 -336316 -877956
34233 -877956 -532270 357486 619530 22136 -424128 -68040 502228 605896 560203 912417
34223 912417 1294714 957964 65266 -473492 -346811 -168102 -373118 -569092 -286665 225161
34213 225161 409924 247647 211971 524477 860035 822904 441299 84529 26831 197399
34203 197399 318812 207624 -97522 -456640 -758582 -888289 -721361 -327094 -69778 -237208
34193 -237208 -595081 -650415 -419833 -497975 -1106549 -1536594 -1064443 -114471 208134 -330092
$$ packed form
34262H6349k87954r5581J38685R5512j20535j97935o3086J43957K67517J46487
34252A13416k45251n30614k06477O07813J100220P09026j87481p62984o43558
34243d5890j29320K11980L8187m21057m99229P9411O20797L01489m92684n41640
34233h77956L45686Q89756K62044n97394m46264L56088N70268J03668m5693L52214
34223I12417L82297l36750q92698n38758J26681J78709k05016j95974K82427N11826
34213B25161J84763j62277l5676L12506L35558l7131l81605l56770n7698J70568
34203A97399J21413j11188l05146l59118l01942j29707J66928L94267K57316j67430
34193b37208l57873n5334K30582p8142o08574m30045M72151R49972L22605n38226
$$ plain form
34183 -330092 -806245 -571639 -129907 -140942 -325570 -100614 278262 152625 -276892 -160292
34173 -160292 565584 969981 564620 18416 55205 456056 671178 717840 841355 844958
34163 844958 459559 -1033 -29545 291862 501639 514583 567830 619078 433393 146595
34153 146595 114185 250246 125212 -271391 -465424 -280077 -119323 -299400 -587221 -644092
34143 -644092 -548432 -605105 -868895 -1075984 -933460 -386391 306580 765620 849447 732206
34133 732206 541422 179931 -284643 -417061 -24372 337776 34877 -666483 -920293 -499934
34123 -499934 3797 172054 216763 328412 293056 32315 -115258 2655 27535 -253859
34113 -253859 -444923 -174845 230807 203050 -251418 -638851 -666256 -446728 -199990 -93904
$$ packed form
34183c30092m76153K34606M41732j1035j84628K24956L78876j25637m29517J16600
34173a60292P25876M04397m05361n46204L6789M00851K15122M6662J23515L603
34163H44958l85399m60592k8512L21407K09777J2944N3247N1248j85685k86798
34153A46595l2410J36061j25034l96603j94033J85347J60754j80077k87821n6871
34143f44092R5660n6673k63790k07089J42524N47069O92971M59040Q3827j17241
34133G32206j90784l61491m64574j32418L92689L62148l02899p01360k53810M20359
34123d99934N03731J68257M4709J11649l5356k60741j47573J17913K4880k81394
34113b53859j91064K70078M05652k7757m54468l87433k7405K19528K46738J06086
$$ plain form
34103 -93904 -230554 -504745 -634665 -560076 -595995 -961740 -1412393 -1601247 -1544895 -1436020
34093 -1436020 -1262874 -956132 -679707 -610182 -614203 -495102 -381200 -511589 -800373 -983182
34083 -983182 -1057116 -1202531 -1382597 -1387870 -1185391 -885012 -490422 -61786 27593 -506857
34073 -506857 -1236837 -1308735 -459379 650322 1212073 1026481 425547 -144241 -317728 14126
34063 14126 496761 575463 171546 -174734 -19198 439620 770442 937142 1145563 1304075
34053 1304075 1110833 617320 252228 208030 186222 -87164 -415047 -447569 -227402 -116115
34043 -116115 -269337 -475862 -522516 -457169 -401135 -306338 -54505 304352 549638 493890
34033 493890 134850 -319813 -538721 -322099 114402 254905 -129174 -603056 -516949 189466
$$ packed form
34103i3904j36650k74191j29920P4589l5919l65745m50653j88854N6352J08875
34093a436020J73146L06742K76425O9525m021J19101J13902j30389k88784j82809
34083i83182p3934j45415j80066n273K02479L00379L94590M28636Q9379n34450
34073e06857p29980p1898Q49356J109701N61751j85592o00934n69788j73487L31854
34063A4126M82635P8702m03917l46280J55536M58818L30822J66700K08421J58512
34053A304075j93242m93513l65092m4198k1808k73386l27883l2522K20167J11287
34043a16115j53222k06525m6654O5347N6034R4797K51833L58857K45286n5748
34033D93890l59040m54663k18908K16622M36501J40503l84079m73882Q6107P06415
$$ plain form
34023 189466 872028 923486 418476 -82962 -199665 -41354 50694 -85040 -289185 -286041
34013 -286041 -15656 245836 145243 -357927 -910098 -1087185 -766620 -190595 278461 451051
34003 451051 403676 319488 283733 288383 375063 595753 795249 640591 14150 -754331 -1184521
33992 -1184521 -1064329 -495009 263523 830961 849193 382134 3253 174209 665560 897487
33982 897487 706586 413429 253002 158836 66711 21922 -16255 -113450 -134742 51709 226252
33971 226252 108535 -101378 -10542 208248 8088 -544145 -718235 -255767 193576 99181
33961 99181 -214151 -303566 -375027 -703601 -888827 -432002 349730 722421 571695 363046
33951 363046 308897 258472 229098 350702 395596 35361 -514802 -767467 -787956 -1018062
$$ packed form
34023A89466O82562N1458n05010n01438j16703J58311R2048j35734k04145L144
34013b86041K70385K61492j00593n03170n52171j77087L20565N76025M69056J72590
34003D51051m7375q4188l5755M650Q6680K20690J99496j54658o26441p68481m30190
33992a184521J20192N69320P58532N67438J8232m67059l78881J70956M91351K31927
33982H97487j90901k93157j60427r4166r2125m4789l8177r7195k1292J86451J74543
33971B26252j17717k09913R0836K18790k00160n52233j74090M62468M49343r4395
33961I9181l13332q9415p1461l28574j85226M56825P81732L72691j50726k08649
33951C63046n4149n0425k9374J21604M4894l60235n50163k52665k0489k30106
$$ plain form
33941 -1018062 -1315987 -1018035 -107168 526014 338827 -86350 4316 431258 524519 210584
33931 210584 -12310 61234 144612 58712 -25458 -17006 -144025 -587937 -1135277 -1362342 -1061065
33920 -1061065 -417849 143363 279151 -15662 -441450 -728780 -896425 -1091150 -1243798
33911 -1243798 -1084020 -560725 -71270 -69921 -478566 -718955 -448472 -59425 -172378 -724513
33901 -724513 -957132 -427771 341426 516986 -11034 -616557 -783262 -529990 -70236 450530
33891 450530 784069 617851 33268 -420781 -401896 -252752 -488872 -1031761 -1344966 -1221953
33881 -1221953 -1011873 -1033163 -1159105 -1140212 -1024392 -1018771 -1130031 -1183277 -1078422 -817573
33871 -817573 -399023 71891 275277 -1360 -467467 -611821 -418714 -397723 -752568 -969664
$$ packed form
33941a018062k97925K97952R10867O33182j87187m25177R0666M26942R3261l13935
33931B10584k22894P3544Q3378q5900q4170Q452j27019m43912n47340k27065L01277
33920a061065O43216N61212J35788k94813m25788k87330j67645j94725j52648
33911a243798J59778N23295M89455J349m08645k40389K70483L89047j12953n52135
33901g24513k32619N29361P69197J75560n28020o05523j66705K53272M59754N20766
33891D50530L33539j66218n84583m54049J8885J49144k36120n42889l13205J23013
33881a221953K10080k1290j25942J8893J15820N621j11260n3246J04855K60849
33871h17573M18550M70914K03386k76637m66107j44354J93107K0991l54845k17096
$$ plain form
33861 -969664 -576435 57231 168500 -344787 -850328 -909241 -759336 -798193 -1045794 -1284180
33851 -1284180 -1361220 -1177800 -692492 -125861 118241 -72591 -349999 -367967 -196843 -131438
33841 -131438 -294850 -565279 -712499 -525534 -6956 513745 678981 503153 218781 -151529
33831 -151529 -633869 -843082 -346589 478392 718130 249325 -35511 314460 533074 -56567
33821 -56567 -817969 -776220 -149620 133973 -26330 1994 230374 23578 -563309 -623048
33811 -623048 140820 811452 565166 -223041 -655148 -454280 11678 320966 209227 -359436
33801 -359436 -995678 -1172612 -949168 -917820 -1208269 -1167159 -412656 409463 475775 -86215
33791 -86215 -526840 -577347 -583318 -743215 -843499 -725223 -519364 -365042 -228687 -39931
$$ packed form
33861i69664L93229O33666J11269n13287n05541n8913J49905l8857k47601k38386
33851a284180p7040J83420M85308N66631K44102j90832k77408j7968J71124O5405
33841a31438j63412k70429j47220J86965N18578N20701J65236j75828k84372l70310
33831a51529m82340k09213M96493Q24981K39738m68805k84836L49971K18614n89641
33821e6567p61402M1749O26600K83593j60303K8324K28380k06796n86887n9739
33811f23048P63868O70632k46286p88207m32107K00868M65958L09288j11739n68663
33801c59436o36242j76934K23444L1348k90449M1110P54503Q22119O6312n61990
33791h6215m40625n0507n971j59897j00284J18276K05859J54322J36355J88756
$$ plain form
33781 -39931 197811 383064 275036 -314465 -1087505 -1314553 -677859 177900 379366 -43770
33771 -43770 -262721 139544 584648 297178 -701032 -1653864 -1902751 -1410560 -593962 86792
33761 86792 347938 131812 -350678 -669074 -508667 -78750 17977 -457807 -948793 -776572
33751 -776572 -112957 230650 -7836 -182515 199102 691065 671521 363779 395561 661887
33741 661887 467413 -244865 -666834 -360382 37940 -195246 -763166 -847341 -353581 28995
33731 28995 -102863 -398510 -436683 -302929 -252895 -249517 -151522 -38634 -15208 62474 321400
33720 321400 542984 469928 270029 280133 424069 371103 202913 345650 768381 861325
33710 861325 359856 -157155 -61054 474520 830219 786620 566669 328549 90154 -49814
$$ packed form
33781c9931K37742J85253j08028n89501p73040k27048O36694Q55759K01466m23136
33771d3770k18951M02265M45104k87470r98210r52832k48887M92191Q16598O80754
33761H6792K61146k16126m82490l18396J60407M29917R6727m75784m90986J72221
33751g76572O63615L43607k38486j74679L81617M91963j9544l07742L1782K66326
33741F61887j94474p12278m21969L06452L98322k33186n67920q4175M93760L82576
33731B8995j31858k95647l8173J33754N0034L378R7995J12888K3426P7682K58926
33720C21400K21584p3056j99899J0104J43936n2966j68190J42737M22731R2944
33710H61325n01469n17011R6101N35574L55699m3599k19951k38120k38395j39968
$$ plain form
33700 -49814 -64035 -204186 -645450 -1090267 -1121790 -762388 -283733 274228 888139 1128823
33690 1128823 632245 -126873 -257346 316414 733288 441190 -95283 -184112 175843 515312
33680 515312 596115 514718 384153 240993 134234 121266 257913 602925 1075166 1381293
$$ packed form
33700d9814j4221j40151m41264m44817l1523L59402M78655N57961O13911K40684
33690A128823m96578p59118j30473N73760M16874k92098n36473q8829L59955L39469
33680E15312Q0803q1397j30565j43160j06759j2968J36647L45012M72241L06127
$$ [...]
##END NTUPLES=NMR SPECTRUM
##END=
