##TITLE=31Pdec_ABCP507
 CDCl3, 24 sc
 5.7.2019
##JCAMPDX= 6.0         $$ Bruker NMR JCAMP-DX V2.0
##DATA TYPE= NMR SPECTRUM
##DATA CLASS= NTUPLES
##ORIGIN= UXNMR, Bruker Analytische Messtechnik GmbH
##OWNER= root
$$ XWIN-NMR		Version 3.5
$$ Fri Jul  5 16:41:49 2019 Russian Standard Time (UT+4h)  she@DPX200
##.OBSERVE FREQUENCY= 81.013821
##.OBSERVE NUCLEUS= ^31P
##.ACQUISITION MODE= SIMULTANEOUS
##.ACQUISITION SCHEME= undefined
##.AVERAGES= 24
##.DIGITISER RES= 17
##SPECTROMETER/DATA SYSTEM= spect
##.PULSE SEQUENCE= zgpg30
##.SOLVENT NAME= DMSO
##.SHIFT REFERENCE= (INTERNAL, DMSO, 0, 182.463)
##AUDIT TRAIL= $$ (NUMBER, WHEN, WHO, WHERE, WHAT)
$$ ##TITLE= Audit trail, XWIN-NMR		Version 3.5
$$ ##JCAMPDX= 5.01
$$ ##ORIGIN= Bruker BioSpin GmbH
$$ ##OWNER= she
$$ F:/spectra/data/she/nmr/P31/1/pdata/1/auditp.txt
$$ ##AUDIT TRAIL=  $$ (NUMBER, WHEN, WHO, WHERE, WHAT)
(   1,<2019-07-05 16:40:44.53 +0400>,<she>,<DPX200>,
      <created by zg, POWCHK disabled, PULCHK disabled
       configuration hash MD5:
       00 E9 B6 7A A2 85 ED C7 34 08 36 98 17 FE 4E 26
       data hash MD5: 32K
       AA BC BB 22 42 90 91 4A 5B 3E 97 58 CA B8 AF 07>)
(   2,<2019-07-05 16:40:47.00 +0400>,<she>,<DPX200>,
      <Start of raw data processing
       efp BC_mod = 2 LB = 1 FT_mod = 6 PKNL = 1 PHC0 = -2861.429 PHC1 = 0.9989319 SI = 64K 
       data hash MD5: 64K
       6E B5 6F 4C 09 8F 4E 48 51 26 E7 66 68 34 FF 0B>)
(   3,<2019-07-05 16:41:09.92 +0400>,<she>,<DPX200>,
      <pk PHC0 = -78.46873 PHC1 = 181.4 
       data hash MD5: 64K
       DA 23 0E 6F 21 FD 75 82 7C FD AB 86 CA 0C 93 FD>)
(   4,<2019-07-05 16:41:14.10 +0400>,<she>,<DPX200>,
      <abs ABSG = 5 
       data hash MD5: 64K
       1C 72 F8 7A BB 80 70 DF 36 2F C6 F1 EF 61 A3 2D>)
$$ ##END=
$$ 
$$ hash MD5
$$ C7 FB C0 53 CA 23 DD AC F3 21 E8 E8 D3 03 C8 17
##$RELAX= 
##$RELAX= 
##$RELAX= 
##$RELAX= 
##$RELAX= 
##$RELAX= 
##$RELAX= 
##$RELAX= 
$$ Bruker specific parameters
$$ --------------------------
##$DU= <F:/spectra>
##$EXPNO= 1
##$NAME= <P31>
##$PROCNO= 1
##$TYPE= <nmr>
##$USER= <she>
##$AMP= (0..31)
100 100 100 100 100 100 100 100 100 100 100 100 100 100 100 100 100 100 
100 100 100 100 100 100 100 100 100 100 100 100 100 100 
##$AQSEQ= 0
##$AQ_mod= 1
##$AUNM= <au_zg>
##$AUTOPOS= <>
##$BF1= 81.014009
##$BF2= 200.13
##$BF3= 200.13
##$BF4= 200.13
##$BF5= 200.13
##$BF6= 200.13
##$BF7= 200.13
##$BF8= 200.13
##$BYTORDA= 1
##$CFDGTYP= 0
##$CFRGTYP= 5
##$CHEMSTR= <none>
##$CNST= (0..31)
1 1 145 1 1 1 1 1 1 1 1 1 1 1 1 1 1 1 1 1 1 1 1 1 1 1 1 1 1 1 1 1 
##$CPDPRG= <waltz16>
##$CPDPRG1= <>
##$CPDPRG2= <waltz16>
##$CPDPRG3= <>
##$CPDPRG4= <mlev>
##$CPDPRG5= <mlev>
##$CPDPRG6= <mlev>
##$CPDPRG7= <mlev>
##$CPDPRG8= <mlev>
##$CPDPRGB= <>
##$CPDPRGT= <>
##$D= (0..31)
0 1 0 0 0 0 0 0 0 0 0 0.03 2e-05 3e-06 0 0 0 0 0 0 0 0 0 0 0 0 0 0 0 0 
0 0 
##$DATE= 1562330443
##$DBL= (0..7)
120 120 120 11 120 120 24 19 
##$DBP= (0..7)
150 150 150 150 150 150 150 150 
##$DBP07= 0
##$DBPNAM0= <>
##$DBPNAM1= <>
##$DBPNAM2= <>
$$ [...]
##$SUBNAM3= <"">
##$SUBNAM4= <"">
##$SUBNAM5= <"">
##$SUBNAM6= <"">
##$SUBNAM7= <"">
##$SUBNAM8= <"">
##$SUBNAM9= <"">
##$SW= 369.568048894756
##$SWIBOX= (0..15)
0 1 3 0 0 0 0 0 0 0 0 0 0 0 0 0 
##$SW_h= 29940.119760479
##$TD= 32768
##$TD0= 1
##$TE= 0
##$TE2= 300
##$TE3= 300
##$TEG= 300
##$TL= (0..7)
0 120 53 12 22 120 120 120 
##$TP= (0..7)
150 150 150 150 150 150 150 150 
##$TP07= 0
##$TPNAME0= <>
##$TPNAME1= <>
##$TPNAME2= <>
##$TPNAME3= <>
##$TPNAME4= <>
##$TPNAME5= <>
##$TPNAME6= <>
##$TPNAME7= <>
##$TPOAL= (0..7)
0.5 0.5 0.5 0.5 0.5 0.5 0.5 0.5 
##$TPOFFS= (0..7)
0 0 0 0 0 0 0 0 
##$TUNHIN= 0
##$TUNHOUT= 0
##$TUNXOUT= 0
##$USERA1= <user>
##$USERA2= <user>
##$USERA3= <user>
##$USERA4= <user>
##$USERA5= <user>
##$V9= 5
##$VALIST= <valist>
##$VCLIST= <CCCCCCCCCCCCCCC>
##$VD= 0
##$VDLIST= <DDDDDDDDDDDDDDD>
##$VPLIST= <PPPPPPPPPPPPPPP>
##$VTLIST= <TTTTTTTTTTTTTTT>
##$WBST= 1024
##$WBSW= 4
##$XGAIN= (0..3)
0 0 0 0 
##$XL= 0
##$YL= 0
##$YMAX_a= 38502
##$YMIN_a= -48463
##$ZGOPTNS= <>
##$ZL1= 120
##$ZL2= 120
##$ZL3= 120
##$ZL4= 120
##$ABSF1= 182.463
##$ABSF2= -187.1042
##$ABSG= 5
##$ABSL= 3
##$ALPHA= 0
##$AQORDER= 0
##$ASSFAC= 0
##$ASSFACI= 0
##$ASSFACX= 0
##$ASSWID= 0
##$AUNMP= <proc_1d>
##$AZFE= 0.1
##$AZFW= 0.5
##$BCFW= 0
##$BC_mod= 2
##$BYTORDP= 0
##$COROFFS= 0
##$CY= -3
##$DATMOD= 1
##$DC= 0
##$DFILT= <>
##$DTYPP= 0
##$F1P= 0
##$F2P= 0
##$FCOR= 1
##$FTSIZE= 65536
##$FT_mod= 6
##$GAMMA= 0
##$GB= 0
##$INTBC= 1
##$INTSCL= 5.30512e-09
##$ISEN= 30
##$LB= 1
##$LEV0= 0
##$LPBIN= 0
##$MAXI= 10000
##$MC2= 0
##$MEAN= 0
##$ME_mod= 0
##$MI= 50
##$NCOEF= 0
##$NC_proc= -4
##$NLEV= 6
##$NOISF1= 182.463
##$NOISF2= 159.3651
##$NSP= 0
##$NTH_PI= 0
##$NZP= 0
##$OFFSET= 182.463
##$PC= 4
##$PHC0= -2939.898
##$PHC1= 182.3989
##$PH_mod= 1
##$PKNL= yes
##$PPARMOD= 0
##$PSCAL= 0
##$PSIGN= 0
##$REVERSE= no
##$SF= 81.0140089999434
##$SI= 65536
##$SIGF1= 159.3651
##$SIGF2= -187.1042
##$SINO= 113.3802
##$SIOLD= 16384
##$SREGLST= <1H.CDCl3>
##$SSB= 0
##$STSI= 65536
##$STSR= 0
##$SW_p= 29940.119760479
##$SYMM= 0
##$S_DEV= 0
##$TDeff= 32768
##$TDoff= 0
##$TI= <>
##$TILT= no
##$TM1= 0
##$TM2= 0
##$TOPLEV= 0
##$USERP1= <user>
##$USERP2= <user>
##$USERP3= <user>
##$USERP4= <user>
##$USERP5= <user>
##$WDW= 1
##$XDIM= 65536
##$YMAX_p= 324784247
##$YMIN_p= -8238121
$$ End of Bruker specific parameters
$$ ---------------------------------
##NTUPLES= NMR SPECTRUM
##VAR_NAME=  FREQUENCY,     SPECTRUM/REAL,   SPECTRUM/IMAG
##SYMBOL=    X,             R,               I
##VAR_TYPE=  INDEPENDENT,   DEPENDENT,       DEPENDENT
##VAR_FORM=  AFFN,          ASDF,            ASDF
##VAR_DIM=   65536,         65536,           65536
##UNITS=     HZ,            ARBITRARY UNITS, ARBITRARY UNITS
##FACTOR=    0.456856943014862, 1,           1
##FIRST=     14782.0589164792, 0,            0
##LAST=      -15158.0608439998, 0,           0
##MIN=       -15158.0608439998, -8238121,    0
##MAX=       14782.0589164792, 324784247,    0
$$ Real data points
##PAGE= N=1
##DATA TABLE= (X++(R..R)), XYDATA
$$ [...]
$$ plain form
40994 -1285742 -1234128 -1206036 -1294730 -1177548 -728652 -289493 -141982 -120657 20766 214766
40984 214766 301450 322466 336230 243320 63401 82466 421561 746081 739200 593139 651169
40973 651169 807613 707090 369379 140700 97440 -37954 -365812 -599810 -480705 -102923
40963 -102923 253720 400792 321126 166259 168897 388652 600233 590980 429068 232243
40953 232243 -107169 -625954 -920118 -542814 293157 872882 839794 467566 88822 -232115
40943 -232115 -378208 -92642 531049 912686 656036 55868 -315653 -249079 93568 498324
40933 498324 756247 671968 314260 61469 150290 385745 530945 723501 1177321 1673840
40923 1673840 1740567 1271670 655454 305130 303297 472349 568481 427162 109616 -108810
$$ packed form
40994a285742N1614K8092q8694J17182M48896M39159J47511K1325J41423J94000
40984B14766Q6684K1016J3764r2910j79919J9065L39095L24520o881j46061N8030
40973F51169J56444j00523l37711k28679m3260j35394l27858k33998J19105L77782
40963a02923L56643J47072p9666j54867K638K19755K11581r253j61912j96825
40953B32243l39412n18785k94164L77304Q35971N79725l3088l72228l78744l20937
40943b32115j46093K85566O23691L81637k56650o00168l71521O6574L42647M04756
40933D98324K57923q4279l57708k52791Q8821K35455J45200J92556M53820M96519
40923A673840O6727m68897o16216l50324j833J69052R6132j41319l17546k18426
$$ plain form
40913 -108810 -29881 248253 509907 679218 741150 587378 197172 -155390 -166233 93785
40903 93785 315205 426246 611821 871169 923128 658983 364632 288629 228680 -180084
40893 -180084 -871012 -1309242 -1083996 -370795 270111 456411 254299 -48841 -284527 -450465
40883 -450465 -538458 -484373 -295819 -94234 20526 56666 46325 -27910 -169752 -302238
40873 -302238 -303603 -81525 331396 663947 512486 -193725 -892792 -896418 -248041 290148
40863 290148 243450 12997 183886 634314 787623 511246 227417 182511 122158 -200828
40853 -200828 -613008 -806507 -740423 -549457 -267860 132463 541393 741086 625321 308569
40843 308569 36671 3601 188884 352626 255656 -92125 -440535 -542283 -348068 -11887
$$ packed form
40913a08810P8929K78134K61654J69311O1932j53772l90206l52562j0843K60018
40903I3785K21420J11041J85575K59348N1959k64145k94351p6003n9949m08764
40893a80084o90928m38230K25246P13201O40906J86300k02112l03140k35686j65938
40883d50465q7993N4085J88554K01585J14760L6140j0341p4235j41842j32486
40873c02238j365K22078M12921L32551j51461p06211o99067l626O48377N38189
40863B90148m6698k30453J70889M50428J53309k76377k83829m4906o0353l22986
40853b00828m12180j93499O6084J90966K81597M00323M08930J99693j15765l16752
40843C08569k71898l3070J85283J63742r6970l47781l48410j01748J94215L36181
$$ plain form
40833 -11887 219695 169224 -118136 -381560 -357474 13939 566292 995890 1005648 558142
40823 558142 24202 -147580 16677 64336 -179685 -326674 -74802 263426 291804 231463
40813 231463 529367 999474 1020189 531747 168393 317355 678155 920673 1152069 1445557
40803 1445557 1489220 1115807 725296 736847 981979 1077439 1069068 1222684 1439680 1402632
40793 1402632 1141603 956864 880651 699821 454252 419586 582189 607856 408797 289963
40783 289963 399203 468575 319350 234172 510907 918561 954477 517147 15897 -152776
40773 -152776 -7000 137733 19010 -340473 -635984 -547562 -117501 192467 -26179 -618536
40763 -618536 -993323 -791345 -287941 -70768 -426492 -1110005 -1619441 -1620317 -1191074 -751776
$$ packed form
40833a1887K31582n0471k87360k63424K4086L71413N52353M29598R758m47506
40823E58142n33940j71782J64257M7659k44021j46989K51872L38228K8378o0341
40813B31463K97904M70107K0715m88442l63354J48962L60800K42518K31396K93488
40803A445557M3663l73413l90511J1551K45132R5460q371J53616K16996l7048
40793A402632k61029j84739p6213j80830k45569l4666J62603K5667j99059j18834
40783B89963J09240O9372j49225q5178K76735M07654L5916m37330n01250j68673
40773a52776J45776J44733j18723l59483k95511Q8422M30061L09968k18646n92357
40763f18536l74787K01978N03404K17173l55724o83513n09436q76M29243M39298
$$ plain form
40753 -751776 -678487 -885935 -879802 -364587 301109 494083 140789 -165827 38650 483791
40743 483791 578624 192134 -299729 -607027 -787075 -915202 -864311 -559640 -201697 -41461
40733 -41461 -58190 -10160 256813 641121 879233 768511 349948 -121329 -434511 -598442
40723 -598442 -673036 -546017 -95160 481071 767596 610165 261620 7049 -123538 -212979
40713 -212979 -284305 -369877 -514506 -604083 -440068 -108733 -3896 -304207 -688889 -794358
40703 -794358 -709157 -743627 -913486 -974785 -852212 -716745 -676915 -647350 -514102 -249967
40693 -249967 92375 353389 325112 4705 -313829 -375827 -274370 -240488 -280502 -258430
40683 -258430 -189176 -162383 -93409 131637 349607 306101 103474 93729 310495 387076 129986
$$ packed form
40753g51776P3289k07448O133N15215O65696J92974l53294l06616K04477M45141
40743D83791R4833l86490m91863l07298j80048j28127N0891L04671L57943J60236
40733d1461j6729M8030K66973L84308K38112j10722m18563m71277l13182j63931
40723e98442p4594J27019M50857N76231K86525j57431l48545k54571j30587q9441
40713b12979p1326q5572j44629q9577J64015L31335J04837l00311l84682j05469
40703g94358Q5201l4470j69859o1299J22573J35467L9830K9565J33248K64135
40693b49967L42342K61014k8277l20407l18534o1998J01457L3882m0014K2072
40683b58430O9254K6793O8974K25046K17970m3506k02627r745K16766P6581k57090
$$ plain form
40672 129986 -178746 -204994 9387 223385 347623 407908 363261 203373 101745 229544
40662 229544 459468 461174 115133 -318483 -512344 -464507 -464500 -657426 -771079 -433125 269488
40651 269488 770703 666642 185888 -146980 -146389 -27505 41527 136240 321457 478324
40641 478324 482318 385577 336816 416601 587390 738238 790648 808364 916233 1038768 881838
40630 881838 336344 -260232 -490920 -359001 -175019 -74453 50174 220724 301280 231131
40620 231131 57907 -208757 -507743 -597610 -346315 -27950 62998 149367 601633 1130041
40610 1130041 1029646 317260 -109636 256662 781641 661629 73130 -238941 -94176
40601 -94176 77517 86423 192057 488639 671801 542828 322768 297716 427443 458870
$$ packed form
40672A29986l08732k6248K14381K13998J24238O0285m4647j59888j01628J27799
40662B29544K29924J706l46041m33616j93861M7837Pj92926j13653L37954P02613
40651B69488N01215j04061m80754l32868N91J18884O9032R4713J85217J56867
40641D78324L994r6741m8761P9785J70789J50848N2410J7716J07869J22535j56930
40630H81838n45494n96576k30688J31919J83982J00566J24627J70550Q0556p0149
40620B31131j73224k66664k98986q9867K51295L18365R0948Q6369M52266N28408
40610A130041j00395p12386m26896L66298N24979j20012n88499l12071J44765
40601i4176J71693Q906J05634K96582J83162j28973k20060k5052J29727L1427
$$ plain form
40591 458870 271955 6271 -106695 -23956 16087 -197857 -472218 -404220 -6704 233357
40581 233357 96354 162 287969 566895 297087 -242339 -241998 449391 1081136 1061609
40571 1061609 690846 588461 850988 1121916 1194588 1162497 1092147 877307 455102 -23095
40561 -23095 -332482 -435882 -518102 -714371 -877205 -760040 -406386 -122007 -12267 147063
40551 147063 425924 480952 89783 -355674 -312925 145056 474250 448039 340985 386072
40541 386072 506572 580888 552343 296128 -189635 -507405 -279498 185629 235961 -95885
40531 -95885 -107256 391900 707586 423818 136453 433621 831599 523881 -290714 -724877
40521 -724877 -577616 -464400 -641512 -627853 -158319 320611 439403 493669 809703 1091106
$$ packed form
40591D58870j86915k65684j12966Q2739M0043k13944k74361O7998L97516K40061
40581B33357j37003r6192K87807K78926k69808n39426L41O91389O31745j9527
40571A061609l70763j02385K62527K70928P2672l2091p0350k14840m22205m78197
40561b3095l09387j03400q2220j96269j62834J17165L53654K84379J09740J59330
40551A47063K78861N5028l91169m45457M2749M57981L29194k6211j07054M5087
40541C86072J20500P4316k8545k56215m85763l17770K27907M65127N0332l31846
40531i5885j1371M99156L15686k83768k87365K97168L97978l07718q14595m34163
40521g24877J47261J13216j77112J3659M69534M78930J18792N4266L16034K81403
$$ plain form
40511 1091106 925158 528090 414122 576557 571012 299677 153967 333741 508596 331108
40501 331108 -59519 -264049 -129357 170099 395156 399212 150954 -191284 -296686 25298
40491 25298 516601 667624 295489 -226359 -427852 -305490 -247233 -450561 -659402 -579173
40481 -579173 -353367 -387935 -747798 -994163 -738550 -174641 144406 -16360 -340376 -417021
40471 -417021 -210190 41396 211510 373236 573583 734176 802300 846487 943134 1060040
40461 1060040 1084230 892537 415295 -237735 -722613 -728987 -381538 -193985 -485698 -982193
40451 -982193 -1158773 -876596 -488107 -364372 -513522 -679300 -657785 -458801 -239053 -121670
40441 -121670 -66643 49936 214782 245235 64891 -102730 32359 462927 901733 1109331
$$ packed form
40511A091106j65948l97068j13968J62435n545k71335j45710J79774J74855j77488
40501C31108l90627k04530J34692K99456K25057M056k48258l42238j05402L21984
40491B5298M91303J51023l72135n21848k01493J22362N8257k03328k08841Q0229
40481e79173K25806l4568l59863k46365K55613N63909L19047j60766l24016p6645
40471d17021K06831K51586J70114J61726K00347J60593O8124M4187R6647J16906
40461A060040K4190j91693m77242o53030m84878o374L47449J87553k91713m96495
40451i82193j76580K82177L88489J23735j49150j65778K1515J98984K19748J17383
40441a21670N5027J16579J64846L0453j80344j67621J35089M30568M38806K07598
$$ plain form
40431 1109331 1056765 828884 562501 452047 593978 787943 687595 223701 -274082 -456366
40421 -456366 -336465 -220914 -347993 -654038 -837016 -630592 -80145 454331 634309 448308
40411 448308 114183 -217201 -494621 -594466 -378135 56062 407230 523360 537887 612322
40401 612322 739098 857929 961534 996364 846470 516481 166030 -115776 -388429 -644454
40391 -644454 -745538 -685180 -662767 -722561 -570935 -9384 648626 907079 724030 500789
40381 500789 475938 455028 202387 -178891 -406721 -383408 -231858 -55506 169862 450675
40371 450675 645285 585445 318578 118413 176006 355642 385246 248426 217452 477517
40361 477517 887571 1177218 1234360 1121028 941539 793528 747520 790089 856339 931853
$$ packed form
40431A109331n2566k27881k66383j10454J41931J93965j00348m63894m97783j82284
40421d56366J19901J15551j27079l06045j82978K06424N50447N34476J79978j86001
40411D48308l34125l31384k77420r9845K16331M34197L51168J16130J4527P4435
40401F12322J26776J18831J03605L4830j49894l29989l50451k81806k72653k56025
40391f44454j01084O0358K2413n9794J51626N61551O58010K58453j83049k23241
40381E00789k4851k0910k52641l81278k27830K3313J51550J76352K25368K80813
40371D50675J94610n9840k66867k00165N7593J79636K9604j36820l0974K60065
40361D77517M10054K89647N7142j13332j79489j48011m6008M2569O6250P5514
$$ plain form
40351 931853 1001155 918489 560961 152514 142604 602741 1005298 836400 227380 -280359
40341 -280359 -427292 -393401 -382678 -391396 -386141 -416329 -477978 -472921 -382631 -344153 -490286 -788497
40329 -788497 -1046290 -1034012 -678274 -214613 -32398 -234583 -470371 -373693 -41760 141124
40319 141124 38041 -169677 -379401 -685580 -1049710 -1182377 -917985 -480471 -202510 -149663
40309 -149663 -191842 -288730 -475545 -646576 -614025 -419196 -355845 -544351 -647817 -248296
40299 -248296 539240 1102657 1063718 713822 546194 617064 680750 739895 990783 1282414
40289 1282414 1163343 585941 81716 29750 195132 247631 275746 420205 425498 36954
40279 36954 -477652 -708481 -740853 -881586 -983299 -654955 -22117 356197 319631 266216
$$ packed form
40351I31853O9302q2666l57528m08447r910M60137M02557j68898o09020n07739
40341b80359j46933L3891J0723q718N255l0188o1649N057R0290L8478j46133k98211
40329g88497k57793J2278L55738M63661J82215k02185k35788R6678L31933J82884
40319A41124j03083k07718k09724l06179l64130j32667K64392M37514K77961N2847
40309a49663m2179r6888j86815j71031L2551J94829O3351j88506j03466L99521
40299b48296P87536N63417l8939l49896j67628P0870O3686N9145K50888K91631
40289A282414j19071n77402n04225n1966J65382N2499K8115J44459N293l88544
40279C6954n14606k30829l2372j40733j01713L28344O32838L78314l6566n3415
$$ plain form
40269 266216 437941 611968 600448 529123 488202 392998 316923 476008 750390 727899 385264
40258 385264 201335 387529 545853 359474 82124 826 -63145 -296561 -417778 -154722
40248 -154722 194319 205823 24629 83146 382183 584039 621662 684790 751094 651863 489070
40237 489070 473164 439187 60796 -494618 -671901 -320336 137961 397065 598601 837337
40227 837337 860312 528317 167442 141878 356792 473116 399847 298907 249671 163795
40217 163795 -20825 -224946 -287041 -88767 308326 654631 766014 757414 840755 930573
40207 930573 724707 203484 -254754 -349666 -166544 91664 350314 472700 186482 -486626
40197 -486626 -998994 -859425 -298295 20834 -135033 -374834 -331947 -99927 85473 238760
$$ packed form
40269B66216J71725J74027j1520p1325m0921r5204p6075J59085K74382k2491l42635
40258C85264j83929J86194J58324j86379k77350q1298o3971k33416j21217K63056
40248a54722L49041J1504j81194N8517K99037K01856L7623O3128O6304r9231j62793
40237D89070j5906l3977l78391n55414j77283L51565M58297K59104K01536K38736
40227H37337K2975l31995l60875k5564K14914J16324p3269j00940m9236q5876
40217A63795j84620k04121o2095J98274L97093L46305J11383q600Q3341Q9818
40207I30573k05866n21223m58238r4912J83122K58208K58650J22386k86218o73108
40197d86626n12368J39569N61130L19129j55867k39801M2887K32020J85400J53287
$$ plain form
40187 238760 465204 637382 520462 165337 -52662 151914 629479 941919 834911 496464
40177 496464 288002 261406 99624 -393275 -924429 -1041666 -727512 -391462 -292387 -286453
40167 -286453 -222003 -235340 -437978 -602922 -479590 -223656 -161641 -268941 -283707 -257610
40157 -257610 -507905 -964979 -1072007 -555296 126748 401730 296744 188096 156504 30017
40147 30017 -153636 -221222 -293603 -643269 -1121641 -1195368 -648033 137697 698552 937428
40137 937428 949716 770448 465025 170198 -123983 -570812 -1113075 -1421239 -1340160 -1114947
40127 -1114947 -1009697 -986717 -927849 -856944 -741062 -404263 108246 410484 317291 178759
40117 178759 322560 488914 270545 -149722 -235840 68933 289176 164805 -57095 -126558
$$ packed form
40187B38760K26444J72178j16920l55125k17999K04576M77565L12440j07008l38447
40177D96464k08462k6596j61782m92899n31154j17237L14154L36050R9075N934
40167b86453O4450j3337k02638j64944J23332K55934O2015j07300j4766K6097
40157b57610k50295m57074j07028N16711O82044K74982j04986j08648l1592j26487
40147C0017j83653o7586p2381l49666m78372p3727N47335P85730N60855K38876
40137I37428J2288j79268l05423k94827k94181m46829n42263l08164Q1079K25213
40127a114947J05250K2980N8868P0905J15882L36799N12509L02238r3193j38532
40117A78759J43801J66354k18369m20267q6118L04773K20243j24371k21900o9463
$$ plain form
40107 -126558 -131327 -225432 -389936 -565173 -694331 -577009 -50812 583113 712809 188773
40097 188773 -387673 -388876 84554 421663 271919 -162014 -475731 -460342 -189148 108423
40087 108423 241141 204202 141652 174037 326921 580575 832368 825397 346495 -409446
40077 -409446 -871472 -664632 -60022 301751 111605 -299073 -369140 49405 539258 624148
40067 624148 322116 47961 21806 39775 -105392 -298638 -400476 -552004 -842665 -936078
40057 -936078 -483615 247644 674991 755961 964824 1369120 1378060 678915 -142812 -348688
40047 -348688 -8885 257493 213551 143400 195858 139660 -151698 -398969 -295707 68791
40037 68791 363289 443993 438695 457445 408479 176235 -128051 -253107 -153811 -81355 -224742
$$ packed form
40107a26558m769r4105j64504j75237j29158J17322N26197O33925J29696n24036
40097A88773n76446j203M73430L37109j49744m33933l13717J5389K71194K97571
40087A08423J32718l6939o2550L2385J52884K53654K51793o971m78902p55941
40077d09446m62026K06840O04610L61773j90146m10678p0067M18545M89853Q4890
40067F24148l02032k74155k6155J7969j45167j93246j01838j51528k90661r3413
40057i36078M52463P31259M27347Q0970K08863M04296Q940o99145q21727k05876
40047c48688L39803K66378m3942p0151N2458n6198k91358k47271J03262L64498
40037F8791K94498Q0704n298J8750m8966k32244l04286j25056R9296P2456j43387
$$ plain form
40026 -224742 -414497 -365470 -107547 58490 -12438 -173255 -276808 -366697 -533544 -777287
40016 -777287 -1046725 -1246277 -1216787 -910710 -556916 -417837 -424584 -328146 -155538 -159240 -335180
40005 -335180 -417186 -396725 -574088 -953215 -1070703 -672467 -130299 103089 60233 -23276
39995 -23276 -150764 -344513 -355704 -51171 197465 -6045 -427117 -513827 -212854 31140
39985 31140 26848 98636 547867 1231775 1763524 1874805 1556922 1063287 760427 788312
39975 788312 919314 899086 776398 707634 645733 488312 332120 289370 263266 209191 346815
39964 346815 729004 904937 522866 -92 -30333 262827 172657 -340527 -534770 -96232
39954 -96232 345510 216689 -201196 -397830 -444982 -634654 -761760 -390131 379094 931895
$$ packed form
40026b24742j89755M9027K57923J66037p0928j60817j03553q9889j66847k43743
40016g77287k69438j99552K9490L06077L53794J39079o747R6438J72608l702j75940
40005c35180q2006K0461j77363l79127j17488L98236N42168K33388m2856q3509
39995b3276j27488j93749j1191L04533K48636k03510m21072q6710L00973K43994
39985C1140m292P1788M49231O83908N31749J11281l17883m93635l02860K7885
39975G88312J31002k0228j22688o8764o1901j57421j56192m2750k6104n4075J37624
39964C46815L82189J75933l82071n22958l0241K93160r0170n13184j94243M38538
39954i6232M41742j28821m17885j96634m7152j89672j27106L71629P69225N52801
$$ plain form
39944 931895 866975 341202 -232563 -549553 -559258 -486103 -637191 -1041798 -1405061 -1516889
39934 -1516889 -1483032 -1415239 -1182126 -703543 -242155 -124654 -351303 -702088 -1013855 -1128190
39924 -1128190 -841911 -230500 215775 144270 -159583 -199692 -11556 -22566 -278183 -324117
39914 -324117 85206 609139 799218 618993 334789 159681 152583 247619 252676 10773
39904 10773 -333599 -426627 -170241 104197 53931 -269819 -576131 -711969 -704411 -576863
39894 -576863 -347814 -135636 -47393 11015 210701 474265 481019 86956 -414794 -589196
39884 -589196 -333682 72553 340409 439653 499235 606156 777775 1004431 1199441 1186173
39874 1186173 873110 418984 110292 74859 192281 258936 155519 -105279 -381177 -471148
$$ packed form
39944I31895o4920n25773n73765l16990r705P3155j51088m04607l63263j11828
39934a516889L3857O7793K33113M78583M61388J17501k26649l50785l11767j14335
39924a128190K86279O11411M46275p1505l03853m0109J88136j1010k55617m5934
39914c24117M09323N23933J90079j80225k84204j75108p098R5036N057k41903
39904A0773l44372r3028K56386K74438n0266l23750l06312j35838P558J27548
39894e76863K29049K12178Q8243N8408J99686K63564O754l94063n01750j74402
39884e89196K55514M06235K67856R9244N9582J06921J71619K26656J95010j3268
39874A186173l13063m54126l08692l5433J17422O6655j03417k60798k75898q9971
$$ plain form
39864 -471148 -289750 52621 420614 801746 1135353 1138956 604205 -169664 -578448 -424111
39854 -424111 -120404 -80627 -216311 -223575 -62624 111361 249866 333453 175019 -350409
39844 -350409 -963525 -1193149 -920843 -467827 -177386 -160857 -406056 -819390 -1118026 -976185
39834 -976185 -405630 200987 501440 517966 461178 434846 426324 431483 447787 427064 335625
39823 335625 207666 96283 49066 146092 428844 740564 788339 477963 86855 -16394
39813 -16394 233894 580196 753618 702964 558215 480184 538971 644519 585199 222276
39803 222276 -309332 -649290 -531817 -69379 317434 283950 -121450 -528294 -611277 -358501
39793 -358501 -2334 231346 271375 180965 82765 86273 205552 323040 275241 2925 -380812
$$ packed form
39864d71148J81398L42371L67993L81132L33607L603n34751p73869m08784J54337
39854d24111L03707L9777j35684p264J60951J73985J38505Q3587j58434n25428
39844c50409o13116k29624K72306M53016K90441J6529k45199m13334k98636J41841
39834i76185N70555O06617L00453J6526n6788k6332q522N159J6304k0723r1439
39823C35625j27959j11383m7217R7026K82752L11720M7775l10376l91108j03249
39813a6394K50288L46302J73422n0654j44749p8031N8787J05548n9320l62923
39803B22276n31608l39958J17473M62438L86813l3484m05400m06844q2983K52776
39793c58501L56167K33680M0029r0410r8200L508J19279J17488m7799k72316l83737
$$ plain form
39782 -380812 -665497 -700373 -523169 -339802 -321447 -412750 -420655 -314055 -310742 -575859 -940062
39771 -940062 -1058905 -799032 -330428 114020 399376 433750 185292 -150671 -191583 233487
39761 233487 790943 930775 492415 -101427 -310810 -47907 304085 382632 216807 67213
39751 67213 27628 -55304 -280827 -489094 -465229 -257713 -150904 -319752 -619328 -763462
39741 -763462 -654427 -475035 -457367 -604984 -690611 -537482 -244527 -65332 -97310 -198238
39731 -198238 -221297 -208608 -286539 -471306 -669280 -790754 -767011 -536111 -142143 208489
39721 208489 343096 352195 460429 664736 693839 404913 40575 -67480 58316 85599
39711 85599 -173803 -544334 -753818 -747343 -644444 -524304 -395363 -293475 -247113 -171968
$$ packed form
39782c80812k84685l4876J77204J83367J8355r1303p905J06600L313k65117l64203
39771i40062j18843K59873M68604M44448K85356L4374k48458l35963m0912M25070
39761B33487N57456J39832m38360n93842k09383K62903L51992P8547j65825j49594
39751F7213l9585q2932k25523k08267K3865K07516J06809j68848k99576j44134
39741g63462J09035J79392J7668j47617q5627J53129K92955J79195l1978j00928
39731a98238k3059J2689p7931j84767j97974j21474K3743K30900L93968L50632
39721B08489J34607R099J08234K04307K9103k88926l64338j08055J25796K7283
39711H5599k59402l70531k09484O475J02899J20140J28941J01888M6362P5145
$$ plain form
39701 -171968 53059 411534 781436 1108027 1364349 1367925 916374 189196 -279574 -225371
39691 -225371 -2490 -55358 -266617 -183955 247154 597043 583517 388550 268683 212916
39681 212916 132037 75743 64152 -59621 -393670 -742249 -790983 -430966 176098 745611
39671 745611 1039060 1022560 879175 732228 436256 -110682 -562275 -459597 26231 195310
39661 195310 -199626 -595304 -491055 -155613 -74906 -154686 27794 506050 956420 1189650
39651 1189650 1144658 666559 -181634 -817056 -723794 -192080 85157 6491 49544 382768
39641 382768 675108 787196 948952 1139029 971195 417593 23874 108087 281867 97616
39631 97616 -293943 -480124 -390356 -230048 -133075 -159324 -329942 -439973 -190203 270405
$$ packed form
39701a71968K25027L58475L69902L26591K56322L576m51551p27178m68770N4203
39691b25371K22881n2868k11259Q2662M31109L49889j3526j94967j19867n5767
39681B12916q0879n6294j1591j23773l34049l48579m8734L60017O07064N69513
39671G45611K93449j6500j43385j46947k95972n46938m51593J02678M85828J69079
39661A95310l94936l95678J04249L35442Q0707p9780J82480M78256M50370K33230
39651A189650m4992m78099q48193o35422R3262N31714K77237p8666M3053L33224
39641C82768K92340J12088J61756J90077j67834n53602l93719Q4213J73780j84251
39631I7616l91559j86181Q9768J60308R6973k6249j70618j10031K49770M60608
$$ plain form
39621 270405 344953 -185328 -753564 -771656 -405902 -193206 -248083 -301780 -233807 -104204
39611 -104204 107217 368716 441651 270795 251393 635212 959852 648418 -43759 -334582
39601 -334582 -44329 271996 300795 347779 605084 743192 533663 296978 348228 458004
39591 458004 284675 -12647 -37477 204641 354404 253587 84492 27631 91401 244151
39581 244151 452045 603112 607031 539235 492536 350749 -43341 -518555 -658105 -327304
39571 -327304 121088 300373 257265 309934 557919 779745 771684 557914 233587 -172227
39561 -172227 -555683 -659089 -360262 48508 125861 -163570 -393742 -248743 69688 148624
39551 148624 -94937 -376594 -455284 -377260 -322877 -374258 -471884 -503718 -396679 -159531 146719
$$ packed form
39621B70405P4548n30281n68236j8092L65754K12696n4877n3697O7973J29603
39611a04204K11421K61499P2935j70856j9402L83819L24640l11434o92177k90823
39601c34582K90253L16325K8799M6984K57305J38108k09529k36685N1250J09776
39591D58004j73329k97322k4830K42118J49763j00817j69095n6861O3770J52750
39581B44151K07894J51067L919o7796m6699j41787l94090m75214j39550L30801
39571c27304M48392J79285m3108N2669K47985K21826q061k13770l24327m05814
39561a72227l83456j03406K98827M08770P7353k89431k30172J44999L18431P8936
39551A48624k43561k81657p8690P8024N4383n1381r7626l1834J07039K37148L06250
$$ plain form
39540 146719 466552 732772 820108 638739 291989 -5186 -203094 -429354 -661927 -653487
39530 -653487 -364413 -202460 -500694 -926164 -823612 -122681 512220 531600 125903 -187205
39520 -187205 -276813 -398382 -670043 -893519 -874540 -652093 -354858 -29998 285181 459277
39510 459277 380060 137191 -26947 22750 174018 225112 117137 -64416 -269044 -535236
39500 -535236 -849603 -1077959 -1106455 -961110 -715833 -380714 10621 290718 295734 95991
39490 95991 -53424 -8928 136457 252157 362789 553026 762842 803367 580950 216713
39480 216713 -92190 -259590 -293906 -165916 158315 540816 706940 572807 402936 482253
39470 482253 738480 886645 858004 828887 859916 804535 620063 475624 439537 323816
$$ packed form
39540A46719L19833K66220Q7336j81369l46750k97175j97908k26260k32573Q440
39530f53487K89074J61953k98234m25470J02552P00931O34901J9380m05697l13108
39520a87205q9608j21569k71661k23476J8979K22447K97235L24860L15179J74096
39510D59277p9217k42869j64138M9697J51268N1094j07975j81553k04628k66192
39500e35236l14367k28356k8496J45345K45277L35119L91335K80097N016j99743
39490I5991j49415M4496J45385J15700J10632J90237K09816M0525k22417l64237
39480B16713l08903j67400l4316J27990L24231L82501J66124j34133j69871P9317
39470D82253K56227J48165k8641k9117L1029n5381j84472j44439l6087j15721
$$ plain form
39460 323816 -766 -348620 -451980 -293208 -69649 24605 -115573 -459662 -788865 -888709
39450 -888709 -860402 -977914 -1166670 -996018 -361447 236030 374816 276194 304534 293500
39440 293500 -107286 -690545 -896823 -639002 -351796 -260397 -148115 118413 349857 414239
39430 414239 408852 356073 148806 -98706 -60306 311613 683516 847828 952976 1104828
39420 1104828 1144047 1002115 908089 1028169 1208822 1254929 1158297 912297 468948 59456
39410 59456 143558 754558 1254822 1083931 468889 55179 82708 283325 388301 347763
39400 347763 156550 -176465 -499580 -616655 -517802 -358724 -261151 -248517 -280841 -247810
39390 -247810 -53376 203461 292838 174063 46188 15541 -2835 45255 408679 1041038
$$ packed form
39460C23816l24582l47854j03360J58772K23559R4254j40178l44089l29203r9844
39450h88709K8307j17512j88756J70652O34571N97477J38786r8622K8340j1034
39440B93500m00786n83259k06278K57821K87206R1399J12282K66528K31444O4382
39430D14239n387n2779k07267k47512L8400L71919L71903J64312J05148J51852
39420A104828L9219j41932r4026J20080J80653M6107r6632k46000m43349m09492
39410E9456Q4102O11000N00264j70891o15042m13710K7529K00617J04976m0538
39400C47763j91213l33015l23115j17075R8853J59078R7573J2634l2324L3031
39390b47810J94434K56837Q9377j18775j27875l0647j8376M8090L63424O32359
$$ plain form
39380 1041038 1424146 1194466 638623 229835 -22350 -354088 -658804 -629331 -349790 -239606
39370 -239606 -431216 -638882 -658241 -595351 -547805 -425086 -195840 -34072 -97122 -327613
39360 -327613 -525725 -496623 -169920 283332 546084 533569 536824 789480 1085894 1112223
39350 1112223 953584 896806 892690 664517 268610 72410 179051 331268 421531 635882
39340 635882 999508 1221365 1133744 901463 666346 370502 67110 1104 199762 357301
39330 357301 301718 194645 103336 -169765 -588195 -704179 -347387 -42547 -275436 -719923
39320 -719923 -733055 -319328 6207 116062 351865 739520 799585 308662 -290416 -486274
39310 -486274 -301209 -53957 132437 310759 452939 485173 427179 309831 101118 -150574
$$ packed form
39380A041038L83108k29680n55843m08788k52185l31738l04716K9473K79541J10184
39370b39606j91610k07666j9359O2890M7546J22719K29246J61768o3050k30491
39360c27613j98112K9102L26703M53252K62752j2515L255K52656K96414K6329
39350A112223j58639n6778m116k28173l95907j96200J06641J52217R0263K14351
39340F35882L63626K21857q7621k32281k35117k95844l03392o6006J98658J57539
39330C57301n5583j07073r1309k73101m18430j15984L56792L04840k32889m44487
39320g19923j3132M13727L25535J09855K35803L87655O0065m90923n99078j95858
39310d86274J85065K47252J86394J78322J42180L2234n7994j17348k08713k51692
$$ plain form
39300 -150574 -283600 -272667 -306019 -457112 -509452 -312589 -77377 -45220 -69961 134573
39290 134573 477611 602149 441735 275443 238086 184964 100771 205019 478379 496384
39280 496384 20827 -573756 -809707 -776338 -871978 -1041338 -763334 155212 1166325 1521874
39270 1521874 1020480 129376 -466939 -398295 128107 539313 494156 241316 217208 381140
39260 381140 260639 -334579 -991405 -1210856 -967419 -600915 -391177 -403262 -542771 -593086
39250 -593086 -375741 -21657 99458 -146455 -467095 -577163 -567795 -619248 -594712 -252856
39240 -252856 270376 540360 376610 66696 -9472 201574 423951 388700 167310 142470
39230 142470 519350 914449 728964 -4811 -529736 -323576 230041 463872 361887 384872
$$ packed form
39300a50574j33026J0933l3352j51093n2340J96863K35212L2157k4741K04534
39290A34573L43038J24538j60414j66292l7357n3122q4193J04248K73360J8005
39280D96384m75557n94583k35951L3369r5640j69360K78004R18546J011113L55549
39270A521874n01394q91104n96315O8644N26402M11206m5157k52840k4108J63932
39260C81140j20501n95218o56826k19451K43437L66504K09738j2085j39509n0315
39250e93086K17345L54084J21115k45913l20640j10068R368n1453K4536L41856
39240b52856N23232K69984j63750l09914p6168K11046K22377l5251k21390k4840
39230A42470L76880L95099j85485p33775n24925K06160N53617K33831j01985K2985
$$ plain form
39220 384872 598667 572480 138850 -267607 -174404 368666 915818 1069918 744954 201027
39210 201027 -158164 -192976 -172944 -341873 -518082 -422840 -203099 -193471 -294719 -111672
39200 -111672 325470 539474 379154 259663 458934 692871 648554 488360 512324 689259
39190 689259 847408 1025588 1306396 1530194 1467260 1103611 556930 -73978 -596048 -732420
39180 -732420 -482352 -231128 -274552 -468530 -554010 -541766 -519773 -371956 -2860 403382
39170 403382 655986 842220 1025082 940870 399822 -253506 -535579 -498654 -538754 -686122
39160 -686122 -624796 -343518 -182991 -192226 -17992 408160 623906 356266 21843 139145
39150 139145 594145 900512 932178 943786 1007333 914994 659349 567930 797799 1027168
$$ packed form
39220C84872K13795k6187m33630m06457R3203N43070N47152J54100l24964n43927
39210B01027l59191l4812K0032j68929j76209R5242K19741R628j01248J83047
39200a11672M37142K14004j60320j19491J99271K33937m4317j60194K3964J76935
39190F89259J58149J78180K80808K23798o2934l63649n46681o30908n22070j36372
39180g32420K50068K51224m3424j93978q5480J2244K1993J47817L69096M06242
39170D03382K52604J86234J82862q4212n41048o53328k82073L6925m0100j47368
39160f86122O1326K81278J60527r235J74234M26152K15746k67640l34423J17302
39150A39145M55000L06367L1666J1608O3547r2339k55645r1419K29869K29369
$$ plain form
39140 1027168 889542 501178 289392 411845 622853 687776 650384 618079 531619 317761
39130 317761 106967 88097 216515 265444 164416 122348 362220 817426 1138362 1003394
39120 1003394 462901 -41591 -122359 87520 116037 -150530 -261655 117606 648428 773919
39110 773919 464902 96513 -188185 -474024 -590970 -253667 324954 572823 393851 269852
39100 269852 409808 439925 159661 -58267 27659 48369 -296036 -633276 -525461 -198853
39090 -198853 -89020 -68353 246284 737205 971842 897299 743645 475673 -18696 -404553
39080 -404553 -262587 151044 210990 -77535 -102859 328187 724536 768116 717038 754104
39070 754104 609222 141848 -256516 -190866 214857 585395 709279 504519 -3803 -480676
$$ packed form
39140A027168j37626l88364k11786J22453K11008O4923l7392l2305q6460k13858
39130C17761k10794j8870J28418M8929j01028m2068K39872M55206L20936j34968
39120A003394n40493n04492q0768K09879K8517k66567j11125L79261N30822J25491
39110G73919l09017l68389k84698k85839j16946L37303N78621K47869j78972j23999
39100B69852J39956L0117k80264k17928Q5926K0710l44405l37240J07815L26608
39090a98853J09833K0667L14637M90921K34637p4543j53654k67972m94369l85857
39080d04553J41966M13631N9946k88525k5324M31046L96349M3580n1078L7066
39070G54104j44882m67374l98364O5650M05723L70538J23884k04760n08322m76873
$$ plain form
39060 -480676 -499746 -163144 -40728 -297627 -426681 -125748 159991 5745 -239336 -43513
39050 -43513 396934 503658 295202 326295 749969 1078355 918746 432688 -20913 -273434
39040 -273434 -284214 -65124 209369 307114 254253 303534 522764 664401 528459 230913
39030 230913 15355 -14610 112846 341407 577805 700440 662918 513537 285769 -28095
39020 -28095 -367713 -579982 -559099 -354079 -119273 -1715 -49720 -162149 -161615 1706 163768
39009 163768 157897 53316 49314 171781 244264 178368 131718 298173 636362 889759 844390
38998 844390 529356 180820 14091 20815 23436 -54190 -61094 152552 472651 643396 617109
38987 617109 594403 684510 721019 531951 242396 128815 241129 361956 341446 279342
$$ packed form
39060d80676j9070L36602J22416k56899j29054L00933K85739j54246k45081J95823
39050d3513M40447J06724k08456L1093M23674L28386j59609m86058m53601k52521
39040b73434j0780K19090K74493R7745n2861M9281K19230J41637j35942k97546
39030B30913k15558k9965J27456K28561K36398J22635l7522j49381k27768l13864
39020b8095l39618k12269K0883K05020K34806J17558m8005j12429N34J63321J62062
39009A63768n871j04581m002J22467P2483o5896m6650J66455L38189K53397m5369
38998H44390l15034l48536j66729O724K621p7626o904K13646L20099J70745k6287
38987F17109k2706R0107L6509j89068k89555j13581J12314J20827k0510o2104
$$ plain form
38977 279342 295812 285980 63104 -329042 -621240 -641594 -498421 -414450 -498277 -721455 -1000575
38966 -1000575 -1219015 -1249376 -1044078 -671409 -232396 189773 484927 553113 456816 404755
38956 404755 479782 509073 340026 122401 126021 346154 493251 366782 67007 -181678
38946 -181678 -278149 -292036 -368792 -590156 -839194 -837060 -437619 133057 466967 412267 198574
38935 198574 105067 131597 80530 -99889 -179192 64747 458185 524894 101176 -325769
38925 -325769 -186308 372777 668607 457865 218118 299687 369074 73205 -248217 -66500
38915 -66500 466741 759961 678770 606184 737431 892314 954678 958647 822180 542973 537691
38904 537691 1141486 1857316 1856270 1241292 986308 1457806 1858477 1492597 784248 516806
$$ packed form
38977B79342J6470r832k22876l92146k92198k0354J43173Q3971q3827k23178k79120
38966a000575k18440l0361K05298L72669M39013M22169K95154O8186r6297n2061
38956D04755P5027K9291j69047k17625L620K20133J47097j26469k99775k48685
38946a81678r6471j3887p6756k21364k49038K134L99441N70676L33910n4700k13693
38935A98574r3507K6530n1067j80419p9303K43939L93438O6709m23718m26945
38925c25769J39461N59085K95830k10742k39747Q1569O9387k95869l21422J81717
38915f6500N33241K93220q1191p2586J31247J54883O2364L969j36467k79207n282
38904E37691O03795P15830j046o14978k54984M71498M00671l65880p08349k67442
$$ plain form
38894 516806 711261 860333 788961 676242 559689 359124 163461 80863 30338 -12112
38884 -12112 134768 477670 697691 677786 743830 1036615 1139629 774997 379369 452627
38874 452627 768308 803915 559916 354883 184126 -87187 -250749 -140033 -141634 -610768
38864 -610768 -1113723 -1036098 -627184 -549386 -655434 -253447 523471 757802 279151 18622
38854 18622 481221 915928 570699 -115851 -293817 -6818 64291 -256912 -506238 -392332
38844 -392332 -131923 -20696 -100670 -240489 -269090 -76674 238726 421215 363305 206662
38834 206662 73374 -63006 -159192 -44653 299378 677904 984248 1249456 1334158 998826
38824 998826 422301 181248 469204 780688 673244 406937 444136 709572 815338 724547
$$ packed form
38894E16806J94455J49072p1372j12719j16553k00565j95663q2598n0525m2450
38884a2112J46880L42902K20021j9905O6044K92785J03014l64632l95628P3258
38874D52627L15681L5607k43999k05033j70757k71313j63562J10716j601m69134
38864f10768n02955P7625M08914P7798j06048M01987P76918K34331m78651k60529
38854A8622M62599M34707l45229o86550j77966K86999P1109l21203k49326J13906
38844c92332K60409J11227p9974j39819k8601J92416L15400J82489n7910j56643
38834B06662j33288j36380r6186J14539L44031L78526L06344K65208Q4702l35332
38824I98826n76525k41053K87956L11484j07444k66307L7199K65436J05766r0791
$$ plain form
38814 724547 694271 750402 696362 534497 452541 460628 423651 395137 542551 760491 720756
38803 720756 352980 -19161 -87845 119980 388902 588816 731407 873632 1022056 1104142
38793 1104142 1066493 1004336 1064493 1186976 1144547 936607 900888 1235741 1619500 1572867
38783 1572867 1079296 587489 464721 675663 964181 1145541 1204599 1228697 1256209 1182094
38773 1182094 914185 612204 547844 677718 653906 391997 280066 569320 894431 773415
38763 773415 325856 60145 127798 257049 309600 385159 386414 22855 -616247 -963471
38753 -963471 -679904 -104571 242882 304438 358473 505360 604436 590812 552163 537782 538029
38742 538029 628257 885183 1122721 953143 265996 -489274 -704396 -296910 175201 167461
$$ packed form
38814G24547l0276N6131n4040j61865q1956Q087l6977k8514J47414K17940l9735
38803G20756l67776l72141o8684K07825K68922J99914J42591J42225J48424Q2086
38793A104142l7649o2157O0157J22483m2429k07940l5719L34853L83759m6633
38783A572867m93571m91807j22768K10942K88518J81360N9058K4098K7512p4115
38773A182094k67909l01981o4360J29874k3812k61909j11931K89254L25111j21016
38763G73415m47559k65711O7653J29251N2551P5559J255l63559o39102l47224
38753i63471K83567N75333L47453O1556N4035J46887R9076j3624l8649j4381K47
38742E38029R0228K56926K37538j69578o87147p55270k15122M07486M72111p740
$$ plain form
38732 167461 -211562 -377294 -25749 517734 773933 713892 693873 909319 1165594 1202351
38722 1202351 1027129 817219 619531 301709 -204251 -714126 -918905 -703450 -295549
38713 -295549 -54283 -121043 -324603 -412179 -291738 -39487 222125 388540 393540 249414
38703 249414 35845 -191114 -421857 -586368 -525455 -183241 220888 352617 123860 -196986
38693 -196986 -277181 -50688 297793 600738 823794 917642 746158 314942 -46253 30019
38683 30019 480497 860197 904812 796510 778303 792104 690052 535475 428891 268421
38673 268421 -7198 -155286 21576 255516 179049 -39723 64631 467481 681923 584738
38663 584738 587858 847094 940558 624533 317439 408623 581015 345205 -111917 -186057
$$ packed form
38732A67461l79023j65732L51545N43483K56199o0041k0019K15446K56275L6757
38722A202351j75222k09910j97688l17822n05960n09875k04779K15455M07901
38713b95549K41266o6760k03560q7576J20441K52251K61612J66415N000j44126
38703B49414k13569k26959k30743j64511O0913L42214M04129J31729k28757l20846
38693a96986q0195K26493L48481L02945K23056R3848j71484m31216l61195P6272
38683C0019M50478L79700M4615j08302j8207J3801j02052j54577j06584j60470
38673B68421k75619j48088J76862K33940p6467k18772J04354M02850K14442r7185
38663E84738L120K59236R3464l16025l07094R1184J72392k35810m57122p4140
$$ plain form
38653 -186057 232514 643555 666698 433352 244007 200573 236114 263522 256209 317982 606180
38642 606180 1051582 1298570 1118046 743609 583806 720680 902148 912791 743080 495530
38632 495530 306612 254256 209354 -45474 -411999 -445098 64321 739682 1112400 1193624
38622 1193624 1240115 1229813 978065 567641 235410 -2384 -185665 -69206 514904 1074414
38612 1074414 881562 54120 -396451 171105 1209876 1738660 1522059 1121189 1026216
38603 1026216 1162435 1202099 1023650 772467 648568 741342 997444 1256074 1332389 1170472
38593 1170472 970077 1068241 1575500 2196653 2560560 2642809 2645151 2562262 2230837 1795143
38583 1795143 1668489 1895973 1997636 1673846 1250589 1132000 1212460 1199784 1159490 1299453
$$ packed form
38653a86057M18571M11041K3143k33346j89345m3434L5541K7408p313O1773K88198
38642F06180M45402K46988j80524l74437j59803J36874J81468J0643j69711k47550
38632D95530j88918n2356m4902k54828l66525l3099N09419O75361L72718Q1224
38622A193624M6491j0302k51748m10424l32231k37794j83281J16459N84110N59510
38612A074414j92852q27442m50571N67556J038771N28784k16601m00870r4973
38603A026216J36219L9664j78449k51183j23899R2774K56102K58630P6315j61917
38593A170472k00395R8164N07259O21153L63907Q2249K342q2889l31425m35694
38583A795143j26654K27484J01663l23790m23257j18589Q0460j2676m0294J39963
$$ plain form
38573 1299453 1493243 1469856 1278097 1158251 1135013 1096701 1064065 1031979 807475 382447
38563 382447 168453 436962 844926 984859 1047407 1370892 1688032 1507719 976828 636129
38553 636129 538738 377169 290966 675731 1260480 1282439 658550 150476 240458 627828
38543 627828 961947 1263713 1451536 1269020 909709 919488 1252175 1254473 837261 731272
38533 731272 1201971 1486772 1074064 621044 876767 1495156 1735278 1649104 1677726 1646262
38523 1646262 1147637 528876 493100 930988 1081967 755420 505385 594256 636926 410423
38513 410423 253279 400061 533050 317991 -59799 -201316 -19770 296760 608544 869961
38503 869961 995449 888920 594300 330865 340070 646158 968037 978058 676305 373963
$$ packed form
38573A299453J93790k3387j91759j19846k3238l8312l2636l2086k24504m25028
38563C82447k13994K68509M07964J39933O2548L23485L17140j80313n30891l40699
38553F36129r7391j61569q6203L84765N84749K1959o23889n08074Q9982L87370
38543F27828L34119L01766J87823j82516l59311R779L32687K298m17212j05989
38533G31272M70699K84801m12708m53020K55723O18389K40122q6174K8622l1464
38523A646262m98625o18761l5776M37888J50979l26547k50035Q8871M2670k26503
38513D10423j57144J46782J32989k15059l77790j41517J81546L16530L11784K61417
38503H69961J25488j06529k94620k63435R205L06088L21879J0021l01753l02342
$$ plain form
38493 373963 288735 344586 393053 386277 285980 88749 -1468 229716 560547 506200 81419
38482 81419 -98189 272958 694649 657931 445861 608454 1014805 1049241 553694 -12021
38472 -12021 -267185 -249454 -75828 273166 759326 1195545 1410890 1335984 1000606 618213
38462 618213 507308 701012 811958 531817 75234 -132772 -5936 241350 458746 585018
38452 585018 531940 366042 388714 705077 943402 756739 360229 177483 204975 188124
38442 188124 201946 505543 932698 992416 594473 192798 134280 266702 290239 171442
38432 171442 93174 208242 505067 785180 811737 601987 459140 583740 828499 983174
38422 983174 1056314 1078811 923928 602307 455547 727722 1181246 1450966 1529654 1582535
$$ packed form
38493C73963q5228N5851M8467o776j00297j97231r0217K31184L30831n4347m24781
38482H1419j79608L71147M21691l6718k12070J62593M06351L4436m95547n65715
38472a2021k55164J7731J73626L48994M86160M36219K15345p4906l35378l82393
38462F18213j10905J93704J10946k80141m56583k08006J26836K47286K17396J26272
38452E85018n3078j65898K2672L16363K38325j86663l96510j82746K7492j6851
38442A88124J3822L03597M27155N9718l97943m01675n8518J32422K3537j18797
38432A71442p8268J15068K96825K80113K6557k09750j42847J24600K44759J54675
38422I83174P3140K2497j54883l21621j46760K72175M53524K69720P8688N2881
$$ plain form
38412 1582535 1553821 1318915 985802 707902 451677 249605 344431 740359 1005146 915870
38402 915870 859418 1121136 1272510 871412 288250 102623 109122 -222424 -641279 -448537
38392 -448537 237387 561796 290186 112695 436536 770819 614203 212526 73679 290619
38382 290619 653217 979554 1105197 933588 648963 537226 567519 528317 503319 718088
38372 718088 987359 902655 565669 529348 956718 1419443 1596650 1600046 1538831 1356308
38362 1356308 1208731 1428998 1955208 2292868 2173203 1803454 1411734 1015750 677720
38353 677720 517588 456936 375815 421261 678977 752559 306265 -191245 -42127 530624
38343 530624 702567 430695 504942 1140705 1573267 1336593 974416 1056623 1319131 1269519
$$ packed form
38412A582535k8714k34906l33113k77900k56225k02072R4826L95928K64787q9276
38402I15870n6452K61718J51374m01098n83162j85627O499l31546m18855J92742
38392d48537O85924L24409k71610j77491L23841L34283j56616m01677j38847K16940
38382B90619L62598L26337J25643j71609k84625j11737L0293l9202k4998K14769
38372G18088K69271q4704l36986l6321M27370M62725J77207L396o1215j82523
38362A356308j47577K20267N26210L37660j19665l69749l91720l95984l38030
38353F77720j60132o0652q1121M5446K57716P3582m46294m97510J49118N72751
38343E30624J71943k71872P4247O35763M32562k36674l62177Q2207K62508m9612
$$ plain form
38333 1269519 988073 867016 1054214 1480044 1991273 2280125 2147412 1891471 1909497 1984981
38323 1984981 1646416 1111123 1011103 1241454 1067502 418751 37933 223507 487471
38314 487471 624140 1003825 1583881 1779939 1589989 1661643 1965244 1707988 936165 785495
38304 785495 1567629 2063252 1476761 681606 618220 824323 624548 500777 1055413 1713455
38294 1713455 1722457 1489778 1686868 1927793 1608024 1213115 1464985 1896981 1619283 892986
38284 892986 643751 933879 1148374 1200941 1361750 1374116 926870 550696 891046 1529281
38274 1529281 1645892 1399329 1525241 2024749 2377193 2599633 2964506 3124756 2670971
38265 2670971 2120729 2210992 2636925 2612328 2216513 2050551 2054604 1838600 1673214 1939129
$$ packed form
38333A269519k81446j21057J87198M25830N11229K88852j32713k55941J8026P5484
38323A984981l38565n35293j00020K30351j73952o48751l80818J85574K63964
38314D87471J36669L79685N80056J96058j89950P1654L03601k57256p71823j50670
38304G85495P82134M95623n86491p95155o3386K06103j99775j23771N54636O58042
38294A713455R002k32679J97090K40925l19769l94909K51870M31996k77698p26297
38284H92986k49235K90128K14495N2567J60809J2366m47246l76174L40350O38235
38274A529281J16611k46563J25912M99508L52444K22440L64873J60250m53785
38265B670971n50242R0263M25933k4597l95815j65962M053k16004j65386K65915
$$ plain form
38255 1939129 2113938 1566996 852097 926489 1592242 1998460 2125434 2416190 2543101 2015393
38245 2015393 1441977 1658243 2160235 1996871 1615887 2075818 2972565 3044493 2424888 2344117
38235 2344117 2902768 3119054 2955991 3284524 3975500 4051156 3650370 3822951 4439757 4378776
38225 4378776 3753770 3810763 4560922 4707501 4071455 3902669 4566687 5071093 5096314 5344119
38215 5344119 5704912 5294314 4443994 4365060 4773340 4307999 3317372 3489794 4627294
38206 4627294 4795218 3940302 4127405 5683350 6480742 5785820 5379119 5979091 6101802
38197 6101802 5464698 5803836 7185102 7420127 6372818 6623179 8515065 9262587 8580727
38188 8580727 9858921 13654677 16076210 16416949 19475047 26491644 32116394 36601665
$$ packed form
38255A939129J74809n46942p14899P4392O65753M06218J26974K90756J26911n27708
38245B015393n73416K16266N01992j63364l80984M59931Q96747P1928o19605q0771
38235B344117N58651K16286j63063L28533O90976P5656m00786J72581O16806o0981
38225D378776o25006N6993P50159J46579o36046j68786O64018N04406K5221K47805
38215E344119L60793m10598q50320p8934M08280m65341r90627J72422J137500
38206D627294J67924q54916J87103J555945P97392o94922m06701N99972J22711
38197F101802o37104L39138J381266K35025j047309K50361J891886P47522o81860
38188H580727J278194L795756K421533L40739L058098P016597N624750M485271
$$ plain form
38180 36601665 51641330 82958131 113419213 117549527 91867324 58538223 38279884
38173 38279884 31487947 28327106 24931140 23151568 23253783 24385031 27347817 32274556
38165 32274556 38568489 49884109 71317995 96760882 107601965 92422111 62385330
38158 62385330 38608360 28632844 24149026 18035084 12516551 10605797 9840882 7655578
38150 7655578 5757252 5793901 5921602 4566235 3320679 3597293 4066552 3587624 3332510
38141 3332510 4009322 4120847 2926557 2199082 3105274 4080197 3722151 3193786 3745146
38132 3745146 4292604 3595700 2672438 2869907 3437905 3184367 2832721 3551233 4642584
38123 4642584 4885485 4872461 5823406 7175009 7531140 7107307 7076760 7239955 6556940 5493389
$$ packed form
38180C6601665J5039665L1316801L0461082M130314k5682203l3329101k0258339
38173C8279884o791937l160841l395966j779572J02215J131248K962786M926739
38165C2274556O293933J1315620K1433886K5442887J0841083j5179854l0036781
38158F2385330k3776970r975516m483818o113942n518533j910754p64915k185304
38150G655578j898326L6649J27701j355367j245556K76614M69259m78928k55114
38141C332510O76812J11525j194290p27475R06192R74923l58046n28365N51360
38132C745146N47458o96904r23262J97469N67998k53538l51646P18512J091351
38123D642584K42901j3024R50945J351603L56131m23833l0547J63195o83015j063551
$$ plain form
38113 5493389 5588386 6813791 7440627 6678225 5605374 5184962 5024849 4584039 4170407
38104 4170407 4121279 4102172 3816228 3579182 3733490 4163841 4668472 5153619 5305959 4800126
38094 4800126 3991417 3671419 3987048 4346207 4508045 4895543 5591699 5951906 5661706
38085 5661706 5372984 5726341 6390566 6663496 6507878 6405968 6584788 6918664 7280553
38076 7280553 7531470 7457827 7122175 6982973 7317883 7850718 8249007 8572776 8897444 8994193
38066 8994193 8814741 8776070 9070239 9251260 9102327 9311105 10511767 12196029 13466767
38057 13466767 14391001 15592010 16918616 17707309 18143774 19148313 20977402 23088637
38049 23088637 25325187 28062294 31279878 34765480 39128509 45214129 52668171 60713765
$$ packed form
38113E493389R4997J225405O26836p62402j072851m20412j60113m40810m13632
38104D170407m9128j9107k85944k37046J54308M30351N04631M85147J52340n05833
38094D800126q08709l19998L15629L59159J61838L87498O96156L60207k90200
38085E661706k88722L53357O64225K72930j55618j01910J78820L33876L61889
38076G280553K50917p3643l35652j39202L34910N32835L98289L23769L24668R6749
38066H994193j79452l8671K94169J81021j48933K08778J200662J684262J270738
38057A3466767R24234J201009J326606P88693M36465J004539J829089K111235
38049B3088637K236550K737107L217584L485602M363029O085620P454042Q045594
$$ plain form
38041 60713765 70173124 82738270 98352866 115793947 136059330 162296772 195589935
38034 195589935 233365410 271821424 305586298 324784247 320130414 295901188 271290339
38027 271290339 260379669 254022586 231005640 186342527 138429413 106258958 89651444
38020 89651444 77060742 63753521 53448430 47317250 41423592 34236998 28791644 26522721
38012 26522721 24888658 22247219 20156329 19495465 18545627 16443654 14910142 14949822 14970479
38003 14970479 13761862 12550479 12485980 12567696 11705422 10680860 10472672 10530654 10206792
37994 10206792 10159015 10883609 11446245 11083663 10626557 11006619 11721306 12066543 12569333
37985 12569333 13891827 15528952 16846933 18222520 19881472 20769555 19949176 18145228
$$ packed form
38041F0713765R459359J2565146J5614596J7441081K0265383K6237442L3293163
38034A95589935L7775475L8456014L3764874J9197949m653833k4229226k4610849
38027B71290339j0910670o357083k3016946m4663113m7913114l2170455j6607514
38020H9651444j2590702j3307221j0305091o131180n893658p186594n445354k268923
38012B6522721j634063k641439k090890o60864r49838k101973j533512L9680K0657
38003A4970479j208617j211383o4499Q1716q62274j024562k08188N7982l23862
37994A0206792m7777P24594N62636l62582m57106L80062P14687L45237N02790
37985A2569333J322494J637125J317981J375587J658952Q88083q20379j803948
$$ plain form
37977 18145228 16612193 15376584 13849160 12274716 11250965 10545249 9624519 8707318
37969 8707318 8189744 7734394 7006965 6569636 6935792 7483441 7430398 7127223 7220589 7334099
37959 7334099 6872144 6384704 6714481 7404920 7423785 6962155 7000415 7480596 7493995 7077508
37949 7077508 7230758 8136864 8868999 9035088 9309882 10002449 10352344 9736023 8589055
37940 8589055 7670689 7205390 7123035 7434633 8004743 8506154 8850791 9199514 9455891 9275321
37930 9275321 8651265 7986812 7533214 7208617 6940130 6728291 6461542 6128962 6069571 6533667
37920 6533667 7205785 7667821 8050554 8637832 9140111 9053165 8474022 7854497 7215252 6346690
37910 6346690 5498319 5041238 4696881 3971658 3135936 2858902 3070330 3152588 3087164 3343622
$$ packed form
37977A8145228j533035j235609j527424j574444j023751p05716r20730r17201
37969H707318n17574m55350p27429m37329L66156N47649n3043l03175R3366J13510
37959G334099m61955m87440L29777O90439J8865m61630L8260M80181J3399m16487
37949G077508J53250R06106P32135J66089K74794O92567L49895o16321j146968
37940H589055r18366m65299q2355L11598N70110N01411L44637L48723K56377j80570
37930I275321o24056o64453m53598l24597k68487k11839k66749l32580n9391M64096
37920F533667O72118M62036L82733N87278N02279q6946n79143o19525o39245q68562
37910F346690q48371m57081l44357p25223q35722k77034K11428Q2258o5424K56458
$$ plain form
37900 3343622 3711814 3394829 2368388 1563443 1491311 1678728 1682460 1676307 1748355 1575007
37890 1575007 1169902 1102807 1570010 1988773 1884339 1510601 1279244 1211920 1222524 1326009
37880 1326009 1359788 1101644 781808 834275 1115471 1128285 1003575 1329093 1955322 2043382
37870 2043382 1496512 1219156 1610706 1933731 1660726 1341521 1512259 1778047 1711728 1730036
37860 1730036 2261379 2837933 2842378 2489407 2301861 2248289 2135488 2211011 2598485 2743183
37850 2743183 2236390 1646743 1691997 2058141 1906280 1187333 605791 519504 636564 647080
37840 647080 522406 321044 193017 399232 940276 1427557 1628198 1748062 1894748 1808271
37830 1808271 1477268 1374201 1623307 1630682 1092582 645989 857720 1289814 1330279 1246226
$$ packed form
37900C343622L68192l16985j026441q04945p2132J87417L732o153P2048j73348
37890A575007m05105o7095M67203M18763j04434l73738k31357o7324J0604J03485
37880A326009L3779k58144l19836N2467K81196J2814j24710L25518O26229Q8060
37870B043382n46870k77356L91550L23025k73005l19205J70738K65788o6319J8308
37860A730036N31343N76554M445l52971j87546n3572j12801P5523L87474J44698
37850B743183n06793n89647M5254L66144j51861p18947n81542q6287J17060J0516
37840F47080j24674k01362j28027K06215N41044M87281K00641J19864J46686q6477
37830A808271l31003j03067K49106P375n38100m46593K11731M32094M0465q4053
$$ plain form
37820 1246226 1534095 1866067 1660672 1179153 1060365 1202491 1089570 832552 890956 1109349
37810 1109349 1025839 818853 944988 1143306 850032 349412 425154 1036001 1414219 1377557
37800 1377557 1497416 2028957 2684133 3391907 4250247 4777932 4293960 3080419 2146382
37791 2146382 1799588 1469159 951265 701467 762063 542058 -62214 -370564 -62927 326398
37781 326398 369594 311277 384623 424269 439267 732181 1183473 1233857 809309 458877 414495
37770 414495 380567 374632 787317 1424878 1541962 1086821 853500 1097761 1108723 537051
37760 537051 27020 45522 150660 -52498 -241857 -165132 -93410 -35746 423529 1049960
37750 1049960 919077 8276 -424087 274340 1143141 1249907 1058302 1280720 1618348
$$ packed form
37820A246226K87869L31972k05395m81519j18788J42126j12921k57018N8404K18393
37810A109349q3510k06986J26135J98318k93274n00620P5742O10847L78218l6662
37800A377557J19859N31541O55176P07774Q58340N27685m83972j213541r34037
37791B146382l46794l30429n17894k49798O0596k20005o04272l08350L07637L89325
37781C26398M3196n8317P3346L9646J4998K92914M51292N0384m24548l50432m4382
37770D14495l3928n935M12685O37561J17084m55141k33321K44261J0962n71672
37760E37051n10031J8502J05138k03158j89359P6725P1722N7664M59275O26431
37750A049960j30883r10801m32363O98427Q68801J06766j91605K22418L37628
$$ plain form
37741 1618348 1617035 1603405 1820881 1826219 1627854 2060971 3135487 3660705 3558283 4524095
37731 4524095 7000147 9025333 10350090 14834661 24820747 34901577 36260868 27350562
37723 27350562 15881724 9304614 7409117 5962617 3594402 1932200 1537905 1279812
37715 1279812 773116 693346 1043740 1140391 1015402 1191869 1389472 918767 67100 -242939
37705 -242939 74238 334590 353263 484533 625137 329092 -190055 -221203 305548 744186
37695 744186 767593 674492 712679 827733 1009832 1216347 1081276 376594 -394751 -552785
37685 -552785 -220010 -47883 -148621 -69866 283082 500785 431317 341179 281295 -9803
37675 -9803 -504270 -828328 -875329 -886072 -895741 -716850 -491107 -585477 -856294 -709049 -59487
$$ packed form
37741A618348j313j3630K17476N338j98365M33117J074516N25218j02422R65812
37731D524095K476052K025186J324757M484571R986086J0080830J359291q910306
37723B7350562j1468838o577110j895497j446500k368215j662202l94295k58093
37715A279812n06696p9770L50394R6651j24989J76467J97603m70705q51667l10039
37705b42939L17177K60352J8673J31270J40604k96045n19147l1148N26751M38638
37695G44186K3407r3101L8187J15054J82099K06515j35071p04682p71345j58034
37685e52785L32775J72127j00738P8755L52948K17703o9468r0138n9884k91098
37675i803m94467l24058m7001j0743r669J78891K25743r4370k70817J47245O49562
$$ plain form
37664 -59487 439848 386376 208162 413254 808489 894918 630425 350869 201929 66772
37654 66772 -82278 -109228 30816 177499 138722 -81576 -241024 -111082 181807 242844
37644 242844 -14353 -128147 275807 863999 1066482 991129 1282241 2087658 2780080 2837147
37634 2837147 2439328 1988202 1564040 1157916 967465 1082033 1231789 1214680 1257614 1588786
37624 1588786 1961093 2026811 1929032 2033878 2243203 2107772 1588505 1180973 1184018 1301735
37614 1301735 1164096 862375 700172 699038 666690 573557 535256 517736 385307 223580
37604 223580 306613 700134 1175840 1577666 1970768 2343176 2558564 2835969 3824077 5686495
37594 5686495 7381336 7518429 5963178 4021235 2905903 2564213 2238033 1616264 973091
$$ packed form
37664e9487M99335n3472j78214K05092L95235Q6429k64493k79556j48940j35157
37654F6772j49050k6950J40044J46683l8777k20298j59448J29942K92889O1037
37644B42844k57197j13794M03954N88192K02483p5353K91112Q05417O92422N7067
37634B837147l97819m51126m24162m06124j90451J14568J49756j7109M2934L31172
37624A588786L72307O5718r7779J04846K09325j35431n19267m07532L045J17717
37614A301735j37639l01721j62203j134l2348r3133l8301j7520j32429j61727
37604B23580Q3033L93521M75706M01826L93102L72408K15388K77405R88108J862418
37594E686495J694841J37093j555251j941943j115332l41690l26180o21769o43173
$$ plain form
37585 973091 537225 266900 127016 158598 288460 360911 338100 272102 168108 68119
37575 68119 137127 434260 715836 703297 440261 151660 -127776 -504846 -885284 -979777
37565 -979777 -678649 -218051 64226 34613 -146105 -167288 113769 445632 416628 -28892
37555 -28892 -498543 -634814 -444607 -83203 353146 678603 638076 305153 115637 272093
37545 272093 491013 591988 875785 1544703 2201937 2395274 2257476 2125813 1965792 1742610
37535 1742610 1894513 2685042 3439027 3269593 2360421 1685861 1598170 1570951 1285714 1032841
37525 1032841 926496 623081 74167 -215121 22252 411983 568615 517913 310555 -116438
37515 -116438 -485782 -294783 343003 667944 397134 168287 484397 932770 955910 754393
$$ packed form
37585I73091m35866k70325j39884L1582J29862P2451k2811o5998j03994r9989
37575F8119O9008K97133K81576j2539k63036k88601k79436l77070l80438r4493
37565i79777L01128M60598K82277k9613j80718k1183K81057L31863k9004m45520
37555b8892m69651j36271J90207L61404M36349L25457m0527l32923j89516J56456
37545B72093K18920J00975K83797O68918O57234J93337j37798j31663j60021k23182
37535A742610J51903P90529P53985j69434r09172o74560q7691k7219k85237k52873
37525A032841j06345l03415n48914k89288K37373L89731J56632n0702k07358m26993
37515a16438l69344J90999O37786L24941k70810k28847L16110M48373K3140k01517
$$ plain form
37505 754393 820678 1078557 1107669 867296 637980 504930 363681 221091 133587 77013
37495 77013 134391 496439 1039570 1295591 1104641 876489 932410 1059409 1023368 1004355
37485 1004355 1136748 1124457 754888 334499 178759 130087 6916 14883 229486 220250
37475 220250 -228720 -547730 -192247 441847 620915 371656 224444 237698 105129 -49355
37465 -49355 140463 461164 351056 -96001 -181448 303227 790879 842451 634869 414587
37455 414587 140815 -106500 36731 658417 1267699 1343263 919024 449942 311485 523633
37445 523633 783547 747656 429255 229762 414082 755504 943936 1082128 1416442 1817654
37435 1817654 1966281 1872903 1768887 1636524 1307165 899566 696481 669434 552758 311277
$$ packed form
37505G54393O6285K57879K9112k40373k29316j33050j41249j42590q7504n6574
37495G7013N7378L62048N43131K56021j90950k28152N5921J26999l6041j9013
37485A004355J32393j2291l69569m20389j55740m8672j23171P967K14603r236
37475B20250m48970l19010L55483O34094J79068k49259j47212J3254j32569j54484
37465d9355J89818L20701j10108m47057q5447M84675M87652N1572k07582k20282
37455D14587k73772k47315J43231O21686O09282P5564m24239m69082j38457K12148
37445E23633K59914l5891l18401j99493J84320L41422J88432J38192L34314M01212
37435A817654J48627r3378j04016j32363l29359m07599k03085k7047j16676k41481
$$ plain form
37425 311277 147272 143723 253863 486303 746164 725625 368011 173196 546231 1101156
37415 1101156 1182220 862749 799158 1223173 1706889 1876511 1780767 1568142 1327509 1261460
37405 1261460 1574445 2184233 2850465 3442690 3801712 3675436 3201133 3037071 3474738
37396 3474738 3847731 3472632 2751462 2559374 2893179 3001568 2624318 2223568 2110544
37387 2110544 2143897 2190819 2177976 1865505 1256532 940137 1286713 1681377 1395074 776122
37377 776122 605152 735899 518381 147319 290758 691903 531241 -16981 -21237 527540
37367 527540 737691 492801 621253 1317430 1838395 1891151 1935622 2036883 1806581 1483058
37357 1483058 1626219 1838724 1357116 710627 996140 1732626 1509374 609005 652314 1668665
$$ packed form
37425C11277j64005l549J10140K32440K59861k0539l57614j94815L73035N54925
37415A101156Q1064l19471o3591M24015M83716J69622r5744k12625k40633o6049
37405A261460L12985O09788O66232N92225L59022j26276m74303j64062M37667
37396C474738L72993l75099p21170j92088L33805J08389l77250m00750j13024
37387B110544L3353M6922j2843l12471o08973l16395L46576L94664k86303o18952
37377G76122j70970J30747k17518l71062J43439M01145j60662n48222m256N48777
37367E27540K10151k44890J28452O96177N20965N2756M4471J01261k30302l23523
37357A483058J43161K12505m81608o46489K85513P36486k23252r00369M3309J016351
$$ plain form
37347 1668665 2080864 1696250 1914578 2741936 2686415 2016098 2707215 4543856 5061265
37338 5061265 4243273 5015924 7847423 9741571 10329530 13186217 18496614 21635672 23936444
37329 23936444 36615639 64479839 91254543 93578693 69063434 39274548 23394259
37322 23394259 19753429 16905180 11751271 8707558 8448741 7216213 4412319 3016818
37314 3016818 3468037 3212490 1820347 1442487 2386803 2641114 1767361 1397100 1807402
37305 1807402 1540327 566104 518982 1490400 1651195 511942 -254817 194481 643866
37296 643866 244603 -167917 55227 259641 30257 34207 561608 828993 441147 117042
37286 117042 342580 611203 536440 485531 642424 613776 365730 421019 787957 804713
$$ packed form
37347A668665M12199l84614K18328Q27358n5521o70317O91117J836641N17409
37338E061265q17992P72651K831499J894148N87959K856687N310397L139058K300772
37329B3936444J2679195K7864200K6774704K324150k4515259k9788886j5880289
37322B3394259l640830k848249n153909l043713k58817j232528k803894j395501
37314C016818M51219k55547j392143l77860R44316K54311q73753l70261M10302
37305A807402k67075r74223m7122R71418J60795j139253p66759M49298M49385
37296F43866l99263m12520K23144K04414k29384L950N27401K67385l87846l24105
37286A17042K25538K68623p4763n0909J56893k8648k48046N5289L66938J6756
$$ plain form
37276 804713 333379 12523 108837 245377 414705 1012770 1684052 1497833 601082 323308
37266 323308 1167194 2008152 1865488 1234207 993511 1117522 1193234 1235735 1271157 958557
37256 958557 269030 -228011 -272111 -301959 -504905 -406108 89863 241710 -300354 -748732
37246 -748732 -389634 317753 612534 583110 621018 482648 -172672 -894975 -1018719 -691792
37236 -691792 -498236 -445968 -149198 289139 374765 31527 -336369 -449686 -312797 27128
37226 27128 418988 546777 348855 216448 392803 537048 299937 -71674 -168058 -41805
37216 -41805 92427 351329 823981 1148026 1075505 1082456 1715746 2621007 2940085 2479031
37206 2479031 1786444 1231503 732242 336577 333905 679014 899122 733397 418355 231671
$$ packed form
37276H04713m71334l20856R6314J36540J69328N98065O71282j86219q96751k77774
37266C23308Q43886Q40958j42664o31281k40696J24011P5712M2501L5422l12600
37256I58557o89527m97041m4100k9848k02946R8797M95971J51847n42064m48378
37246g48732L59098P07387K94781k9424L7908j38370o55320p22303j23744L26927
37236f91792J93556N2268K96770M38337Q5626l43238l67896j13317J36889L39925
37226B7128L91860J27789j97922j32407J76355J44245k37111l71611r6384J26253
37216d1805J34232K58902M72652L24045p2521O951O33290R05261L19078m61054
37206B479031o92587n54941m99261l95665k672L45109K20108j65725l15042j86684
$$ plain form
37196 231671 157225 106656 120011 230543 381742 529516 630897 575571 348204 177174
37186 177174 279276 538926 666901 569585 351485 113579 -21122 114904 463659 669242
37176 669242 560765 446202 591490 718603 473270 105533 115428 407674 428696 81269
37166 81269 -134484 50350 301368 299863 220089 349271 616727 740366 575703 163478
37156 163478 -327017 -605315 -473281 -119392 55475 -40014 -132028 -99448 -184234 -531204
37146 -531204 -855336 -818667 -516868 -335870 -444210 -635249 -621559 -346262 -15940 115389
37136 115389 2628 -168072 -241698 -279445 -380837 -456805 -371240 -198523 -100372 -29725 166201
37125 166201 403532 439524 291457 247602 403167 507740 389083 236850 301548 542232
$$ packed form
37196B31671p4446n0569J3355J10532J51199J47774J01381n5326k27367j71030
37186A77174J02102K59650J27975r7316k18100k37906j34701J36026L48755K05583
37176F69242j08477j14563J45288J27113k45333l67737R895K92246K1022l47427
37166H1269k15753J84834K51018j505p9774J29182K67456J23639j64663m12225
37156A63478m90495k78298J32034L53889J74867r5489r2014L2580q4786l46970
37146e31204l24132L6669L01799J80998j08340j91039J3690K75297L30322J31329
37136A15389j12761j70700p3626l7747j01392p5968Q5565J72717R8151P0647J95926
37125A66201K37331L5992j48067m3855J55565J04573j18657j52233O4698K40684
$$ plain form
37115 542232 745206 812894 771548 632856 404879 161415 -203 -21803 107916 318141
37105 318141 455740 455775 466046 628036 808892 800252 715392 850119 1153502 1231222 959783
37094 959783 694527 709385 829833 846731 891881 1076963 1114089 714527 122083 -178385
37084 -178385 -117928 1307 72611 275539 664047 1070277 1405513 1705131 1902656 1902038
37074 1902038 1828749 1858995 1882143 1736818 1672434 2056460 2676205 2928437 2716942 2510481
37064 2510481 2470310 2315534 2209019 2833862 4226139 5545282 6553211 8182159 10835795
37055 10835795 13545619 16277080 21574473 31185987 41407210 44961107 38751604 27546463
37047 27546463 18491583 13877086 11145633 8185943 5648538 4480663 4055511 3508189
$$ packed form
37115E42232K02974O7688m1346j38692k27977k43464j61618k1600J29719K10225
37105C18141J37599L5J0271J61990J80856q640q4860J34727L03383P7720k71439
37094I59783k65256J4858J20448J6898M5150J85082L7126l99562n92444l00468
37084a78385O0457J19235P1304K02928L88508M06230L35236K99618J97525o18
37074A902038p3289L0246K3148j45325o4384L84026O19745K52232k11495k06461
37064B510481m0171j54776j06515O24843J392277J319143J007929J628948K653636
37055A0835795K709824K731461N297393R611514J0221223L553897o209503j1205141
37047B7546463r054880m614497k731453k959690k537405j167875m25152n47322
$$ plain form
37039 3508189 3022761 2892604 2652780 1986664 1449828 1525035 1805889 1787426 1677621 1760335
37029 1760335 1693832 1168715 643572 679936 1026207 1067747 800862 698661 913559 1205259
37019 1205259 1407486 1461931 1253055 862175 693136 918181 1125071 924918 520890 241466
37009 241466 -11875 -307989 -192290 630144 1521048 1617993 1038099 574451 427681 117508
36999 117508 -460138 -816695 -777972 -757799 -956735 -1052143 -910323 -897076 -1183257 -1359229
36989 -1359229 -1068878 -514168 -45035 257525 321659 -59574 -752813 -1131848 -822644 -254474
36979 -254474 -76395 -318883 -520870 -445500 -269100 -195829 -220352 -206521 17894 542720
36969 542720 1174266 1493603 1301459 871646 590561 491825 338104 30235 -284189 -444074
$$ packed form
37039C508189m85428j30157k39824o66116n36836P5207K80854j8463j09805Q2714
37029A760335o6503n25117n25143L6364L46271M1540k66885j02201K14898K91700
37019A205259K02227N4445k08876l90880j69039K25045K06890k00153m04028k79424
37009B41466k53341k96114J15699Q22434Q90904R6945n79894m63648j46770l10173
36999A17508n77646l56557L8723K0173j98936r5408J41820J3247k86181j75972
36989a359229K90351N54710M69133L02560O4134l81233o93239l79035L09204N68170
36979b54474J78079k42488k01987P5370J76400P3271k4523J3831K24415N24826
36969E42720O31546L19337j92144m29813k81085r8736j53721l07869l14424j59885
$$ plain form
36959 -444074 -435029 -342371 -266061 -257245 -257366 -133106 166546 509096 662240 479800 53208
36948 53208 -295191 -286619 -48235 -56629 -552232 -1150202 -1263739 -803691 -196855 189491
36938 189491 323615 268859 40391 -233940 -316776 -146411 67251 86139 -160029 -582363
36928 -582363 -954239 -1001864 -699264 -386549 -359528 -480212 -482868 -470837 -687532 -945319
36918 -945319 -809646 -319327 3052 -101463 -363491 -514890 -580835 -578615 -448466 -379317
36908 -379317 -664821 -1118892 -1207315 -913684 -851620 -1280867 -1651391 -1454608 -908873 -403027
36898 -403027 118354 701591 893867 366573 -365736 -512880 -53302 360658 330262 3189
36888 3189 -376796 -674219 -727329 -490349 -240548 -253238 -378678 -300044 -53617 91150
$$ packed form
36959d44074R045R2658P6310Q816j21J24260K99652L42550J53144j82440m26592
36948E3208l48399Q572K38384q394m95603n97970j13537M60048O06836L86346
36938A89491J34124n4756k28468k74331q2836J70365K13662J8888k46168m22334
36928e82363l71876m7625L02600L12715K7021j20684k656J2031k16695k57787
36918i45319J35673M90319L22379j04515k62028j51399o5945K220J30149O9149
36908c79317k85504m54071q8423K93631O2064m29247l70524J96783N45735N05846
36898d03027N21381N83237J92276n27294p32309j47144M59578M13960l0396l27073
36888C189l79985k97423n3110K36980K49801j2690j25440P8634K46427J44767
$$ plain form
36878 91150 106114 153215 201706 104634 -52683 -56533 87875 240354 403179 589175 617290
36867 617290 401969 219768 290890 346256 64463 -318487 -359541 -134428 -34897 -48353
36857 -48353 111403 306969 132611 -274556 -308315 157454 571864 558195 304866 -880
36847 -880 -425338 -787755 -633245 -19958 326745 26047 -392982 -349197 -39811 97073
36837 97073 213255 705903 1407521 1769148 1644894 1326408 960950 487496 43190 -115486
36827 -115486 -75108 -156992 -342166 -288055 28151 181287 -23435 -199101 17008 362193
36817 362193 317304 -143401 -571451 -726332 -818003 -993288 -984489 -555996 -42896 -19710
36807 -19710 -471708 -734442 -405731 77855 85953 -283066 -370469 79087 603013 706077
$$ packed form
36878I1150J4964M7101M8491r7072j57317l850J44408J52479J62825J85996K8115
36867F17290k15321j82201P1122N5366k81793l82950m1054K25113R9531j3456
36857d8353J59756J95566j74358m07167l3759M65769M14410j3669k53329l05746
36847h80m24458l62417J54510O13287L46703l00698m19029M3785L09386J36884
36837I7073J16182M92648P01618L61627j24254l18486l65458m73454m44306j58676
36827a15486M0378q1884j85174N4111L16206J53136k04722j75666K16109L45185
36817C62193m4889m60705m28050j54881r1671j75285Q799M28493N13100K3186
36807a9710m51998k62734L28711M83586Q098l69019q7403M49556N23926J03064
$$ plain form
36797 706077 423658 60251 -245482 -453085 -418901 -82926 286597 317914 -27510 -416316
36787 -416316 -508960 -249912 149125 409995 419057 328353 374973 582640 754953 776415 735803
36776 735803 687548 515403 185679 -63419 -8688 206312 238303 -4471 -294042 -422924
36766 -422924 -394241 -284843 -148622 -98637 -266305 -576255 -742403 -630007 -476864 -568200
36756 -568200 -786627 -723323 -241654 300721 483330 291934 21730 -136817 -234609 -382608
36746 -382608 -622909 -925500 -1151200 -1101662 -797228 -590617 -733402 -935285 -725084 -198664
36736 -198664 68937 -70574 -56830 507188 1195016 1359896 1012698 640913 437005 198903
36726 198903 -173602 -543971 -793451 -822813 -445950 303244 904423 860195 387112 137241
$$ packed form
36797G06077k82419l63407l05733k07603L4184L35975L69523L1317l45424l88806
36787d16316r2644K59048L99037K60870R062r0704M6620K07667J72313K1462m0612
36776G35803m8255j72145l29724k49098N4731K15000L1991k42774k89571j28882
36766d22924K8683J09398J36221M9985j67668l09950j66148J12396J53143r1336
36756e68200k18427O3304M81669N42375J82609j91396k70204j58547r7792j47999
36746c82608k40301l02591k25700M9538L04434K06611j42785k01883K10201N26420
36736a98664K67601j39511J3744N64018O87828J64880l47198l71785k03908k38102
36726A98903l72505l70369k49480k9362L76863P49194O01179m4228m73083k49871
$$ plain form
36716 137241 296066 437324 249170 -86221 -269242 -190212 167642 691951 988671 728886
36706 728886 187298 -30222 170785 305951 129017 -59363 -45201 -44764 -188260 -226056
36696 -226056 -50583 1519 -283567 -579701 -538792 -328228 -277020 -342684 -317281 -261145 -345468
36685 -345468 -495098 -521824 -416689 -251651 -11698 256587 382737 351191 353786 405448
36675 405448 280342 11625 -3766 337656 575474 420992 265815 512389 867123 839041
36665 839041 546402 428973 460470 269712 -146390 -414009 -375448 -204270 -43222 48557
36655 48557 -57775 -362060 -570531 -508439 -434596 -545769 -530705 -131724 247482 155271
36645 155271 -46845 266913 839829 844646 238109 -150644 44501 236183 -43080 -441620
$$ packed form
36716A37241J58825J41258j88154l35391j83021P9030L57854N24309K96720k59785
36706G28886n41588k17520K01007J35166j76934j88380J4162M37j43496l7796
36696b26056J75473N2102k85086k96134M0909K10564N1208o5664K5403N6136q4323
36685c45468j49630k6726J05135J65038K39953K68285J26150l1546K595N1662
36675D05448j25106k68717j5391L41422K37818j54482j55177K46574L54734k8082
36665H39041k92639j17429L1497j90758m16102k67619L8561J71178J61048R1779
36655D8557j06332l04285k08471O2092P3843j11173J5064L98981L79206r2211
36645A55271k02116L13758N72916M817o06537l88753J95145J91682k79263l98540
$$ plain form
36635 -441620 -532002 -511449 -696068 -899756 -808369 -551059 -453242 -517207 -502362 -300114 8280
36624 8280 259831 258077 -23538 -243294 -46913 356560 415793 75422 -134019 47023
36614 47023 240903 127031 -83114 -160922 -295869 -638631 -889505 -755597 -425331 -208893
36604 -208893 -80532 60296 62393 -147702 -273044 -89238 154423 166272 90865 144475
36594 144475 152157 -61368 -171982 180124 698325 813981 582044 562096 886891 1078623
36584 1078623 832852 412949 129636 -78189 -324630 -417038 -99756 520579 1002660 979495
36574 979495 480720 -107443 -401227 -353111 -170584 40683 326325 583413 576109 375382
36564 375382 374800 640916 696456 303580 -5138 295245 812735 787955 294768 106113
$$ packed form
36635d41620r0382K0553j84619k03688R1387K57310R7817o3965J4845K02248L08394
36624H280K51551j754k81615k19756J96381M03473N9233l40371k09441J81042
36614D7023J93880j13872k10145p7808j34947l42762k50874J33908L30266K16438
36604b08893J28361J40828K097k10095j25342J83806K43661J1849p5407N3610
36594A44475P682k13525j10614L52106N18201J15656k31937j9948L24795J91732
36584A078623k45771m19903k83313k07825k46441r2408L17282O20335M82081k3165
36574I79495m98775n88163k93784M8116J82527K11267K85642K57088p304k00727
36564C75382n82K66116N5540l92876l08718L00383N17490k4780m93187j88655
$$ plain form
36554 106113 423487 557940 54316 -580316 -623107 -100181 374487 382122 -8391 -484445
36544 -484445 -749307 -703322 -549441 -575753 -755182 -773893 -515389 -236032 -162314 -220324
36534 -220324 -315374 -570753 -1053757 -1491034 -1513317 -1074552 -467685 -26133 99262 8626
36524 8626 -22240 165709 362251 224946 -220091 -597233 -746518 -905463 -1184038 -1260421
36514 -1260421 -891352 -395281 -245354 -402901 -463048 -328612 -307109 -547574 -771736 -666998
36504 -666998 -274012 129094 335351 313014 163248 67515 170044 445876 751445 1007903
36494 1007903 1234344 1405056 1411171 1209418 910255 674168 587079 642058 748091 747402 547062
36483 547062 281310 224062 454407 708934 693429 486474 475138 866604 1405832 1669651
$$ packed form
36554A06113L17374J34453n03624o34632m2791N22926M74668P635l90513m76054
36544d84445k64862M5985J53881k6312j79429j8711K58504K79357P3718n8010
36534b20324r5050k55379m83004m37277k2283M38765O06867M41552J25395r0636
36524H626l0866J87949J96542j37305m45037l77142j49285j58945k78575p6383
36514a260421L69069M96071J49927j57547o0147J34436K1503k40465k24162J04738
36504f66998L92986M03106K06257k2337j49766r5733J02529K75832L05569K56458
36494A007903K26441J70712O115k01753k99163k36087q7089N4979J06033o89k00340
36483E47062k65752n7248K30345K54527j5505k06955j1336L91466N39228K63819
$$ plain form
36473 1669651 1548553 1305448 1192240 1168957 1058506 852068 731465 815945 991654 1026535
36463 1026535 820600 513244 320734 264737 141609 -146558 -322326 -24249 614808 972379
36453 972379 688005 158709 15321 296838 499571 342625 65320 -61258 -94593 -138847
36443 -138847 -72107 187771 408975 327854 36931 -180386 -271051 -380873 -480379 -334592
36433 -334592 121553 625864 887193 863452 664317 341872 -88118 -507014 -735094 -741314
36423 -741314 -721196 -879034 -1139351 -1179208 -823176 -314084 -37543 -33295 -10728 136250
36413 136250 135830 -181307 -494714 -385018 68829 433113 561336 691246 889420 833632
36403 833632 333018 -278822 -550225 -491149 -455654 -586471 -684748 -591157 -416839 -348935
$$ packed form
36473A669651j21098k43105j13208k3283j10451k06438j20603Q4480J75709L4881
36463A026535k05935l07356j92510n5997j23128k88167j75768K98077O39057L57571
36453I72379k84374n29296j43388K81517K02733j56946k77305j26578l3335m4254
36443a38847O6740K59878K21204q1121k90923k17317r0665j09822r9506J45787
36433c34592M56145N04311K61329k3741j99135l22445m29990m18896k28080o220
36423g41314K0118j57838k60317l9857L56032N09092K76541M248K2567J46978
36413A36250m20l17137l13407J09696M53847L64284J28223J29910J98174n5788
36403H33632n00614o11840k71403N9076L5495j30817r8277R3591J74318O7904
$$ plain form
36393 -348935 -418621 -516964 -513917 -342193 -72706 108663 117821 117009 283520 498020 494394
36382 494394 288629 162917 188685 112934 -142376 -230863 97207 525720 589129 347303
36372 347303 233978 368198 475652 451763 506950 669826 623981 234130 -181452 -362294
36362 -362294 -515626 -879360 -1185019 -986100 -362165 128334 168019 3501 12455 220828
36352 220828 335520 102295 -417450 -856999 -874862 -531741 -213859 -118035 -47667 131903
36342 131903 156612 -194361 -595842 -574194 -244217 -130145 -314257 -340657 -48589 83096
36332 83096 -318195 -908706 -1124230 -944148 -774344 -793874 -803962 -623964 -312816 -17767
36322 -17767 169686 212473 131275 -9645 -198608 -485477 -838516 -1114987 -1237184 -1249624
$$ packed form
36393c48935o9686r8343L047J71724K69487J81369R158q12J66511K14500l626
36382D94394k05765j25712K5768p5751k55310q8487L28070M28513O3409k41826
36372C47303j13325J34220J07454k3889N5187J62876m5845l89851m15582j80842
36362c62294j53332l63734l05659J98919O23935M90499L9685j64518Q954K08373
36352B20828J14692k33225n19745m39549j7863L43121L17882R5824P0368J79570
36342A31903K4709l50973m01481K1648L29977J14072j84112k6400K92068J31685
36332H3096m01291n90511k15524J80082J69804j9530j0088J79998L11148K95049
36322a7767J87453M2787q1198j40920j88963k86869l53039k76471j22197j2440
$$ plain form
36312 -1249624 -1145123 -832933 -367587 14978 208264 340148 427609 226903 -325032 -798592
36302 -798592 -752935 -353194 -134126 -248010 -336132 -140891 135186 196998 97152 116612
36292 116612 338582 515795 370235 -44356 -347574 -246865 112922 329573 205932 -160108
36282 -160108 -658875 -1192521 -1421361 -972841 -86941 433062 227165 -134246 -81870 37339
36272 37339 -395385 -1110398 -1254626 -697995 -189524 -175125 -271586 -103668 89998 7695
36262 7695 -198335 -326599 -498713 -747948 -754867 -416889 -200769 -450504 -770160 -618188
36252 -618188 -153060 70475 -48017 -187039 -252062 -389721 -507448 -378645 -143056 -125285
36242 -125285 -210418 2280 427208 504684 81668 -334932 -391880 -370355 -574865 -777818
$$ packed form
36312a249624J04501L12190M65346L82565J93286J31884Q7461k00706n51935m73560
36302g98592M5657L99741K19068j13884q8122J95241K76077O1812r9846J9460
36292A16612K21970J77213j45560m14591l03218J00709L59787K16651j23641l66040
36282a60108m98767n33646k28840M48520Q85900N20003k05897l61411N2376J19209
36272C7339m32724p15013j44228N56631N08471J4399r6461J67918J93666q2303
36262G695k06030j28264j72114k49235o919L37978K16120k49735l19656J51972
36252f18188M65128K23535j18492j39022o5023j37659j17727J28803K35589J7771
36242a25285q5133K12698M24928P7476m23016m16600n6948K1525k04510k02953
$$ plain form
36232 -777818 -652681 -332457 -120868 14868 235478 389241 240504 -36887 -48639 217589
36222 217589 385199 252046 -15056 -252827 -497863 -739017 -810778 -675271 -543696 -545201
36212 -545201 -486044 -142232 348474 607226 472974 147310 -115839 -274152 -372287 -319284
36202 -319284 4965 439601 563376 165750 -427478 -685573 -473274 -117650 95680 220601
36192 220601 372060 441309 299069 75314 -30169 -87793 -296551 -556912 -491730 56253
36182 56253 784251 1256875 1284391 929210 363616 -162923 -406653 -345351 -206741 -166097
36172 -166097 -131356 47493 281467 338673 185564 58546 180054 512169 807462 837916
36162 837916 586495 274656 173688 324448 481357 406962 172359 60095 195612 396338
$$ packed form
36232g77818J25137L20224K11589J35736K20610J53763j48737k77391j1752K66228
36222B17589J67610j33153k67102k37771k45036k41154p1761J35507J31575j505
36212e45201N9157L43812M90706K58752j34252l25664k63149j58313r8135N3003
36202c19284L24249M34636J23775l97626n93228k58095K12299L55624K13330J24921
36192B20601J51459O9249j42240k23755j05483n7624k08758k60361O5182N47983
36182E6253P27998M72624K7516l55181n65594n26539k43730O1302J38610M0644
36172a66097L4741J78849K33974N7206j53109j27018J21508L32115K95293L0454
36162H37916k51421l11839j00968J50760J56909p4395k34603j12264J35517K00726
$$ plain form
36152 396338 400520 144746 -213593 -460531 -469312 -259157 12082 135927 3597 -290044
36142 -290044 -495964 -412291 -95334 148045 73755 -176633 -192059 200010 685397 862944
36132 862944 756792 700383 784444 724845 330897 -184141 -501075 -562849 -467889 -232573
36122 -232573 79707 193500 -46949 -268648 82125 920103 1460946 1182732 502671 185488
36112 185488 335994 394706 28945 -426288 -497487 -169080 236699 508032 638760 649755
36102 649755 561920 469614 441249 392727 223198 24011 -18568 106078 226385 225181 114403
36091 114403 -95486 -395128 -634138 -596233 -289244 9713 75445 -36312 -122502 -31684
36081 -31684 303642 813098 1180164 1029327 385177 -249113 -439379 -253433 23471 345584
$$ packed form
36152C96338M182k55774l58339k46938q781K10155K71239J23845j32330k93641
36142b90044k05920Q3673L16957K43379p4290k50388j5426L92069M85387J77547
36132H62944j06152n6409Q4061n9599l93948n15038l16934o1774R4960K35316
36122b32573L12280J13793k40449k21699L50773Q37978N40843k78214o80061l17183
36112A85488J50506N8712l65761m55233p1199L28407M05779K71333J30728J0995
36102F49755q7835r2306k8365m8522j69529j99187m2579J24646J20307j204j10778
36091A14403k09889k99642k39010L7905L06989K98957O5732j11757q6190R0818
36081c1684L35326N09456L67066j50837o44150o34290j90266J85946K76904L22113
$$ plain form
36071 345584 780192 1134597 1113267 776313 465432 300301 129654 -17629 115663 486675
36061 486675 615186 232550 -278029 -403679 -192796 -64202 -120492 -68378 230288 519133
36051 519133 529322 313840 96966 -399 17192 107639 194333 192418 113482 59104 62756
36040 62756 40383 -45493 -81550 43397 250065 332597 190629 -68207 -248250 -246592 -130879
36029 -130879 -78156 -222588 -512314 -705302 -555856 -61283 477241 699812 537305 277092
36019 277092 221491 325709 287917 -7305 -292348 -244719 112648 470196 608735 553883
36009 553883 386159 98828 -272144 -516234 -400983 50257 522602 678256 431624 -36225
35999 -36225 -478973 -763110 -879292 -853353 -695927 -430078 -129880 96077 178062 154019
$$ packed form
36071C45584M34608L54405k1330l36954l10881j65131j70647j47283J33292L71012
36061D86675J28511l82636n10579j25650K10883J28594n6290N2114K98666K88845
36051E19133J0189k15482k16874r7365J7591R0447Q6694j915p8936n4378L652
36040F2756k2373q5876l6057J24947K06668Q2532j41968k58836j80043J658J15713
36029a30879N2723j44432k89726j92988J49446M94573N38524K22571j62507k60213
36019B77092n5601J04218l7792k95222k85043M7629L57367L57548J38539n4852
36009E53883j67724k87331l70972k44090J15251M51240M72345J55654k46632m67849
35999c6225m42748k84137j16182K5939J57426K65849L00198K25957Q1985k4043
$$ plain form
35989 154019 141636 198081 226566 100514 -127275 -269904 -300252 -423557 -722970 -906850
35979 -906850 -658997 -152845 88263 -133952 -444249 -406347 -18496 435547 768548 907234
35969 907234 736161 218082 -401047 -757696 -743878 -546410 -329455 -51610 366505 819117
35959 819117 1038520 838948 339350 -96546 -230284 -218921 -349490 -534916 -367505 236461
35949 236461 787351 856069 658958 661597 828659 722023 256991 -120813 -80265 183300
35939 183300 331071 351003 450183 699587 961609 1025809 722459 77761 -557728 -739837
35929 -739837 -410516 33425 255501 345050 515717 678436 588036 283702 74363 86230
35919 86230 87037 -149860 -494547 -625501 -458927 -241148 -195927 -244206 -201411 -130780 -248951
$$ packed form
35989A54019j2383N6445K8485j26052k27789j42629l0348j23305k99413j83880
35979i06850K47853N06152K41108k22215l10297L7902L87851M54043L33001J38686
35969I07234j71073n18079o19129l56649J3818J97468K16955K77845M18115M52612
35959H19117K19403j99572m99598m35896j33738J1363j30569j85426J67411O03966
35949B36461N50890O8718j97111K639J67062j06636m65032l77804M0548K63565
35939A83300J47771J9932R9180K49404K62022O4200l03350o44698o35489j82109
35929g39837L29321M43941K22076Q9549J70667J62719r0400l04334k09339J1867
35919H6230Q07k36897l44687j30954J66574K17779M5221m8279M2795P0631j18171
$$ plain form
35908 -248951 -475637 -392136 166762 732906 715073 145627 -404542 -572755 -507603 -434374
35898 -434374 -307228 -23510 314212 524382 545936 402272 148168 -69038 -92655 26595
35888 26595 97842 119956 294915 643586 887730 826200 562548 254688 -61078 -277077
35878 -277077 -203441 56347 83862 -244197 -486964 -296389 27392 51112 -65854 102006
35868 102006 440360 449830 126064 35841 419803 797491 692085 292742 106711 274366
35858 274366 516864 555266 344828 30007 -172877 -163949 -108753 -239822 -472399 -462179
35848 -462179 -129444 160239 100968 -140233 -245322 -247932 -414154 -757547 -987440 -915294
35838 -915294 -666030 -475607 -472516 -671077 -998837 -1280057 -1318588 -1051284 -566156 462
$$ packed form
35908b48951k26686Q3501N58898N66144j7833n69446n50169j68213O5152P3229
35898d34374J27146K83718L37722K10170K1554j43664k54104k17206k3617J19250
35888B6595P1247K2114J74959L48671K44144o1530k63652l07860l15766k15999
35878b77077P3636K59788K7515l28059k42767J90575L23781K3720j16966J67860
35868A02006L38354R470l23766r0223L83962L77688j05406l99343j86031J67655
35858B74366K42498L8402k10438l14821k02884Q928N5196j31069k32577J0220
35848d62179L32735K89683n9271k41201j05089k610j66222l43393k29893P2146
35838i15294K49264J90423L091j98561l27760k81220l8531K67304M85128N66618
$$ plain form
35828 462 490742 707680 546213 167420 -108843 -143184 -88623 -111931 -150308 -62631 92033
35817 92033 98254 -126608 -435867 -641610 -664638 -501744 -211328 31048 45908 -89765
35807 -89765 -70646 218219 491195 458168 250232 173071 175587 -56582 -501209 -712976 -458489
35796 -458489 -71910 30088 -106224 -154235 2524 224814 378306 382664 157758 -218862
35786 -218862 -432670 -270107 70011 241326 206869 181878 250477 329779 413380 540254
35776 540254 590159 417021 131184 -51652 -170847 -397252 -628247 -608799 -426149 -428562
35766 -428562 -604201 -523972 -49391 371903 361187 150641 169498 431762 671586 801742
35756 801742 868274 769280 414865 42847 8830 317880 666753 887969 1046343 1138349
$$ packed form
35828D62M90280K16938j61467l78793k76263l4341N4561k3308l8377Q7677J54664
35817I2033O221k24862l09259k05743k3028J62894K90416K42376J4860j35673
35807h9765J9119K88865K72976l3027k07936p7161K516k32169m44627k11767K54487
35796d58489L86579J01998j36312m8011J56759K22290J53492M358k24906l76620
35786b18862k13808J62563L40118J71315l4457k4991O8599P9302Q3601J26874
35776E40254M9905j73138k85837j82836j19195k26405k30995J9448J82650k413
35766d28562j75639Q0229M74581M21294j0716k10546J8857K62264K39824J30156
35756H01742O6532r8994l54415l72018l4017L09050L48873K21216J58374R2006
$$ plain form
35746 1138349 1028975 730990 466435 364259 309699 171021 -18131 -194783 -411962 -720827
35736 -720827 -1021222 -1159259 -1115559 -987675 -817258 -550532 -198026 66006 72367 -89170
35726 -89170 -113461 151637 483372 551813 335014 108046 63945 144678 252877 407358
35716 407358 607004 727475 673275 508654 348928 234873 169464 136540 33266 -234477
35706 -234477 -515410 -483131 -69779 368543 473453 287415 72982 -67145 -165430 -155359
35696 -155359 62284 395668 630451 667433 524530 214191 -179577 -422289 -366863 -177771
35686 -177771 -86580 -49009 63437 56661 -393764 -1142114 -1579680 -1368622 -831375 -447869
35676 -447869 -273986 -84881 153023 242976 71814 -278638 -671926 -973474 -1016109 -713011
$$ packed form
35746A138349j09374k97985k64555j02176n4560j38678j89152j76652k17179l08865
35736g20827l00395j38037M3700J27884J70417K66726L52506K64032O361j61537
35726h9170k4291K65098L31735O8441k16799k26968m4101Q0733J08199J54481
35716D07358J99646J20471n4200j64621j59726j14055o5409l2924j03274k67743
35706b34477k80933L2279M13352M38322J04910j86038k14433j40127r8285J0071
35696a55359K17643L33384K34783L6982j42903l10339l93768k42712N5426J89092
35686a77771R1191L7571J12446o776m50425p48350m37566K11058N37247L83506
35676d47869J73883J89105K37904Q9953j71162l50452l93288l01548m2635L03098
$$ plain form
35666 -713011 -233603 74982 12371 -272108 -430625 -267380 55918 182528 -34466 -331074
35656 -331074 -332844 -33863 170146 -39681 -540133 -944356 -996645 -690324 -158015 361100
35646 361100 536669 176672 -509904 -1033006 -1068104 -700987 -233344 103750 200713 24769
35636 24769 -311322 -533953 -451738 -201192 -97432 -241228 -432563 -485390 -425309 -297599
35626 -297599 -9209 439245 731765 534755 -24615 -456957 -527670 -514857 -735014 -1039403
35616 -1039403 -997481 -478533 163892 493278 427259 221062 107658 63002 -54318 -235285
35606 -235285 -330993 -308583 -291753 -270362 -14220 523305 948157 892671 566369 432279
35596 432279 452304 182118 -373398 -615293 -275162 94307 -64949 -485627 -543337 -200405
$$ packed form
35666g13011M79408L08585o2611k84479j58517J63245L23298J26610k16994k96608
35656c31074j770K98981K04009k09827n00452m04223n2289L06321N32309N19115
35646C61100J75569l59997o86576n23102l5098L67117M67643L37094R6963j75944
35636B4769l36091k22631Q2215K50546J03760j43796j91335n2827O0081J27710
35626b97599K88390M48454K92520j97010n59370m32342p0713J2813k20157l04389
35616a039403M1922N18948O42425L29386o6019k06197j13404m4656j17320j80967
35606b35285r5708K2410J6830K1391K56142N37525M24852n5486l26302j34090
35596D32279K0025k70186n55516k41895L40131L69469j59256m20678n7710L42932
$$ plain form
35586 -200405 51576 -40104 -301567 -557438 -742491 -702438 -378365 -107562 -241848 -528709
35576 -528709 -403191 128079 469073 341274 93870 -30071 -287525 -794445 -1083624 -758467
35566 -758467 -155212 134985 86990 94420 241667 245838 19269 -195870 -259190 -299062 -395957
35555 -395957 -424796 -293404 -84647 118376 346914 612670 816001 854467 727341 518581
35545 518581 352376 320655 359725 285279 79887 18900 295923 633943 581208 180698
35535 180698 -4536 352796 872178 959606 548144 83276 -90821 -41882 2871 -70342
35525 -70342 -282114 -593473 -808333 -662811 -185254 197667 127563 -221760 -377111 -181092
35515 -181092 102591 259515 347955 384033 193757 -200968 -394952 -139671 192572 113965
$$ packed form
35586b00405K51981r1680k61463k55871j85053M0053L24073K70803j34286k86861
35576e28709J25518N31270L40994j27799k47404j23941k57454n06920k89179L25157
35566g58467O03255K90197m7995P430J47247M171k26569k15139o3320l9872r6895
35555c95957k8839J31392K08757K03023K28538K65756K03331L8466j27126k08760
35545E18581j66205l1721L9070p4446k05392o0987K77023L38020n2735m00510
35535A80698j85234L57332N19382Q7428m11462m64868j74097M8939M4753p3213
35525g0342k11772l11359k14860J45522M77557L82921p0104l49323j55351J96019
35515a81092K83683J56924Q8440L6078j90276l94725j93984K55281L32243p8607
$$ plain form
35505 113965 -177284 -18295 700842 1268262 1070137 347532 -221530 -349510 -235035 -97559
35495 -97559 4275 10873 -129153 -295912 -305094 -191212 -174492 -330280 -485742 -479912 -344235
35484 -344235 -158638 100973 441156 688793 640351 387194 320874 676269 1146440 1153311
35474 1153311 538455 -220901 -605439 -643833 -665350 -656545 -297404 349296 661745 235104
35464 235104 -485502 -704186 -248780 309543 462337 330866 329825 545129 665029 419173
35454 419173 -119804 -668998 -1003006 -1026673 -726867 -219158 203283 268549 31722 -177824
35444 -177824 -188110 -183816 -357791 -571488 -570412 -363818 -127405 132734 510849 896720
35434 896720 1086596 1147303 1305153 1495507 1432152 1155733 1059079 1242774 1304600 993584
$$ packed form
35505A13965k91249J58989P19137N67420j98125p22605n69062j27980J14475J37476
35495i7559J01834O598j40026j66759r182J13882J6720j55788j55462N830J35677
35484c44235J85597K59611L40183K47637m8442k53157o6320L55395M70171O871
35474A153311o14856p59356l84538l8394k1517Q805L59141O46700L12449m26641
35464B35104p20606k18684M55406N58323J52794j31471j041K15304J19900k45856
35454D19173n38977n49194l34008k3667K99806N07709M22441O5266k36827k09546
35444a77824j0286M294j73975k13697J076K06594K36413K60139L78115L85871
35434H96720J89876O0707J57850J90354o3355k76419r6654J83695O1826l11016
$$ plain form
35424 993584 643268 629348 749096 542460 7114 -410847 -441048 -266641 -199629 -319466
35414 -319466 -446444 -347669 14695 412993 620936 701383 815260 825348 483060 19600
35404 19600 32837 609053 1085395 982418 650386 579201 578258 212725 -339220 -522525 -262580
35393 -262580 38356 197520 338488 399516 160588 -284871 -630312 -867997 -1167342 -1346593
35383 -1346593 -1083203 -591843 -422033 -579940 -563533 -324798 -395336 -854456 -1006992 -493201
35373 -493201 27186 -145580 -687855 -799852 -368186 76558 255275 334239 386027 264793
35363 264793 -9453 -225283 -338808 -467887 -554114 -413960 -132172 -42363 -252178 -468488
35353 -468488 -359041 117621 746824 1210232 1222834 766006 214954 15094 182830 317871
$$ packed form
35424I93584l50316j3920J19748k06636n35346m17961l0201J74407O7012j19837
35414c19466j26978R8775L62364L98298K07943Q0447J13877J0088l42288m63460
35404A9600J3237N76216M76342j02977l32032p1185r43l65533n51945j83305K59945
35393b62580L00936J59164J40968O1028k38928m45459l45441k37685k99345j79251
35383a346593K63390M91360J69810j57907J6407K38735p0538m59120j52536N13791
35373d93201N20387j72766n42275j11997M31666M44744J78717P8964N1788j21234
35363B64793k74246k15830j13525j29079q6227J40154K81788Q9809k09815k16310
35353d68488J09447M76662O29203M63408J2602m56828n51052j99860J67736J35041
$$ plain form
35343 317871 158478 -76913 -11842 368105 671163 549406 88602 -294805 -313122 -89007
35333 -89007 62220 45894 49859 223533 475555 640507 683337 642427 499336 228463 -93943
35322 -93943 -331059 -410211 -369639 -315610 -325619 -342487 -224529 -413 33603 -326318 -808286
35311 -808286 -910531 -521756 -22331 236306 234823 34371 -386896 -886563 -1103465 -894715
35301 -894715 -566674 -453344 -518331 -586947 -680369 -830572 -826161 -499043 -86522 48231
35291 48231 -65224 -109925 -16826 -32003 -248593 -394879 -185272 301317 666546 548368
35281 548368 -25666 -581518 -626070 -224610 40710 -168451 -480326 -358913 124770 429772
35271 429772 302381 -11641 -264135 -508477 -843476 -1180523 -1382500 -1420307 -1319540 -1123749
$$ packed form
35343C17871j59393k35391O5071L79947L03058j21757m60804l83407j8317K24115
35333h9007J51227j6326L965J73674K52022J64952M2830m0910j43091k70873l22406
35322i3943k37116p9152M0572N4029j0009j6868J17958K24116L4016l59921m81968
35311h08286j02245L88775M99425K58637j483k00452m21267m99667k16902K08750
35301h94715L28041J13330o4987o8616r3422j50203M411L27118M12521J34753
35291D8231j13455m4701R3099j5177k16590j46286K09607M86589L65229j18178
35281E48368n74034n55852m4552M01460K65320k09161l11875J21413M83683L05002
35271D29772j27391l14022k52494k44342l34999l37047k01977l7807J00767J95791
$$ plain form
35261 -1123749 -933713 -816503 -693849 -508546 -449887 -754737 -1285348 -1581703 -1401676 -980815
35251 -980815 -678694 -575858 -521548 -409152 -278684 -227609 -285408 -339812 -223859 42067
35241 42067 182313 -8605 -355837 -519525 -456248 -422404 -538954 -626197 -530511 -379130
35231 -379130 -400995 -651103 -996133 -1252006 -1286090 -1100251 -853071 -712062 -688378 -699583
35221 -699583 -721216 -734716 -623012 -335487 -93068 -171581 -496286 -711783 -662873 -535652
35211 -535652 -493615 -477124 -455641 -575184 -876051 -1095637 -965383 -565522 -209464 -74419
35201 -74419 -82990 -62366 97618 374103 608443 636973 480838 332709 323821 398179 436189
35190 436189 383579 237051 41535 -68485 18790 192025 195049 -20702 -183765 -43935
$$ packed form
35261a123749J90036J17210J22654J85303N8659l04850n30611k96355J80027M20861
35251i80815L02121J02836N4310J12396J30468N1075n7799n4404J15953K65926
35241D2067J40246j90918l47232j63688O3277L3844j16550q7243R5686J51381
35231c79130k1865k50108l45030k55873l4084J85839K47180J41009K3684j1205
35221f99583k1633j3500J11704K87525K42419p8513l24705k15497M8910J27221
35211e35652M2037J6491K1483j19543l00867k19586J30254L99861L56058J35045
35201g4419q571K0624J59984K76485K34340K8530j56135j48129q888P4358L8010
35190D36189n2610j46528j95516j10020Q7275J73235L024k15751j63063J39830
$$ plain form
35180 -43935 309480 577029 581404 369940 100973 -46978 62858 410073 771403 877587
35170 877587 639058 212227 -137232 -254381 -230434 -302394 -566330 -835507 -860772 -633813
35160 -633813 -366101 -224995 -213799 -249726 -217365 -17289 265619 323808 -15996 -450130
35150 -450130 -477605 -20592 498127 711592 651177 481497 225531 -82243 -242262 -119143
35140 -119143 139568 307002 369694 444462 519351 465225 249753 -15767 -228819 -389816
35130 -389816 -540296 -662906 -662982 -470755 -171999 41571 112365 192415 362179 418940 155157
35119 155157 -261740 -449119 -291994 -8492 207885 318132 255373 -45966 -424715 -622099
35109 -622099 -650222 -690336 -627199 -121609 758001 1419238 1447321 1054247 660522 412248
$$ packed form
35180d3935L53415K67549M375k11464k68967j47951J09836L47215L61330J06184
35170H77587k38529m26831l49459j17149K3947p1960k63936k69177k5265K26959
35160f33813K67712J41106J1196l5927L2361K00076K82908N8189l39804m34134
35150d50130k7475M57013N18719K13465o0415j69680k55966l07774j60019J23119
35140a19143K58711J67434O2692P4768P4889n4126k15472k65520k13052j60997
35130c89816j50480j22610p6J92227K98756K13570P0794Q0050J69764N6761k63783
35119A55157m16897j87379J57125K83502K16377J10247o2759l01339l78749j97384
35109f22099k8123m0114O3137N05590Q79610O61237K8083l93074l93725k48274
$$ plain form
35099 412248 299833 345699 420771 247696 -153852 -393311 -326536 -312109 -533604 -550938
35089 -550938 -2556 657480 708991 180340 -272113 -312486 -173671 -79777 -5373 22288
35079 22288 -72582 -84100 300460 936247 1286687 1130438 789675 588938 502976 428060
35069 428060 390743 367042 272300 241161 525146 979620 1071495 608476 80997 18635 336360
35058 336360 606514 677282 670715 594621 362889 114061 136955 449180 723761 703410 488906
35047 488906 335322 313696 283718 118620 -154985 -418697 -562268 -501261 -205110 192736
$$ packed form
35099D12248j12415M5866P5072j73075m01548k39459O6775J4427k21495j7334
35089e50938N48382O60036N1511n28651m52453m0373J38815R3894P4404K7661
35079B2288r4870j1518L84560O35787L50440j56249l40763k00737q5962p4916
35069D28060l7317k3701r4742l1139K83985M54474R1875m63019n27479o2362L17725
35058C36360K70154P0768o567p6094k31732k48828K2894L12225K74581k0351k14504
35047D88906j53584k1626k9978j65098k73605k63712j43571O1007K96151L97846
$$ [...]
##END NTUPLES=NMR SPECTRUM
##END=
