##TITLE=31Pdec_9P117_TFA
 CDCl3
  24 sc
 2.11.2023
##JCAMPDX= 6.0         $$ Bruker NMR JCAMP-DX V2.0
##DATA TYPE= NMR SPECTRUM
##DATA CLASS= NTUPLES
##ORIGIN= UXNMR, Bruker Analytische Messtechnik GmbH
##OWNER= root
$$ XWIN-NMR		Version 3.5
$$ Thu Nov  2 18:03:44 2023 Russian Standard Time (UT+4h)  she@DPX200
##.OBSERVE FREQUENCY= 81.013821
##.OBSERVE NUCLEUS= ^31P
##.ACQUISITION MODE= SIMULTANEOUS
##.ACQUISITION SCHEME= undefined
##.AVERAGES= 24
##.DIGITISER RES= 16
##SPECTROMETER/DATA SYSTEM= spect
##.PULSE SEQUENCE= zgpg30
##.SOLVENT NAME= CD2Cl2
##.SHIFT REFERENCE= (INTERNAL, CD2Cl2, 0, 248.564)
##AUDIT TRAIL= $$ (NUMBER, WHEN, WHO, WHERE, WHAT)
$$ ##TITLE= Audit trail, XWIN-NMR		Version 3.5
$$ ##JCAMPDX= 5.01
$$ ##ORIGIN= Bruker BioSpin GmbH
$$ ##OWNER= she
$$ F:/spectra/data/she/nmr/P31/1/pdata/1/auditp.txt
$$ ##AUDIT TRAIL=  $$ (NUMBER, WHEN, WHO, WHERE, WHAT)
(   1,<2023-11-02 18:02:17.20 +0400>,<she>,<DPX200>,
      <created by zg, POWCHK disabled, PULCHK disabled
       configuration hash MD5:
       00 E9 B6 7A A2 85 ED C7 34 08 36 98 17 FE 4E 26
       data hash MD5: 32K
       5A D1 85 CF 11 B4 8D 86 F4 C3 4C 9E 88 FA 00 C7>)
(   2,<2023-11-02 18:02:34.43 +0400>,<she>,<DPX200>,
      <Start of raw data processing
       efp BC_mod = 2 LB = 5 FT_mod = 6 PKNL = 1 PHC0 = -10861.87 PHC1 = 676.2902 SI = 64K 
       data hash MD5: 64K
       10 26 E2 CC 1A E5 78 89 C3 0C D4 6D 55 84 48 CD>)
(   3,<2023-11-02 18:02:54.62 +0400>,<she>,<DPX200>,
      <pk PHC0 = 39.94108 PHC1 = 0 
       data hash MD5: 64K
       70 19 86 91 7A 45 E1 C0 E5 A4 1F 56 6B 84 E9 43>)
(   4,<2023-11-02 18:03:12.04 +0400>,<she>,<DPX200>,
      <abs ABSG = 5 
       data hash MD5: 64K
       AE 2B 87 76 5C 80 9A FF AE 85 09 9C 73 C4 4D F4>)
$$ ##END=
$$ 
$$ hash MD5
$$ 48 0C 74 DF B9 05 A5 0F 67 C0 5A 85 B5 64 B1 2C
##$RELAX= 
##$RELAX= 
##$RELAX= 
##$RELAX= 
##$RELAX= 
##$RELAX= 
##$RELAX= 
##$RELAX= 
##$RELAX= 
$$ Bruker specific parameters
$$ --------------------------
##$DU= <F:/spectra>
##$EXPNO= 1
##$NAME= <P31>
##$PROCNO= 1
##$TYPE= <nmr>
##$USER= <she>
##$AMP= (0..31)
100 100 100 100 100 100 100 100 100 100 100 100 100 100 100 100 100 100 
100 100 100 100 100 100 100 100 100 100 100 100 100 100 
##$AQSEQ= 0
##$AQ_mod= 1
##$AUNM= <au_zg>
##$AUTOPOS= <>
##$BF1= 81.014009
##$BF2= 200.13
##$BF3= 200.13
##$BF4= 200.13
##$BF5= 200.13
##$BF6= 200.13
##$BF7= 200.13
##$BF8= 200.13
##$BYTORDA= 1
##$CFDGTYP= 0
##$CFRGTYP= 5
##$CHEMSTR= <none>
##$CNST= (0..31)
1 1 145 1 1 1 1 1 1 1 1 1 1 1 1 1 1 1 1 1 1 1 1 1 1 1 1 1 1 1 1 1 
##$CPDPRG= <waltz16>
##$CPDPRG1= <>
##$CPDPRG2= <waltz16>
##$CPDPRG3= <>
##$CPDPRG4= <mlev>
##$CPDPRG5= <mlev>
##$CPDPRG6= <mlev>
##$CPDPRG7= <mlev>
##$CPDPRG8= <mlev>
##$CPDPRGB= <>
##$CPDPRGT= <>
##$D= (0..31)
0 1 0 0 0 0 0 0 0 0 0 0.03 2e-05 3e-06 0 0 0 0 0 0 0 0 0 0 0 0 0 0 0 0 
0 0 
##$DATE= 1698933736
##$DBL= (0..7)
120 120 120 11 120 120 24 19 
##$DBP= (0..7)
150 150 150 150 150 150 150 150 
##$DBP07= 0
##$DBPNAM0= <>
##$DBPNAM1= <>
$$ [...]
##$SUBNAM3= <"">
##$SUBNAM4= <"">
##$SUBNAM5= <"">
##$SUBNAM6= <"">
##$SUBNAM7= <"">
##$SUBNAM8= <"">
##$SUBNAM9= <"">
##$SW= 501.771253377433
##$SWIBOX= (0..15)
0 1 3 0 0 0 0 0 0 0 0 0 0 0 0 0 
##$SW_h= 40650.406504065
##$TD= 32768
##$TD0= 1
##$TE= 0
##$TE2= 300
##$TE3= 300
##$TEG= 300
##$TL= (0..7)
0 120 53 12 22 120 120 120 
##$TP= (0..7)
150 150 150 150 150 150 150 150 
##$TP07= 0
##$TPNAME0= <>
##$TPNAME1= <>
##$TPNAME2= <>
##$TPNAME3= <>
##$TPNAME4= <>
##$TPNAME5= <>
##$TPNAME6= <>
##$TPNAME7= <>
##$TPOAL= (0..7)
0.5 0.5 0.5 0.5 0.5 0.5 0.5 0.5 
##$TPOFFS= (0..7)
0 0 0 0 0 0 0 0 
##$TUNHIN= 0
##$TUNHOUT= 0
##$TUNXOUT= 0
##$USERA1= <user>
##$USERA2= <user>
##$USERA3= <user>
##$USERA4= <user>
##$USERA5= <user>
##$V9= 5
##$VALIST= <valist>
##$VCLIST= <CCCCCCCCCCCCCCC>
##$VD= 0
##$VDLIST= <DDDDDDDDDDDDDDD>
##$VPLIST= <PPPPPPPPPPPPPPP>
##$VTLIST= <TTTTTTTTTTTTTTT>
##$WBST= 1024
##$WBSW= 4
##$XGAIN= (0..3)
0 0 0 0 
##$XL= 0
##$YL= 0
##$YMAX_a= 135
##$YMIN_a= -241
##$ZGOPTNS= <>
##$ZL1= 120
##$ZL2= 120
##$ZL3= 120
##$ZL4= 120
##$ABSF1= 248.5645
##$ABSF2= -253.2056
##$ABSG= 5
##$ABSL= 3
##$ALPHA= 0
##$AQORDER= 0
##$ASSFAC= 0
##$ASSFACI= 0
##$ASSFACX= 0
##$ASSWID= 0
##$AUNMP= <proc_1d>
##$AZFE= 0.1
##$AZFW= 0.5
##$BCFW= 0
##$BC_mod= 2
##$BYTORDP= 0
##$COROFFS= 0
##$CY= -3
##$DATMOD= 1
##$DC= 0
##$DFILT= <>
##$DTYPP= 0
##$F1P= 0
##$F2P= 0
##$FCOR= 1
##$FTSIZE= 65536
##$FT_mod= 6
##$GAMMA= 0
##$GB= 0
##$INTBC= 1
##$INTSCL= 6.047779e-11
##$ISEN= 30
##$LB= 5
##$LEV0= 0
##$LPBIN= 0
##$MAXI= 10000
##$MC2= 0
##$MEAN= 0
##$ME_mod= 0
##$MI= 50
##$NCOEF= 0
##$NC_proc= -12
##$NLEV= 6
##$NOISF1= 182.463
##$NOISF2= 159.3651
##$NSP= 0
##$NTH_PI= 0
##$NZP= 0
##$OFFSET= 248.5645
##$PC= 4
##$PHC0= -10821.93
##$PHC1= 676.2902
##$PH_mod= 1
##$PKNL= yes
##$PPARMOD= 0
##$PSCAL= 0
##$PSIGN= 0
##$REVERSE= no
##$SF= 81.0140089999694
##$SI= 65536
##$SIGF1= 159.3651
##$SIGF2= -187.1042
##$SINO= 113.3802
##$SIOLD= 16384
##$SREGLST= <1H.CDCl3>
##$SSB= 0
##$STSI= 65536
##$STSR= 0
##$SW_p= 40650.406504065
##$SYMM= 0
##$S_DEV= 0
##$TDeff= 32768
##$TDoff= 0
##$TI= <>
##$TILT= no
##$TM1= 0
##$TM2= 0
##$TOPLEV= 0
##$USERP1= <user>
##$USERP2= <user>
##$USERP3= <user>
##$USERP4= <user>
##$USERP5= <user>
##$WDW= 1
##$XDIM= 65536
##$YMAX_p= 330013464
##$YMIN_p= -76617697
$$ End of Bruker specific parameters
$$ ---------------------------------
##NTUPLES= NMR SPECTRUM
##VAR_NAME=  FREQUENCY,     SPECTRUM/REAL,   SPECTRUM/IMAG
##SYMBOL=    X,             R,               I
##VAR_TYPE=  INDEPENDENT,   DEPENDENT,       DEPENDENT
##VAR_FORM=  AFFN,          ASDF,            ASDF
##VAR_DIM=   65536,         65536,           65536
##UNITS=     HZ,            ARBITRARY UNITS, ARBITRARY UNITS
##FACTOR=    0.620285442955139, 1,           1
##FIRST=     20137.2065510682, 0,            0
##LAST=      -20513.1999529968, 0,           0
##MIN=       -20513.1999529968, -76617697,   0
##MAX=       20137.2065510682, 330013464,    0
$$ Real data points
##PAGE= N=1
##DATA TABLE= (X++(R..R)), XYDATA
$$ [...]
41518B213560q96984q94745r68986j026609r39376o76845l05987Q4870M20376
41509b990726O30256O68030N47676L35101J08273m9051m3895J59295M48118O05066
41499D18143N00161K26946J6987L2451K52271N18439O55871N84909L78811K05335
41489C790324J63221J77104R5886j11125l12399l79655l38494l19244l95643n14900
41479A855075n69026m93740k97899k9496K67311N61718Q07599R22585Q29503N36030
41469D389660J55045j72300l66525m27087m01142l59925l65147m08169m03402
41460A641008k96250j63852j41741k46760l46316l28829k31559j49141p9535O0449
41450b82526K95650N44738P04309P20546N87572L42661O7438j67506l67525n69692
$$ plain form
41518 2213560 1316576 421831 -547155 -1573764 -2513140 -3189985 -3495972 -3411102 -2990726
41509 -2990726 -2360470 -1692440 -1144764 -809663 -701390 -750441 -794336 -635041 -186923 418143
41499 418143 918304 1145250 1162237 1194688 1446959 1965398 2621269 3206178 3584989 3790324
41489 3790324 3953545 4130649 4226535 4115410 3803011 3423356 3084862 2765618 2369975 1855075
41479 1855075 1286049 792309 494410 464914 732225 1293943 2101542 3024127 3853630 4389660
41469 4389660 4544705 4372405 4005880 3578793 3177651 2817726 2452579 2044410 1641008
41460 1641008 1344758 1180906 1039165 792405 446089 117260 -114299 -263440 -342975 -282526
41450 -282526 13124 557862 1262171 1982717 2570289 2912950 2980388 2812882 2445357 1875665
41440A875665p38727p84845o98018n76211m83182l65764j72623K5812J23843J31693
41430a662357J44931J98436K50863K96136L81037M97038N46574M47563K03593
41421A303814j44236n46379q85181r77589p32588k86720Q2650J89701P4658o5094
41411a986964n2008J34481L56773M53422L82459K24992P3261k5335j9976J44971
41401c13924M20628O16752N72803L46225J50298J11686J63974J80142J20193Q981
41391B377758j58516m10808p12527r46190j006951q95853p00623m93832k75956
41382c223498k9871J95728L01490K44484R5700l0527q1070p9305o3320m0051J2466
41371b697774J20904K81636M32311M83413M08931K89768K40313L08077M65068
$$ plain form
41440 1875665 1136938 352093 -345925 -922136 -1405318 -1771082 -1943705 -1917893 -1794050 -1662357
41430 -1662357 -1517426 -1318990 -1068127 -771991 -390954 106084 652658 1100221 1303814
41421 1303814 1159578 613199 -271982 -1249571 -1982159 -2268879 -2186229 -1996528 -1921870 -1986964
41411 -1986964 -2038972 -1904491 -1547718 -1094296 -711837 -486845 -413584 -438919 -458895 -313924
41401 -313924 106704 723456 1296259 1642484 1792782 1904468 2068442 2248584 2368777 2377758
41391 2377758 2219242 1808434 1095907 149717 -857234 -1753087 -2453710 -2947542 -3223498
41382 -3223498 -3253369 -3057641 -2756151 -2511667 -2415967 -2446494 -2527564 -2606869 -2670189 -2710240 -2697774
41371 -2697774 -2576870 -2295234 -1862923 -1379510 -970579 -680811 -440498 -132421 332647
41362C32647O60861Q40191R38845R22579Q20888O72288M53390J28433k36095m85263
41352E048764n29843m30727l09965k40645k56199l94135o48294q97765r61635
41343C79556p58694l95947q4599L2762k1291j23690k01212k95468m65936o60603
41333b595122p32037n80529k43583J47137M45512N35969L85429R7445j36689j95482
41323b871950j21571m2947m0058j11731k13621k77693k35114q3775Q3876J70426
41313c744158J74879J58321J29719L1056j53908l22876l14167m2901M05130Q01886
41303b877019R33300P71889M89833K82534K02451J83378J71489J66461J59383
41294D83699J02479n3571l27402o86216j004480j081987q03111k95010J44992
$$ plain form
41362 332647 993508 1833699 2772544 3695123 4516011 5188299 5641689 5770122 5534027 5048764
41352 5048764 4518921 4088194 3778229 3537584 3281385 2887250 2238956 1341191 379556
41343 379556 -379138 -775085 -859684 -826922 -848213 -971903 -1173115 -1468583 -1934519 -2595122
41333 -2595122 -3327159 -3907688 -4151271 -4004134 -3558622 -3022653 -2637224 -2539779 -2676468 -2871950
41323 -2871950 -2993521 -3036468 -3076526 -3188257 -3401878 -3679571 -3914685 -3998460 -3914584 -3744158
41313 -3744158 -3569279 -3410958 -3281239 -3250183 -3404091 -3726967 -4041134 -4084035 -3678905 -2877019
41303 -2877019 -1943719 -1171830 -681997 -399463 -197012 -13634 157855 324316 483699
41294 483699 586178 532607 205205 -481011 -1485491 -2567478 -3370589 -3665599 -3520607
41285c520607L05794K03479k1970k62052m63735n83142n89123m92346l33665j55103
41275e912470J1510J57484K98229M16245M08839J70701k39554n81496o34215l85253
41265f289980K300L56536N96017P23351P86214Q28417Q45138Q03080P09138O05466
41255c4323M79208K51478r6311m47662o57967o84828n69070l61884j37734K554
41245b256539M3811J12951L12760N45717O24635N22920L76502K55359R5317j17815
41235E15618k59613k40636j46383j10540j34670j22759k9648J05044K14280K20312
41225A1005N2578k59948n43412o03875l90259l353M00830O64687O68426M30011
41215D26690J37341k2728n7475j02912j89493j94584m4640J52407K28251J21872
$$ plain form
41285 -3520607 -3214813 -3011334 -3033304 -3295356 -3759091 -4342233 -4931356 -5423702 -5757367 -5912470
41275 -5912470 -5900960 -5743476 -5445247 -5029002 -4620163 -4449462 -4689016 -5270512 -5904727 -6289980
41265 -6289980 -6287680 -5931144 -5335127 -4611776 -3825562 -2997145 -2152007 -1348927 -639789 -34323
41255 -34323 444885 696363 600052 152390 -505577 -1190405 -1759475 -2121359 -2259093 -2256539
41245 -2256539 -2212728 -2099777 -1787017 -1241300 -616665 -93745 282757 538116 633433 515618
41235 515618 256005 15369 -131014 -241554 -376224 -498983 -528631 -423587 -209307 11005
41225 11005 63583 -196365 -739777 -1343652 -1733911 -1737264 -1336434 -671747 -3321 426690
41215 426690 564031 541303 483828 380916 191423 -3161 -47801 104606 332857 454729
41205D54729j21170m24457o76519p26202n04076j48046Q2347N2686j21327k07770
41195b339805q2306J92200M64292O25153O46006N33877L02014l068k84107m52837
41185c98581n09214n20818n13061m26878k20805K2160J50283J07843n39k4843
41175b334453Q0108K29718K99971K17479j0147l02561n35632n98137m55294j65826
41165c574774J64018M39657N99884O12647M84401K75525P4853o7094j72733k87422
41155a451038m03083m62386m46216m19670m53003n12864m83745l10286p1769J16095
41145d897965K31619L25175L94366L62789K00813p53j18960j15851l2592P8634
41135c572725J60190J37192j0716j78223k17984j01728P2467K32740M00647N82340
$$ plain form
41205 454729 333559 -90898 -767417 -1493619 -1997695 -2145741 -2063394 -2010708 -2132035 -2339805
41195 -2339805 -2422111 -2229911 -1765619 -1140466 -494460 39417 341431 338363 54256 -398581
41185 -398581 -907795 -1428613 -1941674 -2368552 -2589357 -2567197 -2416914 -2309071 -2309610 -2334453
41175 -2334453 -2254345 -2024627 -1724656 -1507177 -1517324 -1819885 -2355517 -2953654 -3408948 -3574774
41165 -3574774 -3410756 -2971099 -2371215 -1758568 -1274167 -998642 -923789 -990883 -1163616 -1451038
41155 -1451038 -1854121 -2316507 -2762723 -3182393 -3635396 -4148260 -4632005 -4942291 -5014060 -4897965
41145 -4897965 -4666346 -4341171 -3946805 -3584016 -3383203 -3383956 -3502916 -3618767 -3651359 -3572725
41135 -3572725 -3412535 -3275343 -3286059 -3464282 -3682266 -3783994 -3711527 -3478787 -3078140 -2495800
41125b495800O96794O81985N97565N35808M78208L29807P1251k04367l86941m01483
41115i7173j91034K33467O98932R31603P84636L56629j55873o54447j118582j451221
41105f63063j468977j083748m38390J77965N38352O03844M82652K95731Q0525
41096a475109j79826m38640n35609l25588J28959N55013P14425O25405M81504
41087d49466L78285K27280k6019k15797j11037K77492O71234Q22668P36879N65273
41077B876792L98277K49450J52229J37802J38855L2757k04029m68143o67901q10197
41067A835892r31332j021665j053465j015285q81775o19358k77886j9699J8081
41058c966492j26461k77246k92263j63066K7061J87399K69428K84837K92997L53871
$$ plain form
41125 -2495800 -1799006 -1117021 -519456 16352 494560 824367 895618 691251 304310 -97173
41115 -97173 -288207 -54740 644192 1575795 2360431 2717060 2561187 1906740 788158 -663063
41105 -663063 -2132040 -3215788 -3654178 -3476213 -2937861 -2334017 -1851365 -1555634 -1475109
41096 -1475109 -1654935 -2093575 -2629184 -2954772 -2825813 -2270800 -1556375 -930970 -449466
41087 -449466 -71181 156099 130080 -85717 -196754 80738 751972 1574640 2311519 2876792
41077 2876792 3275069 3524519 3676748 3814550 3953405 3986162 3782133 3313990 2646089 1835892
41067 1835892 904560 -117105 -1170570 -2185855 -3067630 -3686988 -3964874 -3984573 -3966492
41058 -3966492 -4092953 -4370199 -4662462 -4825528 -4798467 -4611068 -4341640 -4056803 -3763806 -3409935
41048c409935M84026O48432P68947P44847N20981J65356j66593l79576n01566
41039a125081n61196m79594j84435K02712M13586K94993m9045l88254n59960n16980
41029b953254k86787M1490L40810N27511O02921N85817M54481K12724k6847j04866
41019f06000L4959K98902N33352O20339N12985K58338K818r0843J9052K12293
41009A796195L19161K63603J06146j5949P763J62001K87276K09925o7093l32725
40999B736303l67949j60393J08956K61455K57031J63730O5138Q590j5098o8955
40989B988808k04777l70915m24885k85983o0744K8868j47870n11406q51336j000196
40979h40436r34858p45176n31792l33639j40530M2057J64502J82512J20638O0753
$$ plain form
41048 -3409935 -2925909 -2277477 -1508530 -763683 -242702 -77346 -243939 -623515 -1125081
41039 -1125081 -1686277 -2165871 -2350306 -2147594 -1734008 -1439015 -1488060 -1876314 -2436274 -2953254
41029 -2953254 -3240041 -3198551 -2857741 -2330230 -1727309 -1141492 -687011 -474287 -501134 -606000
41019 -606000 -571041 -272139 261213 881552 1394537 1652875 1655693 1564850 1583902 1796195
41009 1796195 2115356 2378959 2485105 2469156 2476919 2638920 2926196 3136121 3069028 2736303
40999 2736303 2368354 2207961 2316917 2578372 2835403 2999133 3064271 3072861 3057763 2988808
40989 2988808 2784031 2413116 1988231 1702248 1641504 1670372 1522502 1011096 159760 -840436
40979 -840436 -1775294 -2520470 -3052262 -3385901 -3526431 -3484374 -3319872 -3137360 -3016722 -2955969
40969b955969O3080J15767J69256K03866K46866L28052M36848N31613N80089N74512
40959B93980N12172L91606K47254J60454J88873K79792K95068J47200j07918l23226
40949B085255l75838k22181J02363M79475P31992P31486N08885K25759K4891o5817
40939D226270r3706j08747j53067k61217m08650m82221l71794j16229P8820J1303
40929B320762l18103o85658q29742o60145k98371N3328K48679K25394j4985l80372
40919c39213o66965o64131l42624Q4537L35976L10445J60026J28010L22588O33746
40909c7605Q47705Q35405O41461M13754K71015K35169K49911K30397J17756o7048
40899C737920k19453k34760j04444Q3935K24780K42347R4533j92548m81420n88511
$$ plain form
40969 -2955969 -2892889 -2777122 -2607866 -2404000 -2157134 -1829082 -1392234 -860621 -280532 293980
40959 293980 806152 1197758 1445012 1605466 1794339 2074131 2369199 2516399 2408481 2085255
40949 2085255 1709417 1487236 1589599 2069074 2801066 3532552 4041437 4267196 4292087 4226270
40939 4226270 4132564 4023817 3870750 3609533 3200883 2718662 2346868 2230639 2309459 2320762
40929 2320762 2002659 1317001 487259 -172886 -471257 -417929 -169250 56144 41159 -339213
40919 -339213 -1006178 -1670309 -2012933 -1928396 -1592420 -1281975 -1121949 -993939 -671351 -37605
40909 -37605 810100 1645505 2286966 2700720 2971735 3206904 3456815 3687212 3804968 3737920
40899 3737920 3518467 3283707 3179263 3263198 3487978 3730325 3824858 3632310 3150890 2562379
40889B562379m42501j50851J11931K45322K37705J03022j41257m57674p91444
40880A276632j071449j187801j019982n54950L2234M73446O06061M75744K70173
40871f99892J75890K60042M25751M77049K75993j33278n55162p91569p64006n28880
40861a858062k15302N7395K34072L16044L18572K67437K29897K82173M06717M71849
40851E10792L71351J58118j2159m9567M015N2349L3490n2579j49766j85664j48607
40840E31773j12840j49340k38761l19804l83468m44639m52304l33227j35279l1641
40830b069530j36848l68271n17722m28420j07731K75468N02631M83218L41802
40821b025403K81338L59778M58553M55835L40595J56500m9766j86672j41916P0335
$$ plain form
40889 2562379 2119878 1969027 2080958 2326280 2563985 2667007 2525750 2068076 1276632
40880 1276632 205183 -982618 -2002600 -2557550 -2525316 -2051870 -1445809 -970065 -699892
40871 -699892 -524002 -263960 161791 638840 914833 781555 226393 -565176 -1329182 -1858062
40861 -1858062 -2073364 -2015969 -1781897 -1465853 -1147281 -879844 -649947 -367774 38943 510792
40851 510792 882143 1040261 1028102 978535 982550 1034899 1068389 1015810 866044 680380 531773
40840 531773 418933 269593 30832 -288972 -672440 -1117079 -1569383 -1902610 -2037889 -2069530
40830 -2069530 -2206378 -2574649 -3092371 -3520791 -3628522 -3353054 -2850423 -2367205 -2025403
40821 -2025403 -1744065 -1384287 -925734 -469899 -129304 27196 -22570 -209242 -351158 -280823
40811b80823K65721K80302J57505P6100J38289K96822M46573N06088M27044J98126
40801B511747j43410n22620q38811r74027q53475n25661j25551K64055O38508
40792e69245R35240R93744P41288L22903o5697l96344p30896r96475j012625p40151
40782a518258l51800l1344J70645K58966K16468P6077l5309j4417J08027K26705
40772h94240K77136K46887J31617n7069k67552m34686n16787m99030l96361k56080
40762b666165j08307Q6051L70151O64674P90485O59522L86892J84276J94138M29660
40752I91377P74917J001930Q97196M67592k8929l22257l53563k30335o3970O3911
40742C197869P6849j6670o8671N1200K69662L98774L80429L07272K19658M7421
$$ plain form
40811 -280823 -15102 265200 422705 498805 637094 933916 1380489 1886577 2313621 2511747
40801 2511747 2368337 1845717 1006906 32879 -820596 -1346257 -1471808 -1207753 -569245
40792 -569245 365995 1359739 2101027 2423930 2358233 1961889 1230993 234518 -778107 -1518258
40782 -1518258 -1870058 -1901402 -1730757 -1471791 -1255323 -1179246 -1214555 -1228972 -1120945 -894240
40772 -894240 -617104 -370217 -238600 -295669 -563221 -997907 -1514694 -2013724 -2410085 -2666165
40762 -2666165 -2774472 -2688421 -2318270 -1653596 -863111 -203589 183303 367579 561717 991377
40752 991377 1766294 2768224 3665420 4133012 4104083 3781826 3428263 3197928 3133958 3197869
40742 3197869 3274718 3258048 3189377 3240577 3510239 3909013 4289442 4596714 4816372 4863793
40732D863793k15956m40591n35731n70443o28079o48000n26777l05729j35800
40723H56687q6725r6663r9609j05469j38001j62836j04735Q7840L80833O18076
40713A149398N79885J64149m68791r86010j147733r70112o43245l50296j79541
40704b852296j41860k03996l05164l77024l68303k63446r2412Q4453K25905L44448
40694c949695M68924N79944O21801N82779N16941M64171L90866K46605N1960j09118
40684a34822j68028j11650L0968J92668K70120J85036k8895k34437l19104l06504
40674f24648l22349m53697o51319p69983p04643m90717k66705j36146q3270l4764
40664d538241L0140P6804J02733J56520K49370L12872K93298K42343K50826L17482
$$ plain form
40732 4863793 4647837 4207246 3671515 3101072 2472993 1824993 1298216 992487 856687
40723 856687 769962 673299 573690 468221 330220 167384 62649 150489 531322 1149398
40713 1149398 1729283 1893432 1424641 438631 -709102 -1679214 -2322459 -2672755 -2852296
40704 -2852296 -2994156 -3198152 -3503316 -3880340 -4248643 -4512089 -4604501 -4520048 -4294143 -3949695
40694 -3949695 -3480771 -2900827 -2279026 -1696247 -1179306 -715135 -324269 -77664 -25704 -134822
40684 -134822 -302850 -414500 -383532 -190864 79256 264292 235397 960 -318144 -624648
40674 -624648 -946997 -1400694 -2052013 -2821996 -3526639 -4017356 -4284061 -4420207 -4503477 -4538241
40664 -4538241 -4508101 -4431297 -4328564 -4172044 -3922674 -3609802 -3316504 -3074161 -2823335 -2505853
40654b505853L55592L26518K90386L00348L16246K74853J96313J49982J37211
40645a58404R1820J0881j281J11840K06015M1621m25022r17887j069612p64006
40635b874035k23296K14281L50620J94092j13809l75651m14361j82246J88411
40626c235994M93960O27602O09806M82133K59393M595j44884j04321M5946J45453
40616h16311J29321N6531j3908q8670j70468k04174j39664n717J15098J52463
40606i85499O8865j28106l44438m24077k99616j06249o2884k23514m12876m33074
40596c351468k69342n1007J26573K63161L65380L92033L20524K14210J72047K18279
40586a599610K71209K26204N6675j69635l60706m71108n03840m64820l41282j24608
$$ plain form
40654 -2505853 -2150261 -1823743 -1533357 -1233009 -916763 -641910 -445597 -295615 -158404
40645 -158404 -66584 -55703 -56984 54856 260871 302492 -122530 -1040417 -2110029 -2874035
40635 -2874035 -3097331 -2883050 -2532430 -2338338 -2452147 -2827798 -3242159 -3424405 -3235994
40626 -3235994 -2742034 -2114432 -1504626 -1022493 -763100 -758505 -903389 -1007710 -961764 -816311
40616 -816311 -686990 -630459 -644367 -733037 -903505 -1107679 -1247343 -1253060 -1137962 -985499
40606 -985499 -916634 -1044740 -1389178 -1813255 -2112871 -2219120 -2282004 -2505518 -2918394 -3351468
40596 -3351468 -3620810 -3671817 -3545244 -3282083 -2916703 -2524670 -2204146 -1989936 -1817889 -1599610
40586 -1599610 -1328401 -1102197 -1045522 -1215157 -1575863 -2046971 -2550811 -3015631 -3356913 -3481521
40576c481521J65776M80760P40166Q38819P06308L96242Q7429m7567K3101J93907
40566A03420L28643L45355K48511J37855J55895L53207O10657P56928P51183O73439
40556D465093N48421K99428q0385m23282n44671m43774k67185j30367o6548r8264
40546C258466k29210l64553l58980j84975K7683J59552K37936L58891N33094O72312
40536D110216O99203O14939M69018L07761J60379N3214K2103R4405K37404L34165
40526G102807K55198k1822l80926o65924p94135p81683p01039o29621o02233n86860
40516B193762n26928m18127l13453k41434j60492j9429J71767L59454N02013N79383
40506B126516N82146N29797M72468M33653L72908K45567P8667n9473j53816k58563
$$ plain form
40576 -3481521 -3315745 -2834985 -2094819 -1256000 -549692 -153450 -66021 -113588 -90487 103420
40566 103420 432063 777418 1025929 1163784 1319679 1672886 2283543 3040471 3791654 4465093
40556 4465093 5013514 5312942 5232557 4809275 4264604 3820830 3553645 3423278 3356730 3258466
40546 3258466 3029256 2664703 2305723 2120748 2148431 2307983 2545919 2904810 3437904 4110216
40536 4110216 4809419 5424358 5893376 6201137 6361516 6414730 6436833 6531238 6768642 7102807
40526 7102807 7358005 7336183 6955257 6289333 5495198 4713515 4012476 3382855 2780622 2193762
40516 2193762 1666834 1248707 935254 693820 533328 513899 685666 1045120 1547133 2126516
40506 2126516 2708662 3238459 3710927 4144580 4517488 4763055 4841722 4782249 4628433 4369870
40496D369870m17215o06361p68704q76683r54315j044527j148128j191059j077944
40487c715066p94543m28044p0028K52149N13295O25577N19501K63554K1586r8988
40477b911007q5402O4455L46980O59498Q26870P89068O76548O25670N89826M19076
40467B001582P6522l13661n98927o90258n53571k25316J49578L96868M74167M84097
40457A201081M90918M03792J14998k97857o04093o57969n36418m22456m10264
40448g18268m65627n39587o52201q40621j053665j138493r57327n26862l5039
40439f927690L01331M11176L99288M02240M40382M34821L35641J67663m5599l12230
40429d392977n80823p04891n94143l55102j68588m6184J60281M90580P64607Q11517
$$ plain form
40496 4369870 3952655 3346294 2577590 1700907 746592 -297935 -1446063 -2637122 -3715066
40487 -3715066 -4509609 -4937653 -5007681 -4755532 -4242237 -3616660 -3097159 -2833605 -2812019 -2911007
40477 -2911007 -2996409 -2931954 -2584974 -1925476 -1098606 -309538 367010 992680 1582506 2001582
40467 2001582 2078104 1764443 1165516 475258 -78313 -303629 -154051 242817 716984 1201081
40457 1201081 1691999 2095791 2210789 1912932 1308839 650870 114452 -308004 -718268
40448 -718268 -1183895 -1723482 -2375683 -3216304 -4269969 -5408462 -6365789 -6892651 -6927690
40439 -6927690 -6626359 -6215183 -5815895 -5413655 -4973273 -4538452 -4202811 -4035148 -4080747 -4392977
40429 -4392977 -4973800 -5678691 -6272834 -6627936 -6796524 -6842708 -6682427 -6191847 -5427240 -4615723
40419d615723O82479N24117L46577P0823k56479m74938n33365n30770n01848l30851
40409e619978L0770L93510N04789L29933N8299j14150j11128N3735K96055M52061
40399c726104L71368O7970k68071m22082k88916J00731N94312R64587J053242
40390a552963R16053P62859P19903P10056N94406L56139Q8055j41650l35867n09592
40380A607399o51499p35911p25867n78490l01036j092J69515J40553k6380k12797
40370a315605l39905l86871l50289k24118k8522J61541K53539K31451K02204L10851
40360a485724N93199R24273J110369J018451O45036J20308l51157o19975o95265
40351A259515o82383o17557m40005j47430J26937K65425L07532L45836L58416
$$ plain form
40419 -4615723 -3933244 -3409127 -3062550 -2991727 -3248206 -3723144 -4256509 -4787279 -5289127 -5619978
40409 -5619978 -5589208 -5195698 -4690909 -4360976 -4302677 -4416827 -4527955 -4474220 -4178165 -3726104
40399 -3726104 -3354736 -3286766 -3554837 -3976919 -4265835 -4165104 -3570792 -2606205 -1552963
40390 -1552963 -636910 125949 845852 1555908 2150314 2506453 2594508 2452858 2116991 1607399
40380 1607399 955900 219989 -505878 -1084368 -1385404 -1386496 -1216981 -1076428 -1102808 -1315605
40370 -1315605 -1655510 -2042381 -2392670 -2616788 -2645310 -2483769 -2230230 -1998779 -1796575 -1485724
40360 -1485724 -892525 31748 1142117 2160568 2805604 2925912 2574755 1954780 1259515
40351 1259515 577132 -40425 -480430 -627860 -500923 -235498 72034 417870 776286
40342G76286K73657J51451J42723K65795L65427L20617J62300m8573l11440n76333
40332A521910o78339n10235j91234M6699R5095P618j29354k49039k73490j67646
40322e28015k8467q812j28054k37259j87121L6682L39243N87089O47361M65085
40312I57732J50215q9943j57932j50772k02994l15430l93653l92748l50553l14815
40302a260893l07021l36234l83961l83546k67580l6464K49323N22296P14235P45992
40292g43853N86222L18653Q3020o5633j83301l09744l80825l09211j08240J09876
40282a003036K29577J86981k8665l54787o41622p34337o06957l82781k03057j12218
40272c650902q8565j23684k05160k55177j75174L4190K61002M08623M76818N00653
$$ plain form
40342 776286 1049943 1201394 1344117 1609912 1975339 2295956 2458256 2409683 2098243 1521910
40332 1521910 843571 333336 142102 188801 283896 291514 162160 -86879 -360369 -528015
40322 -528015 -556482 -565294 -693348 -930607 -1117728 -1081046 -741803 -154714 492647 957732
40312 957732 1107947 1018004 860072 709300 506306 190876 -202777 -595525 -946078 -1260893
40302 -1260893 -1567914 -1904148 -2288109 -2671655 -2939235 -2975699 -2726376 -2204080 -1489845 -743853
40292 -743853 -157631 161022 244042 178409 -4892 -314636 -695461 -1004672 -1112912 -1003036
40282 -1003036 -773459 -586478 -615143 -969930 -1611552 -2345889 -2952846 -3335627 -3538684 -3650902
40272 -3650902 -3739467 -3863151 -4068311 -4323488 -4498662 -4464472 -4203470 -3794847 -3318029 -2817376
40262b817376M88128M69561N31629P05915Q55650P73780M03484j03135n38232
40253G69404p76918p80463n79394k95706q7895o281M3096J49487K84210L87060
40243h93400M76526N79709O17213M76985J82587j14127k97967l55439k94982j24967
40233B52138P2109J65004J27348P8133J18441K09269K63906K74815K76641K62786
40223B100590K33494K69007M45920P03253Q83984Q95448P47032M56837L5575m26701
40213F344439p68718q99891q66084p50088n89962m31302l60247l99544m32953
40204H45650l28108j10784O2286R2611L0862j7076n576L8636N8112k466j56494
40193E07653l44194m78712n45431o19822p60572r15216r63532q36644n68264k48644
$$ plain form
40262 -2817376 -2329248 -1859687 -1328058 -622143 233507 1007287 1410771 1307636 769404
40253 769404 -7514 -787977 -1367371 -1663077 -1750972 -1757253 -1714157 -1564670 -1280460 -893400
40243 -893400 -416874 162835 780048 1257033 1439620 1325493 1027526 672087 377105 252138
40233 252138 324247 489251 616599 694732 813173 1022442 1286348 1561163 1837804 2100590
40223 2100590 2334084 2603091 3049011 3752264 4636248 5531696 6278728 6735565 6771140 6344439
40213 6344439 5575721 4675830 3809746 3059658 2469696 2038394 1678147 1278603 845650
40204 845650 517542 406758 469044 561655 592517 575441 569865 608501 666613 664147 507653
40193 507653 163459 -315253 -860684 -1480506 -2241078 -3156294 -4119826 -4956470 -5524734 -5773378
40183e773378L7433K35188L22819L13239K50121J93902J98414K78380L90050M62407
40173c091425M67053M47242M58638M89444M64040L27896J07284j22601l08381
40164g60810m41531n27109n60754n44852n01822m43409l33626j17567J96933N12853
40154c521694P25584Q10413P94602O67415L90445J5654k82371l62545k77606k07440
40144a247543k34115k51156j17575J57325M24320N48004N00856L35170J32170
40135B47456j5231l4911O5426J96619K78943L19690L72147M37731M57944M08104
40125B733918L47972L43827L66235L06740R3283k38539n81801q29504r10194q05563
40115H26374n73702l37267k07981k11521k93990l90317m65900n02657m83103m07747
$$ plain form
40183 -5773378 -5735945 -5500757 -5177938 -4864699 -4614578 -4420676 -4222262 -3943882 -3553832 -3091425
40173 -3091425 -2624372 -2177130 -1718492 -1229048 -765008 -437112 -329828 -452429 -760810
40164 -760810 -1202341 -1729450 -2290204 -2835056 -3336878 -3780287 -4113913 -4231480 -4034547 -3521694
40154 -3521694 -2796110 -1985697 -1191095 -523680 -133235 -117581 -399952 -762497 -1040103 -1247543
40144 -1247543 -1481658 -1732814 -1850389 -1693064 -1268744 -720740 -219884 115286 247456
40135 247456 232225 197314 262740 459359 738302 1057992 1430139 1867870 2325814 2733918
40125 2733918 3081890 3425717 3791952 4098692 4191975 3953436 3371635 2542131 1631937 826374
40115 826374 252672 -84595 -292576 -504097 -798087 -1188404 -1654304 -2156961 -2640064 -3047811
40105c047811l10912k37059j99192j67225r6049L8265K24117M22729N82528O52301
40095b138308O03312M61009L11911K50922K99782L81248L85701K64065N9277j33648
40085G45271k26954j82005k4348J76653L53105M63713M80903L90548K35324J28233
40075B540443J62115K97121L86123L33338J92309Q6616P4378J26642K03175K92320
40065D694580L86380M74883N70203O84696P55881O47308K86014k14233o29250
40056G656462q41578r35794j050847j187739j227989j122098r72149q93432q58628
40047a433792p39459m68334r6418K82887N87904P28948O36234L67939J31185J13601
40037A10695K97839M91557N37581M52450L60085L38860L54903L13011J43593j46369
$$ plain form
40105 -3047811 -3358723 -3595782 -3794974 -3962199 -4058248 -4019983 -3795866 -3373137 -2790609 -2138308
40095 -2138308 -1534996 -1073987 -762076 -511154 -211372 169876 555577 819642 878919 745271
40085 745271 518317 336312 311964 488617 841722 1305435 1786338 2176886 2412210 2540443
40075 2540443 2702558 2999679 3385802 3719140 3911449 3998065 4072443 4199085 4402260 4694580
40065 4694580 5080960 5555843 6126046 6810742 7566623 8213931 8499945 8285712 7656462
40056 7656462 6814884 5879090 4828243 3640504 2412515 1290417 318268 -575164 -1433792
40047 -1433792 -2173251 -2641585 -2738003 -2455116 -1867212 -1138264 -502030 -134091 -2906 110695
40037 110695 408534 900091 1437672 1890122 2250207 2589067 2943970 3256981 3400574 3254205
40027C254205m77671p45989q81239q81753q00349o88806n40207k88887J08203
40018a942493N77938R38976J030539Q41614N16008K40615J21440J30614J48264
40009B603515P6069o2132j40851p0535J03582K59994L26328L02802J87413m4208
39999C541977l59609o26501p01535n55345k87917l0848J48470K60139L39860L97461
39989B126152M12205L64088K49584O6279j80505m26603n42512m45058k13323k4402
39979A385905M5177Q3087J63842J83093l2042m63616q57328r79532q58492p10648
39969b040554o59929o08670m05270p3197J95920K63669J85815J08699R7857J36578
39959b799082K40043M53638P26204Q95380Q60172O95910N33850L93496K19537
$$ plain form
40027 3254205 2776534 2030545 1149306 267553 -532796 -1221602 -1761809 -2050696 -1942493
40018 -1942493 -1364555 -425579 604960 1446574 1962582 2203197 2324637 2455251 2603515
40009 2603515 2679584 2617452 2476601 2406066 2509648 2769642 3095970 3398772 3586185 3541977
39999 3541977 3182368 2555867 1854332 1298987 1011070 980222 1128692 1388831 1728691 2126152
39989 2126152 2538357 2902445 3152029 3218308 3037803 2611200 2068688 1623630 1410307 1385905
39979 1385905 1431082 1514169 1678011 1861104 1829062 1365446 508118 -471414 -1329906 -2040554
39969 -2040554 -2700483 -3309153 -3714423 -3787620 -3591700 -3328031 -3142216 -3033517 -2935660 -2799082
39959 -2799082 -2559039 -2105401 -1379197 -483817 376355 1072265 1606115 1999611 2219148
39950B219148L3945n8173m330J46904L26272M70822M68294K09013k37714o00107
39940B974074o61533m99088l81566m59382o32863p02003n58055k31482J56187
39931i95711M57301N84792N82775N79637O44934P23989P31184O61603N72203M88733
39921E031440L86333K52382J14759j0287j63840m02101p05974r54996j016069
39912B531647q67213o20766m12312k80624j74858n6382N4332J31587J87973K33721
39902G27105K34116J52981K1203p6235p4413L2153J97780L32728L25799J25487
39892A998704j86736m45345n38082m71403l13735j32176Q432N6811K8379k590
39882B259o239m2377j49393k42362k07583p2101J8252o870o4099n6240K348N1617
$$ plain form
39950 2219148 2253093 2194920 2190590 2337494 2663766 3134588 3602882 3811895 3574181 2974074
39940 2974074 2312541 1813453 1431887 972505 339642 -362361 -920416 -1151898 -995711
39931 -995711 -538410 46382 629157 1208794 1853728 2577717 3308901 3970504 4542707 5031440
39921 5031440 5417773 5670155 5784914 5774627 5610787 5208686 4502712 3547716 2531647
39912 2531647 1664434 1043668 631356 350732 175874 119492 173824 305411 493384 727105
39902 727105 961221 1114202 1135405 1059170 984757 1016910 1214690 1547418 1873217 1998704
39892 1998704 1811968 1366623 828541 357138 43403 -88773 -80341 -23530 4849 2259
39882 2259 -3980 -46357 -195750 -438112 -645695 -717796 -699544 -706414 -770513 -826753 -824405 -772788
39870g72788R6798J73993K52341K54443J56724J272j76157l57453m88039m93932
39860a352798l77988k38695j61821j35726r5902o833J26686K80376M02588M24706
39850a135407L25343J59058j4350j92865l74908m77999l99231j62485O7303J47874
39840b057667R3853K3921J7631N8597Q7431P0431K8001K0732R0262J87203J78715
39829a200890k9726l80065p00156q57547q46906p30220n43677k99456n1177R7913
39819e541907P5567q0310k34856k56504j19836P7535K03992K09395J51180J10262
39809e405482J09752J37213K11306L62754N44189O24338N14010K63908N021j63257
39799b796248j76083M6701N35664J137609J546317J540816J164261O35711J35107
$$ plain form
39870 -772788 -675990 -501997 -249656 4787 161511 162783 -13374 -370827 -858866 -1352798
39860 -1352798 -1730786 -1969481 -2131302 -2267028 -2362930 -2369763 -2243077 -1962701 -1560113 -1135407
39850 -1135407 -810064 -651006 -665356 -858221 -1233129 -1711128 -2110359 -2272844 -2205541 -2057667
39840 -2057667 -1963814 -1939893 -1922262 -1863665 -1776234 -1705803 -1677802 -1657070 -1566808 -1379605 -1200890
39829 -1200890 -1230616 -1610681 -2310837 -3168384 -4015290 -4745510 -5289187 -5588643 -5639820 -5541907
39819 -5541907 -5466340 -5546650 -5781506 -6038010 -6157846 -6080311 -5876319 -5666924 -5515744 -5405482
39809 -5405482 -5295730 -5158517 -4947211 -4584457 -4040268 -3415930 -2901920 -2638012 -2632991 -2796248
39799 -2796248 -2972331 -2925630 -2389966 -1252357 293960 1834776 2999037 3634748 3769855
39790C769855k78428n94501p94829q75895q65350p93216o76384n37096m05951
39781b051795k95368j83153k1114K37623N78736Q67581R07750O36473K43081J3118
39771I32932N0428K18754L49708M11730M49252M57163L86142K13934m7565l61549
39761C060929o23689o74563m50131r9370J27771J04248j15856m24212p44766r97687
39751h37326j089637r93436p75191n01027j78468J56661L58584K80256k6683k98434
39741c904701k99474n8459J71376J80923O85j72619j90727n0421J83592M57677
39731c682148P06113Q32402P87910O36055M76170L30987J76618N6396O5154K01805
39721E87462L25974L11671J86594O5291j0579r5340k16419k98756k44875o5594
$$ plain form
39790 3769855 3491427 2896926 2102097 1226202 360852 -432364 -1108748 -1645844 -2051795
39781 -2051795 -2347163 -2530316 -2551430 -2313807 -1735071 -867490 40260 676733 919814 932932
39771 932932 983360 1202114 1551822 1963552 2412804 2869967 3256109 3470043 3422478 3060929
39761 3060929 2437240 1762677 1312546 1213176 1340947 1445195 1329339 905127 160361 -837326
39751 -837326 -1926963 -2920399 -3695590 -4196617 -4375085 -4218424 -3859840 -3579584 -3606267 -3904701
39741 -3904701 -4204175 -4262634 -4091258 -3910335 -3909650 -4082269 -4272996 -4323417 -4139825 -3682148
39731 -3682148 -2976035 -2143633 -1355723 -719668 -243498 87489 264107 320503 385657 587462
39721 587462 913436 1225107 1411701 1476992 1466413 1371073 1154654 855898 611023 545429
39711E45429J03500J27407K645j53114k32790k21091j33651N6556L55769O41903
39701A092563P25276N50912K71069P3858p591p2503j93772l48316m79668n59808
39691A052020n78025n10122l23280j4830L44077O11287O63956N12270K94567J35796
39681B187716M1928m3911j31504j81878j79328j39163n9241P0028K09057K89261
39671B062965L04862L22261L63903L33915J17330k60968o28720q30546q65772
39662I19230q38450p97595o82382m40847j46193O8524J73228K63697M07467N39596
39652e33725N57487M67799L79978L78905M52005N21124N00984L45873Q7929j77807
39642B980552l79891n25745o43824p10093o83207n77988m40354k78987r7399L1309
$$ plain form
39711 545429 648929 776336 778981 625867 393077 171986 38335 94891 450660 1092563
39701 1092563 1817839 2368751 2639820 2713678 2706087 2633584 2439812 2091496 1611828 1052020
39691 1052020 473995 -36127 -359407 -374237 -30160 581127 1245083 1757353 2051920 2187716
39681 2187716 2229644 2185733 2054229 1872351 1693023 1553860 1494619 1564647 1773704 2062965
39671 2062965 2367827 2690088 3053991 3387906 3505236 3244268 2615548 1785002 919230
39662 919230 80780 -716815 -1399197 -1840044 -1986237 -1917713 -1744485 -1480788 -1073321 -533725
39652 -533725 23762 491561 871539 1250444 1702449 2223573 2724557 3070430 3158359 2980552
39642 2980552 2600661 2074916 1431092 720999 37792 -540196 -980550 -1259537 -1356936 -1325627
39632a325627K0594r1354j51945p3281O5453J14549j2776l10048o82819r40851
39622c388105q79214m56734J34422O24933Q69876Q90540Q01300P44222Q08269
39613A49509R21296Q72699N35031L5226l67495n33779m93741l05560o422K97438
39603A104202M40858L66417J91582M9184o5246k22819m02144m84164l84481j34800
39593D58589J47616L28090L25790J83522O0339R9125K93830N18822O72834P40098
39583C828655P18643N71191K92474k7464k76559m50315o50540r34074j201431
39574A870580j277462j098686p86205n15269l31375j23537K21107O64886J037305
39565c38656J185686J085246Q15380M71910J22073j87920m30026o09200p51260
$$ plain form
39632 -1325627 -1305033 -1396387 -1548332 -1621613 -1556160 -1441611 -1454387 -1764435 -2447254 -3388105
39622 -3388105 -4267319 -4724053 -4589631 -3964698 -3094822 -2204282 -1402982 -658760 149509
39613 149509 1070805 1943504 2478535 2513761 2146266 1612487 1118746 813186 806764 1104202
39603 1104202 1545060 1911477 2103059 2152243 2086997 1864178 1462034 977870 593389 458589
39593 458589 606205 934295 1260085 1443607 1503946 1603071 1896901 2415723 3088557 3828655
39583 3828655 4547298 5118489 5410963 5383499 5106940 4656625 4006085 3072011 1870580
39574 1870580 593118 -505568 -1291773 -1807042 -2138417 -2261954 -2040847 -1375961 -338656
39565 -338656 847030 1932276 2747656 3219566 3341639 3153719 2723693 2114493 1363233
39556A363233q52428q52209o82897l55080J7027K88030L86078L54538L00908L05656
39546B72856L67627M21880M05540L15942K19047K03564L09301M78490N77651M92482
39536D064380K22217j20634m08473n87735o69701o61761n40748k92583M5356L85983
39526A436301O27734P05058O38596N37599N20127O16237P65283R02748J009417
39517G759100J064427J001813P63277L81400k6511l48178n44523o45333p07541
39508H697931p74574q51740r14358r40664r20443q27239o21395l14291N81K28932
39498B762740L71559M86526N65616N15390K79602p1609l97107n82763n66216l35453
39488C028285K8734L43767M43745L28580J55707O9613O6141K8522j39161m30280
$$ plain form
39556 1363233 510805 -341404 -1024301 -1379381 -1362354 -1074324 -688246 -333708 -32800 272856
39546 272856 640483 1062363 1467903 1783845 2002892 2206456 2515757 2994247 3571898 4064380
39536 4064380 4286597 4165963 3757490 3169755 2500054 1838293 1297545 1004962 1050318 1436301
39526 1436301 2064035 2769093 3407689 3945288 4465415 5081652 5846935 6749683 7759100
39517 7759100 8823527 9825340 10588617 10970017 10943506 10595328 10050805 9405472 8697931
39508 8697931 7923357 7071617 6157259 5216595 4296152 3468913 2847518 2533227 2533808 2762740
39498 2762740 3134299 3620825 4186441 4701831 4981433 4909824 4512717 3929954 3363738 3028285
39488 3028285 3057019 3400786 3844531 4173111 4328818 4398431 4464572 4493094 4353933 3923653
39478C923653p52741r94371j086001j038106r29400q43483p98716p37195n85560
39469c841920l23242J1360L64513O85477Q99502R14927P15722M40129L03983M09521
39459E79972O51119Q25178Q02050N75441K01844k38115o31108q56496q54823o54982
39449D00080l36882O29K45511L16862K49320J99644L10018N50941P22954O31255
39439C290332K64490j90107n03869n86958n23823m43693l83254k94778j54945
39430D73395l622J29422K71453M43496N95167O51816O02979N01111L93976L04893
39420D364086K58718K62199K55116J45283p8374l08427m23847m03969l16728k30693
39410C523364j78207j80240k51391l69385m73980n14858m84565l95635k50037
$$ plain form
39478 3923653 3170912 2176541 1090540 52434 -876966 -1720449 -2519165 -3256360 -3841920
39469 -3841920 -4165162 -4153802 -3789289 -3103812 -2204310 -1289383 -573661 -133532 170451 579972
39459 579972 1231091 2056269 2858319 3433760 3635604 3397489 2766381 1909885 1055062 400080
39449 400080 63198 63827 309338 626200 875520 1075164 1385182 1936123 2659077 3290332
39439 3290332 3554822 3364715 2860846 2273888 1750065 1306372 923118 628340 473395
39430 473395 469773 599195 870648 1314144 1909311 2561127 3164106 3665217 4059193 4364086
39420 4364086 4622804 4885003 5140119 5285402 5207028 4898601 4474754 4070785 3754057 3523364
39410 3523364 3345157 3164917 2913526 2544141 2070161 1555303 1070738 675103 425066
39401D25066n7153J31239K41927K47125J82480Q4486n0896k07386k81617j55239
39391E60032J56804M97232P27031Q26612Q08927O31033K84053r3863l18089l60588
39381C719184l50545l77246m01913l78856l45533l42334l39735l06830k72230
39372F03962k53977k04985j01621k1430n2632j74015k91190l35032k57236j1175
39362a099331L49967O17469O10507L97902K08482J30613M4478j28839k68347k22862
39352F40039k7904J45708J96196J59812J22806J46459K55471M23694N61420N59149
39342C182850L66171L4376k99515m87334m68067l00344o5243K47264O89748J193663
39332D093569J536231J512586J101827M57620j98137o66984q68006r05218r70294
$$ plain form
39401 425066 367913 499152 741079 988204 1170684 1255170 1204274 996888 715271 560032
39391 560032 716836 1214068 1941099 2767711 3576638 4207671 4491724 4397861 4079772 3719184
39381 3719184 3368639 2991393 2589480 2210624 1865091 1522757 1183022 876192 603962
39372 603962 349985 145000 43379 21949 -30683 -204698 -495888 -830920 -1088156 -1099331
39362 -1099331 -749364 -131895 478612 876514 1084996 1215609 1260087 1131248 862901 640039
39352 640039 612135 757843 954039 1113851 1236657 1383116 1638587 2062281 2623701 3182850
39342 3182850 3549021 3583397 3283882 2796548 2328481 2028137 1962894 2210158 2899906 4093569
39332 4093569 5629800 7142386 8244213 8701833 8503696 7836712 6968706 6063488 5093194
39323E093194j116825j192744j049750p39528m21910j54462J11337L64945M95991
39314A390248M33722K40714M4178p4510j19653j61777k75618m48813n58721m89079
39304a9309k64282k6092J09030J28196Q6388N1877O8038J08510Q4272m7849k03818
39293G4961k61242k05566j16112l2703P2196J97617K87942L12464K85864K05920
39283H21341O9432l5393L3819K93089N76278P10914O73495N30109L23734R7500
39273D094318n7635q7945o9797j22599k46618l22134k55795o6116J53014K83235
39263C301928K14983q0548m86230p95364q60062o75743l46487j5756J86950K07441
39253F51112J07252N432m7860j21176l08913o01431q59766r19272p27220l92712
$$ plain form
39323 5093194 3976369 2783625 1733875 994347 572437 417975 529312 894257 1390248
39314 1390248 1823970 2064684 2108862 2034352 1914699 1752922 1477304 1028491 469770 -19309
39304 -19309 -283591 -309683 -200653 -72457 13931 65808 133846 242356 326628 278779 74961
39293 74961 -186281 -391847 -507959 -540662 -468466 -270849 17093 329557 615421 821341
39283 821341 890773 855380 889199 1182288 1758566 2469480 3142975 3673084 3996818 4094318
39273 4094318 4036683 3948738 3878941 3756342 3509724 3187590 2931795 2865679 3018693 3301928
39263 3301928 3516911 3436363 2950133 2154769 1294707 618964 272477 256721 443671 651112
39253 651112 758364 763796 715936 594760 285847 -315584 -1175350 -2094622 -2821842 -3214554
39243c214554r8041N1614R3312J29614K10376K96142L06654J83991o4667l54253
39233b459812n65258o27285n54241l91242j59654J24489M20903O97802R60029
39224b554269J191627J305115J228156J033589Q94671Q83477Q85152P52809M84543
39215F104870J91146n5307k54936l88203l98499l00498k20132k48500k95109j79544
39205C955288J19417L85321L81519R9442k62784n30084o83856p81058q36405q27134
39195A019666p50235o10822l82874m6889L29890N99098O45097M90446K88370K10775
39185A792522L20659N26560O59616O08125L85662Q6529j94171l96804n02530n36366
39175B749802n38069m97124l45026o2084K20511K89997N6753l32922o13078o22426
$$ plain form
39243 -3214554 -3312595 -3260981 -3167669 -3038055 -2827679 -2531537 -2224883 -2040892 -2105559 -2459812
39233 -2459812 -3025070 -3652355 -4206596 -4597838 -4757492 -4633003 -4212100 -3514298 -2554269
39224 -2554269 -1362642 -57527 1170629 2204218 3098889 3982366 4867518 5620327 6104870
39215 6104870 6296016 6240709 5985773 5597570 5199071 4898573 4678441 4429941 4134832 3955288
39205 3955288 4074705 4460026 4841545 4940987 4678203 4148119 3464263 2683205 1846800 1019666
39195 1019666 269431 -341391 -724265 -771154 -441264 157834 802931 1293377 1581747 1792522
39185 1792522 2113181 2639741 3299357 3907482 4293144 4379673 4185502 3788698 3286168 2749802
39175 2749802 2211733 1714609 1369583 1307499 1528010 1818007 1874760 1541838 928760 306334
39165C06334m12331j64546m1748j14318l67044p00175r24064q48450m61484J0960
39155c716866L10554M10281M94338O72549Q23607P77319N60380L67139L32955
39146A032256M25563N33319N70509M98067L20334Q3711j61203l93956n84092o43065
39136A681443m86178j46514K24550M70721N06382L12896n3680m47459p08858p87570
39126E65733p43043o23859m21063j54183Q4410K18086K59444K55916K18196J41052
39116a99311L6734r7796k91448n25476p01294p39917o70766n66595m40112k75829
39106d471810j17595k7131L1898J74770M44912P49711R59330J007417Q85994O22841
39096B60337L10109R4152O3070J50036J90725Q1836j34975l39820m61624n31134
$$ plain form
39165 306334 -105997 -270543 -312291 -426609 -793653 -1493828 -2417892 -3266342 -3727826 -3716866
39155 -3716866 -3406312 -2996031 -2501693 -1829144 -1005537 -228218 332162 699301 1032256
39146 1032256 1457819 1991138 2561647 3059714 3380048 3463759 3302556 2908600 2324508 1681443
39136 1681443 1195265 1048751 1273301 1744022 2250404 2563300 2509620 2062161 1353303 565733
39126 565733 -177310 -801169 -1222232 -1376415 -1292005 -1073919 -814475 -558559 -340363 -199311
39116 -199311 -162577 -260373 -551821 -1077297 -1778591 -2518508 -3189274 -3755869 -4195981 -4471810
39106 -4471810 -4589405 -4616536 -4584638 -4409868 -3964956 -3215245 -2255915 -1248498 -362504 260337
39096 260337 570446 664598 727668 877704 1068429 1150265 1015290 675470 213846 -317288
39086c17288o15714p14628p37945o01319l29721n1007J01626O6049j35064l97287
39076c732298n50885m44936p0104M11554P79846Q91016P15762L23254j09541l24293
39066b110625j38639L68031Q72962J066369Q85969M98284J10348j44036j82549
39057A226114L4331M24842P50629P51242L60785k06631o02791o15104l40904j01748
39047A680765j41993l87344n28928l58419K5842L66927N31037N72751N77113N51917
39037B889668M79448L70207K27304L6976j58998k50195j77305j8989R4291J09914
39027C602321M4064j01315l24292n47429o49089n85988m23268k34868l9052J51250
39017H92334K87956L48734L94823N07619O72457P62457O46692L11292j08585m04826
$$ plain form
39086 -317288 -933002 -1647630 -2385575 -2986894 -3316615 -3367622 -3265996 -3199947 -3335011 -3732298
39076 -3732298 -4283183 -4728119 -4798223 -4386669 -3606823 -2715807 -2000045 -1676791 -1786332 -2110625
39066 -2110625 -2249264 -1881233 -1008271 58098 944067 1442351 1552699 1408663 1226114
39057 1226114 1260445 1685287 2435916 3187158 3547943 3341312 2738521 2123417 1782513 1680765
39047 1680765 1538772 1151428 622500 264081 289923 656850 1187887 1760638 2337751 2889668
39037 2889668 3369116 3739323 3966627 4003603 3844605 3594410 3417105 3398116 3492407 3602321
39027 3602321 3646385 3545070 3220778 2673349 2024260 1438272 1015004 780136 741084 892334
39017 892334 1180290 1529024 1923847 2431466 3103923 3866380 4513072 4824364 4715779 4310953
39007D310953m33302k16210Q3372K99823L75264L32564J79084j04968m76015p86528
38997C564037q94886q07557o62945n66904m93989l73468k12297o8203O2007K32630
38987b21575M19255M92197L68062J18660j34396l75197o54567r24300j018365
38978a930226q32676m62838j27850J1725n0248k00355l01239k78851j49608L2483
38968d289683K44777M91024P44212R43456J056312J102933J106973J062195R56390
38959C418589P81632N12162J39208k40612m48193m07812k65985k39223l57582
38950B892184m40059l28416o8659J61765K40068J76545O6361J7724R2742K57012
38940C067267L89824L86184K54198Q7128n3753j91360l62546n35599o30585o13688
$$ plain form
39007 4310953 3877651 3661441 3744813 4044636 4419900 4752464 4931548 4826580 4350565 3564037
38997 3564037 2669151 1861594 1198649 631745 137756 -235712 -448009 -516212 -454205 -221575
38987 -221575 197680 689877 1057939 1176599 1042203 667006 12439 -911861 -1930226
38978 -1930226 -2762902 -3225740 -3353590 -3341865 -3392113 -3592468 -3893707 -4172558 -4322166 -4289683
38968 -4289683 -4044906 -3553882 -2809670 -1866214 -809902 293031 1400004 2462199 3418589
38959 3418589 4200221 4712383 4851591 4610979 4162786 3754974 3488989 3249766 2892184
38950 2892184 2452125 2123709 2055050 2216815 2456883 2633428 2699789 2717513 2810255 3067267
38940 3067267 3457091 3843275 4097473 4184601 4130848 3939488 3576942 3041343 2410758 1797070
38930A797070n46683n32869o13625p14401o94441m67026q7558K81593N09481O00916
38920d67543O49727O93227O49269M27735Q4007j91557k57749j61663o2058m2387
38910A321008n4991m4669m8633j23936k30603k73837k52191k67625l54921l90837
38900g21235k50128Q623K14533L09610L78349M46344L95121J56900j17946k09234
38890F10937q2072J26523L27834N34637O94012O38341K89324j91987n46937o44691
38880A755921n06645k05750J46678L83251L96321K71126J97052K45438L32123
38871C015515L87948M34600M70083M28805L34033L58022O00208Q87477R44864
38862G861555P34397M81676L67708L42432K85644K10910K06577K58542K50546
$$ plain form
38930 1797070 1250387 717518 103893 -610508 -1304949 -1771975 -1859533 -1577940 -1068459 -467543
38920 -467543 182184 875411 1524680 1952415 2036422 1844865 1587116 1425453 1363395 1321008
38910 1321008 1266017 1221348 1172715 1048779 818176 544339 292148 24523 -330398 -721235
38900 -721235 -971363 -962740 -748207 -438597 -60248 386096 781217 938117 820171 610937
38890 610937 528865 655388 983222 1517859 2211871 2850212 3139536 2947549 2400612 1755921
38880 1755921 1249276 1043526 1190204 1573455 1969776 2240902 2437954 2683392 3015515
38871 3015515 3403463 3838063 4308146 4736951 5070984 5429006 6029214 6916691 7861555
38862 7861555 8595952 9077628 9445336 9787768 10073412 10284322 10490899 10749441 10999987
38853A0999987J17026r1044k79106l74786l38284j95759o9789q7869k22622k90337
38843I167417j57019J04937L16457L98887M08360L91847L08153J26381o1971r5016
38833A0908433R8269M20341O93488Q12337Q08941P85275Q03531Q52721R05294
38824A7088630R66851J050496J129223J150577J098097J018413R90608J075633
38816B5568528J265331J448508J460486J232668Q92461O53103N94382O13095N98650
38807C4327212N67368N72741N68645M55410K12659j16782n44974j110250j707125
38798C3224904k070191k017837j659318j286554j090105j041758j024941r92909
38790B2041291r75444r84759r62445q21779n31437j51314K19754N22951P46164
$$ plain form
38853 10999987 11117013 11025969 10746863 10372077 10033793 9838034 9768245 9680376 9457754 9167417
38843 9167417 9010398 9115335 9431792 9830679 10239039 10630886 10939039 11065420 11003449 10908433
38833 10908433 11006702 11427043 12120531 12932868 13741809 14527084 15330615 16183336 17088630
38824 17088630 18055481 19105977 20235200 21385777 22483874 23502287 24492895 25568528
38816 25568528 26833859 28282367 29742853 30975521 31867982 32521085 33115467 33728562 34327212
38807 34327212 34894580 35467321 36035966 36491376 36704035 36587253 36042279 34932029 33224904
38798 33224904 31154713 29136876 27477558 26191004 25100899 24059141 23034200 22041291
38790 22041291 21065847 20081088 19118643 18296864 17765427 17614113 17833867 18356818 19102982
38781A9102982Q67225Q51366P29885O16452N81630N57665M57900L66380M84780
38772B4616265Q54426J244242J400692J331634J235146J203969J151777J038349
38764C4076500R99055J148629J364493J411944J256795J121408J216439J534375
38756D4129638J951142K417224K951943L519560M036489M497431M992638N570865
38748G4066930O154217O624118O946257P188007P462126P878566Q492205R248228
38740A34060654J0023580J0778747J1627366J2677458J3823560J4790697J5403954
38733B23186016J5729842J5900287J5859191J5353610J4143433J2149168R416754
38726C21738301O047984K227179j740334n511368q859958j1728035j4113495j5936582
$$ plain form
38781 19102982 19970207 20821573 21551458 22167910 22749540 23307205 23765105 24131485 24616265
38772 24616265 25470691 26714933 28115625 29447259 30682405 31886374 33038151 34076500
38764 34076500 35075555 36224184 37588677 39000621 40257416 41378824 42595263 44129638
38756 44129638 46080780 48498004 51449947 54969507 59005996 63503427 68496065 74066930
38748 74066930 80221147 86845265 93791522 100979529 108441655 116320221 124812426 134060654
38740 134060654 144084234 154862981 166490347 179167805 192991365 207782062 223186016
38733 223186016 238915858 254816145 270675336 286028946 300172379 312321547 321738301
38726 321738301 327786285 330013464 328273130 322761762 313901804 302173769 288060274 272123692
38718B72123692j7046119j7357518j6969385j6140676j5157928j4210476j3352388
38711A61889202j2543097j1719791j0861777j0011099r224163q490974p725109
38704I1313192o875267o043252n429394n116213m941015m645043m144485l597363
38696E0521160l199208k982583k848152k718079k582246k430864k232257j982305
38688B9545466j706899j405374j060686p29472n52183o20250q68486j139885j326345
38679B0135886j413162j431601j428274j455280j520007j539216j394618j051846
38671H901882o01124j81665J10107K51353K74701K26676J25050l1380j94790k55648
38661H625162j59289p458L9670l9380j17636j24067j54680l15385n31768o09258
$$ plain form
38718 272123692 255077573 237720055 220750670 204609994 189452066 175241590 161889202
38711 161889202 149346105 137626314 126764537 116753438 107529275 99038301 91313192
38704 91313192 84437925 78394673 72965279 67849066 62908051 58263008 54118523 50521160
38696 50521160 47321952 44339369 41491217 38773138 36190892 33760028 31527771 29545466
38688 29545466 27838567 26433193 25372507 24643035 24090852 23470602 22602116 21462231 20135886
38679 20135886 18722724 17291123 15862849 14407569 12887562 11348346 9953728 8901882
38671 8901882 8300758 8119093 8229200 8480553 8755254 8981930 9106980 9075600 8880810 8625162
38661 8625162 8465873 8458415 8498085 8458705 8341069 8217002 8062322 7746937 7215169 6605911
38651F605911m54545j61029J09815K59112K66351J54616j7554j57635j67776P163
38641F444429L27656O36043P24110M83728q65n29047r32379j128282j088891q52223
38631D084279n58394l73612l32768l17314k26809j10349p2687j03066q0435O0980
38621A969825K42930L38278L10776K35188J98020J95214J25876j07984m83770
38612C024353q44487j013627r22135o29537k60840M9435J94566J52647J9383o6331
38602b96573n4913j7680l7701j10862j79766k25460k78265l49587l94239l49421
38592b294467j97596N077J55660J81706J13276N6541O6476O8517m9875k85016
38582b179701n10046o21978o33559n99515n15689l40445p7050K17620M82570O63250
$$ plain form
38651 6605911 6151366 5990337 6100152 6359264 6625615 6780231 6762677 6605042 6437266 6444429
38641 6444429 6772085 7408128 8132238 8615966 8615101 8086054 7153675 6025393 4936502 4084279
38631 4084279 3525885 3152273 2819505 2502191 2275382 2165033 2092346 1989280 1908845 1969825
38621 1969825 2212755 2551033 2861809 3096997 3295017 3490231 3616107 3508123 3024353
38612 3024353 2179866 1166239 244104 -385433 -646273 -596838 -402272 -249625 -230242 -296573
38602 -296573 -351486 -369166 -406867 -517729 -697495 -922955 -1201220 -1550807 -1945046 -2294467
38592 -2294467 -2492063 -2486986 -2331326 -2149620 -2036344 -1979803 -1913327 -1844810 -1894685 -2179701
38582 -2179701 -2689747 -3311725 -3945284 -4544799 -5060488 -5400933 -5477983 -5260363 -4777793 -4114543
38572d114543O99922N75225L76573K47756K52070L22646L66650L71830L72993
38563e28878L52719K42906L5878j53334j77441r135K23603L71243M16563M64191
38553A238315N77868O75872O22013L86828P0099k09281l74590l52772q2829L69319
38543B920842P62803Q42368N61531J12448k56411m16200l76214k08498J112J60797
38533D104578J92353P4767j30514l10017l71396l01338j60145l0092K6134j7755
38523C076575j31045k14804j58329N2559K94904M03036L04348O3359j77515k85765
38513C227323k12133l0984R6632L9671k08274n47038q50692j009393r38989o23654
38503a057531j59620K89418O01383P46925P46538O23491M11320J68793m4416j99803
$$ plain form
38572 -4114543 -3414621 -2839396 -2462823 -2215067 -1962997 -1640351 -1273701 -901871 -528878
38563 -528878 -176159 66747 102625 -50709 -228150 -237285 -13682 357561 774124 1238315
38553 1238315 1816183 2492055 3114068 3500896 3570995 3361714 2987124 2634352 2551523 2920842
38543 2920842 3683645 4526013 5087544 5199992 4943581 4527381 4151167 3942669 3943781 4104578
38533 4104578 4296931 4371698 4241184 3931167 3559771 3258433 3098288 3068196 3094330 3076575
38523 3076575 2945530 2730726 2572397 2624956 2919860 3322896 3627244 3690603 3513088 3227323
38513 3227323 3015190 2984206 3080838 3120509 2912235 2365197 1514505 505112 -433877 -1057531
38503 -1057531 -1217151 -927733 -326350 420575 1167113 1790604 2201924 2370717 2326301 2126498
38493B126498k92225l00780j72088J25995N02662P20675N60512N7360m76377p24138
38483B128094o31339l63183p6023J61882K70241J45155j88652n09570n62465k66745
38473A07395K45772P33038R68896Q70007N73299L37229L03957L86450M12577L12776
38463E251396J22961j11445l45135n01120n27230m62547l72035k45936m9575J53658
38453B912992K34567J60507L7415k3565J987J10137L20448O05222Q22021P92281
38443E974012M58304m2263m43636n18604k52057J26261L35375L00882J82487J35940
38433F256701J22477M109k40420m84958o17270o39685n96170m81272k76864m0849
38423C005799J06034R2973l3068j64633k33250k32116j69497n5130N9192Q6153
$$ plain form
38493 2126498 1834273 1533493 1361405 1487400 1990062 2710737 3271249 3328609 2852232 2128094
38483 2128094 1496755 1133572 1057549 1219431 1489672 1634827 1446175 936605 374140 107395
38473 107395 353167 1086205 2055101 2925108 3498407 3835636 4139593 4526043 4938620 5251396
38463 5251396 5374357 5262912 4917777 4416657 3889427 3426880 3054845 2808909 2759334 2912992
38453 2912992 3147559 3308066 3345481 3321916 3323903 3434040 3754488 4359710 5181731 5974012
38443 5974012 6432316 6390053 5946417 5427813 5175756 5302017 5637392 5938274 6120761 6256701
38433 6256701 6379178 6383287 6142867 5657909 5040639 4400954 3804784 3323512 3046648 3005799
38423 3005799 3111833 3204806 3171738 3007105 2773855 2541739 2372242 2317112 2376304 2462457
38413B462457K26j03465j10673m1448l6166j71549l51589m23735l64709k97429
38403E61920l31789m29769m39313k49170Q9575L92404N05564M49631L80598L98539
38393A328190M26733L11604K0305l05529m93051n00843m34110m31554n52209p45418
38383a375882r00368r25680p99179n53086k24285J59909N42022Q12538Q72793
38374b391218P32078N14733L45732K39278J22323m0411j75338j61591N2187L86148
38364c76079O52260O46146K88264k67065o92800p32578m08252L2703L61734N21328
38354B5661N56160M86611L08075P2914r9544j12013K8007K06913K72461J30213
38344A875458j76468m68271n42840l22308R2606N07981P80995Q98880R30931R05284
$$ plain form
38413 2462457 2462683 2359218 2248545 2207097 2170931 1999382 1647793 1224058 859349 561920
38403 561920 230131 -199638 -638951 -888121 -798546 -406142 99422 549053 929651 1328190
38393 1328190 1754923 2066527 2086832 1781303 1288252 787409 353299 -78255 -630464 -1375882
38383 -1375882 -2276250 -3201930 -4001109 -4554195 -4778480 -4618571 -4076549 -3264011 -2391218
38374 -2391218 -1659140 -1144407 -798675 -559397 -437074 -477485 -652823 -814414 -762227 -376079
38364 -376079 276181 922327 1210591 943526 250726 -481852 -890104 -857401 -495667 25661
38354 25661 581821 1068432 1376507 1449421 1349877 1237864 1265871 1472784 1745245 1875458
38344 1875458 1698990 1230719 687879 365571 458177 966158 1747153 2646033 3576964 4482248
38334D482248P44413L52190k24275p55608r97054q94966o05188l21021j25463
38325A655276q348M2327K0058o2293j79348l38239n58435p85597q78516p32407
38315a825522l98862m5583J90549K77977K45578J31899q354j06221j24085p3738
38305a736362K4203J57317K81242L23657K74709K19756K16438J85099J3469k49110
38295b89582m07390l45986j42997P4796K86386N08810O55777N87482K98141l7322
38285A188115k29382k35739j48569q1585j00944k18783l96402n54415o14469n47397
38275a939570l78282j50890R7397L21850M49542M00222J47686k40124o32881r12679
38265b837729j018234r37887o98242l72125o4177J50608K76724L68325M49171
$$ plain form
38334 4482248 5226661 5578851 5354576 4598968 3601914 2706948 2101760 1780739 1655276
38325 1655276 1646928 1689255 1709313 1647020 1467672 1129433 570998 -214599 -1093115 -1825522
38315 -1825522 -2224384 -2269967 -2079418 -1801441 -1555863 -1423964 -1432318 -1538539 -1662624 -1736362
38305 -1736362 -1712159 -1554842 -1273600 -949943 -675234 -455478 -239040 -53941 -40472 -289582
38295 -289582 -696972 -1042958 -1185955 -1111159 -824773 -315963 339814 927296 1225437 1188115
38285 1188115 958733 722994 574425 492840 391896 173113 -223289 -777704 -1392173 -1939570
38275 -1939570 -2317852 -2468742 -2371345 -2049495 -1599953 -1199731 -1052045 -1292169 -1925050 -2837729
38265 -2837729 -3855963 -4793850 -5492092 -5864217 -5928394 -5777786 -5501062 -5132737 -4683566
38256d683566M79953M12761K65858J28591Q5236J36211K01890K07878J60801J34779
38246b469608J90216L12820M22522M32910L19693J56752P6432J60984L64275N56486
38236E23482O40402N99650M49095J97421j17266l98759n41324m96948k83336M1875
38226F14292L88207O46203P41356O75338M97320K50771l2175l09060n32502o63051
38216B276699o56595m76460j66785J14686K10981J23853N659j5562N1095J33488
38206A601059K09761K88866L16451J73970k10589p70414j311358j605508j519674
38197b827436j120068o50612l42508k14488r9687J13216L30665M01789L57060
38188d052069L89078N88408Q06619Q42962O92408N23116M49926M28205L66660
$$ plain form
38256 -4683566 -4203613 -3790852 -3524994 -3396403 -3311167 -3174956 -2973066 -2765188 -2604387 -2469608
38246 -2469608 -2279392 -1966572 -1544050 -1111140 -791447 -634695 -558263 -397279 -33004 523482
38236 523482 1163884 1763534 2212629 2410050 2292784 1894025 1352701 855753 572417 614292
38226 614292 1002499 1648702 2390058 3065396 3562716 3813487 3781312 3472252 2939750 2276699
38216 2276699 1620104 1143644 976859 1091545 1302526 1426379 1432038 1416476 1467571 1601059
38206 1601059 1810820 2099686 2416137 2590107 2379518 1609104 297746 -1307762 -2827436
38197 -2827436 -3947504 -4598116 -4940624 -5155112 -5254799 -5141583 -4810918 -4409129 -4052069
38188 -4052069 -3662991 -3074583 -2267964 -1425002 -732594 -209478 240448 668653 1035313
38179A035313K52245J38559Q3549J32079K94856M96330N92485M97819K73965N8603
38169C855803o2347p9668q847J19953K43262L05868L20593L30587L12769J83429
38159E521402p9412l74268n73558o48128o57256o42149n84186m74311l72602l52244
38149G63288l94250l88638k64037p8100N9261J14568J15168L2768k03383n41490
38139g84845p61351o80107l44734N9598M31083P74548J048644J135862R92438
38130A871136P21553M55570K44708R4648K8231N5477J44555K68416M18694N28475
38120D831463M56376J28600l37542p16629q61033p71250n40348k97536j60352
38111A731749j51747j72151j16152K039R9037J57968K19033K59396K08165J01306
$$ plain form
38179 1035313 1287558 1426117 1509666 1641745 1936601 2432931 3025416 3523235 3797200 3855803
38169 3855803 3793456 3713788 3704941 3824894 4068156 4374024 4694617 5025204 5337973 5521402
38159 5521402 5441990 5067722 4494164 3846036 3188780 2546631 1962445 1488134 1115532 763288
38149 763288 369038 -19600 -283637 -361737 -302476 -187908 -72740 -39972 -243355 -784845
38139 -784845 -1546196 -2226303 -2571037 -2511439 -2080356 -1305808 -257164 878698 1871136
38130 1871136 2592689 3048259 3292967 3387615 3415846 3471323 3615878 3884294 4302988 4831463
38120 4831463 5287839 5416439 5078897 4362268 3501235 2729985 2189637 1892101 1731749
38111 1731749 1580002 1407851 1291699 1293738 1392775 1550743 1769776 2029172 2237337 2338643
38101B338643R5211K59121M51040M86669L57135J75037l9423l74716q16073j147888
38091A784756j153533q59544n04239k80414j72995n3536J31158L11723M08292
38082c88332M23893M01637L36838J97837L3955j2013J42712L83591M78238K95679
38072B294035r7595n49938r54922j239911j306671j077527n92600L223N72719
38063b949187J038403J340172J431538J353607J239383J175051J089321Q44317
38055F562605M22329l6109l76432n55151o13894n90848m98923l63358k38877j83788
38045C527554k21563l14402l71135l09770j37771M1450J25425J13303R3263J34503
38035B680857K15689K68802K71118K64318K81320K86917K22445R9729J1111L0710
$$ plain form
38101 2338643 2433854 2692975 3144015 3630684 3987819 4162856 4123433 3748717 2932644 1784756
38091 1784756 631223 -228321 -732560 -1012974 -1185969 -1239505 -1108347 -796624 -388332
38082 -388332 35561 437198 774036 971873 1005828 993815 1136527 1520118 1998356 2294035
38072 2294035 2196440 1646502 691580 -548331 -1855002 -2932529 -3525129 -3521906 -2949187
38063 -2949187 -1910784 -570612 860926 2214533 3453916 4628967 5718288 6562605
38055 6562605 6984934 6948825 6572393 6017242 5403348 4812500 4313577 3950219 3711342 3527554
38045 3527554 3305991 2991589 2620454 2310684 2172913 2214363 2339788 2453091 2546354 2680857
38035 2680857 2896546 3165348 3436466 3700784 3982104 4269021 4491466 4591195 4602306 4633016
38025D633016J31847K19400K17644J05602r7872l36878n24712o02687n96569n73471
38015B575320n45795m68462l31972j90971p6649N0095K08198L16743K80333J29690
38005A946530N746P846J15510K52570L56508L72988K61473N5275j35128k35168
37995C004150k92528l96330n32943n87451m87126k77455l7309K15150M82313P00579
37985A791050P71776O82150N28993M08398L23388K32841J48922J30189J83984
37976E201691K23126J41786p7501l40204n20867n76068n84754o62023q20233r37351
37966A047602q87771o83708m54270l10096k83068l78749n92801q37200r32512
37957d312573p64308m33542j84802j74743l44048n06278n13820l38685n4288K25965
$$ plain form
38025 4633016 4764863 4984263 5201907 5307509 5209637 4872759 4348047 3745360 3148791 2575320
38015 2575320 2029525 1561063 1229091 1038120 961471 1011566 1219764 1536507 1816840 1946530
38005 1946530 1952276 1960122 2075632 2328202 2684710 3057698 3319171 3374446 3239318 3004150
37995 3004150 2711622 2315292 1782349 1194898 707772 430317 393008 608158 1090471 1791050
37985 1791050 2562826 3244976 3773969 4182367 4505755 4738596 4887518 5017707 5201691
37976 5201691 5424817 5566603 5489102 5148898 4628031 4051963 3467209 2805186 1984953 1047602
37966 1047602 159831 -523877 -978147 -1288243 -1571311 -1950060 -2542861 -3380061 -4312573
37957 -4312573 -5076881 -5510423 -5695225 -5869968 -6214016 -6720294 -7234114 -7572799 -7627087 -7401122
37947g401122M26494N68985P49211J031216J363738J607616J636642J412067R92267
37938B387114N01919P7146k01448l38471l77594l35073k09968n8188j676j19862
37928A323899l52418n50552o13370n35996l48376q6614J59214K57848J67632P716
37918e71017p5042p9186j08198j80709j91136q0336O2385J30163J48203K06418
37908g38455K96944L19398K29203Q5525n1566j80550k90936l23504k56903j81167
37898a092011k18569l87608n88864p12918p31165o99739p05184p77425q11668
37889f725151o10342q3101N91493J084487J231192J166015J106626J078781R34453
37880b25547N90010J32981l03317o56007q88418r40287q12409o40679n79464o12563
$$ plain form
37947 -7401122 -6974628 -6405643 -5656432 -4625216 -3261478 -1653862 -17220 1394847 2387114
37938 2387114 2889033 2966179 2764731 2426260 2048666 1713593 1503625 1445437 1443761 1323899
37928 1323899 971481 420929 -192441 -728437 -1076813 -1163427 -1004213 -746365 -578733 -571017
37918 -571017 -646059 -725245 -833443 -1014152 -1205288 -1285624 -1223239 -1093076 -944873 -738455
37908 -738455 -441511 -122113 107090 192615 141049 -39501 -330437 -653941 -910844 -1092011
37898 -1092011 -1310580 -1698188 -2287052 -2999970 -3731135 -4430874 -5136058 -5913483 -6725151
37889 -6725151 -7335493 -7418594 -6827101 -5742614 -4511422 -3345407 -2238781 -1160000 -225547
37880 -225547 364463 497444 194127 -461880 -1350298 -2290585 -3102994 -3743673 -4323137 -4935700
37870d935700n53196k49092K46397P00828Q69262O68017K51320q9539j67394m9789
37860c308886P0701J29424K28575M32290O44246P42511P35409O94382O02425L85655
37850A356732Q0584j34056j04073J49360M58330O51245O67026N69136M59489L60365
37840D514138J90735j15407m88005p63876q48226p95170p28369p19122p47060
37831e00362p47571o83568n78272m69518l33427j05351J85283L62396K77549J9981
37821b572860j43796n3794K01910M39000N61771N47888L66834L9888k61191l08955
37811a183305m9536L28772N80659O06267M52172J81960j79261n81609r05832j037693
37801a787406r80295q47462p22647n54953k37231K23870O65820R09343R01525
$$ plain form
37870 -4935700 -5488896 -5737988 -5491591 -4790763 -3921501 -3253484 -3002164 -3091703 -3259097 -3308886
37860 -3308886 -3238185 -3108761 -2880186 -2447896 -1803650 -1061139 -325730 368652 971077 1356732
37850 1356732 1437316 1303260 1199187 1348547 1806877 2458122 3125148 3694284 4153773 4514138
37840 4514138 4704873 4589466 4101461 3337585 2489359 1694189 965820 246698 -500362
37831 -500362 -1247933 -1931501 -2509773 -2979291 -3312718 -3418069 -3232786 -2870390 -2592841 -2572860
37821 -2572860 -2716656 -2770450 -2568540 -2129540 -1567769 -1019881 -653047 -613159 -874350 -1183305
37811 -1183305 -1232841 -904069 -323410 282857 735029 916989 737728 156119 -749713 -1787406
37801 -1787406 -2767701 -3615163 -4337810 -4892763 -5129994 -4906124 -4240304 -3330961 -2429436
37792b429436P13412M50086J97393J2985q5038j10185o0449R2994L31580N38120
37782c48538N85897M77127L41366K97057L62193M89630O10893O22815M14699j7555
37772C835584n13442q62364r67951q66298o16430k47039J78535N11593N89595
37763A041783L64233m6727m27422n94358n00568k43225L0948K36157L69305M44638
37753F74764M46243L58817K14030P3149k9544j01017j48890j53278r4953l096
37743A236225M1829l5318k38419m88916o81101p48533o82670n08760k63431J4834
37733b354260K98964N72933P93539Q69121P34335M59341K22458J34572J43092
37724A874095J60300K22669M19309O81863P71889N34365R6522k42958k90349r7123
$$ plain form
37792 -2429436 -1716024 -1265938 -1068545 -1055560 -1140598 -1250783 -1311232 -1218238 -886658 -348538
37782 -348538 237359 714486 1055852 1352909 1715102 2204732 2815625 3438440 3853139 3835584
37772 3835584 3322142 2459778 1491827 625529 9099 -237940 -59405 452188 1041783
37763 1041783 1406016 1359289 931867 337509 -163059 -406284 -375336 -139179 230126 674764
37753 674764 1121007 1479824 1693854 1767003 1737459 1636442 1487552 1334274 1239321 1236225
37743 1236225 1278054 1242736 1004317 515401 -165700 -914233 -1596903 -2105663 -2369094 -2354260
37733 -2354260 -2055296 -1482363 -688824 180297 914632 1373973 1596431 1731003 1874095
37724 1874095 2034395 2257064 2676373 3358236 4130125 4664490 4761012 4518054 4227705 4130582
37714D130582J19102J46178p6262m01085n68949m22777n3560K82239L94176L07119
37704C856763K06540K54486M37632N76540N01515K24454r5604l49540n60916p44329
37694D307541p91897o10573l14002j43153j97637l56608m68902m93650m16173
37685E14946j66294K63343O85678Q31195O01239J52581k62368m92308n46314n32955
37675A048743n69976p19658r70724j253011j447924j405849j026254l69540L39135
37666f375058Q63839J114980J148627J056588R00077P18660N42973L93914K93837
37657F58437K59763K58130K04430O2378q6279j42576j44403k28380m18754n41389
37647a18643m04934j9899M12974O95640P63387O55435M29330J24563k19940n33879
$$ plain form
37714 4130582 4249684 4395862 4319600 3918515 3349566 2926789 2873229 3155468 3549644 3856763
37704 3856763 4063303 4317789 4755421 5331961 5833476 6057930 5962326 5612786 5051870 4307541
37694 4307541 3515644 2905071 2591069 2447916 2250279 1893671 1424769 931119 514946
37685 514946 348652 611995 1297673 2128868 2730107 2882688 2620320 2128012 1581698 1048743
37675 1048743 478767 -240891 -1211615 -2464626 -3912550 -5318399 -6344653 -6714193 -6375058
37666 -6375058 -5511219 -4396239 -3247612 -2191024 -1290947 -572287 -29314 364600 658437
37657 658437 918200 1176330 1380760 1443138 1356859 1214283 1069880 841500 422746 -118643
37647 -118643 -523577 -543476 -130502 565138 1328525 1983960 2413290 2537853 2317913 1784034
37637A784034p10216o58709l88760k4145K90351M89170N79152N63704M22296J65066
37627B511943j33509l71398m73583m19594k57920j01629o5312j72011l37423m62054
37617b82490n15624n13325m47708k95136q1794J05378J88611J57033N4182n9125
37607a689998j21291q7149M1625K16341L87527N34170O30226O09367M12060Q3922
37597A016800k01453k61012p2552J74395K29299J3107l03872m74880m09809k02015
37587d91992M6415L34064O63666R23715R58153P33505L68158P672k63788l99510
37577B880058l67825j93225K8576J93934K48881J80223K68k31845m16798m87004
37567A835243m56684l74218k41781j0179L49328P76434J118891J212705J007936
$$ plain form
37637 1784034 1073818 415109 26349 2204 292555 781725 1360877 1924581 2346877 2511943
37627 2511943 2378434 2007036 1533453 1113859 855939 754310 688998 516987 179564 -282490
37617 -282490 -798114 -1311439 -1759147 -2054283 -2136077 -2030699 -1842088 -1685055 -1630873 -1689998
37607 -1689998 -1811289 -1898438 -1856813 -1640472 -1252945 -718775 -88549 520818 932878 1016800
37597 1016800 815347 554335 481783 656178 885477 898584 594712 119832 -289977 -491992
37587 -491992 -445577 -111513 552153 1475868 2434021 3167526 3535684 3543356 3279568 2880058
37577 2880058 2512233 2319008 2347584 2541518 2790399 2970622 2970890 2739045 2322247 1835243
37567 1835243 1378559 1004341 762560 752381 1101709 1878143 2997034 4209739 5217675
37558E217675O27190K66574K7683j23047k38917l09750l20992l23280l82595n03911
37548C936630o56780q28700r85479j023629q58306n51856k70567j05609q147R4095
37538a258348J99824K77522L25428L45158L18628K55888K05912J68026N3240j91630
37528F99648m61051n74812m70594k41999j375K08071L59893M04690L33003K13331
37518D68805J16500N4356M0861J45538L95571O63236P64041O75184N53959N08953
37508D387004M60411L01735J09769P0280K17333L61908L00889J7672l42389o14222
37498E270390o99107n94561m07256k89001k97247l50065l66399l99176n46473
37489A321105p56199q22145o06084k05076J33083K26544Q3613j34115k38961j47990
$$ plain form
37558 5217675 5844865 6111439 6139122 6016075 5777158 5467408 5146416 4823136 4440541 3936630
37548 3936630 3279850 2451150 1465671 442042 -416264 -968120 -1238687 -1344296 -1352443 -1258348
37538 -1258348 -1058524 -781002 -455574 -110416 208212 464100 670012 838038 891278 699648
37528 699648 238597 -336215 -806809 -1048808 -1050183 -842112 -482219 -77529 255474 468805
37518 468805 585305 639661 680522 826060 1221631 1884867 2648908 3324092 3878051 4387004
37508 4387004 4847415 5149150 5258919 5329199 5546532 5908440 6209329 6227001 5884612 5270390
37498 5270390 4571283 3976722 3569466 3280465 2983218 2633153 2266754 1867578 1321105
37489 1321105 564906 -257239 -863323 -1068399 -935316 -708772 -625159 -759274 -998235 -1146225
37479a146225O1361K21408K15698N8324j44581k75882k57647q3761J54190K99329
37469h97786K35937j9865l35060n56607o00438m78093k56948J4032L38255P10145
37459a846428J029147J130642R37406N56076K00178L9305J27709M13934P57823
37450C345792R71537R24775O31698K11507k18819n74613p65319p22073m92595
37441C311890k45948j38414j98109l50132n02730n83097n50334m34383l30999
37432b2256k97148k63548j04496K07791N60980Q08239Q71418P50325N01439K37438
37422C250182R2617J27452K66496L55863K85595N5968k51482n42248p52051q44268
37412B044124p87567n62324k04679J77603M68765O20022O33938N00102K17625
$$ plain form
37479 -1146225 -1084864 -863456 -647758 -589434 -734015 -1009897 -1267544 -1351305 -1197115 -897786
37469 -897786 -661849 -681714 -1016774 -1573381 -2173819 -2651912 -2908860 -2894828 -2556573 -1846428
37459 -1846428 -817281 313361 1250767 1806843 2007021 2046326 2174035 2587969 3345792
37450 3345792 4317329 5242104 5873802 6085309 5866490 5291877 4526558 3804485 3311890
37441 3311890 3065942 2927528 2729419 2379287 1876557 1293460 743126 308743 -22256
37432 -22256 -319404 -582952 -687448 -479657 81323 889562 1760980 2511305 3012744 3250182
37422 3250182 3342799 3470251 3736747 4092610 4378205 4434173 4182691 3640443 2888392 2044124
37412 2044124 1256557 694233 489554 667157 1135922 1755944 2389882 2889984 3107609
37403C107609j10320k91760k20827o03J59560J41042k5674k43182m11001m41294
37393A663550l09725j04139M4913R2896Q5445M6453m6039j56913j73297m9854
37383A093290R8674J19874j5826k39067m98223p56551r18761q83227o73936m20552
37373c094305j88125P6801L91521O24400O19455L88056J00399r4238j75944j99192
37363a551172k04463k03662j99264j80344j21639j4478J11825K20754L16360M42735
37353a383348O31951Q57267J033913J060380Q73137M92213L1050l54003n54236
37344B688324n63634m43401k42949J9623K98224M82004M63571K48523k5909j89913
37334B734463j56302L8109K62965L66884K79939R0494r740Q1898K37716K03340
$$ plain form
37403 3107609 2997289 2705529 2484702 2484099 2643659 2784701 2759027 2515845 2104844 1663550
37393 1663550 1353825 1249686 1294599 1387495 1472940 1519393 1473354 1316441 1143144 1093290
37383 1093290 1191964 1311838 1296012 1056945 558722 -197829 -1116590 -1999817 -2673753 -3094305
37373 -3094305 -3282430 -3205629 -2814108 -2189708 -1570253 -1182197 -1081798 -1176036 -1351980 -1551172
37363 -1551172 -1755635 -1959297 -2158561 -2338905 -2460544 -2475022 -2363197 -2142443 -1826083 -1383348
37353 -1383348 -751397 105870 1139783 2200163 3073300 3565513 3596563 3242560 2688324
37344 2688324 2124690 1681289 1438340 1457963 1756187 2238191 2701762 2950285 2924376 2734463
37334 2734463 2578161 2616270 2879235 3246119 3526058 3616552 3606812 3688710 3926426 4129766
37324D129766j31939o02077r27031r77095q44414o91821n98887n52734n14469
37315a710701m53656l58537k56621k05314k26779k64204k29595q4017J44047L89211
37305c256166N69018O11293N15252L65716K33532Q2272j56616m24430n39639l93276
37295b393044p4580K36373M46797N80689O81471P41241P01851M89339Q2207m10798
37285A081546p75626q54132o71677l73215o7833K09939M20161M90980L94821J97019
37275E1983N46j30965j85648j72464j01835P432J06420J14302j8000k17361l11268
37264h56858k03647l833Q9465K3075o7590n3487L9110J10974J40294J79538K46567
37253c56392K96746K92633K35073J17852q5946l53113n58092n48210k93379N6098
$$ plain form
37324 4129766 3997827 3395750 2468719 1491624 647210 -44611 -643498 -1196232 -1710701
37315 -1710701 -2164357 -2522894 -2779515 -2984829 -3211608 -3475812 -3705407 -3789424 -3645377 -3256166
37305 -3256166 -2687148 -2075855 -1560603 -1194887 -961355 -879083 -1035699 -1460129 -1999768 -2393044
37295 -2393044 -2467624 -2231251 -1784454 -1203765 -522294 218947 920798 1410137 1492344 1081546
37285 1081546 305920 -548212 -1219889 -1593104 -1660937 -1450998 -1030837 -539857 -145036 51983
37275 51983 52529 -78436 -264084 -436548 -538383 -530951 -424531 -310229 -328229 -545590 -856858
37264 -856858 -1060505 -1064338 -974873 -951798 -1019388 -1072875 -1033765 -922791 -782497 -602959 -356392
37253 -356392 -59646 232987 468060 585912 499966 146853 -411239 -959449 -1252828 -1196730
37243a196730K83385K79707J03009j14657k78744l51325l17209j81631J4358K16048
37233a543789L86610M93069M90442L74022K36277K05291L06297M28272M45642
37224A822133L32052J37077r5917l40310n43093o33159n94353n06118m75337n03673
37214a400698m36976j07665M28413Q45282Q32408M44741R2395J34636N23763Q82604
37204B238903Q84918N12181j4463m64594p45791q82795r03366p64812m09665J03431
37194d46053N63791P52899O30246L51889J07310l3659j14428j82506k29605k30610
37184A169274j98689j77877j97380k55734l36335m03218l84974k17727O1130K97016
37174f44514L44317K00012j8794k08016l40492m13423m00738k84918j02421O8647
$$ plain form
37243 -1196730 -913345 -633638 -530629 -645286 -924030 -1275355 -1592564 -1774195 -1759837 -1543789
37233 -1543789 -1157179 -664110 -173668 200354 436631 641922 948219 1376491 1822133
37224 1822133 2154185 2291262 2195345 1855035 1311942 678783 84430 -421688 -897025 -1400698
37214 -1400698 -1837674 -1945339 -1516926 -671644 160764 605505 697900 832536 1356299 2238903
37204 2238903 3123821 3636002 3621539 3156945 2411154 1528359 624993 -139819 -549484 -446053
37194 -446053 117738 870637 1500883 1852772 1960082 1926423 1811995 1629489 1399884 1169274
37184 1169274 970585 792708 595328 339594 3259 -399959 -784933 -1002660 -941530 -644514
37174 -644514 -300197 -100185 -118979 -326995 -667487 -1080910 -1481648 -1766566 -1868987 -1800340
37164a800340J63274J80392J89556K57427L41819L07526J06197j11345j64795
37155e30289j03446j65231m51627p70171q67225p15342m84714l11308j93074o0479
37145d652906J51068M63819P98341R79278Q98416O61670M84557M48499M52643
37136F85385M04272L43871L42150L69744L41582K36130R8615m8903k34052m64576
37126B074218o72705p49890o34401l68535p6808J18664J77691J53740J35855J73034
37116C30863K41489K85897L00298L47543M64833N71001N37334L59817J79226Q9170
37106C707471P953j80064m19973n31410m35997k39599r0208m6850r6178k00460
37096A474685k93748l07584k43290j64758r6379L549J36075K07468J43685K842
$$ plain form
37164 -1800340 -1637066 -1456674 -1267118 -1009691 -667872 -360346 -254149 -365494 -530289
37155 -530289 -633735 -798966 -1250593 -2020764 -2887989 -3603331 -4088045 -4399353 -4592427 -4652906
37145 -4652906 -4501838 -4038019 -3239678 -2260400 -1361984 -700314 -215757 232742 685385
37136 685385 1089657 1433528 1775678 2145422 2487004 2723134 2821749 2772846 2538794 2074218
37126 2074218 1401513 651623 17222 -351313 -428121 -309457 -131766 21974 157829 330863
37116 330863 572352 858249 1158547 1506090 1970923 2541924 3079258 3439075 3618301 3707471
37106 3707471 3715424 3535360 3115387 2583977 2147980 1908381 1818173 1771323 1675145 1474685
37096 1474685 1180937 873353 630063 465305 368926 372475 508550 716018 859703 862545
37086H62545r3197r8934n0655L1662J62848L15808M03959L70696K57029J56883
37076B318644J27926J56923J85596J52477L0703j46257k96398l50025l15224k72361
37066A592004k78260k74503j30065J90766N27013O42435M61868J56354j4435Q0412
37056B953589L69771O58889P54544N75585K12924j22359k58463j94174p6882o9931
37046D803493k44194n49470q41916r63874q63342o50330m96319m65802m79275
37037g51029m44428l66979k96916k16308n5762J77602L55457L50818J80215o803
37027a074133o7376K5339J90850L20244L46058K68547J34829q906j42616k51128
37017b58292l06580k99838k64244k23362j36639L4554K13311K57007J61034J19654
$$ plain form
37086 862545 769348 670414 619759 651421 814269 1130077 1534036 1904732 2161761 2318644
37076 2318644 2446570 2603493 2789089 2941566 2972269 2826012 2529614 2179589 1864365 1592004
37066 1592004 1313744 1039241 909176 1099942 1626955 2269390 2731258 2887612 2873177 2953589
37056 2953589 3323360 3982249 4736793 5312378 5525302 5402943 5144480 4950306 4873424 4803493
37046 4803493 4559299 4009829 3167913 2204039 1340697 690367 194048 -271754 -751029
37037 -751029 -1195457 -1562436 -1859352 -2075660 -2131422 -1953820 -1598363 -1247545 -1067330 -1074133
37027 -1074133 -1141509 -1116170 -925320 -605076 -259018 9529 144358 135452 -7164 -258292
37017 -258292 -564872 -864710 -1128954 -1352316 -1488955 -1454401 -1241090 -984083 -823049 -703395
37007g03395K96777N93466P49499O58012M75421M06832M76230N46252M89766K86822
36997D275682M216k54427l96753l96936l14148k35346j99532j88212j75714j63754
36987A955076j64363j66323j33089l6818J13958K89524M69239O27389O92633N74344
36977D221570K63241j28409m65389p01365q58119r35867r06224p69261n52440
36968h32263k73375K5038K26223K30293J07744O6560K25065M89304O89258P55819
36958A709666P13571N84270L88827K02974J18489J46787K13438K45327K24043
36949D547392J62705P4912k0916q3293m6681J36269M15865O23296N95691L48061
36939F753301O9307p7047r5042p8872p0330n0732j7695j30k6180j25992l30689
$$ plain form
37007 -703395 -406618 186848 936347 1594359 2069780 2476612 2952842 3499094 3988860 4275682
36997 4275682 4279898 4025471 3628718 3231782 2917634 2682288 2482756 2294544 2118830 1955076
36987 1955076 1790713 1624390 1491301 1454483 1568441 1857965 2327204 2954593 3647226 4221570
36977 4221570 4484811 4356402 3891013 3189648 2331529 1395662 489438 -279823 -832263
36968 -832263 -1105638 -1080600 -854377 -624084 -516340 -449780 -224715 264589 953847 1709666
36958 1709666 2423237 3007507 3396334 3599308 3717797 3864584 4078022 4323349 4547392
36949 4547392 4710097 4785009 4764093 4680800 4634119 4770388 5186253 5809549 6405240 6753301
36939 6753301 6822608 6745561 6650519 6571647 6501317 6450585 6432890 6432760 6406580 6280588 5949899
36928E949899o19200r01970j101427j204274j195577j021498p04332m29888l97362
36919a625629n90882p91256q05135o04892k73846P5126L32968M63507N58204P21994
36909b539841Q90364Q74008O20415L16535J70972J92082K48244K45682J48730
36900A167191q9773m78299q88193j129637j149472j070011j003665r00932o35330
36891f178121k04708K12418M19260L97123L07992K94694L18111K37353K3130j90898
36881d363646k82641k79475k68484k42354j24006Q7986K93567M18269M93460N86950
36871c680374P05382P91956P84483O53478M17734J56058j3984q746J51733L48214
36861C05934M44850L83380K13161L5008q4435j44943j78568k14797k80910l91294
$$ plain form
36928 5949899 5330699 4428729 3327302 2123028 927451 -94047 -798379 -1228267 -1625629
36919 -1625629 -2216511 -3007767 -3812902 -4417794 -4691640 -4616514 -4283546 -3820039 -3261835 -2539841
36909 -2539841 -1649477 -775469 -155054 161481 332453 524535 772779 1018461 1167191
36900 1167191 1077418 599119 -289074 -1418711 -2568183 -3638194 -4641859 -5542791 -6178121
36891 -6178121 -6382829 -6170411 -5751151 -5354028 -5046036 -4751342 -4433231 -4195878 -4172748 -4363646
36881 -4363646 -4646287 -4925762 -5194246 -5436600 -5560606 -5472620 -5179053 -4760784 -4267324 -3680374
36871 -3680374 -2974992 -2183036 -1398553 -745075 -327341 -171283 -185267 -194013 -42280 305934
36861 305934 750784 1134164 1347325 1382333 1297898 1152955 974387 759590 478680 87386
36851H7386n00797m97614k99393L0716K93928L03149K7881l83959p03616p60164
36841b402483n37232j66273J79790L98342M78221M47045L38001K05906J32737
36832i25946J84613L60180N80632P26038O98863M86662J76247j07567k86391l52562
36822A540769l29909k42538j20563n97R4154J50410J34460N059k11738l90064
36812F29443l99548k39892m4644O3029Q6725J02560J16401L6304j88435m47110
36802b85167n51232m40015k41319r7467J1808K05577M91396P11998P24333N58055
36792A087967L50642J82554L9731j00336k29909l58292n20741p04872q10739p22926
36782a786921m10658N4235N51086R62278J201442J235218J092305Q44722N73402
$$ plain form
36851 87386 -413411 -911025 -1210418 -1179702 -885774 -582625 -554744 -938703 -1642319 -2402483
36841 -2402483 -2939715 -3105988 -2926198 -2527856 -2049635 -1602590 -1264589 -1058683 -925946
36832 -925946 -741333 -381153 199479 925517 1624380 2111042 2287289 2179722 1893331 1540769
36822 1540769 1210860 968322 847759 847162 941316 1091726 1226186 1231245 1019507 629443
36812 629443 229895 -9997 -54641 8388 95113 197673 314074 350378 161943 -285167
36802 -285167 -836399 -1276414 -1517733 -1615200 -1603392 -1397815 -906419 -194421 529912 1087967
36792 1087967 1438609 1621163 1660894 1560558 1330649 972357 451616 -253256 -1063995 -1786921
36782 -1786921 -2197579 -2143344 -1592258 -629980 571462 1806680 2898985 3743707 4317109
36773D317109L35243J36720o4306l03859n44348o81658o35967m24589j42598J03373
36763B095120K41403K67930K71866L80651O18058Q28427Q04255M97998O3528l11425
36753E757811n55300o84651p04499o02688m13560k19694p9625J2677Q8309J45374
36743B744154J35961r10k87451o65881j005859j175449j127305r24787o84956
36734b992483m87396l22718j27324J18029L25130L60290J84034r3846l19133m31779
36724c787196m75075m94457m79593m07689k91424j55337L724J94706L78778M69866
36714e043697M01302J86699q3151k95177l73653l12631j71861l6672M2531Q8480
36704e597830J67597L03973M22686M00574J90104j11444l25220l24946j17492
$$ plain form
36773 4317109 4652352 4789072 4724766 4420907 3876559 3194901 2558934 2134345 1991747 2095120
36763 2095120 2336523 2604453 2876319 3256970 3875028 4703455 5507710 6005708 6069236 5757811
36753 5757811 5202511 4517860 3813361 3210673 2797113 2577419 2497794 2510471 2598780 2744154
36743 2744154 2880115 2879205 2591754 1925873 920014 -255435 -1382740 -2307527 -2992483
36734 -2992483 -3479879 -3802597 -3929921 -3811892 -3486762 -3126472 -2942438 -3036284 -3355417 -3787196
36724 -3787196 -4262271 -4756728 -5236321 -5644010 -5935434 -6090771 -6087047 -5892341 -5513563 -5043697
36714 -5043697 -4642395 -4455696 -4538847 -4834024 -5207677 -5520308 -5692169 -5728841 -5686310 -5597830
36704 -5597830 -5430233 -5126260 -4703574 -4303000 -4112896 -4224340 -4549560 -4874506 -4991998
36695d991998J83398M42398N72100N54561M32004K93133K48595L67971O03970
36686a293868P99816Q19709O76814M99668L79018K99547K23201J59932J13536
36677B677373L1779j08152k06739j33353Q8328K68010K44942M2793j80679k78886
36667B445416k00473l226J74090K07630J04395r765m7276n9429j44437l07474
36657B159451m67275n59374n68679m97304l81802l21790l94931n30466n51733
36648b113903l72337p6560K20432M93425P18727P63124N06623O5072k49728k50049
36638b95174o5761M6006J1960k4918O3793K45513M15871N21974N46540M63137
36628A928941L01539K07781L19695N64841O74975M60070K7807l16185l65256j77382
$$ plain form
36695 -4991998 -4808600 -4366202 -3794102 -3239541 -2807537 -2514404 -2265809 -1897838 -1293868
36686 -1293868 -494052 325657 1002471 1502139 1881157 2180704 2403905 2563837 2677373
36677 2677373 2709152 2601000 2394261 2260908 2349236 2617246 2862188 2904981 2724302 2445416
36667 2445416 2244943 2241717 2415807 2623437 2727832 2718067 2670791 2611362 2466925 2159451
36657 2159451 1692176 1132802 564123 66819 -314983 -636773 -1031704 -1562170 -2113903
36648 -2113903 -2486240 -2562800 -2342368 -1848943 -1130216 -367092 139531 204603 -45125 -295174
36638 -295174 -360935 -314929 -302969 -327887 -264094 -18581 397290 919264 1465804 1928941
36628 1928941 2230480 2438261 2757956 3322797 3997772 4457842 4485649 4169464 3804208 3626826
36618C626826K5486P0846m7074k08265k89266k58230j83482j73046l03313n71184
36608A689298q75321j051585r83028p09842m03960k01086p3584J02510L74951
36599b131647O49956P92833P58211O19910N00475M71389N00111N00127M46148
36590C107513M04427M06854L42874P4109l50127p09266q82934r88669j164333
36581B40448j321610j262680r89864p24870o02377n06455k80685L8430L11857
36572e097806N19986P43857R66080J047503R25610P11989N37850L95928K10153
36563I61150M8j16779p7043M2040J08249P1944l019l5699l5934r3862k47550l83338
36551A90207l16900Q050M27637O79546O05628K52384j70190m16340l67532j38389
$$ plain form
36618 3626826 3652312 3723158 3676084 3467819 3178553 2920323 2736841 2563795 2260482 1689298
36608 1689298 813977 -237608 -1220636 -1930478 -2334438 -2535524 -2609108 -2506598 -2131647
36599 -2131647 -1481691 -688858 69353 689263 1189738 1661127 2161238 2661365 3107513
36590 3107513 3511940 3918794 4261668 4335777 3985650 3276384 2393450 1404781 240448
36581 240448 -1081162 -2343842 -3333706 -4058576 -4660953 -5167408 -5448093 -5409663 -5097806
36572 -5097806 -4577820 -3833963 -2867883 -1820380 -894770 -182781 355069 750997 961150
36563 961150 961198 844419 767376 809416 917665 989609 986590 950891 914957 821095 573545 190207
36551 190207 -126693 -118643 308994 988540 1594168 1846552 1676362 1260022 892490 754101
36541G54101N616j02133l64736n42037n13735l70811k62266k23010j69658r192
36531a797861K75438O01722Q15351P79639M87767Q5294k40158l90340l83296k91393
36521e7837j86821j25563j37243k15728l30326m41642m97522m39322k55456l0443
36511b717903J02231Q1920k5500j15476j59886j98142k32926j98344n5982J26420
36501c393588K41807K67357K69610K93531L03987K51895J47402L7871m6903r2261
36491a719292p6315L660J02973J76558K46704L74654N54469O73028O02373L31779
36481A270591J1160j38061J0343L71641P07789Q28221P31390N45568L78401K65113
36471D982156K06874J65671L7548k59023o38616q86491q94677p84796p27093p04014
$$ plain form
36541 754101 759717 657584 292848 -249189 -762924 -1133735 -1396001 -1619011 -1788669 -1797861
36531 -1797861 -1522423 -920701 -105350 674289 1162056 1247350 1007192 616852 233556 -57837
36521 -57837 -244658 -370221 -507464 -723192 -1053518 -1495160 -1992682 -2432004 -2687460 -2717903
36511 -2717903 -2615672 -2533752 -2559252 -2674728 -2834614 -3032756 -3265682 -3464026 -3520008 -3393588
36501 -3393588 -3151781 -2884424 -2614814 -2321283 -2017296 -1765401 -1617999 -1580128 -1627031 -1719292
36491 -1719292 -1795607 -1791947 -1688974 -1512416 -1265712 -891058 -336589 336439 938812 1270591
36481 1270591 1281751 1143690 1154033 1525674 2233463 3061684 3793074 4338642 4717043 4982156
36471 4982156 5189030 5354701 5392249 5133226 4494610 3608119 2713442 1928646 1201553 497539
36461D97539n54964k32680R1673K08470Q7580j20477k54150k64206j93127r4606
36451h28948O54P3089J18524J68439K55001L23886K35824o3610l89555m35570
36441e42266r2598M11780P37672P40898N17868K32444L114q6248n547J56503K36265
36430B309885J49073n3468k92192n38995p40726p57814m89381l9107L38096M73253
36420C58624M12056L04071K37436K19015K50549L38015M26736L99795J88639j32879
36410C002057m01787n17314n19571n15682n54162n92853n73261m86215l49924
36401a508712j56013J19518M49426P36709Q88237Q89990P86700O09072L69080
36392C184007J28555Q632P5888K35156K86484J03631k61113o42863r02367r97227
$$ plain form
36461 497539 -57425 -290105 -198432 10038 97618 -22859 -277009 -541215 -734342 -828948
36451 -828948 -828294 -755205 -636681 -468242 -213241 110645 346469 282859 -106696 -542266
36441 -542266 -634864 -223084 514588 1255486 1773354 2005798 2008912 1922664 1917117 2073620 2309885
36430 2309885 2458958 2405490 2113298 1574303 833577 75763 -413618 -452725 -114629 358624
36420 358624 770680 1074751 1312187 1531202 1781751 2119766 2546502 2946297 3134936 3002057
36410 3002057 2600270 2082956 1563385 1047703 493541 -99312 -672573 -1158788 -1508712
36401 -1508712 -1664725 -1545207 -1095781 -359072 529165 1419155 2205855 2814927 3184007
36392 3184007 3312562 3321194 3397082 3632238 3918722 4022353 3761240 3118377 2216010 1218783
36382A218783r58723q34565o52072m19809j55285R7574K84327L66072L27587J86920
36372e39191K0652n1408L8725K28599L88168M60850M88133M91391M09080J95687
36362B130686q2122l16495m84690o27988p27969o98140n22122l27121k63690l33870
36352b253521l75473k15184J72637O42738R94278J114398J025927Q11553N13526
36343B430879J23979l40045p86964j094363j196913j125772r66030p78794n63552
36334d297575k93412K4661L39678N99179P72909Q29064P27784M74639J63644p2750
36324g32179j63269j31949m0045Q2584K47947M72830P40410R95123J176912J258843
36314C907207J239054J103111Q33048M73645J53247p789r610K6788l2876k34207
$$ plain form
36382 1218783 260060 -574505 -1226577 -1646386 -1801671 -1704097 -1419770 -1053698 -726111 -539191
36372 -539191 -518539 -569947 -531222 -302623 85545 546395 1034528 1525919 1934999 2130686
36362 2130686 2048564 1732069 1247379 619391 -108578 -806718 -1328840 -1655961 -1919651 -2253521
36352 -2253521 -2628994 -2844178 -2671541 -2028803 -1034525 79873 1105800 1917353 2430879
36343 2430879 2554858 2214813 1427849 333486 -863427 -1989199 -2955229 -3734023 -4297575
36334 -4297575 -4590987 -4566326 -4226648 -3627469 -2854560 -2025496 -1297712 -823073 -659429 -732179
36324 -732179 -895448 -1027397 -1067442 -984858 -736911 -264081 476329 1471452 2648364 3907207
36314 3907207 5146261 6249372 7082420 7556065 7709312 7701523 7691913 7718701 7685825 7451618
36304G451618n10304p32320q04618p40159o32253n41630m45350l15018j88304
36295B541662j12746p2021m2881q1798k51970m77512n85178n15849l94076l46334
36285c38703l45932l02729k23362j90881k34590l14331m09489n29940o37613o46320
36275d173890n34081l95751l35383l31682k52430j689L73324P30888R72342J105648
36265b842704J172048J155546J015871P92167N95589M68748L15228K4083l73798
36256B322778p31939r44883j017189r95282r07310p79870o44131m93511k85758
36247d477095k2868K10652L28868L34769K89526K16857R0476q9203k61466l70866
36237c750350m32685n02166n90376o35559n59221l38424k4900K91828N33298O54666
$$ plain form
36304 7451618 6941314 6208994 5404376 4664217 4031964 3490334 3044984 2729966 2541662
36295 2541662 2428916 2356895 2314014 2232216 1980246 1502734 917556 401707 7631 -338703
36285 -338703 -684635 -987364 -1210726 -1401607 -1636197 -1950528 -2360017 -2889957 -3527570 -4173890
36275 -4173890 -4707971 -5103722 -5439105 -5770787 -6023217 -6024906 -5651582 -4920694 -3948352 -2842704
36265 -2842704 -1670656 -515110 500761 1292928 1888517 2357265 2672493 2696576 2322778
36256 2322778 1590839 645956 -371233 -1366515 -2273825 -3053695 -3697826 -4191337 -4477095
36247 -4477095 -4499963 -4289311 -3960443 -3625674 -3336148 -3119291 -3028815 -3118018 -3379484 -3750350
36237 -3750350 -4183035 -4685201 -5275577 -5911136 -6470357 -6808781 -6833681 -6541853 -6008555 -5353889
36227e353889O36569M71044J67190k25936o09155q59753q87002o84746l45528
36218g691206j3370K09301L28459M24398N42316O33054O15306M70841K49150M263
36208d227488k21450l63561l58703k25330o1910P1218K12282L90075N11811M47781
36198c825275K18947K1016L8959K79217N89126P93826Q07260O65613M85932L68878
36188D43499L23744K95149K40183J39550l7237k92628n18831n49046l45865p9215
36178c80697M2010k1578j43005j91089j28039J4731J76187K83063K90293K18373
36168A60249J20855K3282p2513j42881j49829q6533K5831J68718K98049L05045
36158F50273R7787k44582m70845l79674l0208L04394L87371K11997k3544j00472
$$ plain form
36227 -5353889 -4717320 -4246276 -4079086 -4305022 -4914177 -5773930 -6660932 -7345678 -7691206
36218 -7691206 -7704576 -7495275 -7166816 -6742418 -6200102 -5567048 -4951742 -4480901 -4231751 -4227488
36208 -4227488 -4448938 -4812499 -5171202 -5396532 -5458442 -5387224 -5174942 -4784867 -4273056 -3825275
36198 -3825275 -3606328 -3585312 -3546353 -3267136 -2678010 -1884184 -1076924 -411311 74621 443499
36188 443499 767243 1062392 1302575 1442125 1404888 1112260 593429 44383 -301482 -380697
36178 -380697 -338687 -360265 -503270 -694359 -822398 -807667 -631480 -348417 -58124 160249
36168 160249 281104 304386 231873 88992 -60837 -147370 -121539 47179 345228 650273
36158 650273 748060 503478 32633 -347041 -377249 -72855 314516 526513 502969 402497
36148D02497M6844L01084M87637N34150N12077N33544O26229P10621O80799M99851
36138E335333K29841k5262k13682l70686n51653p49153r04850r84805r92058r11296
36128a38271p16852m68714l28761m04217n98135o82918n20484j63132K44911N91535
36118c185038Q16400Q93213Q49712P66254P05649O63496O14790N69419N32217
36109C226112M41506K20945j04947m07408n81547o33142o26307n96247n39294
36100C99671m44771l02620j13337P8403J95546K09589J72807J26379J9656k08021
36090A33302m87489o48870o07370m55660l45890l28875l31950k48190k3756K93334
36080c051414N56804O19006M70137K57995J40052J44077J94400K18917J77474
$$ plain form
36148 402497 449341 750425 1238062 1772212 2284289 2817833 3444062 4154683 4835482 5335333
36138 5335333 5565174 5539912 5326230 4955544 4403891 3654738 2749888 1765083 773025 -138271
36128 -138271 -855123 -1323837 -1652598 -2056815 -2654950 -3337868 -3858352 -4021484 -3776573 -3185038
36118 -3185038 -2368638 -1475425 -625713 140541 846190 1509686 2124476 2693895 3226112
36109 3226112 3667618 3888563 3783616 3376208 2794661 2161519 1535212 938965 399671
36100 399671 -45100 -347720 -461057 -382654 -187108 22481 195288 321667 341323 133302
36090 133302 -354187 -1003057 -1610427 -2066087 -2411977 -2740852 -3072802 -3320992 -3344748 -3051414
36080 -3051414 -2494610 -1875604 -1405467 -1147472 -1007420 -863343 -668943 -450026 -272552
36071b72552L6644j94379m10322m73121l52658j58845k2434J6190K677J6007J35889
36060a676904L94080P09568R14676R01219P24754N25229L65889J99219k0170k49679
36050B787881m02136m31029l49590k05315p5458n8363k01664m19812n32769m35977
36040c24232k18949o7982m5329j4181J82630N05643P43600P59437O49478O14687
36030B784802P12130Q02117P40486N48437L50063K01194O3884o5216j04922k0194
36020F012781O2351m7310l93836q16672j094810j111114q91292n53193k41241
36011I25664n7139j1539n4936j58006l21584m98151n64324m21709j01685K61511
36001a001898N32459O19773M72557J11610l35860o94889q61337q43508o98899
$$ plain form
36071 -272552 -235908 -430287 -840609 -1313730 -1666388 -1825233 -1847667 -1831477 -1828800 -1812793 -1676904
36060 -1676904 -1282824 -573256 341420 1242639 1967393 2492622 2858511 3057730 3037560 2787881
36050 2787881 2385745 1954716 1605126 1399811 1324353 1265990 1064326 644514 111745 -324232
36040 -324232 -543181 -611163 -656492 -670673 -488043 17600 761200 1520637 2170115 2784802
36030 2784802 3496932 4299049 5039535 5587972 5938035 6139229 6203113 6137897 6032975 6012781
36020 6012781 6075132 6027822 5633986 4817314 3722504 2611390 1720098 1166905 925664
36011 925664 868525 856986 802050 644044 322460 -175691 -740015 -1161724 -1263409 -1001898
36001 -1001898 -469439 150334 622891 734501 398641 -296248 -1157585 -2001093 -2699992
35992b699992m74780k10921N1839K86109M65850N30229M12597J41196j32364k62729
35982a892966k54773k26255k32782j93885j6913K62975N17889O64920P00384O14645
35972e6761L70019M001l21117m48645l80773k46774j54256j39818k21634l79659
35962a975417m75921l25388Q1953N11193P08625O40824M50326K54067Q5549k4853
35952f9042n4292p5169k11967m63373o54781o25310m03480j43260O4186K43367
35942b393121M17004N12619M28062J73375q9763j74790l6969J98571L67906M00385
35932a96721L28052K24241J64694J94901K75624K92258J82868M1319L2599K13983
$$ plain form
35992 -2699992 -3174772 -3385693 -3333854 -3047745 -2581895 -2051666 -1639069 -1497873 -1630237 -1892966
35982 -1892966 -2147739 -2373994 -2606776 -2800661 -2817574 -2554599 -2036710 -1371790 -671406 -56761
35972 -56761 313258 317259 -3858 -452503 -833276 -1080050 -1234306 -1374124 -1595758 -1975417
35962 -1975417 -2451338 -2776726 -2694773 -2183580 -1474955 -834131 -383805 -129738 -44189 -69042
35952 -69042 -123334 -198503 -410470 -873843 -1528624 -2153934 -2557414 -2700674 -2636488 -2393121
35942 -2393121 -1976117 -1463498 -1035436 -862061 -951824 -1126614 -1163583 -965012 -597106 -196721
35932 -196721 131331 355572 520266 715167 990791 1283049 1465917 1507236 1539835 1753818
$$ [...]
##END NTUPLES=NMR SPECTRUM
##END=
